##TITLE=trans-Cu(gly)2 $$ Begin of the data block
##JCAMP-DX= 4.24   $$ ISAS JCAMP-DX check program V1.1/a
##DATA TYPE= INFRARED SPECTRUM
##ORIGIN= Dept of Chemistry, UWI, JAMAICA
##OWNER= RJ Lancashire
##DATE= 04/02/17
##TIME= 14:43:40
##SPECTROMETER/DATA SYSTEM= Bruker Vector 22
##INSTRUMENT PARAMETERS= 4000- 400 cm-1 scan by 10 collections
##DATA PROCESSING= OPUS NT export
##DELTAX=   1.928777    
##XUNITS= 1/CM
##YUNITS= TRANSMITTANCE
##XFACTOR=   .1220827    
##YFACTOR=   .2986742E-04
##FIRSTX=   399.2568    
##LASTX=   4000.283    
##MAXY=   .9786656    
##MINY=   .1223332E-03
##NPOINTS=   1868
##FIRSTY=   .8771596    
##XYDATA=(X++(Y..Y))
3270 29368 29994 30514 30943 31291 31573 31642 31710 31898 32100 32187 32211 32288 32454 32640 32755 32767 32721 32672 32636 32584 32491 32377 32285 32243 32234 32210 32139
3697 32139 32032 31924 31844 31788 31734 31668 31595 31511 31367 31059 30460 29500 28220 26789 25451 24443 23922 23921 24365 25105 25966 26794 27474
4060 27474 27943 28190 28248 28187 28084 28003 27976 27991 28016 28015 27966 27865 27719 27520 27242 26835 26258 25501 24613 23704 22905 22328 22009 21912 21946
4455 21946 22019 22081 22126 22171 22215 22229 22164 21974 21647 21184 20597 19884 19039 18069 17017 15962 15003 14236 13732 13524 13608 13950 14496 15174
4834 15174 15902 16596 17185 17614 17858 17918 17819 17591 17257 16824 16288 15643 14892 14056 13180 12316 11527 10863 10364 10038 9870 9819
5182 9819 9832 9860 9865 9829 9756 9664 9583 9545 9576 9686 9870 10107 10370 10635 10882 11102 11288 11435 11529 11551 11481 11295 10986 10554 10019 9408
5593 9408 8765 8133 7565 7116 6836 6776 6963 7409 8101 9001 10053 11190 12337 13431 14423 15283 15998 16569 16996 17280 17421
5925 17421 17414 17253 16929 16438 15784 14992 14115 13241 12484 11973 11822 12100 12817 13914 15282 16794 18326 19785 21111 22277
6241 22277 23284 24145 24882 25522 26087 26587 27036 27434 27787 28098 28372 28617 28841 29053 29258 29460 29653 29836 30006 30163 30307
6572 30307 30442 30568 30686 30801 30915 31025 31134 31238 31339 31437 31536 31632 31725 31809 31884 31956 32027 32095 32161 32219 32272 32322 32367 32405 32431 32446 32458
6999 32458 32468 32477 32481 32478 32474 32478 32495 32513 32518 32501 32458 32393 32295 32135 31882 31538 31145 30776 30502 30361 30345 30409 30446 30258 29556 28028 25514 22200
7441 22200 18687 15867 14583 15265 17727 21250 24906 27932 29973 31086 31563 31701 31655 31411 30865 29947 28708 27369
7726 27369 26263 25728 25962 26924 28349 29848 31083 31889 32291 32432 32462 32469 32473 32465 32440 32410 32383 32357 32322 32267 32200 32128 32059 31994 31927 31857
8136 31857 31783 31708 31628 31540 31442 31334 31222 31104 30982 30857 30735 30620 30507 30388 30247 30067 29833 29534 29168 28752 28336 27979 27714 27526
8516 27526 27360 27152 26861 26439 25759 24570 22562 19576 15842 12079 9327 8532 10095 13655 18222 22617 25954 27900
8800 27900 28654 28673 28387 28044 27713 27382 27044 26717 26413 26121 25809 25450 25036 24577 24086 23559 22996 22398 21779 21154 20537 19931
9148 19931 19330 18724 18101 17437 16711 15900 14990 13980 12884 11717 10506 9279 8076 6941 5921 5046 4343 3817 3479
9448 3479 3338 3410 3719 4290 5140 6270 7647 9205 10843 12442 13893 15119 16100 16869 17501 18079 18672 19311 19989 20675
9764 20675 21328 21921 22443 22898 23295 23645 23956 24229 24469 24679 24863 25025 25166 25290 25399 25496 25582 25658 25721 25773 25815 25847 25872 25888
10143 25888 25897 25900 25898 25890 25874 25847 25809 25759 25698 25629 25555 25479 25402 25322 25237 25144 25040 24922 24786 24633 24460 24269 24060 23832 23582 23305 22994 22638
10585 22638 22218 21710 21093 20349 19472 18459 17324 16099 14856 13698 12729 11995 11435 10884 10144 9104 7841 6638
10870 6638 5898 5965 6981 8826 11164 13590 15758 17474 18689 19460 19875 20018 19940 19665 19201 18548 17706 16671 15434
11170 15434 13981 12311 10459 8517 6631 4962 3635 2690 2080 1705 1460 1284 1165 1129 1223 1493 1996 2803 3990
11470 3990 5612 7660 10034 12549 14980 17140 18933 20359 21454 22209 22529 22277 21394 20017 18508 17348 16935
11739 16935 17406 18576 20046 21399 22367 22900 23109 23146 23121 23079 23034 22997 22994 23039 23118 23185 23195 23122 22974 22776 22555 22317 22061 21782
12118 21782 21482 21173 20870 20590 20350 20155 20002 19874 19749 19599 19408 19177 18918 18650 18383 18114 17828 17512 17159 16781 16401
12450 16401 16047 15729 15449 15188 14921 14623 14269 13833 13297 12661 11952 11224 10546 9967 9494 9086 8665 8160 7535 6798 5986
12781 5986 5149 4320 3522 2767 2070 1456 950 567 305 144 58 19 6 5 9 14 19 23 25 24 22 18 13 9 6 4 5 9 19 42 82 147 245 378
13319 378 550 766 1030 1345 1704 2094 2504 2930 3383 3892 4480 5161 5926 6745 7581 8408 9209 9983 10732 11459 12159 12820
13666 12820 13441 14022 14579 15138 15732 16390 17120 17905 18697 19436 20072 20590 21011 21380 21746 22138 22557 22981 23379 23725 24012
13998 24012 24246 24453 24665 24905 25179 25470 25745 25971 26133 26242 26328 26424 26547 26698 26855 26995 27107 27191 27265 27344 27437 27543 27652
14361 27652 27757 27852 27936 28009 28069 28113 28146 28176 28215 28280 28370 28479 28590 28692 28771 28832 28876 28913 28952 29000 29064 29145 29242 29350 29459 29562 29657 29745
14804 29745 29831 29916 30000 30076 30134 30164 30162 30135 30106 30099 30137 30229 30358 30497 30615 30697 30744 30774 30808 30855 30913 30971 31019 31052 31068 31070 31059 31036 31008 30983 30977 30997
15309 30997 31039 31095 31147 31183 31195 31188 31164 31133 31100 31072 31054 31051 31063 31088 31115 31139 31155 31164 31170 31175 31181 31185 31187 31188 31191 31201 31221 31248 31280 31311 31338 31357 31366 31367 31360 31347 31334 31326 31326
15925 31326 31332 31343 31351 31354 31351 31345 31337 31326 31315 31305 31296 31290 31290 31297 31305 31316 31326 31335 31343 31347 31345 31339 31330 31323 31320 31319 31319 31314 31304 31290 31276 31265 31257 31253 31251 31249 31249 31249 31252 31254 31255 31253 31249 31243 31235 31226 31216 31203 31189 31174
16715 31174 31158 31144 31129 31112 31095 31076 31055 31032 31008 30981 30956 30930 30907 30888 30872 30858 30847 30838 30829 30819 30807 30792 30771 30745 30712 30675 30633 30588 30538 30482 30417 30345 30272
17237 30272 30201 30143 30103 30082 30076 30075 30072 30060 30042 30026 30019 30028 30055 30096 30148 30203 30255 30300 30335 30361 30375 30382 30383 30381 30377 30372 30368 30364 30360 30358 30355 30352 30349 30345 30339 30330 30319 30304 30287 30269 30248 30227 30204
17916 30204 30180 30155 30129 30101 30072 30041 30008 29974 29938 29902 29865 29829 29794 29760 29726 29692 29658 29623 29589 29552 29514 29475 29434 29390 29342 29288 29227 29160 29085 29005 28920 28831 28737 28638
18453 28638 28538 28439 28347 28266 28198 28146 28102 28063 28019 27966 27899 27816 27719 27611 27501 27396 27303 27223 27157 27096 27037 26972 26897 26811 26713 26607 26495 26379
18896 26379 26261 26135 25999 25850 25688 25514 25331 25144 24957 24777 24605 24440 24283 24137 24011 23924 23899 23950 24068 24227 24383 24501 24564
19259 24564 24587 24601 24643 24736 24889 25094 25342 25622 25923 26236 26549 26852 27131 27382 27601 27785 27937 28058 28152 28225 28283 28334 28379 28421 28460
19654 28460 28497 28532 28565 28595 28624 28651 28676 28703 28731 28758 28785 28809 28830 28846 28857 28864 28865 28862 28854 28845 28833 28819 28802 28783 28761 28738 28711 28683 28655 28626 28598 28572 28548 28527 28508
20207 28508 28490 28470 28444 28407 28355 28286 28202 28107 28010 27921 27849 27799 27772 27764 27770 27783 27801 27822 27850 27885 27928 27978 28031 28083 28131 28171 28203 28227 28245 28259 28271 28279 28286
20728 28286 28292 28297 28302 28308 28313 28318 28322 28325 28326 28325 28324 28322 28322 28323 28325 28328 28330 28330 28327 28320 28308 28291 28272 28249 28226 28202 28179 28156 28137 28119 28104 28090 28077 28066 28054 28040 28025 28007 27987 27966 27943 27921
21392 27921 27901 27886 27874 27868 27865 27864 27863 27860 27856 27849 27840 27829 27818 27808 27799 27792 27784 27777 27769 27760 27749 27738 27729 27723 27721 27720 27721 27720 27718 27712 27703 27690 27674 27652 27627 27598 27565 27529 27492 27452 27410 27366 27319 27271
22087 27271 27222 27172 27122 27075 27031 26991 26956 26926 26900 26876 26855 26834 26815 26794 26773 26749 26725 26700 26675 26652 26628 26605 26579 26549 26514 26473 26424 26370 26313 26255 26198 26146 26100 26061
22624 26061 26029 26004 25983 25966 25951 25941 25933 25926 25920 25913 25903 25891 25876 25855 25829 25794 25747 25684 25607 25515 25414 25309 25211 25129 25068 25031 25018 25026 25049 25082 25118 25154 25188
23145 25188 25217 25245 25267 25287 25298 25302 25294 25275 25243 25199 25147 25090 25035 24983 24937 24895 24856 24817 24777 24735 24689 24642 24592 24542 24491 24437 24380 24315 24246 24169 24086 23998 23906
23667 23906 23808 23710 23611 23509 23407 23303 23200 23098 22996 22892 22782 22666 22544 22422 22303 22190 22080 21969 21849 21699 21479 21132 20605 19892
24046 19892 19056 18249 17660 17450 17681 18281 19079 19871 20505 20918 21127 21194 21180 21123 21045 20958 20877 20809 20751 20690 20619 20528 20403 20201 19851
24441 19851 19291 18527 17674 16949 16582 16716 17327 18226 19147 19866 20280 20416 20379 20279 20179 20097 20026 19956 19890 19833 19785 19739 19685 19621 19550
24836 19550 19476 19400 19323 19243 19162 19082 19003 18927 18850 18770 18687 18601 18512 18419 18322 18220 18118 18014 17908 17800 17686 17568 17445 17318 17186 17049 16904
25263 16904 16751 16591 16424 16250 16069 15881 15687 15490 15288 15081 14869 14653 14431 14202 13969 13728 13481 13227 12964 12695 12416
25594 12416 12126 11824 11510 11186 10851 10508 10155 9795 9429 9058 8684 8312 7944 7590 7257 6951 6676 6434 6221 6032 5863
25926 5863 5711 5577 5465 5384 5341 5339 5373 5432 5503 5565 5607 5617 5591 5527 5430 5304 5154 4984 4797 4598 4388 4171 3949 3725 3503 3288
26337 3288 3084 2897 2729 2581 2452 2341 2240 2148 2058 1965 1867 1760 1646 1524 1394 1258 1118 977 839 707 587 483 401
26700 401 342 308 302 325 377 458 563 686 817 947 1067 1172 1255 1317 1354 1367 1360 1333 1292 1240 1180 1114 1050 986 929 882 847 827 828 850 894
27190 894 958 1042 1144 1261 1389 1527 1674 1828 1986 2149 2312 2475 2636 2793 2948 3099 3245 3388 3529 3670 3812 3957 4103 4250 4397
27585 4397 4542 4687 4830 4973 5118 5262 5407 5551 5696 5840 5980 6116 6247 6372 6490 6601 6704 6801 6893 6979 7061 7139 7212 7280 7345
27980 7345 7407 7471 7536 7605 7678 7753 7833 7917 8004 8093 8185 8280 8381 8493 8617 8754 8903 9062 9229 9403 9583 9772 9968 10173 10384
28375 10384 10600 10818 11036 11256 11480 11709 11946 12189 12437 12690 12947 13205 13466 13727 13988 14246 14501 14751 14998 15241 15482 15723 15964 16202 16438
28770 16438 16665 16885 17096 17300 17500 17699 17900 18104 18310 18515 18717 18912 19096 19273 19445 19615 19786 19959 20134 20313 20491
29102 20491 20662 20818 20959 21087 21213 21351 21513 21698 21899 22100 22291 22463 22615 22756 22890 23024 23162 23309 23463 23623 23787 23950
29449 23950 24111 24268 24418 24558 24686 24805 24914 25024 25137 25261 25392 25522 25641 25742 25824 25903 25994 26112 26258 26417 26566 26676
29797 26676 26731 26731 26695 26656 26650 26698 26802 26948 27103 27241 27339 27389 27393 27354 27283 27195 27119 27083 27108 27187 27293 27386 27436 27439 27416 27396 27404 27444 27502 27559 27598
30287 27598 27610 27595 27558 27511 27472 27456 27468 27504 27543 27566 27564 27541 27505 27465 27423 27375 27324 27279 27254 27256 27273 27284 27270 27230 27183 27156 27167 27217 27289 27360 27414 27441
30792 27441 27447 27437 27421 27407 27398 27393 27386 27368 27334 27291 27250 27223 27211 27205 27188 27148 27079 26987 26884 26790 26728 26710 26743 26811 26883 26929 26930 26889 26828 26775 26752 26767 26811 26863
31329 26863 26899 26901 26861 26791 26714 26662 26652 26680 26717 26732 26699 26620 26523 26444 26408 26418 26449 26469 26455 26409 26351 26306 26286 26287 26289 26274 26237 26185 26131 26084 26050 26031 26026
31851 26026 26028 26026 26004 25959 25902 25860 25854 25890 25950 26011 26050 26063 26059 26047 26033 26022 26016 26017 26024 26032 26037 26047 26069 26112 26169 26220 26257 26283 26315 26362 26414 26451 26465 26474 26501 26558
32419 26558 26623 26669 26692 26719 26774 26840 26862 26800 26681 26588 26588 26649 26672 26612 26598 26875 26891 26898 26890 26870 26834 26783
32767 26783
##END=
