##TITLE=  GC of Headspace vapours of yellow passionfruit
##JCAMP-DX= 4.24
##DATA TYPE= GC CHROMATOGRAM
##ORIGIN= Dept of Chemistry, UWI, JAMAICA
##OWNER= public domain
##DATE= 11-26-1995
##TIME= 08:51:28
##SPECTROMETER/DATA SYSTEM= HP 5890 GC TABULATED file
##RESOLUTION= 1.000000
##DELTAX= -0.003462
##XUNITS= TIME
##YUNITS= ARBITRARY UNITS
##XFACTOR=0.000625
##YFACTOR=0.00273116
##FIRSTX=2.000000
##LASTX=20.000000
##NPOINTS=5200
##FIRSTY=78.5194
##DELTAX=0.003462
##XYDATA=(X++(Y..Y))
3200B8749n22m06n23n22l48l49k90m06n81l48Tm65k90m06k32m07k90l48k32k91
$$ 28749 28227 27821 27298 26776 26428 26079 25789 25383 24802 24454 24106 23641 23351 22945 22713 22306 22016 21668 21436 21145
3316B1145k90Uk32k33k32l48m06j75j74n8k90m06j16k33j74k90j74Tj16k91j16T
$$ 21145 20855 20565 20275 20043 19810 19578 19230 18824 18649 18475 18417 18127 17721 17605 17372 17198 16908 16734 16560 16444 16153 16037 15921
3444A5921j74k32j16j74Tj17k90%n8j74Tj16T%j74j16n9n8Tj74%k32N8k90n8WJ16
$$ 15921 15747 15515 15399 15225 15051 14934 14644 14644 14586 14412 14238 14122 14006 14006 13832 13716 13657 13599 13541 13367 13367 13135 13193 12903 12845 12787 12729 12671 12613 12729
3610A2729n8j16j75J17n8n9n8j16l48m64m65n80o97o38n81m64j16j74Tj16N8n8
$$ 12729 12671 12555 12380 12497 12439 12380 12322 12206 11858 11394 10929 10349 9652 9014 8433 7969 7853 7679 7505 7389 7447 7389
3732G389o97q13l48%j16N8K32N8J74K91K90M64N23N22N80Q13P55O96J103R87J045T
$$ 7389 6692 5879 5531 5531 5415 5473 5705 5763 5937 6228 6518 6982 7505 8027 8607 9420 10175 10871 11974 12961 14006 15051
3854A5051J044J103J045R87J161R87R28R29Q71P54N81O38O39N80L49M06K90TJ16
$$ 15051 16095 17198 18243 19230 20391 21378 22306 23235 24106 24860 25441 26079 26718 27298 27647 28053 28343 28633 28749
3959B8749J17n9J17%j75k90j16l48j74k91n22m64l49m64Tm07n22l48o39m06n81
$$ 28749 28866 28807 28924 28924 28749 28459 28343 27995 27821 27530 27008 26544 26195 25731 25267 24860 24338 23990 23351 22945 22364
4075B2364n22m64n81m06n81n80m64n23m64m65l48n22n23m06k90n23m06Tm65k90
$$ 22364 21842 21378 20797 20391 19810 19230 18766 18243 17779 17314 16966 16444 15921 15515 15225 14702 14296 13890 13425 13135
4186A3135m06m07l48k90m06k91l48k32j74m07k32Tl48j74k91j74k90j74j16k90
$$ 13135 12729 12322 11974 11684 11278 10987 10639 10407 10233 9826 9594 9362 9014 8840 8549 8375 8085 7911 7795 7505
4297G505k33j16j74j16j74Tj16j74j75n8Tk90%n8%j74j16n8k32J16n8k33N9j17
$$ 7505 7272 7156 6982 6866 6692 6518 6402 6228 6053 5995 5937 5647 5647 5589 5589 5415 5299 5241 5009 5125 5067 4834 4893 4776
4430D776n8%j16%j74N8n8T%Tn8%j16j74J16j16n8T%N8T%k90J74j16J16%j74N8T
$$ 4776 4718 4718 4602 4602 4428 4486 4428 4370 4370 4370 4312 4312 4196 4022 4138 4022 3964 3906 3906 3964 4022 4022 3732 3906 3790 3906 3906 3732 3790 3848
4596C848j16%N8j16N8n8TN8n8n9%J75j16n9N9%n9J17j17K33j16n8K32j16%TN8T
$$ 3848 3732 3732 3790 3674 3732 3674 3616 3674 3616 3557 3557 3732 3616 3557 3616 3616 3557 3674 3557 3790 3674 3616 3848 3732 3732 3732 3790 3848
4751C848n8J16TN8n8N8T%N8n8N8%Tn8N8T%n8J74%n8N8j16J16n8%J16k32J74n8T
$$ 3848 3790 3906 4022 4080 4022 4080 4138 4138 4196 4138 4196 4196 4196 4138 4196 4254 4254 4196 4370 4370 4312 4370 4254 4370 4312 4312 4428 4196 4370 4312 4254
4923D254J16j16%Tj74J16%Tn8j74%J16n8N8n8%j16n8J74j16%n8j16J74%N8j16%
$$ 4254 4370 4254 4254 4254 4080 4196 4196 4196 4138 3964 3964 4080 4022 4080 4022 4022 3906 3848 4022 3906 3906 3848 3732 3906 3906 3964 3848 3848
5078C848J16%N8n8K32n8j16N8J74%Tj16N8J74j16%J16%J16%N8n8N8T%J16n8N8%T
$$ 3848 3964 3964 4022 3964 4196 4138 4022 4080 4254 4254 4254 4138 4196 4370 4254 4254 4370 4370 4486 4486 4544 4486 4544 4602 4602 4718 4660 4718 4718 4718
5244D718j16N8%N8U%TN9n9%TN9n9%n8N8j16n8J16j16%Tn8UJ16n8j16j74J74j16
$$ 4718 4602 4660 4660 4718 4776 4834 4834 4834 4893 4834 4834 4834 4893 4834 4834 4776 4834 4718 4660 4776 4660 4660 4660 4602 4544 4486 4602 4544 4428 4254 4428 4312
5421D312n8VN8%Uj74N8j74J16j16%Tj16%j16N8Tj75%n8%n8TJ16%j16n8N8Tn8j16
$$ 4312 4254 4196 4138 4080 4138 4138 4138 4138 3964 4022 3848 3964 3848 3848 3848 3732 3732 3616 3674 3732 3557 3557 3499 3499 3441 3383 3499 3499 3383 3325 3383 3441 3383 3267
5610C267%n8K32j74N8Tn8N8n8TN8n8%J74n8j74N8Tj16n8N8%TJ16j16N8%Tn8%UJ16
$$ 3267 3267 3209 3441 3267 3325 3383 3325 3383 3325 3267 3325 3267 3267 3441 3383 3209 3267 3325 3209 3151 3209 3209 3209 3325 3209 3267 3267 3267 3209 3209 3209 3209 3325
5792C325%Tj16n8N8n8N8J16j74N8%N8n8N8Tn8%K32j16TJ16j16%J74%n8%Un8%Tn8
$$ 3325 3325 3325 3209 3151 3209 3151 3209 3325 3151 3209 3209 3267 3209 3267 3325 3267 3267 3499 3383 3267 3383 3267 3267 3441 3441 3383 3383 3383 3383 3325 3325 3325 3267
5975C267N8%N8%j16N8Tj16N8j16%TJ16j16N8j16n8J16%Tk32N8J16n8VJ16%n8%n8T
$$ 3267 3325 3325 3383 3383 3267 3325 3383 3267 3325 3209 3209 3209 3325 3209 3267 3151 3093 3209 3209 3209 2977 3035 3151 3093 3035 2977 2919 3035 3035 2977 2977 2919 2861
6158B861J16%VN8%j74N8%UJ74j74%n8J16j16N8Un8UJ74N8j16J74%N8n8j16N8J16
$$ 2861 2977 2977 2977 2977 2977 3035 3035 2861 2919 2919 2919 2919 3093 2919 2919 2861 2977 2861 2919 2977 3035 2977 2919 2861 3035 3093 2977 3151 3151 3209 3151 3035 3093 3209
6346C209J74k90J16N8%n8J16%J16%TN8%N8N9J16%TJ16N8Un8N8TJ16%J16N8%N8J16T
$$ 3209 3383 3093 3209 3267 3267 3209 3325 3325 3441 3441 3441 3499 3499 3557 3616 3732 3732 3732 3848 3906 3964 4022 3964 4022 4080 4196 4196 4312 4370 4370 4428 4544 4660
6529D660n8J16%N8J17n9J75%J74%TN8n8J16%N8J16j16J16%TN8j16N8Un8J74j74
$$ 4660 4602 4718 4718 4776 4893 4834 5009 5009 5183 5183 5183 5241 5183 5299 5299 5357 5473 5357 5473 5473 5473 5531 5415 5473 5531 5589 5531 5705 5531
6690E531N8%N8n8J16%n8%N8j16%N8Tn8%n8j74%J16n8T%N8Tj74N8%N8j16k32N8J16
$$ 5531 5589 5589 5647 5589 5705 5705 5647 5647 5705 5589 5589 5647 5705 5647 5647 5589 5415 5415 5531 5473 5415 5415 5473 5531 5357 5415 5415 5473 5357 5125 5183 5299
6867E299n8UN8Tj74%n8%Tn8Tn9N9%j17%n8%N8j16%Tj16J16%j74J74j16n8%n8N8
$$ 5299 5241 5183 5125 5183 5241 5067 5067 5009 5009 5009 4951 4893 4834 4893 4893 4776 4776 4718 4718 4776 4660 4660 4660 4544 4660 4660 4486 4660 4544 4486 4486 4428 4486
7050D486%TN8%j16%J74k32%UN8J16k32J16N8n8T%n8N8%n8%n8J16j74n8TN8j16N8
$$ 4486 4486 4486 4544 4544 4428 4428 4602 4370 4370 4370 4370 4428 4544 4312 4428 4486 4428 4370 4370 4312 4370 4370 4312 4312 4254 4370 4196 4138 4080 4138 4022 4080
7227D080%Tn8TN8%j16%j16J74j16%Uj16N8j16n8%J74j16n8%n9n8%N8n8J75j75%T
$$ 4080 4080 4080 4022 3964 4022 4022 3906 3906 3790 3964 3848 3848 3848 3848 3732 3790 3674 3616 3616 3790 3674 3616 3616 3557 3499 3499 3557 3499 3674 3499 3499 3499
7405C499n8J16j16N8n8N8%n8%Un8j16J16j16N8J16k32N8%N8n8%Vn8%TN8%n8%J16
$$ 3499 3441 3557 3441 3499 3441 3499 3499 3441 3441 3441 3441 3383 3267 3383 3267 3325 3441 3209 3267 3267 3325 3267 3267 3267 3267 3267 3209 3209 3209 3267 3267 3209 3209 3325
7593C325%j16%N8%TN8n8TN8n8N8J16j74N8%N8T%j16%J16j16n8N8%N8Tn8J16%j16
$$ 3325 3325 3209 3209 3267 3267 3267 3325 3267 3209 3267 3209 3267 3383 3209 3267 3267 3325 3383 3383 3267 3267 3383 3267 3209 3267 3267 3325 3383 3325 3441 3441 3325
7770C325N8Un8TJ74j74N8n8%J16j16N8T%N8j16%J16n8%TJ17j75N8T%N9n9j16N8
$$ 3325 3383 3441 3499 3441 3383 3557 3383 3441 3383 3383 3499 3383 3441 3499 3499 3557 3441 3441 3557 3499 3499 3499 3616 3441 3499 3557 3557 3616 3557 3441 3499
7942C499%Uj16%TJ16n8T%N8%TN8j16N8j16N8%n8N8n8%n8J16j16%J16n8UN8T%Uj16
$$ 3499 3499 3499 3499 3383 3383 3383 3499 3441 3383 3383 3441 3441 3441 3499 3383 3441 3325 3383 3383 3325 3383 3325 3325 3267 3383 3267 3267 3383 3325 3267 3209 3267 3325 3325 3325 3325 3209
8147C209J74j16N8n8TN8Tn8j16n8J74%Tn8N8%N8j16N8n8N8n8%n8N8Un8TN8j16%
$$ 3209 3383 3267 3325 3267 3209 3267 3325 3267 3151 3093 3267 3267 3267 3209 3267 3267 3325 3209 3267 3209 3267 3209 3209 3151 3209 3267 3325 3267 3209 3267 3151 3151
8324C151J16N8k90K32j74J74n8N8j16N8n8T%J16n8TN8n8J16j16TJ16N8n8J16j74
$$ 3151 3267 3325 3035 3267 3093 3267 3209 3267 3151 3209 3151 3093 3093 3209 3151 3093 3151 3093 3209 3093 2977 3093 3151 3093 3209 3035
8468C035N8%Uj16N8Tn8N8n8j74J16%n8N8j16n8N8n8N8Tk32J16n8J16%N8n8T%N8
$$ 3035 3093 3093 3093 3093 2977 3035 3093 3035 3093 3035 2861 2977 2977 2919 2977 2861 2803 2861 2803 2861 2919 2687 2803 2745 2861 2861 2919 2861 2803 2803 2861
8640B861j16N8%N8n8j16J74%N8j16N8%N8j16N8Tj74K32j74N8J16k32J74j16J16
$$ 2861 2745 2803 2803 2861 2803 2687 2861 2861 2919 2803 2861 2861 2919 2803 2861 2919 2745 2977 2803 2861 2977 2745 2919 2803 2919
8778B919n8N8%n8N8Tn8TJ16Tj16N8%TN8J74j74j16%n8J16n8J16N8J16n8N8T%n8
$$ 2919 2861 2919 2919 2861 2919 2977 2919 2861 2977 3093 2977 3035 3035 3035 3093 3267 3093 2977 2977 2919 3035 2977 3093 3151 3267 3209 3267 3325 3325 3267
8944C267N8%N8J16n8TN8j16N8J16j16J16j16J16%Tj16J74j16n8TJ16%Tj74n8J16
$$ 3267 3325 3325 3383 3499 3441 3383 3441 3325 3383 3499 3383 3499 3383 3499 3499 3499 3383 3557 3441 3383 3325 3441 3441 3441 3267 3209 3325
9094C325n8%Tn8%Tn8N8n8%n8%n8J16%j16J16j74N8%N8j74n8J74n8j16J74j16n8
$$ 3325 3267 3267 3267 3209 3209 3209 3151 3209 3151 3151 3093 3093 3035 3151 3151 3035 3151 2977 3035 3035 3093 2919 2861 3035 2977 2861 3035 2919 2861
9255B861J16j16%j74J16%Un8J16j74J16j74J16n8%VN8%N8j74N8%N8J16j74n8J74
$$ 2861 2977 2861 2861 2687 2803 2803 2803 2803 2745 2861 2687 2803 2629 2745 2687 2687 2687 2687 2687 2745 2745 2803 2629 2687 2687 2745 2861 2687 2629 2803
9421B803%n8N8Un8N8UJ16n8J16TN8K33J16%K32J16N8K90J16K32K33N8K90TK32%
$$ 2803 2803 2745 2803 2861 2919 2861 2919 2977 3035 3151 3093 3209 3325 3383 3616 3732 3732 3964 4080 4138 4428 4544 4776 5009 5067 5357 5647 5879 5879
9582E879M07%K32TJ74J16TK33N8L48j16N8J16N8J16Tj16J74%Uj16n8U%j16J16n8
$$ 5879 6286 6286 6518 6750 6924 7040 7156 7389 7447 7795 7679 7737 7853 7911 8027 8143 8027 8201 8201 8201 8201 8085 8027 7969 7911 7911 7795 7911 7853
9742G853j16n8k90%j17%j74j16Uj74%k32%j74n8j17j74j16N8j74j16j74%n8j74
$$ 7853 7737 7679 7389 7389 7272 7272 7098 6982 6866 6750 6576 6576 6344 6344 6170 6112 5995 5821 5705 5763 5589 5473 5299 5299 5241 5067
9886E067n8j16N8j75%n8j16n8Tj16TN8j16%TJ16%TJ16J74N8J74J75M06K90M65M06
$$ 5067 5009 4893 4951 4776 4776 4718 4602 4544 4486 4370 4254 4312 4196 4196 4196 4312 4312 4312 4428 4602 4660 4834 5009 5415 5705 6170 6576
10036F576N22N81P54O39Q71Q70Q71R87J161J044J161R87J103J277J161J103J045
$$ 6576 7098 7679 8433 9072 9943 10813 11684 12671 13832 14876 16037 17024 18127 19404 20565 21668 22713
10130B2713J044R87J103P55Q12P55TN80TN81L48K32K91K32Tn8j74N8n8j16l49l48
$$ 22713 23757 24744 25847 26602 27414 28169 28924 29504 30084 30665 31013 31245 31536 31768 32000 31942 31768 31826 31768 31652 31303 30955
10252C0955j74n80m07m64n23m64m06o97n22m65m06o96n23n80o39m64n23o38m64
$$ 30955 30781 30201 29794 29330 28807 28343 27937 27240 26718 26253 25847 25151 24628 24048 23409 22945 22422 21784 21320
10357B1320o97m06o39m06n81n80n22m07n80m65n22Tl49n80k90m07m06n22k91k32
$$ 21320 20623 20217 19578 19172 18591 18011 17489 17082 16502 16037 15515 14993 14644 14064 13774 13367 12961 12439 12148 11916
10468A1916l48Tk33m64j74Tm07j74k32l48j16j74k91n8j74l48j16Tk32%k91%j74
$$ 11916 11568 11220 10987 10523 10349 10175 9768 9594 9362 9014 8898 8724 8433 8375 8201 7853 7737 7621 7389 7389 7098 7098 6924
10595F924n8j16j74Tn8N8n8j74j17n8%n8Tj16Tn8J16j16N8%j16%Tj16n8J16j16
$$ 6924 6866 6750 6576 6402 6344 6402 6344 6170 6053 5995 5995 5937 5879 5763 5647 5589 5705 5589 5647 5647 5531 5531 5531 5415 5357 5473 5357
10745E357%Vn8%n8TN8n8N8%N8n8T%n8%n8J16j16n8%N8n8%N8j74N8%TN8j16N8Tj16
$$ 5357 5357 5357 5357 5357 5299 5299 5241 5183 5241 5183 5241 5241 5299 5241 5183 5183 5125 5125 5067 5183 5067 5009 5009 5067 5009 5009 5067 4893 4951 4951 4951 5009 4893 4951 5009 4893
10944D893%Uj17%n8N8n8J16n8N8j74%TJ74j16n8TJ16n8j16J16j16N8T%n8%Tn8%U
$$ 4893 4893 4893 4893 4776 4776 4718 4776 4718 4834 4776 4834 4660 4660 4660 4834 4718 4660 4602 4718 4660 4544 4660 4544 4602 4660 4660 4602 4602 4602 4544 4544 4544 4544
11127D544j74J74j16N8Tj74J16j74n8J74j16N8n8N8j16n8TN8%n8%n8J16j74n8j16
$$ 4544 4370 4544 4428 4486 4544 4370 4486 4312 4254 4428 4312 4370 4312 4370 4254 4196 4138 4196 4196 4138 4138 4080 4196 4022 3964 3848
11271C848J74k32N8n8N8%N8j74%Un8N8j16n9j16N8%n8%N8k90N8%TN8j74N8K32k90
$$ 3848 4022 3790 3848 3790 3848 3848 3906 3732 3732 3732 3732 3674 3732 3616 3557 3441 3499 3499 3441 3441 3499 3209 3267 3267 3267 3325 3151 3209 3441 3151
11437C151%n8N8j16N8j16n8N8n8N8%n8TJ16n8j16%N8j16%n8J74j74J16n8TN8Tj16
$$ 3151 3151 3093 3151 3035 3093 2977 2919 2977 2919 2977 2977 2919 2861 2977 2919 2803 2803 2861 2745 2745 2687 2861 2687 2803 2745 2687 2745 2803 2687
11598B687%UJ16n8N8n8j16J16j16%UJ74j74J16%J16j16J74N8j16%N8%Tn8J16N8
$$ 2687 2687 2687 2687 2803 2745 2803 2745 2629 2745 2629 2629 2629 2629 2803 2629 2745 2745 2861 2745 2919 2977 2861 2861 2919 2919 2919 2861 2977 3035
11759C035%j16%N8%Tn8T%TJ16n8%UN8j16N8V%n8%TN8%J16n8%TJ16%J16Tn8%N8K33
$$ 3035 3035 2919 2919 2977 2977 2977 2919 2861 2861 2861 2977 2919 2919 2919 2919 2977 2861 2919 2977 3035 3093 3093 3035 3035 3035 3093 3093 3209 3151 3151 3151 3267 3267 3383 3499 3441 3441 3499 3732
11975C732%N8J16N8J16N8TJ74%M06j16N8J16%K33%J74%J16T%TK32n8TK32j16N8
$$ 3732 3732 3790 3906 3964 4080 4138 4196 4370 4370 4776 4660 4718 4834 4834 5067 5067 5241 5241 5357 5473 5473 5473 5705 5647 5589 5821 5705 5763
12130E763J74N8%N8n8K33n8N8T%N8J74N8Tn8K32N8J16N8J16n8J16%N8J17N8j17
$$ 5763 5937 5995 5995 6053 5995 6228 6170 6228 6286 6286 6344 6518 6576 6634 6576 6808 6866 6982 7040 7156 7098 7214 7214 7272 7389 7447 7330
12279G330J17N8j16j17J75n8%n9%n8T%j16N8j16n8%j74%n8Tj16j74J74j16T%j74
$$ 7330 7447 7505 7389 7272 7447 7389 7389 7330 7330 7272 7214 7214 7098 7156 7040 6982 6982 6808 6808 6750 6692 6576 6402 6576 6460 6344 6344 6170
12434F170n8n9j16J16j74n8Tj16Tn8Tj16n8j16T%Tn8%n8j75N8j74J74j16N8n8k32
$$ 6170 6112 6053 5937 6053 5879 5821 5763 5647 5531 5473 5415 5299 5241 5125 5009 5009 5009 4951 4951 4893 4718 4776 4602 4776 4660 4718 4660 4428
12589D428n8%N8j74n8J16j16J16j16n8%N8j74J16n8Tj16J16N8j74%J16%j16N8n8
$$ 4428 4370 4370 4428 4254 4196 4312 4196 4312 4196 4138 4138 4196 4022 4138 4080 4022 3906 4022 4080 3906 3906 4022 4022 3906 3964 3906
12734C906N8n8j16J16N8n8%j16J16%j16n8%N8%J16j16J16j74n8N8%Tn8TN8n8%j17
$$ 3906 3964 3906 3790 3906 3964 3906 3906 3790 3906 3906 3790 3732 3732 3790 3790 3906 3790 3906 3732 3674 3732 3732 3732 3674 3616 3674 3616 3616 3499
12894C499%TJ17n9j16n8%N8%Tj16n8%n8N8j74J16%j16%j16%Un8T%j16%N8n8J16
$$ 3499 3499 3499 3616 3557 3441 3383 3383 3441 3441 3441 3325 3267 3267 3209 3267 3093 3209 3209 3093 3093 2977 2977 2977 2977 2919 2861 2861 2745 2745 2803 2745 2861
13071B861k32J16N8j74N8n8%J16j74N8Tn8N8n8%j16%N8%n8%J16j16%TN8%TN8n8T
$$ 2861 2629 2745 2803 2629 2687 2629 2629 2745 2571 2629 2687 2629 2687 2629 2629 2513 2513 2571 2571 2513 2513 2629 2513 2513 2513 2571 2571 2571 2629 2571 2513
13243B513%J16N8n8N8n8T%N8n8N8n8N8Tj16J16n8TJ74j16J74j74N8j16J16n8%U
$$ 2513 2513 2629 2687 2629 2687 2629 2571 2571 2629 2571 2629 2571 2629 2687 2571 2687 2629 2571 2745 2629 2803 2629 2687 2571 2687 2629 2629 2629 2629
13404B629N8%n8N8%Tn8N8%n8TJ16n8J74%UN8Un8J16J74J16n8N8J74J17%K32J74
$$ 2629 2687 2687 2629 2687 2687 2687 2629 2687 2687 2629 2571 2687 2629 2803 2803 2803 2803 2861 2919 2977 2919 3035 3209 3325 3267 3325 3499 3616 3616 3848 4022
13576D022J16N8K90N8J16K33J16K90%J74K32%K32J75K32J16TK32J74N8J16%J74
$$ 4022 4138 4196 4486 4544 4660 4893 5009 5299 5299 5473 5705 5705 5937 6112 6344 6460 6576 6808 6982 7040 7156 7156 7330
13703G330N9%K32%j16N8%n8%Uj75%k32N8j74j16%N8n8k32n8Tk32n8j16n9n8%j16
$$ 7330 7389 7389 7621 7621 7505 7563 7563 7505 7505 7505 7505 7330 7330 7098 7156 6982 6866 6866 6924 6866 6634 6576 6518 6286 6228 6112 6053 5995 5995 5879
13869E879k32j16T%j74n8j74n8Tk33n8Xj74j16n8%n8%j74%j75N9n9%j74N8j74N8
$$ 5879 5647 5531 5415 5415 5241 5183 5009 4951 4893 4660 4602 4544 4486 4428 4370 4312 4138 4022 3964 3964 3906 3906 3732 3732 3557 3616 3557 3557 3383 3441 3267 3325
14046C325n8T%Tj16N8j16n8%N8n8TN8n8N8k32K32j74%j16J16n8N8j16N8Tj16%j16
$$ 3325 3267 3209 3209 3209 3093 3151 3035 2977 2977 3035 2977 2919 2977 2919 2977 2745 2977 2803 2803 2687 2803 2745 2803 2687 2745 2803 2687 2687 2571
14207B571%N8%Tn8TJ74j16%n8N8Tj16N8n8%UJ74j16N8j16%N8J74j16TJ74j16N8
$$ 2571 2571 2629 2629 2629 2571 2513 2687 2571 2571 2513 2571 2629 2513 2571 2513 2513 2513 2513 2687 2571 2629 2513 2513 2571 2745 2629 2513 2687 2571 2629
14373B629%VJ16j16J74n8N8TJ16N8Tj16N8J16%J16Tn8J16j16J74n8N8%VN8J75n8
$$ 2629 2629 2629 2629 2629 2745 2629 2803 2745 2803 2861 2977 3035 3093 2977 3035 3151 3151 3267 3383 3325 3441 3325 3499 3441 3499 3499 3499 3499 3499 3557 3732 3674
14550C674N8n8N8n8%N8%N8n8j16N8j75J75n8n9%n8N8j16J16n8j16n8T%J16j16N8
$$ 3674 3732 3674 3732 3674 3674 3732 3732 3790 3732 3616 3674 3499 3674 3616 3557 3557 3499 3557 3441 3557 3499 3383 3325 3267 3267 3383 3267 3325
14706C325j16N8n8%Tj74%n8%Tn8T%N8j16%TN8j16%n8%Tj16N8%j16J16n8j16%N8T
$$ 3325 3209 3267 3209 3209 3209 3035 3035 2977 2977 2977 2919 2861 2861 2919 2803 2803 2803 2861 2745 2745 2687 2687 2687 2571 2629 2629 2513 2629 2571 2455 2455 2513 2571
14888B571n8%n8N8n8T%N8%Tn8K32j74j16J16%n8TJ16n8%n8%UN8j17n8N8%Vj16J75
$$ 2571 2513 2513 2455 2513 2455 2397 2397 2455 2455 2455 2397 2629 2455 2339 2455 2455 2397 2339 2455 2397 2397 2339 2339 2339 2339 2397 2280 2222 2280 2280 2280 2280 2280 2164 2339
15082B339j17N8n8%N8n8N8j16%N8%UN8n8TJ16%j74%J16%N8j16J16n8%VN8n8N8j16
$$ 2339 2222 2280 2222 2222 2280 2222 2280 2164 2164 2222 2222 2222 2222 2280 2222 2164 2280 2280 2106 2106 2222 2222 2280 2164 2280 2222 2222 2222 2222 2222 2280 2222 2280 2164
15271B164J16N9n9N9N8n8n9J75j16%TN8n8K32k91N9N8J16n8N8n8N8J16j16J16%
$$ 2164 2280 2339 2280 2339 2397 2339 2280 2455 2339 2339 2339 2397 2339 2571 2280 2339 2397 2513 2455 2513 2455 2513 2629 2513 2629 2629
15415B629j16%J74j74%N8T%N8j16J16n8N8%j16J16%J16n8UJ16N8n8N8j16J16n8
$$ 2629 2513 2513 2687 2513 2513 2571 2629 2629 2687 2571 2687 2629 2687 2687 2571 2687 2687 2803 2745 2687 2629 2745 2803 2745 2803 2687 2803 2745
15570B745%n8J16j16%N8n8J16%Tn8TJ74n8%Tn8N8Tn8N8%Tn8J16n8%J16%Tn8%UJ16
$$ 2745 2745 2687 2803 2687 2687 2745 2687 2803 2803 2803 2745 2687 2861 2803 2803 2803 2745 2803 2861 2803 2861 2861 2861 2803 2919 2861 2861 2977 2977 2977 2919 2919 2919 2919 3035
15764C035j16%J16N8j16N8Tj74J16%N8n8TJ16N8n8%n8J16n8N8Uj16N8T%j16TJ74
$$ 3035 2919 2919 3035 3093 2977 3035 3093 2919 3035 3035 3093 3035 2977 3093 3151 3093 3093 3035 3151 3093 3151 3209 3267 3151 3209 3267 3267 3151 3035 3209
15930C209j16J16n8K32j16n8%N8n8%N8j16K32j74%J74n8TN8J16j16%J16n8%N8T
$$ 3209 3093 3209 3151 3383 3267 3209 3209 3267 3209 3209 3267 3151 3383 3209 3209 3383 3325 3267 3325 3441 3325 3325 3441 3383 3383 3441 3499
16079C499n8N8j16%TJ16N8N9j17N8%n8%J17%j17J17n9J17%Uj17J17N8j75N9N8T
$$ 3499 3441 3499 3383 3383 3383 3499 3557 3616 3499 3557 3557 3499 3499 3616 3616 3499 3616 3557 3674 3674 3674 3674 3557 3674 3732 3557 3616 3674 3732
16240C732n8N8%n8N8T%n8J74%Vn8j16J74n8N8%VN8%N8n8J16j16n8J16j16J16n8
$$ 3732 3674 3732 3732 3674 3732 3790 3790 3732 3906 3906 3906 3906 3906 3848 3732 3906 3848 3906 3906 3906 3906 3906 3964 3964 4022 3964 4080 3964 3906 4022 3906 4022 3964
16423C964N8%N8n8%J16%Tj16N8%TN8Tj16J16n8J16j16n8N8%TJ16N8j16%N8%j16
$$ 3964 4022 4022 4080 4022 4022 4138 4138 4138 4022 4080 4080 4080 4138 4196 4080 4196 4138 4254 4138 4080 4138 4138 4138 4254 4312 4196 4196 4254 4254 4138
16589D138J16j16J16j16N8T%j16N8J16%j16J74%j16%N8j16%N8T%n8N8j74n8K32
$$ 4138 4254 4138 4254 4138 4196 4254 4254 4138 4196 4312 4312 4196 4370 4370 4254 4254 4312 4196 4196 4254 4312 4312 4254 4312 4138 4080 4312
16739D312j16N8n8N8Un8UJ74%j16J74n8TN8%J16%n8j16N8n8N8%UN8T%j16%J16n8
$$ 4312 4196 4254 4196 4254 4312 4370 4312 4254 4196 4370 4370 4254 4428 4370 4312 4370 4370 4486 4486 4428 4312 4370 4312 4370 4370 4370 4370 4428 4486 4486 4370 4370 4486 4428
16927D428%n8TJ16n8N8%N8T%Tj74J74j16N8%n8N8T%Un8%N8j16%J16j16J16N8J16
$$ 4428 4428 4370 4312 4428 4370 4428 4428 4486 4544 4544 4544 4370 4544 4428 4486 4486 4428 4486 4544 4544 4544 4544 4486 4486 4544 4428 4428 4544 4428 4544 4602 4718
17104D718j16n8N8J16j16N8n8J16K33j75%N8%N9N8%TN8j16N8T%N8%K32n8T%UJ16
$$ 4718 4602 4544 4602 4718 4602 4660 4602 4718 4951 4776 4776 4834 4834 4893 4951 4951 4951 5009 4893 4951 5009 5009 5067 5067 5299 5241 5183 5183 5183 5183 5299
17276E299N8n8TN8j16%J16j16N8J74n8%n8N8n8J16j16TJ74%N8n8%n8TJ74%N8Tj74
$$ 5299 5357 5299 5241 5299 5183 5183 5299 5183 5241 5415 5357 5357 5299 5357 5299 5415 5299 5183 5357 5357 5415 5357 5357 5299 5241 5415 5415 5473 5531 5357
17442E357N8T%J16%N8Tn8K32j74J74N8J16K33j74n9%J17J16N8%N8J74J16Tn8N8
$$ 5357 5415 5473 5473 5589 5589 5647 5705 5647 5879 5705 5879 5937 6053 6286 6112 6053 6053 6170 6286 6344 6344 6402 6576 6692 6808 6750 6808
17592F808%J74%J74n8N8%J16%J17%n9J75%n8j17J75%j75%J75n8N8%k33%TN8%n8
$$ 6808 6808 6982 6982 7156 7098 7156 7156 7272 7272 7389 7389 7330 7505 7505 7447 7330 7505 7505 7330 7330 7505 7447 7505 7505 7272 7272 7272 7330 7330 7272
17758G272J17j17j16N8j74N8%n8Uj16%N8j74n8J16n8j16%Tj16TJ16j16%Tk91K33
$$ 7272 7389 7272 7156 7214 7040 7098 7098 7040 6982 6924 6808 6808 6866 6692 6634 6750 6692 6576 6576 6576 6460 6344 6460 6344 6344 6344 6053 6286
17913F286k33J17j75%Tj16J16j16TN8%k32%Tn8%n8U%j74J16j16TJ16j74N8Tj16T
$$ 6286 6053 6170 5995 5995 5995 5879 5995 5879 5763 5821 5821 5589 5589 5589 5531 5531 5473 5415 5357 5357 5183 5299 5183 5067 5183 5009 5067 5125 5009 4893
18079D893J16j16j17J17n9n8%j16%J16n8VN8j16n8N8n8%n8%n8TJ16k32J16n8TN8
$$ 4893 5009 4893 4776 4893 4834 4776 4776 4660 4660 4776 4718 4660 4602 4544 4602 4486 4428 4486 4428 4428 4370 4370 4312 4254 4370 4138 4254 4196 4138 4196
18245D196j74n8J16j16N8j16%Tj16J16k32N8%J16j16%j16%Wn9n8N8N9j75N8%n8
$$ 4196 4022 3964 4080 3964 4022 3906 3906 3906 3790 3906 3674 3732 3732 3848 3732 3732 3616 3616 3616 3616 3616 3616 3557 3499 3557 3616 3441 3499 3499 3441
18412C441%Tj16%N8%N8j74%n8%J16n8TJ16j16N8n8TN8%n8j74%K32j74%TN8j74%
$$ 3441 3441 3441 3325 3325 3383 3383 3441 3267 3267 3209 3209 3325 3267 3209 3325 3209 3267 3209 3151 3209 3209 3151 2977 2977 3209 3035 3035 3035 3093 2919 2919
18583B919N8T%j74N8%N8n8j16N8%TN8n8TN8%n8N8j74N8%Tn8N8n8N8j16%N8j16J16
$$ 2919 2977 3035 3035 2861 2919 2919 2977 2919 2803 2861 2861 2861 2919 2861 2803 2861 2861 2803 2861 2687 2745 2745 2745 2687 2745 2687 2745 2629 2629 2687 2571 2687
18761B687%Un8N8%n8%Tn8%N8j16N8%TN8j16%N8n8j16N8Tj16n8J16j16J16%n8T%
$$ 2687 2687 2687 2687 2629 2687 2687 2629 2629 2629 2571 2571 2629 2513 2571 2571 2571 2629 2513 2513 2571 2513 2397 2455 2513 2397 2339 2455 2339 2455 2455 2397 2339 2339
18943B339j17K33j75N9N8n8n9%N9%N8n8n9%UJ75k33J17%Tj17N8%j16%J16%j16J16
$$ 2339 2222 2455 2280 2339 2397 2339 2280 2280 2339 2339 2397 2339 2280 2280 2280 2280 2455 2222 2339 2339 2339 2222 2280 2280 2164 2164 2280 2280 2164 2280
19110B280%N9n9%N9n9%N9n9%N9J16%N8%j16K32j16n8K32n8N8%N8%N8%J16n8N8T
$$ 2280 2280 2339 2280 2280 2339 2280 2280 2339 2280 2280 2339 2455 2455 2513 2513 2397 2629 2513 2455 2687 2629 2687 2687 2745 2745 2803 2803 2919 2861 2919 2977
19281B977%TN8%N8%TJ74%n8K32k32N8J16j16J74j16J16%n8N8Tn8%Tj74J16n8J16
$$ 2977 2977 2977 3035 3035 3093 3093 3093 3267 3267 3209 3441 3209 3267 3383 3267 3441 3325 3441 3441 3383 3441 3499 3441 3441 3441 3267 3383 3325 3441
19442C441j16%j16%j16J16j74n8%Un8N8n8T%n8j16J74j16n8%Tj74%n8N8Tj16n8T
$$ 3441 3325 3325 3209 3209 3093 3209 3035 2977 2977 2977 2977 2919 2977 2919 2861 2861 2803 2687 2861 2745 2687 2687 2687 2513 2513 2455 2513 2571 2455 2397 2339
19614B339J16j16N8j17%n8N8n8%Tn8T%N8n8N8j16TJ74%j16%TN8n8U%j16J74n8N8
$$ 2339 2455 2339 2397 2280 2280 2222 2280 2222 2222 2222 2164 2106 2106 2164 2106 2164 2048 1932 2106 2106 1990 1990 1990 2048 1990 1932 1874 1874 1758 1932 1874 1932
19791A932n8j16K32j16TJ74j16J16j74J16%j16J16n8J16k32N8Vj16N8Tn8j16N8
$$ 1932 1874 1758 1990 1874 1758 1932 1816 1932 1758 1874 1874 1758 1874 1816 1932 1700 1758 1816 1874 1932 1816 1874 1932 1874 1758 1816
19935A816n8%J16N8j16n8J74j74J16%N8n8j16J74j74N8%J16%j16N8%J16n8%J16
$$ 1816 1758 1758 1874 1932 1816 1758 1932 1758 1874 1874 1932 1874 1758 1932 1758 1816 1816 1932 1932 1816 1874 1874 1990 1932 1932 2048
20079B048n8TJ16n8%TN8j74J74n8J16%UJ16j74%J16j74J16%VJ16n8TJ16n8N8%n8
$$ 2048 1990 1932 2048 1990 1990 1990 2048 1874 2048 1990 2106 2106 2106 2106 2222 2048 2048 2164 1990 2106 2106 2106 2106 2106 2222 2164 2106 2222 2164 2222 2222 2164
20256B164N8j16%N8%TJ16%j74N8n8N8n8%N8Tj16n8J16%n8j74J16n8TN8T%j16%U
$$ 2164 2222 2106 2106 2164 2164 2164 2280 2280 2106 2164 2106 2164 2106 2106 2164 2222 2106 2048 2164 2164 2106 1932 2048 1990 1932 1990 2048 2048 1932 1932 1932 1932
20433A932N8j74%J74n8%TN8n8%n8N8n8TN8J16j16N8j16TN8%N8n8J16%j74%N8Tn8
$$ 1932 1990 1816 1816 1990 1932 1932 1932 1990 1932 1932 1874 1932 1874 1816 1874 1990 1874 1932 1816 1700 1758 1758 1816 1758 1874 1874 1700 1700 1758 1816 1758
20605A758N8j74J16n8N8%Tn8j16N8%N8j16N8n8J16n8TN8J16%TJ16j74n8J16N8n8
$$ 1758 1816 1642 1758 1700 1758 1758 1758 1700 1584 1642 1642 1700 1584 1642 1584 1700 1642 1584 1642 1758 1758 1758 1874 1700 1642 1758 1816 1758
20760A758%WN8j16N8J16n8N8%j16N8Tn8j16%N8n8N8j16N8n8N8%j16K32j74%N8%
$$ 1758 1758 1758 1758 1758 1758 1816 1700 1758 1874 1816 1874 1874 1758 1816 1874 1816 1700 1700 1758 1700 1758 1642 1700 1642 1700 1700 1584 1816 1642 1642 1700 1700
20938A700N8n8J16k90J74j16N8Tn8N8n8%N8%Un8J16n8N8n8%n8TJ16%Uj16K32k32
$$ 1700 1758 1700 1816 1526 1700 1584 1642 1700 1642 1700 1642 1642 1700 1700 1700 1700 1642 1758 1700 1758 1700 1700 1642 1584 1700 1700 1700 1700 1584 1816 1584
21109A584J16%TN8%n8%n8J74n8T%N8%j16n8%J16%N8j16N8%N8J16j74%N8%Tn8J74
$$ 1584 1700 1700 1700 1758 1758 1700 1700 1642 1816 1758 1700 1700 1758 1758 1642 1584 1584 1700 1700 1758 1642 1700 1700 1758 1874 1700 1700 1758 1758 1758 1700 1874
21287A874%n8N8n8N8j74N8J16j16J16n8N8%Tn8N8n8%j16J16N8n8TN8Tn8J16j16
$$ 1874 1874 1816 1874 1816 1874 1700 1758 1874 1758 1874 1816 1874 1874 1874 1816 1874 1816 1816 1700 1816 1874 1816 1758 1816 1874 1816 1932 1816
21442A816N8J16n8%j74N8%J16%Uj74K32n8%n8j16N8%TJ16j74J16N8n8TJ16n8N8
$$ 1816 1874 1990 1932 1932 1758 1816 1816 1932 1932 1932 1932 1758 1990 1932 1932 1874 1758 1816 1816 1816 1932 1758 1874 1932 1874 1816 1932 1874 1932
21602A932j16N8n8%J16%j16N8j16%N8j16n8J74%n8j16%N8j74J16N8n8N8j74N8%
$$ 1932 1816 1874 1816 1816 1932 1932 1816 1874 1758 1758 1816 1700 1642 1816 1816 1758 1642 1642 1700 1526 1642 1700 1642 1700 1526 1584 1584
21752A584n8TJ74n8T%TN8Tn8%UN8n8j16J16j16J16%N8%Tj74J16Tn8UN8n8J16j74
$$ 1584 1526 1468 1642 1584 1526 1526 1526 1584 1642 1584 1584 1584 1584 1642 1584 1468 1584 1468 1584 1584 1642 1642 1642 1468 1584 1700 1642 1584 1526 1584 1526 1642 1468
21935A468J16n8J16n8j16J16Tj74K32j74j16J16%Tj16N8T%Uj16N8J16n8%n8%N8
$$ 1468 1584 1526 1642 1584 1468 1584 1700 1526 1758 1584 1468 1584 1584 1584 1468 1526 1584 1584 1584 1584 1468 1526 1642 1584 1584 1526 1526 1584
22090A584%n8N8T%N8j16%Tn8%N8%J16j16n8J16n8J16j16N8Tn8TJ16n8%N8j16N8
$$ 1584 1584 1526 1584 1642 1642 1700 1584 1584 1584 1526 1526 1584 1584 1700 1584 1526 1642 1584 1700 1584 1642 1700 1642 1584 1700 1642 1642 1700 1584 1642
22256A642n8%TN8n8TN8j16J16%TN8n8j16n8J16n8%J16j16J16j16n8J16N8n8TJ16
$$ 1642 1584 1584 1584 1642 1584 1526 1584 1468 1584 1584 1584 1642 1584 1468 1410 1526 1468 1468 1584 1468 1584 1468 1410 1526 1584 1526 1468 1584
22411A584%Tj74J16n8J16%Tj16J16n8J74j74N8%j16n8J16n8J16%n8%N8%n8%TN8
$$ 1584 1584 1584 1410 1526 1468 1584 1584 1584 1468 1584 1526 1700 1526 1584 1584 1468 1410 1526 1468 1584 1584 1526 1526 1584 1584 1526 1526 1526 1584
22572A584j16%TN8Tn8%VJ16n8%n8N8%n8%n8J16j16J16N8%n8%N8j16N8j16%TN8T
$$ 1584 1468 1468 1468 1526 1584 1526 1526 1526 1526 1526 1642 1584 1584 1526 1584 1584 1526 1526 1468 1584 1468 1584 1642 1642 1584 1584 1642 1526 1584 1468 1468 1468 1526 1584
22760A584%n8j16J74n8T%J16%j16J16n8T%WN8Tk32J74n8%TJ16n8N8n8N8k32K32
$$ 1584 1584 1526 1410 1584 1526 1468 1468 1584 1584 1468 1584 1526 1468 1468 1468 1468 1468 1468 1526 1584 1352 1526 1468 1468 1468 1584 1526 1584 1526 1584 1352 1584
22937A584n8UK32n8j16N8%Vn8N8j16n8J74%Tn8UJ74n8N8J16n8UN8n8J16j16n8%
$$ 1584 1526 1468 1410 1642 1584 1468 1526 1526 1526 1526 1526 1468 1526 1410 1352 1526 1526 1526 1468 1410 1352 1526 1468 1526 1642 1584 1526 1468 1526 1468 1584 1468 1410 1410
23126A410J16N8j16%N8T%Tj16J74j16TJ16Tn8%n8N8%Tn8N8n8%N8Tk32J16%N8%j16
$$ 1410 1526 1584 1468 1468 1526 1584 1584 1584 1468 1642 1526 1410 1526 1642 1584 1584 1526 1584 1584 1584 1526 1584 1526 1526 1584 1642 1410 1526 1526 1584 1584 1468
23303A468J74%n8N8j74J16n8N8%J16%n8TN8%TN8n8J16n8%UN8%n8N8J74n8%n8J16
$$ 1468 1642 1642 1584 1642 1468 1584 1526 1584 1584 1700 1700 1642 1584 1642 1642 1642 1700 1642 1758 1700 1700 1700 1700 1758 1758 1700 1758 1932 1874 1874 1816 1932
23480A932N8n8J74N8T%TN8J17N8%N8TJ16%n8N8K90%VK32n8N8%TJ16N8n8%J74%T
$$ 1932 1990 1932 2106 2164 2222 2222 2222 2280 2397 2455 2455 2513 2571 2687 2687 2629 2687 2977 2977 2977 2977 2977 3209 3151 3209 3209 3209 3325 3383 3325 3325 3499 3499 3499
23669C499K33n8%N8%Tj16J74%J16j74J74n8N8%TN8n8N8%TN8%TN8j16J16n8N8n8
$$ 3499 3732 3674 3674 3732 3732 3732 3616 3790 3790 3906 3732 3906 3848 3906 3906 3906 3964 3906 3964 3964 3964 4022 4022 4022 4080 3964 4080 4022 4080 4022
23835D022%J16n8%Tn8%N8j16J16j16N8%n8%n8%N8j16J16n8%n8N8j74J74n8j16%U
$$ 4022 4022 4138 4080 4080 4080 4022 4022 4080 3964 4080 3964 4022 4022 3964 3964 3906 3906 3964 3848 3964 3906 3906 3848 3906 3732 3906 3848 3732 3732 3732 3732
24006C732N8%k33J17j75n8J75j17n8J16j16%Un8%N8k32N8%N8%n8UJ74j74N8n8T
$$ 3732 3790 3790 3557 3674 3499 3441 3616 3499 3441 3557 3441 3441 3441 3441 3383 3383 3441 3209 3267 3267 3325 3325 3267 3209 3151 3325 3151 3209 3151 3093
24173C093J74j16j74J16j16%Un8T%N8%j74N8J16j16%Tj16%J74j16%j74J16n8N8
$$ 3093 3267 3151 2977 3093 2977 2977 2977 2977 2919 2861 2861 2919 2919 2745 2803 2919 2803 2803 2803 2687 2687 2861 2745 2745 2571 2687 2629 2687
24328B687%Uj16N8n8TJ74n8%k32J16j16n8%UN8j17N9n9n8N8%n8TN8%Tn8J75j17
$$ 2687 2687 2687 2687 2571 2629 2571 2513 2687 2629 2629 2397 2513 2397 2339 2339 2339 2339 2397 2280 2339 2280 2222 2280 2280 2222 2164 2222 2222 2222 2164 2339 2222
24505B222n8%N8j16J16j16J16k32J74j16N8%Tn8N8%n8%n8TJ74n8Tj16J16%Tj16
$$ 2222 2164 2164 2222 2106 2222 2106 2222 1990 2164 2048 2106 2106 2106 2048 2106 2106 2048 2048 1990 1932 2106 2048 1990 1874 1990 1990 1990 1874
24660A874%J16n8%J16k32J74j74N8n8%J16j16J16n8%j74J74J16k32J16j16%Uj16
$$ 1874 1874 1990 1932 1932 2048 1816 1990 1816 1874 1816 1816 1932 1816 1932 1874 1874 1700 1874 1990 1758 1874 1758 1758 1758 1758 1642
24804A642J16n8N8n8T%j74J16N8n8%n8N8%n8%N8j16%J74n8T%Un8%N8T%j74N8%N8
$$ 1642 1758 1700 1758 1700 1642 1642 1468 1584 1642 1584 1584 1526 1584 1584 1526 1526 1584 1468 1468 1642 1584 1526 1526 1526 1526 1468 1468 1526 1584 1584 1410 1468 1468 1526
24992A526n8%Tn8J16n8%Un8J74j16%n8%N8J16j16n8N8T%n8N8Tj16n8N8j16%J16
$$ 1526 1468 1468 1468 1410 1526 1468 1468 1468 1468 1410 1584 1468 1468 1410 1410 1468 1584 1468 1410 1468 1526 1526 1468 1526 1584 1468 1410 1468 1352 1352 1468
25164A468N8n8j16J16%Tn8%n8TJ74n8J16j74J16%VN8%Tj16J74j16N8%n8N8n8Tj16
$$ 1468 1526 1468 1352 1468 1468 1468 1410 1410 1352 1294 1468 1410 1526 1352 1468 1468 1468 1468 1468 1526 1526 1526 1410 1584 1468 1526 1526 1468 1526 1468 1410 1294
25341A294J16n8J16%Tj16N8n8J74j16N8j16J16%j16J16j74N8%N8%TN8%J16j16n8T
$$ 1294 1410 1352 1468 1468 1468 1352 1410 1352 1526 1410 1468 1352 1468 1468 1352 1468 1294 1352 1352 1410 1410 1410 1468 1468 1584 1468 1410 1352
25497A352%N8%n8%TJ74j16n8N8T%n8TN8TJ16n8%Tn8N8Tj16J16j16%J16n8N8T%j74
$$ 1352 1352 1410 1410 1352 1352 1352 1526 1410 1352 1410 1468 1468 1410 1352 1410 1468 1584 1526 1526 1526 1468 1526 1584 1468 1584 1468 1468 1584 1526 1584 1642 1642 1468
25679A468J74j74%J74n8N8n8J16n8j16J74%n8J16%n8%N8%n8J16%Un8%N8Tn8%N8
$$ 1468 1642 1468 1468 1642 1584 1642 1584 1700 1642 1526 1700 1700 1642 1758 1758 1700 1700 1758 1758 1700 1816 1816 1816 1816 1758 1758 1816 1874 1816 1816 1874
25851A874J16n8TN8%N8j16J16%Tn8J16Tj16N8%Tn8J16j74J16N8n8N8%VN8n8TJ16
$$ 1874 1990 1932 1874 1932 1932 1990 1874 1990 1990 1990 1932 2048 2164 2048 2106 2106 2106 2048 2164 1990 2106 2164 2106 2164 2164 2164 2164 2164 2222 2164 2106 2222
26028B222j74N8%J16N8n8%N8n8J17j17%N8%n8J17j17n8N8J17j17n8J75j17%N8N9
$$ 2222 2048 2106 2106 2222 2280 2222 2222 2280 2222 2339 2222 2222 2280 2280 2222 2339 2222 2164 2222 2339 2222 2164 2339 2222 2222 2280 2339
26178B339n9j16J16%Un8N8j16J16%n8%N8n8T%TN8TN9n9%n8j16J74%N9%n9J17j17
$$ 2339 2280 2164 2280 2280 2280 2280 2222 2280 2164 2280 2280 2222 2222 2280 2222 2164 2164 2164 2222 2280 2339 2280 2280 2222 2106 2280 2280 2339 2339 2280 2397 2280
26355B280J17j17n8N8%N9n9j16K33j75%N8n8N8N9%Tn9%n8N8n8J17%Tn9n8J17n9
$$ 2280 2397 2280 2222 2280 2280 2339 2280 2164 2397 2222 2222 2280 2222 2280 2339 2339 2339 2280 2280 2222 2280 2222 2339 2339 2339 2280 2222 2339 2280
26516B280n8N8J17j75N8%j16N8Tj16N8n8N8Tn8U%n8%J74k32%N8%N8n8N8j16J16
$$ 2280 2222 2280 2397 2222 2280 2280 2164 2222 2280 2164 2222 2164 2222 2280 2222 2164 2106 2106 2048 2048 2222 1990 1990 2048 2048 2106 2048 2106 1990 2106
26682B106%j16N8%J16k32J74j16J16n8%j16J74n8N8j16%n8J74j16N8j16J74j16
$$ 2106 2106 1990 2048 2048 2164 1932 2106 1990 2106 2048 2048 1932 2106 2048 2106 1990 1990 1932 2106 1990 2048 1932 2106 1990
26815A990n8J16n8%Tn8N8Uj74N8j16J16n8%TN8%n8%WN8n8N8n8%Vn8Tj16J74n8N8
$$ 1990 1932 2048 1990 1990 1990 1932 1990 2048 2106 1932 1990 1874 1990 1932 1932 1932 1990 1990 1932 1932 1932 1932 1932 1932 1990 1932 1990 1932 1932 1932 1932 1932 1874 1816 1700 1874 1816 1874
27026A874n8TN8%n8N8Tj16%Tn8%UN8%n8%VN8j16N8%N8n8N8n8VJ74j16n8%Uj16J16
$$ 1874 1816 1758 1816 1816 1758 1816 1874 1758 1758 1758 1700 1700 1700 1700 1758 1758 1700 1700 1700 1700 1700 1758 1642 1700 1700 1758 1700 1758 1700 1642 1584 1526 1700 1584 1526 1526 1526 1526 1410 1526
27247A526N8j16%j16J16N8n8T%n8J16j74N8J16j74J74j74N8%Tn8%N8%j16N8n8N8
$$ 1526 1584 1468 1468 1352 1468 1526 1468 1410 1410 1352 1468 1294 1352 1468 1294 1468 1294 1352 1352 1352 1294 1294 1352 1352 1236 1294 1236 1294
27402A294%n8N8n8N8%n8N8%Tn8N8%Vj16%N8%Uj16J74%j16J16n8TN8%Tn8%N8%N8
$$ 1294 1294 1236 1294 1236 1294 1294 1236 1294 1294 1294 1236 1294 1294 1294 1294 1294 1178 1178 1236 1236 1236 1236 1120 1294 1294 1178 1294 1236 1178 1236 1236 1236 1178 1178 1236 1236 1294
27607A294n8TN8n8N8j74K32n8j74J16n8N8j16K32N8j74J74j74%TJ16j74J16%n8T
$$ 1294 1236 1178 1236 1178 1236 1062 1294 1236 1062 1178 1120 1178 1062 1294 1352 1178 1352 1178 1178 1178 1294 1120 1236 1236 1178 1120
27751A120%N8%N8%j16N8n8j17J75n8%n8%N8n8J16n8N8n8TJ16j16N8n8j17J75n8
$$ 1120 1120 1178 1178 1236 1236 1120 1178 1120 1003 1178 1120 1120 1062 1062 1120 1062 1178 1120 1178 1120 1062 1178 1062 1120 1062 945 1120 1062
27906A062N8n8%UN8%j75J17n9%N9%n9j16J75n9J17N8%j75%TN9j17J17n9n8%J17
$$ 1062 1120 1062 1062 1062 1062 1120 1120 945 1062 1003 1003 1062 1062 1003 887 1062 1003 1120 1178 1178 1003 1003 1003 1062 945 1062 1003 945 945 1062
28072A062j17j16J16N8j16N8%UN8j74J74%j16%n8J74%UN9j17N8%N9j75N8n8N8n8
$$ 1062 945 829 945 1003 887 945 945 945 945 1003 829 1003 1003 887 887 829 1003 1003 1003 1003 1062 945 1003 1003 1062 887 945 887 945 887
28239H87N8%j16%J16N8j16n8J16j16N8n8K33k33J74n8N8N9n9N9%n9%VN9j75J16
$$ 887 945 945 829 829 945 1003 887 829 945 829 887 829 1062 829 1003 945 1003 1062 1003 1062 1062 1003 1003 1003 1003 1003 1062 887 1003
28399A003N9n9J17j17%N9n9N9%VJ16j16%n9N9%n9J75n8TJ16%j16N8n8N8%N8%Uj16
$$ 1003 1062 1003 1120 1003 1003 1062 1003 1062 1062 1062 1062 1062 1178 1062 1062 1003 1062 1062 1003 1178 1120 1062 1178 1178 1062 1120 1062 1120 1120 1178 1178 1178 1178 1062
28588A062J74j74J16%TJ16j74%N8%J16n8N8Tk32J74%n8j16J74%Tn8N8n8%n8J16
$$ 1062 1236 1062 1178 1178 1178 1294 1120 1120 1178 1178 1294 1236 1294 1352 1120 1294 1294 1236 1120 1294 1294 1294 1236 1294 1236 1236 1178 1294
28743A294j16J74n8TN8%j16N8J16n8N8n8N8j16J16n8TJ16n8N8n8N8n8J16%n8%J16
$$ 1294 1178 1352 1294 1236 1294 1294 1178 1236 1352 1294 1352 1294 1352 1236 1352 1294 1236 1352 1294 1352 1294 1352 1294 1410 1410 1352 1352 1468
28898A468j16%N8%N8%TJ16j16%J16j16n8J16n8J16n8j16%TJ16n8%n8TN8U%K90l48
$$ 1468 1352 1352 1410 1410 1468 1468 1468 1584 1468 1468 1584 1468 1410 1526 1468 1584 1526 1410 1410 1410 1526 1468 1468 1410 1352 1410 1468 1526 1526 1816 1468
29070A468J16%Un8%Tn8N8%J16j74J16Tn8J16j74%N8n8%j16N8T%N8%Tj16J74n8N8
$$ 1468 1584 1584 1584 1584 1526 1526 1526 1468 1526 1526 1642 1468 1584 1700 1642 1758 1584 1584 1642 1584 1584 1468 1526 1584 1584 1642 1642 1642 1526 1700 1642 1700
29247A700n8%J16j16%N8%j74J16N8j16N8%N8n8T%TN8j74J16%N8j16J16j16n8N8
$$ 1700 1642 1642 1758 1642 1642 1700 1700 1526 1642 1700 1584 1642 1642 1700 1642 1584 1584 1584 1642 1468 1584 1584 1642 1526 1642 1526 1468 1526
29402A526n8K32j16N8%j16J16j74J74j16J16n8TJ16j16n8J16N8%n8N8Tj16N8n8
$$ 1526 1468 1700 1584 1642 1642 1526 1642 1468 1642 1526 1642 1584 1526 1642 1526 1468 1584 1642 1642 1584 1642 1700 1584 1642 1584
29540A584J16n8%n8J16j16N8n8N8%j16J16%n8N8%j74J74%j74N8Tn8%j74J74%N8
$$ 1584 1700 1642 1642 1584 1700 1584 1642 1584 1642 1642 1526 1642 1642 1584 1642 1642 1468 1642 1642 1468 1526 1584 1526 1526 1352 1526 1526 1584
29696A584%j74J16n8%Vn8J16n8TJ16%J16j74%Tn8%J16n8TJ16j74J16N8n8TN8%n8
$$ 1584 1584 1410 1526 1468 1468 1468 1468 1468 1410 1526 1468 1410 1526 1526 1642 1468 1468 1468 1410 1410 1526 1468 1410 1526 1352 1468 1526 1468 1410 1468 1468 1410
29873A410N8j16%N8Tj74N8n8J16Tj16TN8J16j16n8%J16j16n8J74n8N8j16n8%TN8
$$ 1410 1468 1352 1352 1410 1468 1294 1352 1294 1410 1526 1410 1294 1352 1468 1352 1294 1294 1410 1294 1236 1410 1352 1410 1294 1236 1236 1236 1294
30028A294j16%TJ16j16N8n8%n8N8Tj74n9N9N8Uj74n9J17j17N9%Tn9N9n9N9%Tn9
$$ 1294 1178 1178 1178 1294 1178 1236 1178 1178 1120 1178 1236 1062 1003 1062 1120 1178 1236 1062 1003 1120 1003 1062 1062 1062 1003 1062 1003 1062 1062 1062 1003
30200A003%N9%n9N9n9N9%n9N9%TN8n8%Vj17J17N8j17%J75j75j16J16j16J16%TJ17
$$ 1003 1003 1062 1062 1003 1062 1003 1062 1062 1003 1062 1062 1062 1120 1062 1062 1062 1062 1062 945 1062 1120 1003 1003 1178 1003 887 1003 887 1003 1003 1003 1120
30377A120j17j74N8%J16k32K32j74J16%j16%N8n8J16%j16N8n8%J74n8T%n8%J16
$$ 1120 1003 829 887 887 1003 771 1003 829 945 945 829 829 887 829 945 945 829 887 829 829 1003 945 887 887 829 829 945
30526I45n8%UJ75n9j74J74j16%J75j17n8J16j16N8Tj16J16j16%N8T%N9j17N8k32
$$ 945 887 887 887 887 1062 1003 829 1003 887 887 1062 945 887 1003 887 945 1003 887 1003 887 887 945 1003 1003 1062 945 1003 771
30682G71N8%J74j74N8U%N9n9%n8N8%J17j17N9n9%n8j74%J74n8N8n8TN8J16k90J16
$$ 771 829 829 1003 829 887 945 1003 1003 1062 1003 1003 945 1003 1003 1120 1003 1062 1003 1003 945 771 771 945 887 945 887 829 887 1003 713 829
30853H29J74%j16TJ74n8J16n8%j16J16N8N9j17%N8n8N8j16J75j75J75j17j16K33
$$ 829 1003 1003 887 771 945 887 1003 945 945 829 945 1003 1062 945 945 1003 945 1003 887 1062 887 1062 945 829 1062
30992A062n9%UN9n9%J17j17J17%n8%n9j16J75%n9%n8J75n8n9J17j17%n8N8%TN9
$$ 1062 1003 1003 1003 1003 1062 1003 1003 1120 1003 1120 1120 1062 1062 1003 887 1062 1062 1003 1003 945 1120 1062 1003 1120 1003 1003 945 1003 1003 1003 1062
31164A062%j17N8j16n8K33%n9N9n9n8N8N9n9J17j17%j16N8T%Un8N8%TJ17n8%N8
$$ 1062 1062 945 1003 887 829 1062 1062 1003 1062 1003 945 1003 1062 1003 1120 1003 1003 887 945 1003 1003 1003 1003 945 1003 1003 1003 1120 1062 1062 1120
31335A120%n8N8T%j16N8J16n8N8%WN8n8%Tn8J16%j74N8%J16j16%N8j16J16N8n8
$$ 1120 1120 1062 1120 1178 1178 1062 1120 1236 1178 1236 1236 1236 1236 1236 1236 1294 1236 1236 1236 1178 1294 1294 1120 1178 1178 1294 1178 1178 1236 1120 1236 1294 1236
31518A236J16j16%J16n8N8%N8Tn8TJ74%j16N8j74K32n8N8%N8%N8n8%UN8Tn8J16
$$ 1236 1352 1236 1236 1352 1294 1352 1352 1410 1468 1410 1352 1526 1526 1410 1468 1294 1526 1468 1526 1526 1584 1584 1642 1584 1584 1584 1584 1642 1700 1642 1758
31690A758j74J16J74j16n8%N8TJ16j74j16J74J16n8N8j16J74n8N8n8j16K32k32
$$ 1758 1584 1700 1874 1758 1700 1700 1758 1816 1932 1758 1642 1816 1932 1874 1932 1816 1990 1932 1990 1932 1816 2048 1816
31817A816J74%N8Tn8J16j16n8N8TJ74n8j16J16%Uj16J74n8%TN8%n8%N8N9%Tn9N9
$$ 1816 1990 1990 2048 2106 2048 2164 2048 1990 2048 2106 2280 2222 2106 2222 2222 2222 2222 2106 2280 2222 2222 2222 2280 2280 2222 2222 2280 2339 2339 2339 2280 2339
31994B339n9%
$$ 2339 2280 2280
32000B280
$$ 2280
##END= 
