##TITLE= GC of headspace vapours of yellow passionfruit
##JCAMP-DX= 5.01
##DATA TYPE= GAS CHROMATOGRAPH
##DATA CLASS= XYDATA
##ORIGIN= Dept of Chemistry, UWI, Mona, JAMAICA
##OWNER= public domain
##DATE= 00/04/26
##TIME= 18:00:00
##XUNITS= TIME
##YUNITS= ARBITRARY
##XFACTOR= 1.4509556E-3
##YFACTOR= 1.00381385E-4
##FIRSTX= 350.057687
##FIRSTY= -0.128125
##LASTX= 1801.013284
##NPOINTS= 287
##XYDATA= (X++(Y..Y))
241260a276L42L11l113%L1%L2L1%L1L237l73l43l73l74l42l74l73l43K989j25e60
321680g16j56j55j56j56j24j56j55j25%L1L1%L1%L2j25j25j24r3j25j25j24r3b833
409093F2m67m67m67m98m67m36J87J87J87J87J86J87J87L673N075N074l673l767G658
479024H72r34r34r34r34r34K740%L1L1M856P534J2639p253p534j1301K646J152B895
545458D047k210R65R65J31841O6247P94346%q25415j32183j6282j5441Q2934J01270B34855
597906I95673L1M98p25733j13723r7503j0989j0959j0958k397O289N790j3511F538
646857I869M451M421M421M451J7496K7894K2383p1228o040o039o040l73M42624A0647
699305C4213R61988%r64634k2290k833j370K024L9879k6555P3626q1533o85j308I246
$$ plain form
241260 -1276 -934 -623 -3736 -3736 -3705 -3705 -3673 -3642 -3642 -3611 -374 -747 -1090 -1463 -1837 -2179 -2553 -2926 -3269 -280 -405 -560
321680 -716 -872 -1027 -1183 -1339 -1463 -1619 -1774 -1899 -1899 -1868 -1837 -1837 -1806 -1806 -1774 -1899 -2024 -2148 -2241 -2366 -2491 -2615 -2708 -2833
409093 62 -405 -872 -1339 -1837 -2304 -2740 -2553 -2366 -2179 -1992 -1806 -1619 -1432 2241 7316 12390 8717 4950 7658
479024 872 -62 -996 -1930 -2864 -3798 -1058 -1058 -1027 -996 3860 11394 24033 16780 9246 -2055 591 1743 2895
545458 4047 1837 2802 3767 135608 201855 996201 996201 170786 38603 22321 6880 89814 191084 234855
597906 995673 995704 996202 270469 156746 59243 48254 37295 26337 23940 30229 36019 22508 6538
646857 9869 14320 18741 23162 27613 45109 73003 95386 24158 18118 12079 6039 5666 448290 10647
699305 34213 996201 996201 31567 9277 6444 5074 7098 46977 20422 94048 12515 11830 10522 9246
751752G938j214r3K3660r495Q1315q3557o631o631L736J5597R5511j11481j588F039
804200E5601j1052J058J16027j27919K3909m4113k210J556J432R81912r69366A4134
849654A7402P29748p32612n167O630J07621j11138n915J6406K5123k4718M6230A2919
895108D3739l1411n759j25L43K3255M68058m73755o164m079m358j899L487K8547A1705
947555F506l486L73K242L393N3453o1298J276J277J276J121J152J24k428k428C642
1003499B241j400J058j494r4r3L705J214J3075j3542K4656j8056M2027m5141L331H032
1059443B0702j4320p16j712J712r34l798J806N385Q0195p3284r121l611j87j56D390
1115387C580l42Q71K397k303J027k273N137m36J650J650L1661j8866j8897l580A961
$$ plain form
751752 7938 6724 6631 30291 20796 102111 18554 11923 5292 9028 24625 120136 8655 7067 6039
804200 55601 44549 45607 161634 33715 57624 13511 11301 12857 14289 996201 26835 14134
849654 17402 747150 14538 9371 16001 123622 12484 6569 22975 48098 23380 69610 12919
895108 43739 12328 6569 6444 6787 30042 498100 24345 18181 14102 9744 7845 11332 39879 11705
947555 6506 3020 3393 5635 9028 62481 1183 2459 3736 5012 6133 7285 7409 4981 2553 3642
1003499 2241 841 1899 405 311 218 3923 5137 18212 4670 29326 11270 53297 8156 11487 8032
1059443 20702 6382 5666 3954 5666 4732 934 2740 8125 88320 15036 5915 2304 2117 1961 4390
1115387 3580 3238 4109 6506 4203 5230 2957 8094 7658 9308 10958 42619 23753 4856 1276 1961
1171330B646O85l1J868J9395k1232j027j028K615n29n60J805j587j557J868r96A308
1230771C456l456@
$$ plain form
1171330 2646 3331 3300 5168 24563 3331 2304 1276 3891 3362 2802 4607 3020 1463 3331 2335 1308
1230771 3456 0 0
1241260@  $$checkpoint
##END=