##TITLE= Compound file, contains several data records
##JCAMP-DX= 5.0
##DATA TYPE= LINK
##BLOCKS=2
##ORIGIN= Department of Chemistry, UWI, JAMAICA
##OWNER= public domain
##TITLE= aspirin in DMSO,  2-(acetyloxy) benzoic acid
##JCAMP-DX= 5.01  $$ exported from JSpecView
##DATA TYPE= NMR SPECTRUM
##DATA CLASS= XYDATA
##BLOCK ID=1
##ORIGIN= rbadger  PROTON-UWSP
##OWNER= public domain
##LONGDATE= 2012/03/18 18:56:22.0774 -0500 $$ export date from JSpecView
##SPECTROMETER/DATA SYSTEM= Bruker BioSpin GmbH 400 MHz
##$MODELS=
<Models>
<ModelData id="aspirin" type="MOL">
aspirin (2-(acetoxyl)benzoic acid)
RLACD/Labs0520021140  
http://wwwchem.uwimona.edu.jm/spectra
 21 21  0  0  0  0  0  0  0  0  0 V2000
   -0.8665    0.8024    0.0000 C   0  0  0  0  0  0  0  0  0  0  0  0
    0.4499    0.2908    0.0000 C   0  0  0  0  0  0  0  0  0  0  0  0
    1.5489    1.1509    0.0000 C   0  0  0  0  0  0  0  0  0  0  0  0
    1.3462    2.5308    0.0000 C   0  0  0  0  0  0  0  0  0  0  0  0
    0.0581    3.0583    0.0000 C   0  0  0  0  0  0  0  0  0  0  0  0
   -1.0298    2.1931    0.0000 C   0  0  0  0  0  0  0  0  0  0  0  0
   -2.1591    0.0020    0.0000 C   0  0  0  0  0  0  0  0  0  0  0  0
    1.5412   -2.0441    0.0000 C   0  0  0  0  0  0  0  0  0  0  0  0
    2.9836   -1.6136    0.0000 C   0  0  0  0  0  0  0  0  0  0  0  0
    0.5219   -1.1013    0.0000 O   0  0  0  0  0  0  0  0  0  0  0  0
   -3.2313    0.5672    0.0000 O   0  0  0  0  0  0  0  0  0  0  0  0
   -2.0988   -1.3365    0.0000 O   0  0  0  0  0  0  0  0  0  0  0  0
    1.1799   -3.1900    0.0000 O   0  0  0  0  0  0  0  0  0  0  0  0
    2.5593    0.7752    0.0000 H   0  0  0  0  0  0  0  0  0  0  0  0
    2.2106    3.1880    0.0000 H   0  0  0  0  0  0  0  0  0  0  0  0
   -0.0976    4.1321    0.0000 H   0  0  0  0  0  0  0  0  0  0  0  0
   -2.0482    2.5645    0.0000 H   0  0  0  0  0  0  0  0  0  0  0  0
   -1.1721   -1.6380    0.0000 H   0  0  0  0  0  0  0  0  0  0  0  0
    3.5898   -2.5187    0.0000 H   0  0  0  0  0  0  0  0  0  0  0  0
    3.2178   -1.0204   -0.8881 H   0  0  0  0  0  0  0  0  0  0  0  0
    3.2178   -1.0204    0.8881 H   0  0  0  0  0  0  0  0  0  0  0  0
  1  2  4  0  0  0  0
  1  6  4  0  0  0  0
  1  7  1  0  0  0  0
  2 10  1  0  0  0  0
  2  3  4  0  0  0  0
  3 14  1  0  0  0  0
  3  4  4  0  0  0  0
  4 15  1  0  0  0  0
  4  5  4  0  0  0  0
  5  6  4  0  0  0  0
  5 16  1  0  0  0  0
  6 17  1  0  0  0  0
  7 12  4  0  0  0  0
  7 11  4  0  0  0  0
  8  9  1  0  0  0  0
  8 10  1  0  0  0  0
  8 13  2  0  0  0  0
  9 21  1  0  0  0  0
  9 20  1  0  0  0  0
  9 19  1  0  0  0  0
 12 18  1  0  0  0  0
M  END
</ModelData>
</Models>
##$PEAKS=
<Peaks type="HNMR" xUnits="ppm" yUnits="arbitrary units" >
<PeakData  id="1" title="methyl group ~2.23" peakShape="singlet" model="aspirin" atoms="19,20,21"  xMax="2.36" xMin="2.1"  yMax="10000" yMin="0" />
<PeakData  id="2" title="OH ~13.10" peakShape="multiplet" model="aspirin" atoms="18"  xMax="13.30" xMin="12.95"  yMax="10000" yMin="0" />
<PeakData  id="3" title="H14 ~7.18" peakShape="multiplet" model="aspirin" atoms="14"  xMax="7.25" xMin="7.07"  yMax="10000" yMin="0" />
<PeakData  id="4" title="H16 ~7.36" peakShape="multiplet" model="aspirin" atoms="16"  xMax="7.45" xMin="7.28"  yMax="10000" yMin="0" />
<PeakData  id="5" title="H15 ~7.62" peakShape="multiplet" model="aspirin" atoms="15"  xMax="7.70" xMin="7.54"  yMax="10000" yMin="0" />
<PeakData  id="6" title="H17 ~7.93" peakShape="multiplet" model="aspirin" atoms="17"  xMax="8.01" xMin="7.85"  yMax="10000" yMin="0" />
</Peaks>
##SOLVENT NAME= DMSO-D6
##.OBSERVE FREQUENCY= 400.132470966543
##.OBSERVE NUCLEUS= ^1H
##XUNITS= HZ
##YUNITS= ARBITRARY UNITS
##XFACTOR= 1
##YFACTOR= 9.579479E-03
##FIRSTX= 5.601995E+03
##FIRSTY= 0
##LASTX= -4.000910E+02
##NPOINTS= 23916
##MINY= -1.496560
##MAXY= 9.577982E+03
##XYDATA= (X++(Y..Y))
5601.99511719@%Z5l1L1%S3L1l1%S2l1L1%S9L1l1%V2l1L1Tl1%U2L1l1%YL1@
5545.0128825422@%T3L1l1%S1L1l1%S0l1L1%XL1l1%XL1l1%S1l1L1%T8L1l1%WL1@
$$ 0 0 0 0 0 0 0 0 0 0 0 0 0 0 0 0 0 0 0 0 0 0 0 0 31 0 0 0 0 0 0 0 0 0 0 0 0 31 0 0 0 0 0 0 0 0 0 0 0 -31 0 0 0 0 0 0 0 31 0 0 0 0 0 0 0 31 0 0 0 0 0 0 0 0 0 0 0 0 -31 0 0 0 0 0 0 0 0 0 0 0 0 0 0 0 0 0 0 0 0 0 0 0 0 0 0 0 0 0 31 0 0 0 0 0 0 31 0
5515.6736274248@%S0L1l1%S3L1l1%YL1l1%S7L1l1%TL1l1%sL1l1%S0L1l1%ZL1@
$$ 0 0 0 0 0 0 0 0 0 0 0 31 0 0 0 0 0 0 0 0 0 0 0 0 0 0 31 0 0 0 0 0 0 0 0 31 0 0 0 0 0 0 0 0 0 0 0 0 0 0 0 0 0 0 31 0 0 0 31 0 0 0 0 0 0 0 0 0 0 31 0 0 0 0 0 0 0 0 0 0 0 31 0 0 0 0 0 0 0 0 0 31 0
5492.2953000071@%sL1l1%S5L1l1%UL1l1%VL1l1%sL1l1%ZL1l1%UL1l1%TL1l1@
$$ 0 0 0 0 0 0 0 0 0 0 31 0 0 0 0 0 0 0 0 0 0 0 0 0 0 0 0 31 0 0 0 0 31 0 0 0 0 0 31 0 0 0 0 0 0 0 0 0 0 31 0 0 0 0 0 0 0 0 0 31 0 0 0 0 31 0 0 0 31 0 0
5474.5384623545@%L1l1L1l1%VL1l1%S1L1l1%VL1l1%L1l1%L1l1%VL1%l1L1%l1C1
$$ 0 0 31 0 31 0 0 0 0 0 31 0 0 0 0 0 0 0 0 0 0 0 0 31 0 0 0 0 0 31 0 0 31 0 0 31 0 0 0 0 0 31 31 0 31 31 0 31
5462.4540912746C1l1L1%Tl1L1%l1%sL1l1%L1l1L1l1%sL1l1%WL1l1%VL1l1%L1@
$$ 31 0 31 31 31 0 31 31 0 0 0 0 0 0 0 0 0 0 31 0 0 31 0 31 0 0 0 0 0 0 0 0 0 0 31 0 0 0 0 0 0 31 0 0 0 0 0 31 0 0 31 0
5449.3677665798@%UL1%l1%VL1l1%TL1%Tl1%TL1l1L1%l1L1l1%WL1l1L1l1L1l1@
$$ 0 0 0 0 31 31 0 0 0 0 0 31 0 0 0 31 31 31 0 0 0 31 0 31 31 0 31 0 0 0 0 0 0 31 0 31 0 31 0 0
5439.39120996@L1l1L1l1L1%l1%sL1%l1L1%Vl1%L1%l1L1l1%L1l1L1l1L1l1@
$$ 0 31 0 31 0 31 31 0 0 0 0 0 0 0 0 0 0 31 31 0 31 31 31 31 31 0 0 31 31 0 31 0 0 31 0 31 0 31 0 0
5429.3521376596C1%l1L1l1L1%Tl1L1%l1%TL1%Wl1L1l1%L1%Tl1L1%Ul1L1l1%@
$$ 31 31 0 31 0 31 31 31 0 31 31 0 0 0 31 31 31 31 31 31 0 31 0 0 31 31 31 0 31 31 31 31 0 31 0 0 0
5420.0285114624C1l1L1%S1l1L1l1L1l1L1l1%L1%Tl1L1%Xl1%L1%S3l1L1%Wl1@
$$ 31 0 31 31 31 31 31 31 31 31 31 31 31 31 0 31 0 31 0 31 0 0 31 31 31 0 31 31 31 31 31 31 31 0 0 31 31 31 31 31 31 31 31 31 31 31 31 31 31 0 31 31 31 31 31 31 0 0
5405.4343723074C1%Zl1L1%l1%L1%Ul1L1%U0l1L1%V7l1L1%VL1l1%U0L1l1L1l1C1
5369.8206970023C1%TL1l1%UL1%l1%VL1%l1L1%Tl1%L1l1L1%l1%WL1%Tl1%VL1C1
$$ 31 31 31 62 31 31 31 31 62 62 31 31 31 31 31 62 62 31 62 62 62 31 31 62 31 62 62 31 31 31 31 31 31 62 62 62 31 31 31 31 31 62 31
5359.09120996F2l1L1l1%UL1%l1%VL1%l1%TL1l1L1l1%L1%l1%L1l1L1l1L1%F2
$$ 62 31 62 31 31 31 31 62 62 31 31 31 31 31 62 62 31 31 31 62 31 62 31 31 62 62 31 31 62 31 62 31 62 62 62
5350.3070216972C1L1%T1l1L1%W9L2l2L2l2L2%Ul2L2%T4L1l1L1l1%S1L1l1L1I4
5315.8501840446I4L1%Xl1L1%S4L1%Tl1%VL1l1%TL1%S9L1l1%TL1l1%L1%l1L1A87
$$ 94 125 125 125 125 125 125 125 94 125 125 125 125 125 125 125 125 125 125 125 125 125 125 125 156 156 156 125 125 125 125 125 156 125 125 125 156 156 156 156 156 156 156 156 156 156 156 156 156 156 156 156 156 156 156 156 187 156 156 156 187 156 156 187 187 156 187 187
5298.8462768146A87%XL2l2L2l2L2l2L2%S4L1%S0L1l1%L1%UL1l1%L1%l1L1%WL2C44
$$ 187 187 187 187 187 187 187 219 187 219 187 219 187 219 219 219 219 219 219 219 219 219 219 219 219 219 219 219 250 250 250 250 250 250 250 250 250 250 250 281 250 250 281 281 281 281 312 281 281 312 312 281 312 312 312 312 312 312 344 344
5283.7501840446C75l1%L1l1L1l1L1%XL1%L1l1%L1%l1L1%WL2l2%L2L1%WL1%TL1E62
$$ 375 344 344 375 344 375 344 375 375 375 375 375 375 375 406 406 437 406 406 437 437 406 437 437 437 437 437 437 469 437 437 469 500 500 500 500 500 500 531 531 531 562 562
5272.9382795374E62L2%VL1%UL1%L1%TL2%L1%TL1TL2l2L2L1%L1%O3%L1%L1T%A094
$$ 562 594 594 594 594 594 625 625 625 625 656 656 687 687 687 719 719 750 750 750 781 812 844 812 844 875 875 906 906 969 969 1000 1000 1031 1062 1062 1094
5263.6833954999A125L1T%L2L1UL2L1%L1O3L1UO3%O2O3L1O2L2O2O3O2L1R4O3B312
$$ 1125 1156 1187 1187 1219 1250 1281 1312 1344 1375 1375 1406 1469 1500 1531 1562 1625 1625 1687 1750 1781 1843 1875 1937 2000 2062 2093 2187 2250 2312
5256.1853491149B375R3O3R4R3R4UJ25J24J25UJ57J25J87J88J87J88K18K19TK50E843
$$ 2375 2468 2531 2625 2718 2812 2906 3000 3125 3249 3374 3499 3624 3781 3906 4093 4281 4468 4656 4874 5093 5312 5562 5843
5250.0892563449F124L12L13L75L44M06M37M69N00TN62N94O56TP19P50P81Q43A6185
$$ 6124 6436 6749 7124 7468 7874 8311 8780 9280 9780 10342 10936 11592 12248 12967 13717 14498 15341 16185
5245.3421867675A7060Q75TQ74Q44P81O88O56N00L75K18O3o3k50m06n31o25p50B0372
$$ 17060 17935 18810 19684 20528 21309 21997 22653 23153 23528 23746 23809 23746 23496 23090 22559 21934 21184 20372
5240.59511719A9497q75r06Uq75q44q12p81p19o87o56n94n62n63m69m99m07G030
$$ 19497 18622 17716 16810 15904 15029 14185 13373 12592 11873 11186 10530 9936 9374 8811 8342 7843 7436 7030
5235.8265578473F655l75l12l13l12k19k81k19k18j88k19j87j56j57j56Tj25B937
$$ 6655 6280 5968 5655 5343 5124 4843 4624 4406 4218 3999 3812 3656 3499 3343 3187 3062 2937
5231.3304650774B812r4j25r3r4Uo2r4o2o3o2o3o2o3o2o3l1o2l2l1o2l2l1To3A156
$$ 2812 2718 2593 2500 2406 2312 2218 2156 2062 2000 1937 1875 1812 1750 1687 1625 1562 1531 1469 1437 1406 1344 1312 1281 1250 1187 1156
5224.4794882699A125l1%o3l1Tl2l1%l1%l1l2%l1T%l1%l2%l1%Tl1Tl2%Ul1%Tl1E00
$$ 1125 1094 1094 1031 1000 969 937 906 906 875 875 844 812 812 781 750 750 719 719 687 687 656 656 656 625 594 562 562 562 562 531 531 531 500 500
5215.7265578473E00l1%l2L2l2%l1%Tl1L1l1%Tl1%Vl2%Vl1%L1%l1%Ul1%Xl1%B19
$$ 500 469 469 437 469 437 437 406 406 406 375 406 375 375 375 344 344 344 344 344 312 312 312 312 312 281 281 312 312 281 281 281 281 250 250 250 250 250 250 250 219 219 219
5204.9658129647B19%Xl2L2l2%Vl1L1%l1L1l1%Xl1L1%l1%S2l1L1%Tl1%TL1l1I4
$$ 219 219 219 219 219 219 219 187 219 187 187 187 187 187 156 187 187 156 187 156 156 156 156 156 156 156 125 156 156 125 125 125 125 125 125 125 125 125 125 125 125 125 94 125 125 125 94 94 94 125 94 94
5191.8638593497I4%S5l2L2l2%L2l2%T0l1L1%Ul1L1l1L1%Xl1%TL1%l1%WL1l1C1
$$ 94 94 94 94 94 94 94 94 94 94 94 94 94 94 94 94 62 94 62 62 94 62 62 62 62 62 62 62 62 62 62 62 62 62 62 62 62 62 62 62 62 62 31 62 62 62 62 31 62 31 62 62 62 62 62 62 62 31 31 31 62 62 31 31 31 31 31 31 62 31 31
5174.1070216972C1%T0l1%L1%Yl1L1%Vl1%L1l1L1l1%L1%Yl1%VL1%l1L1l1L1%C1
$$ 31 31 31 31 31 31 31 31 31 31 31 31 31 31 31 31 31 31 31 31 31 0 0 31 31 31 31 31 31 31 31 0 31 31 31 31 31 0 0 31 0 31 0 0 31 31 31 31 31 31 31 31 0 0 0 0 0 31 31 0 31 0 31 31 31
5157.7560448896C1l1%WL1l1%TL1l1L1%l1%sL1l1%XL1l1%S9L1l1%W1l1L1%l1@
$$ 31 0 0 0 0 0 0 31 0 0 0 31 0 31 31 0 0 0 0 0 0 0 0 0 0 31 0 0 0 0 0 0 0 31 0 0 0 0 0 0 0 0 0 0 0 0 0 0 0 0 0 0 0 0 31 0 0 0 0 0 0 0 0 0 0 0 0 0 0 0 0 0 0 0 0 0 0 0 0 0 0 0 0 0 0 0 0 0 0 0 0 0 0 0 0 0 0 0 0 0 0 0 0 0 0 0 0 -31 0 0 -31 0
5129.6716738098@%S2l1L1%T7l1L1%Zl1%L1%Tl1L1%l1L1%Yl1L1l1L1l1L1%S0l1@
$$ 0 0 0 0 0 0 0 0 0 0 0 0 0 -31 0 0 0 0 0 0 0 0 0 0 0 0 0 0 0 0 0 0 0 0 0 0 0 0 0 0 0 0 -31 0 0 0 0 0 0 0 0 0 -31 -31 0 0 0 -31 0 0 -31 0 0 0 0 0 0 0 0 -31 0 -31 0 -31 0 0 0 0 0 0 0 0 0 0 0 -31 0
5107.7992072371c1L1%Wl1%L1%Zl1L1%Tl1L1%Tl1%L1l1L1%Vl1L1l1%L1l1L1%@
$$ -31 0 0 0 0 0 0 -31 -31 0 0 0 0 0 0 0 0 0 -31 0 0 0 -31 0 0 0 -31 -31 0 -31 0 0 0 0 0 -31 0 -31 -31 0 -31 0 0 0
5096.8187433873@%Vl1%L1l1%L1%Tl1%L1l1%L1%Tl1L1%Wl1%TL1%l1L1%l1L1l1c1
$$ 0 0 0 0 0 -31 -31 0 -31 -31 0 0 0 -31 -31 0 -31 -31 0 0 0 -31 0 0 0 0 0 0 -31 -31 -31 0 0 -31 0 0 -31 0 -31 -31
5086.7421867675c1%L1l1%L1%Tl1L1l1L1%Ul1L1%Tl1%UL1l1L1%l1L1l1L1l1L1c1
$$ -31 -31 0 -31 -31 0 0 0 -31 0 -31 0 0 0 0 -31 0 0 0 -31 -31 -31 -31 0 -31 0 0 -31 0 -31 0 -31 0 -31
5078.2089753122@%Tl1L1%l1L1l1%L1l1L1l1L1l1%L1l1%L1%l1%VL1%l1%VL1l1@
$$ 0 0 0 -31 0 0 -31 0 -31 -31 0 -31 0 -31 0 -31 -31 0 -31 -31 0 0 -31 -31 -31 -31 -31 0 0 -31 -31 -31 -31 -31 0 -31 0
5068.8853491149c1L1l1L1%Tl1L1%Tl1%L1l1L1%l1L1l1%L1l1%TL1%Ul1L1%l1c1
$$ -31 0 -31 0 0 0 -31 0 0 0 -31 -31 0 -31 0 0 -31 0 -31 -31 0 -31 -31 -31 0 0 0 0 -31 0 0 -31 -31
5060.6031144671c1%L1%Tl1%VL1l1L1l1L1%Tl1L1l1%L1l1%TL1%Tl1L1%l1%L1c1
$$ -31 -31 0 0 0 -31 -31 -31 -31 -31 0 -31 0 -31 0 0 0 -31 0 -31 -31 0 -31 -31 -31 0 0 0 -31 0 0 -31 -31 0 -31
5051.8814418849@%l1%L1l1L1%Ul1L1l1L1l1%L1l1L1%Ul1%YL1l1L1%Tl1%TL1c1
$$ 0 0 -31 -31 0 -31 0 0 0 0 -31 0 -31 0 -31 -31 0 -31 0 0 0 0 -31 -31 -31 -31 -31 -31 -31 -31 0 -31 0 0 0 -31 -31 -31 0 -31
5041.8423695845c1%L1l1%L1%S0l1%L1l1L1%l1%UL1%l1L1l1L1%l1L1%l1L1l1@
$$ -31 -31 0 -31 -31 0 0 0 0 0 0 0 0 0 0 0 -31 -31 0 -31 0 0 -31 -31 -31 -31 0 0 -31 0 -31 0 0 -31 0 0 -31 0 -31 0
5031.7658129647c1%L1l1%UL1l1%TL1l1L1%Vl1%WL1l1%UL1l1%L1%Tl1L1l1%L1c1
$$ -31 -31 0 -31 -31 -31 -31 0 -31 -31 -31 0 -31 0 0 0 0 0 -31 -31 -31 -31 -31 -31 0 -31 -31 -31 -31 0 -31 -31 0 0 0 -31 0 -31 -31 0 -31
5021.4382795374@l1L1l1L1l1%L1%Tl1%TL1l1%TL1%l1%WL1l1L1l1%L1l1L1l1c1
$$ 0 -31 0 -31 0 -31 -31 0 0 0 -31 -31 -31 0 -31 -31 -31 0 0 -31 -31 -31 -31 -31 -31 0 -31 0 -31 -31 0 -31 0 -31 -31
5012.6540912746@l1%L1l1%VL1%Ul1L1%l1L1l1%L1%l1%WL1l1%L1l1%L1l1%TL1c1
$$ 0 -31 -31 0 -31 -31 -31 -31 -31 0 0 0 0 -31 0 0 -31 0 -31 -31 0 0 -31 -31 -31 -31 -31 -31 0 -31 -31 0 -31 -31 0 -31 -31 -31 0 -31
5002.6775346548@l1%L1l1%L1l1%UL1l1L1%l1%L1l1%L1l1%L1%Ul1%L1l1L1l1c1
$$ 0 -31 -31 0 -31 -31 0 -31 -31 -31 -31 0 -31 0 0 -31 -31 0 -31 -31 0 -31 -31 0 0 0 0 -31 -31 0 -31 0 -31 -31
4994.1443231995c1%VL1l1%L1%l1%YL1%Ul1%TL1%l1L1l1%TL1l1%VL1l1%L1%l1c1
$$ -31 -31 -31 -31 -31 0 -31 -31 0 0 -31 -31 -31 -31 -31 -31 -31 -31 0 0 0 0 -31 -31 -31 0 0 -31 0 -31 -31 -31 0 -31 -31 -31 -31 -31 0 -31 -31 0 0 -31 -31
4982.8128825422c1%L1l1%VL1l1%TL1l1L1l1L1l1L1l1L1%l1%TL1l1%UL1l1L1c1
$$ -31 -31 0 -31 -31 -31 -31 -31 0 -31 -31 -31 0 -31 0 -31 0 -31 0 -31 0 0 -31 -31 -31 0 -31 -31 -31 -31 0 -31 0 -31
4974.3421867675@l1%L1l1L1l1%L1%l1L1%l1%L1l1%UL1l1%L1l1%ZL1%l1%L1%c1
$$ 0 -31 -31 0 -31 0 -31 -31 0 0 -31 0 0 -31 -31 0 -31 -31 -31 -31 0 -31 -31 0 -31 -31 -31 -31 -31 -31 -31 -31 -31 0 0 -31 -31 0 0 -31
4964.3031144671c1L1%l1L1l1%WL1l1%L1l1L1l1%L1l1L1%Tl1L1%Wl1%L1l1%L1c1
$$ -31 0 0 -31 0 -31 -31 -31 -31 -31 -31 0 -31 -31 0 -31 0 -31 -31 0 -31 0 0 0 -31 0 0 0 0 0 0 -31 -31 0 -31 -31 0 -31
4954.7285114624c1L1l1%sL1%Tl1%WL1l1%TL1l1%L1%Ul1%L1%l1%VL1l1%XL1l1c1
$$ -31 0 -31 -31 -31 -31 -31 -31 -31 -31 -31 -31 0 0 0 -31 -31 -31 -31 -31 -31 0 -31 -31 -31 0 -31 -31 0 0 0 0 -31 -31 0 0 -31 -31 -31 -31 -31 0 -31 -31 -31 -31 -31 -31 -31 0 -31 -31
4941.6421867675c1%TL1l1L1l1%L1l1L1l1%TL1l1%UL1l1L1l1L1l1%XL1%l1L1c1
$$ -31 -31 -31 0 -31 0 -31 -31 0 -31 0 -31 -31 -31 0 -31 -31 -31 -31 0 -31 0 -31 0 -31 -31 -31 -31 -31 -31 -31 0 0 -31 0 -31
4932.6070216972@%l1%UL1l1L1%l1%VL1l1L1%l1%L1l1%L1l1L1l1%TL1l1%UL1c1
$$ 0 0 -31 -31 -31 -31 0 -31 0 0 -31 -31 -31 -31 -31 0 -31 0 0 -31 -31 0 -31 -31 0 -31 0 -31 -31 -31 0 -31 -31 -31 -31 0 -31
4923.3833954999@%Wl1%TL1l1L1l1%L1%l1%L1%l1L1l1%VL1l1%L1l1L1l1%TL1c1
$$ 0 0 0 0 0 0 -31 -31 -31 0 -31 0 -31 -31 0 0 -31 -31 0 0 -31 0 -31 -31 -31 -31 -31 0 -31 -31 0 -31 0 -31 -31 -31 0 -31
4913.8462768146@l1L1l1%TL1l1%TL1%l1%S0L1%l1%ZL1%l1L1l1%TL1%l1%L1l1c1
$$ 0 -31 0 -31 -31 -31 0 -31 -31 -31 0 0 -31 -31 -31 -31 -31 -31 -31 -31 -31 -31 -31 0 0 -31 -31 -31 -31 -31 -31 -31 -31 -31 0 0 -31 0 -31 -31 -31 0 0 -31 -31 0 -31 -31
4901.7619057347c1%VL1%l1%L1%l1%L1l1%UL1%Tl1L1%l1L1l1%L1l1%L1l1L1l1@
$$ -31 -31 -31 -31 -31 0 0 -31 -31 0 0 -31 -31 0 -31 -31 -31 -31 0 0 0 -31 0 0 -31 0 -31 -31 0 -31 -31 0 -31 0 -31 0
4892.6892563449c1%L1l1L1l1%L1l1L1l1%L1l1%WL1l1%TL1l1%TL1%Xl1%UL1%c1
$$ -31 -31 0 -31 0 -31 -31 0 -31 0 -31 -31 0 -31 -31 -31 -31 -31 -31 0 -31 -31 -31 0 -31 -31 -31 0 0 0 0 0 0 0 -31 -31 -31 -31 0 0 -31
4882.3992072371c1L1l1L1l1L1l1%VL1l1L1%Tl1%L1l1%TL1l1%L1%l1L1l1%TL1c1
$$ -31 0 -31 0 -31 0 -31 -31 -31 -31 -31 0 -31 0 0 0 -31 -31 0 -31 -31 -31 0 -31 -31 0 0 -31 0 -31 -31 -31 0 -31
4873.9285114624c1%TL1l1L1%l1L1l1L1l1L1l1L1l1%VL1l1L1%l1L1%l1%S0L1@
$$ -31 -31 -31 0 -31 0 0 -31 0 -31 0 -31 0 -31 0 -31 -31 -31 -31 -31 0 -31 0 0 -31 0 0 -31 -31 -31 -31 -31 -31 -31 -31 -31 -31 -31 0 0
4863.889439162@l1%TL1l1%TL1%l1%YL1l1%UL1%Tl1%WL1l1%TL1l1%VL1%l1L1c1
$$ 0 -31 -31 -31 0 -31 -31 -31 0 0 -31 -31 -31 -31 -31 -31 -31 -31 0 -31 -31 -31 -31 0 0 0 -31 -31 -31 -31 -31 -31 0 -31 -31 -31 0 -31 -31 -31 -31 -31 0 0 -31 0 -31
4852.0560448896@l1L1l1L1%Tl1%L1l1%L1l1L1%Vl1%TL1%Tl1%VL1l1L1l1L1l1@
$$ 0 -31 0 -31 0 0 0 -31 -31 0 -31 -31 0 -31 0 0 0 0 0 -31 -31 -31 0 0 0 -31 -31 -31 -31 -31 0 -31 0 -31 0 -31 0
4842.8324186924c1L1l1L1l1%TL1%Wl1%TL1%Ul1L1l1%UL1l1L1l1%TL1%l1%S1L1c1
$$ -31 0 -31 0 -31 -31 -31 0 0 0 0 0 0 -31 -31 -31 0 0 0 0 -31 0 -31 -31 -31 -31 0 -31 0 -31 -31 -31 0 0 -31 -31 -31 -31 -31 -31 -31 -31 -31 -31 -31 -31 0 -31
4830.785531932@l1%TL1l1%TL1l1%L1l1L1l1%VL1l1%TL1%l1%TL1l1%VL1l1%@
$$ 0 -31 -31 -31 0 -31 -31 -31 0 -31 -31 0 -31 0 -31 -31 -31 -31 -31 0 -31 -31 -31 0 0 -31 -31 -31 0 -31 -31 -31 -31 -31 0 -31 -31 0
4821.2109289272c1%VL1l1L1l1L1%Tl1%TL1l1L1l1%L1l1%L1l1%TL1l1%TL1l1c1
$$ -31 -31 -31 -31 -31 0 -31 0 -31 0 0 0 -31 -31 -31 0 -31 0 -31 -31 0 -31 -31 0 -31 -31 -31 0 -31 -31 -31 0 -31 -31
4812.6421867675c1L1l1%L1l1L1%l1%WL1l1L1%l1%L1%l1L1%Tl1L1l1%UL1l1L1c1
$$ -31 0 -31 -31 0 -31 0 0 -31 -31 -31 -31 -31 -31 0 -31 0 0 -31 -31 0 0 -31 0 0 0 -31 0 -31 -31 -31 -31 0 -31 0 -31
4803.6070216972c1L1l1%XL1l1L1l1%UL1%l1L1l1L1%l1L1l1L1%l1L1%l1%TL1c1
$$ -31 0 -31 -31 -31 -31 -31 -31 -31 0 -31 0 -31 -31 -31 -31 0 0 -31 0 -31 0 0 -31 0 -31 0 0 -31 0 0 -31 -31 -31 0 -31
4794.6343723074c1%L1%Tl1%TL1%l1%L1%l1%L1%Wl1%L1l1%TL1%Tl1L1%l1L1%c1
$$ -31 -31 0 0 0 -31 -31 -31 0 0 -31 -31 0 0 -31 -31 0 0 0 0 0 0 -31 -31 0 -31 -31 -31 0 0 0 -31 0 0 -31 0 0 -31
4785.0972536221@l1L1l1L1l1L1l1%L1l1L1l1%L1%Tl1%L1%Tl1L1%Tl1L1l1%UL1c1
$$ 0 -31 0 -31 0 -31 0 -31 -31 0 -31 0 -31 -31 0 0 0 -31 -31 0 0 0 -31 0 0 0 -31 0 -31 -31 -31 -31 0 -31
4776.5265578473@%l1L1l1%TL1l1%VL1%l1%L1l1%TL1l1%L1%Vl1%L1%Ul1%TL1c1
$$ 0 0 -31 0 -31 -31 -31 0 -31 -31 -31 -31 -31 0 0 -31 -31 0 -31 -31 -31 0 -31 -31 0 0 0 0 0 -31 -31 0 0 0 0 -31 -31 -31 0 -31
4766.487485547c1%TL1l1%TL1%Tl1L1%Tl1L1l1%VL1l1%TL1l1L1l1%UL1l1L1c1
$$ -31 -31 -31 0 -31 -31 -31 0 0 0 -31 0 0 0 -31 0 -31 -31 -31 -31 -31 0 -31 -31 -31 0 -31 0 -31 -31 -31 -31 0 -31 0 -31
4757.4148361572c1L1%Vl1L1%Tl1%L1%Ul1%L1%l1L1l1%L1l1L1l1L1l1%WL1l1@
$$ -31 0 0 0 0 0 -31 0 0 0 -31 -31 0 0 0 0 -31 -31 0 0 -31 0 -31 -31 0 -31 0 -31 0 -31 -31 -31 -31 -31 -31 0 -31 0
4747.9402331525@%Tl1%UL1%Vl1%L1%Tl1L1l1L1%Tl1L1%l1%VL1l1%WL1%Tl1L1c1
$$ 0 0 0 -31 -31 -31 -31 0 0 0 0 0 -31 -31 0 0 0 -31 0 -31 0 0 0 -31 0 0 -31 -31 -31 -31 -31 0 -31 -31 -31 -31 -31 -31 0 0 0 -31 0 -31
4736.8972536221c1%L1%Tl1L1l1%TL1l1%UL1l1%TL1l1%L1l1%L1l1L1l1L1%Tl1@
$$ -31 -31 0 0 0 -31 0 -31 -31 -31 0 -31 -31 -31 -31 0 -31 -31 -31 0 -31 -31 0 -31 -31 0 -31 0 -31 0 0 0 -31 0
4728.3265578473c1L1l1%L1l1%XL1l1L1%Tl1L1l1%L1%Ul1%L1l1%UL1l1%L1l1@
$$ -31 0 -31 -31 0 -31 -31 -31 -31 -31 -31 -31 0 -31 0 0 0 -31 0 -31 -31 0 0 0 0 -31 -31 0 -31 -31 -31 -31 0 -31 -31 0 -31 0
4718.789439162c1L1l1%L1l1%TL1l1L1%l1%L1%Ul1%L1l1%TL1l1%TL1l1L1l1@
$$ -31 0 -31 -31 0 -31 -31 -31 0 -31 0 0 -31 -31 0 0 0 0 -31 -31 0 -31 -31 -31 0 -31 -31 -31 0 -31 0 -31 0
4710.5697201948@l1%VL1%l1L1l1%TL1l1L1l1L1%l1%L1%Tl1%L1l1L1%l1%UL1@
$$ 0 -31 -31 -31 -31 -31 0 0 -31 0 -31 -31 -31 0 -31 0 -31 0 0 -31 -31 0 0 0 -31 -31 0 -31 0 0 -31 -31 -31 -31 0 0
4701.5345551245@%l1%YL1l1L1l1%TL1l1%L1l1L1%Ul1L1l1%L1l1%L1%Tl1%L1@
$$ 0 0 -31 -31 -31 -31 -31 -31 -31 -31 0 -31 0 -31 -31 -31 0 -31 -31 0 -31 0 0 0 0 -31 0 -31 -31 0 -31 -31 0 0 0 -31 -31 0 0
4691.7089753122c1L1l1L1%l1%XL1%l1L1%l1L1%Vl1L1l1L1%Tl1L1l1%TL1%Ul1c1
$$ -31 0 -31 0 0 -31 -31 -31 -31 -31 -31 -31 0 0 -31 0 0 -31 0 0 0 0 0 -31 0 -31 0 0 0 -31 0 -31 -31 -31 0 0 0 0 -31 -31
4681.6343723074@l1L1l1L1%Tl1L1%l1%WL1l1L1%l1L1%l1L1%l1L1%l1%L1%l1@
$$ 0 -31 0 -31 0 0 0 -31 0 0 -31 -31 -31 -31 -31 -31 0 -31 0 0 -31 0 0 -31 0 0 -31 0 0 -31 -31 0 0 -31 0
4672.8501840446c1%UL1%Ul1L1%l1L1%l1L1l1%TL1%Tl1%UL1%Ul1%TL1%l1%L1c1
$$ -31 -31 -31 -31 0 0 0 0 -31 0 0 -31 0 0 -31 0 -31 -31 -31 0 0 0 -31 -31 -31 -31 0 0 0 0 -31 -31 -31 0 0 -31 -31 0 -31
4663.1246042323c1L1%l1%UL1%Tl1%UL1%Tl1L1%Ul1%TL1%Tl1%UL1%Tl1%L1l1c1
$$ -31 0 0 -31 -31 -31 -31 0 0 0 -31 -31 -31 -31 0 0 0 -31 0 0 0 0 -31 -31 -31 0 0 0 -31 -31 -31 -31 0 0 0 -31 -31 0 -31 -31
4653.085531932@%l1%VL1%Tl1%L1%Tl1L1l1%UL1l1L1%Ul1L1%l1%L1l1L1l1%@
$$ 0 0 -31 -31 -31 -31 -31 0 0 0 -31 -31 0 0 0 -31 0 -31 -31 -31 -31 0 -31 0 0 0 0 -31 0 0 -31 -31 0 -31 0 -31 -31 0
4643.5109289272c1L1%l1%L1l1L1l1%TL1l1L1l1L1%Tl1%TL1l1%L1%l1L1%l1%c1
$$ -31 0 0 -31 -31 0 -31 0 -31 -31 -31 0 -31 0 -31 0 0 0 -31 -31 -31 0 -31 -31 0 0 -31 0 0 -31 -31 -31
4635.4421867675c1%TL1l1%L1%l1%WL1%l1%WL1l1L1%l1%VL1%l1%S0L1l1L1%l1c1
$$ -31 -31 -31 0 -31 -31 0 0 -31 -31 -31 -31 -31 -31 0 0 -31 -31 -31 -31 -31 -31 0 -31 0 0 -31 -31 -31 -31 -31 0 0 -31 -31 -31 -31 -31 -31 -31 -31 -31 -31 -31 0 -31 0 0 -31 -31
4622.893346392@l1%L1l1%L1l1L1l1%L1l1%TL1l1L1%Ul1%VL1l1L1%Tl1%L1l1@
$$ 0 -31 -31 0 -31 -31 0 -31 0 -31 -31 0 -31 -31 -31 0 -31 0 0 0 0 -31 -31 -31 -31 -31 0 -31 0 0 0 -31 -31 0 -31 0
4613.9206970023c1L1l1%TL1%Wl1L1l1%L1l1%L1l1L1l1L1l1L1%l1L1l1%L1l1@
$$ -31 0 -31 -31 -31 0 0 0 0 0 0 -31 0 -31 -31 0 -31 -31 0 -31 0 -31 0 -31 0 0 -31 0 -31 -31 0 -31 0
4605.6384623545c1%UL1%l1L1l1L1l1%TL1l1%TL1l1L1%l1L1l1%TL1%Tl1%WL1@
$$ -31 -31 -31 -31 0 0 -31 0 -31 0 -31 -31 -31 0 -31 -31 -31 0 -31 0 0 -31 0 -31 -31 -31 0 0 0 -31 -31 -31 -31 -31 -31 0 0
4596.3148361572@l1%L1l1%TL1l1%TL1l1L1%l1L1l1%L1l1L1l1%L1%l1L1l1%L1c1
$$ 0 -31 -31 0 -31 -31 -31 0 -31 -31 -31 0 -31 0 0 -31 0 -31 -31 0 -31 0 -31 -31 0 0 -31 0 -31 -31 0 -31
4588.2835783169@l1%TL1%l1L1l1%L1%l1%L1%Tl1L1%Ul1L1l1%TL1l1L1l1L1%c1
$$ 0 -31 -31 -31 0 0 -31 0 -31 -31 0 0 -31 -31 0 0 0 -31 0 0 0 0 -31 0 -31 -31 -31 0 -31 0 -31 0 0 -31
4579.7128825422@l1%VL1%Tl1%L1l1%TL1l1L1%l1%L1%l1L1%Zl1L1l1L1l1%L1@
$$ 0 -31 -31 -31 -31 -31 0 0 0 -31 -31 0 -31 -31 -31 0 -31 0 0 -31 -31 0 0 -31 0 0 0 0 0 0 0 0 0 -31 0 -31 0 -31 -31 0 0
4569.4873027299@l1L1%Vl1L1%l1L1l1%L1%Tl1L1l1%L1l1L1%Ul1L1l1L1%Yl1c1
$$ 0 -31 0 0 0 0 0 -31 0 0 -31 0 -31 -31 0 0 0 -31 0 -31 -31 0 -31 0 0 0 0 -31 0 -31 0 0 0 0 0 0 0 0 -31 -31
4559.4482304296@l1%L1%Tl1%L1l1%L1%Tl1L1%l1%L1l1%L1%Tl1%L1%l1%L1%l1@
$$ 0 -31 -31 0 0 0 -31 -31 0 -31 -31 0 0 0 -31 0 0 -31 -31 0 -31 -31 0 0 0 -31 -31 0 0 -31 -31 0 0 -31 0
4550.6265578473@%Wl1%TL1%Tl1L1%Tl1L1l1L1l1L1l1L1%l1%L1%Ul1%L1l1%L1c1
$$ 0 0 0 0 0 0 -31 -31 -31 0 0 0 -31 0 0 0 -31 0 -31 0 -31 0 -31 0 0 -31 -31 0 0 0 0 -31 -31 0 -31 -31 0 -31
4541.089439162c1L1%Tl1L1l1L1%l1L1l1L1%Ul1L1%Ul1%L1%Tl1L1%l1%L1%Tl1@
$$ -31 0 0 0 -31 0 -31 0 0 -31 0 -31 0 0 0 0 -31 0 0 0 0 -31 -31 0 0 0 -31 0 0 -31 -31 0 0 0 -31 0
4532.1167897722@%Tl1%L1%l1%UL1l1%UL1l1%TL1l1L1l1%L1%l1%L1%Tl1%L1%@
$$ 0 0 0 -31 -31 0 0 -31 -31 -31 -31 0 -31 -31 -31 -31 0 -31 -31 -31 0 -31 0 -31 -31 0 0 -31 -31 0 0 0 -31 -31 0 0 0
4522.793163575@l1L1%l1%TL1l1L1%l1L1l1%TL1l1L1%l1L1l1%L1l1L1%l1%L1c1
$$ 0 -31 0 0 -31 -31 -31 0 -31 0 0 -31 0 -31 -31 -31 0 -31 0 0 -31 0 -31 -31 0 -31 0 0 -31 -31 0 -31
4514.7619057347c1L1%l1%L1l1%TL1%Vl1%TL1%l1%TL1l1L1l1L1l1L1%l1L1l1@
$$ -31 0 0 -31 -31 0 -31 -31 -31 0 0 0 0 0 -31 -31 -31 0 0 -31 -31 -31 0 -31 0 -31 0 -31 0 0 -31 0 -31 0
4506.19120996@%Ul1L1l1L1l1%L1%l1L1l1L1l1%TL1l1%L1%Tl1L1%Tl1L1%Ul1c1
$$ 0 0 0 0 -31 0 -31 0 -31 -31 0 0 -31 0 -31 0 -31 -31 -31 0 -31 -31 0 0 0 -31 0 0 0 -31 0 0 0 0 -31 -31
4497.1560448896c1%L1%l1%UL1l1%TL1l1L1l1L1l1L1%Vl1L1%Tl1%TL1%Tl1L1c1
$$ -31 -31 0 0 -31 -31 -31 -31 0 -31 -31 -31 0 -31 0 -31 0 -31 0 0 0 0 0 -31 0 0 0 -31 -31 -31 0 0 0 -31 0 -31
4488.1833954999@%l1L1l1L1%l1%L1l1%TL1l1L1%l1%TL1%l1L1%Tl1%L1%l1%TL1c1
$$ 0 0 -31 0 -31 0 0 -31 -31 0 -31 -31 -31 0 -31 0 0 -31 -31 -31 0 0 -31 0 0 0 -31 -31 0 0 -31 -31 -31 0 -31
4479.3992072371c1L1%l1L1%Tl1L1%l1%TL1%Xl1%sL1%l1%ZL1%l1%WL1l1%L1l1c1
$$ -31 0 0 -31 0 0 0 -31 0 0 -31 -31 -31 0 0 0 0 0 0 0 -31 -31 -31 -31 -31 -31 -31 -31 -31 -31 0 0 -31 -31 -31 -31 -31 -31 -31 -31 -31 0 0 -31 -31 -31 -31 -31 -31 0 -31 -31 0 -31 -31
4465.5579985047@%Xl1L1l1%L1%Tl1L1%l1%L1%Tl1%L1%l1L1%sl1%L1%Tl1%L1c1
$$ 0 0 0 0 0 0 0 -31 0 -31 -31 0 0 0 -31 0 0 -31 -31 0 0 0 -31 -31 0 0 -31 0 0 0 0 0 0 0 0 0 0 -31 -31 0 0 0 -31 -31 0 -31
4453.9755810398@l1%L1l1L1%l1%UL1l1%UL1%l1L1%l1%L1%l1L1l1L1l1L1l1L1@
$$ 0 -31 -31 0 -31 0 0 -31 -31 -31 -31 0 -31 -31 -31 -31 0 0 -31 0 0 -31 -31 0 0 -31 0 -31 0 -31 0 -31 0 0
4445.4423695845c1%TL1%Zl1L1l1L1l1L1l1%L1%l1L1%l1L1%Xl1%L1%Vl1%L1%c1
$$ -31 -31 -31 0 0 0 0 0 0 0 0 0 -31 0 -31 0 -31 0 -31 -31 0 0 -31 0 0 -31 0 0 0 0 0 0 0 -31 -31 0 0 0 0 0 -31 -31 0 0 -31
4434.2128825422@%l1%L1l1%L1l1L1l1L1l1%TL1%l1L1l1%UL1l1L1%Tl1L1%Ul1@
$$ 0 0 -31 -31 0 -31 -31 0 -31 0 -31 0 -31 -31 -31 0 0 -31 0 -31 -31 -31 -31 0 -31 0 0 0 -31 0 0 0 0 -31 0
4425.39120996@%l1L1%l1%WL1l1%L1%Vl1L1%Ul1%UL1%Yl1L1l1%L1l1%L1%l1c1
$$ 0 0 -31 0 0 -31 -31 -31 -31 -31 -31 0 -31 -31 0 0 0 0 0 -31 0 0 0 0 -31 -31 -31 -31 0 0 0 0 0 0 0 0 -31 0 -31 -31 0 -31 -31 0 0 -31 -31
4413.5953000071c1L1l1%UL1%Tl1L1%Ul1L1l1L1l1%TL1%Tl1%L1%l1L1%Wl1L1c1
$$ -31 0 -31 -31 -31 -31 0 0 0 -31 0 0 0 0 -31 0 -31 0 -31 -31 -31 0 0 0 -31 -31 0 0 -31 0 0 0 0 0 0 -31 0 -31
4404.1206970023@l1%UL1%Ul1L1%Ul1L1l1L1%l1L1l1L1l1L1l1L1l1L1l1%VL1c1
$$ 0 -31 -31 -31 -31 0 0 0 0 -31 0 0 0 0 -31 0 -31 0 0 -31 0 -31 0 -31 0 -31 0 -31 0 -31 -31 -31 -31 -31 0 -31
4395.085531932c1L1l1%L1l1%L1%l1%L1%l1%L1l1L1l1L1%l1%L1%Tl1L1l1%L1c1
$$ -31 0 -31 -31 0 -31 -31 0 0 -31 -31 0 0 -31 -31 0 -31 0 -31 0 0 -31 -31 0 0 0 -31 0 -31 -31 0 -31
4387.0167897722c1L1%l1L1%l1L1l1L1%Tl1%L1%Ul1%L1l1L1%Ul1L1%Tl1L1%Ul1c1
$$ -31 0 0 -31 0 0 -31 0 -31 0 0 0 -31 -31 0 0 0 0 -31 -31 0 -31 0 0 0 0 -31 0 0 0 -31 0 0 0 0 -31 -31
4377.693163575@l1%L1l1%TL1l1L1l1%L1%l1%L1%Ul1%XL1l1L1%l1%L1%l1L1@
$$ 0 -31 -31 0 -31 -31 -31 0 -31 0 -31 -31 0 0 -31 -31 0 0 0 0 -31 -31 -31 -31 -31 -31 -31 0 -31 0 0 -31 -31 0 0 -31 0 0
4368.1560448896c1%TL1l1L1%l1%UL1l1L1l1L1%Xl1L1%l1%L1l1L1%Vl1L1l1L1@
$$ -31 -31 -31 0 -31 0 0 -31 -31 -31 -31 0 -31 0 -31 0 0 0 0 0 0 0 -31 0 0 -31 -31 0 -31 0 0 0 0 0 -31 0 -31 0 0
4358.4304650774@l1%L1%Tl1L1l1L1%Ul1%L1l1%L1%Tl1L1l1%L1%l1%L1l1L1%c1
$$ 0 -31 -31 0 0 0 -31 0 -31 0 0 0 0 -31 -31 0 -31 -31 0 0 0 -31 0 -31 -31 0 0 -31 -31 0 -31 0 0 -31
4349.8972536221c1L1l1L1l1%UL1l1%TL1l1L1l1%YL1%Ul1%TL1%l1L1%Tl1L1%c1
$$ -31 0 -31 0 -31 -31 -31 -31 0 -31 -31 -31 0 -31 0 -31 -31 -31 -31 -31 -31 -31 -31 0 0 0 0 -31 -31 -31 0 0 -31 0 0 0 -31 0 0 -31
4339.8206970023@%Tl1%WL1%Tl1L1l1L1%l1%L1%Yl1L1l1L1%l1%L1l1L1%l1%VL1c1
$$ 0 0 0 -31 -31 -31 -31 -31 -31 0 0 0 -31 0 -31 0 0 -31 -31 0 0 0 0 0 0 0 0 -31 0 -31 0 0 -31 -31 0 -31 0 0 -31 -31 -31 -31 -31 0 -31
4328.4892563449c1%UL1l1L1l1L1%l1L1%l1%UL1%Zl1L1l1L1%Tl1L1l1L1%Ul1c1
$$ -31 -31 -31 -31 0 -31 0 -31 0 0 -31 0 0 -31 -31 -31 -31 0 0 0 0 0 0 0 0 0 -31 0 -31 0 0 0 -31 0 -31 0 0 0 0 -31 -31
4318.1992072371c1%L1%Vl1%L1l1L1%l1L1%l1L1%l1%L1%Tl1%L1%l1%L1%Tl1L1c1
$$ -31 -31 0 0 0 0 0 -31 -31 0 -31 0 0 -31 0 0 -31 0 0 -31 -31 0 0 0 -31 -31 0 0 -31 -31 0 0 0 -31 0 -31
4309.2285114624c1L1%l1L1%Tl1L1l1L1%Xl1%L1%Tl1%TL1%Tl1L1%l1%L1%l1%c1
$$ -31 0 0 -31 0 0 0 -31 0 -31 0 0 0 0 0 0 0 -31 -31 0 0 0 -31 -31 -31 0 0 0 -31 0 0 -31 -31 0 0 -31 -31 -31
4299.691392777@l1L1l1%L1%Vl1%L1%Yl1%L1%l1%L1l1%L1%l1L1%l1%L1%l1%c1
$$ 0 -31 0 -31 -31 0 0 0 0 0 -31 -31 0 0 0 0 0 0 0 0 -31 -31 0 0 -31 -31 0 -31 -31 0 0 -31 0 0 -31 -31 0 0 -31 -31 -31
4289.3638593497@%l1%L1l1%L1l1%L1%Tl1%L1%l1L1%Ul1L1l1%TL1l1L1%Ul1L1@
$$ 0 0 -31 -31 0 -31 -31 0 -31 -31 0 0 0 -31 -31 0 0 -31 0 0 0 0 -31 0 -31 -31 -31 0 -31 0 0 0 0 -31 0 0
4280.39120996c1L1l1L1l1L1l1%UL1%Vl1%L1l1L1%Xl1L1%l1L1%l1%L1l1%sL1c1
$$ -31 0 -31 0 -31 0 -31 -31 -31 -31 0 0 0 0 0 -31 -31 0 -31 0 0 0 0 0 0 0 -31 0 0 -31 0 0 -31 -31 0 -31 -31 -31 -31 -31 -31 -31 -31 -31 -31 0 -31
4268.5953000071@l1L1%l1L1l1%TL1%l1L1l1L1%Vl1L1l1L1l1L1l1%L1%l1L1%@
$$ 0 -31 0 0 -31 0 -31 -31 -31 0 0 -31 0 -31 0 0 0 0 0 -31 0 -31 0 -31 0 -31 -31 0 0 -31 0 0 0
4260.2755810398c1L1%Ul1L1%Tl1%L1l1%L1%l1L1l1%XL1%l1%TL1%Xl1L1%l1L1@
$$ -31 0 0 0 0 -31 0 0 0 -31 -31 0 -31 -31 0 0 -31 0 -31 -31 -31 -31 -31 -31 -31 0 0 -31 -31 -31 0 0 0 0 0 0 0 -31 0 0 -31 0 0
4249.4835783169c1L1%l1L1%Tl1L1l1%TL1%l1%L1%l1%VL1l1%TL1l1%UL1l1L1c1
$$ -31 0 0 -31 0 0 0 -31 0 -31 -31 -31 0 0 -31 -31 0 0 -31 -31 -31 -31 -31 0 -31 -31 -31 0 -31 -31 -31 -31 0 -31 0 -31
4240.4109289272c1L1%l1%UL1%Tl1L1%Ul1%L1l1%TL1%Tl1%L1l1L1l1L1%l1%UL1@
$$ -31 0 0 -31 -31 -31 -31 0 0 0 -31 0 0 0 0 -31 -31 0 -31 -31 -31 0 0 0 -31 -31 0 -31 0 -31 0 0 -31 -31 -31 -31 0 0
4230.9363259224@%Wl1L1l1%L1l1L1%l1L1%Tl1L1%Tl1%L1l1L1%Vl1%L1%Tl1L1c1
$$ 0 0 0 0 0 0 -31 0 -31 -31 0 -31 0 0 -31 0 0 0 -31 0 0 0 -31 -31 0 -31 0 0 0 0 0 -31 -31 0 0 0 -31 0 -31
4221.1482304296@%Tl1L1l1%L1l1L1%l1L1%l1L1l1L1%Ul1L1%Ul1%L1l1L1%l1@
$$ 0 0 0 -31 0 -31 -31 0 -31 0 0 -31 0 0 -31 0 -31 0 0 0 0 -31 0 0 0 0 -31 -31 0 -31 0 0 -31 0
4212.5775346548@l1L1l1L1%l1L1l1L1l1L1%Ul1L1%Vl1L1l1%TL1%Tl1%L1%l1@
$$ 0 -31 0 -31 0 0 -31 0 -31 0 -31 0 0 0 0 -31 0 0 0 0 0 -31 0 -31 -31 -31 0 0 0 -31 -31 0 0 -31 0
4203.793346392c1L1%Tl1L1l1%TL1%l1L1%Tl1%UL1%Ul1L1%l1%L1%l1L1%l1L1@
$$ -31 0 0 0 -31 0 -31 -31 -31 0 0 -31 0 0 0 -31 -31 -31 -31 0 0 0 0 -31 0 0 -31 -31 0 0 -31 0 0 -31 0 0
4194.7206970023@%Tl1L1l1%L1%Vl1%L1l1L1%l1L1l1%UL1l1L1%Wl1L1%Ul1%TL1@
$$ 0 0 0 -31 0 -31 -31 0 0 0 0 0 -31 -31 0 -31 0 0 -31 0 -31 -31 -31 -31 0 -31 0 0 0 0 0 0 -31 0 0 0 0 -31 -31 -31 0 0
4184.2441403825@%l1L1%Zl1L1%l1%TL1%l1%L1%Tl1L1%l1L1l1L1l1L1%Ul1%UL1@
$$ 0 0 -31 0 0 0 0 0 0 0 0 0 -31 0 0 -31 -31 -31 0 0 -31 -31 0 0 0 -31 0 0 -31 0 -31 0 -31 0 0 0 0 -31 -31 -31 -31 0 0
4173.4521376596c1L1l1L1%l1L1l1%L1%l1%L1%Yl1%TL1%l1L1l1L1%Wl1L1l1%c1
$$ -31 0 -31 0 0 -31 0 -31 -31 0 0 -31 -31 0 0 0 0 0 0 0 0 -31 -31 -31 0 0 -31 0 -31 0 0 0 0 0 0 -31 0 -31 -31 -31
4163.3755810398@l1%L1l1L1%Ul1%TL1%Wl1%TL1l1L1%Tl1L1%Vl1L1%l1L1%l1c1
$$ 0 -31 -31 0 -31 0 0 0 0 -31 -31 -31 0 0 0 0 0 0 -31 -31 -31 0 -31 0 0 0 -31 0 0 0 0 0 -31 0 0 -31 0 0 -31 -31
4153.3365087395c1L1%l1L1l1L1%l1L1%Ul1L1l1%L1%sl1L1%Tl1L1l1L1l1%UL1@
$$ -31 0 0 -31 0 -31 0 0 -31 0 0 0 0 -31 0 -31 -31 0 0 0 0 0 0 0 0 0 0 -31 0 0 0 -31 0 -31 0 -31 -31 -31 -31 0 0
4143.1089753122c1L1%Ul1%L1l1L1%Tl1L1l1L1l1L1l1L1%Ul1%UL1%Tl1%L1%Zl1c1
$$ -31 0 0 0 0 -31 -31 0 -31 0 0 0 -31 0 -31 0 -31 0 -31 0 0 0 0 -31 -31 -31 -31 0 0 0 -31 -31 0 0 0 0 0 0 0 0 0 -31 -31
4132.2794882699@%Tl1L1l1L1%Tl1%TL1l1L1%Vl1%TL1%l1L1%Tl1L1%Ul1%TL1@
$$ 0 0 0 -31 0 -31 0 0 0 -31 -31 -31 0 -31 0 0 0 0 0 -31 -31 -31 0 0 -31 0 0 0 -31 0 0 0 0 -31 -31 -31 0 0
4122.7423695845c1L1%Vl1%L1%l1L1%Ul1L1l1L1%Xl1%L1%Vl1%L1l1L1%Vl1L1@
$$ -31 0 0 0 0 0 -31 -31 0 0 -31 0 0 0 0 -31 0 -31 0 0 0 0 0 0 0 -31 -31 0 0 0 0 0 -31 -31 0 -31 0 0 0 0 0 -31 0 0
4111.6619057347c1L1%l1%TL1%Tl1L1%Ul1%L1%Ul1L1l1L1%Tl1L1%Ul1%UL1%Yl1@
$$ -31 0 0 -31 -31 -31 0 0 0 -31 0 0 0 0 -31 -31 0 0 0 0 -31 0 -31 0 0 0 -31 0 0 0 0 -31 -31 -31 -31 0 0 0 0 0 0 0 0 -31 0
4100.4304650774@%l1L1l1L1l1L1%Tl1L1%Ul1L1%Yl1L1%Tl1L1%Ul1L1%l1L1l1@
$$ 0 0 -31 0 -31 0 -31 0 0 0 -31 0 0 0 0 -31 0 0 0 0 0 0 0 0 -31 0 0 0 -31 0 0 0 0 -31 0 0 -31 0 -31 0
4090.391392777c1L1l1L1%l1L1%Vl1L1l1L1%Ul1L1%Xl1L1%Tl1L1%Tl1%L1%Ul1@
$$ -31 0 -31 0 0 -31 0 0 0 0 0 -31 0 -31 0 0 0 0 -31 0 0 0 0 0 0 0 -31 0 0 0 -31 0 0 0 -31 -31 0 0 0 0 -31 0
4079.8128825422@%l1L1l1%TL1%Ul1L1l1%L1%l1L1%l1L1%l1%VL1%Tl1%UL1l1@
$$ 0 0 -31 0 -31 -31 -31 0 0 0 0 -31 0 -31 -31 0 0 -31 0 0 -31 0 0 -31 -31 -31 -31 -31 0 0 0 -31 -31 -31 -31 0 -31 0
4070.2382795374@l1L1%Vl1L1l1L1%Tl1L1%l1L1%Vl1%L1%Xl1L1l1%TL1l1%TL1c1
$$ 0 -31 0 0 0 0 0 -31 0 -31 0 0 0 -31 0 0 -31 0 0 0 0 0 -31 -31 0 0 0 0 0 0 0 -31 0 -31 -31 -31 0 -31 -31 -31 0 -31
4059.6972536221@l1%VL1l1%L1l1L1l1L1l1L1%S1l1L1%Tl1L1%Tl1L1%Vl1%L1@
$$ 0 -31 -31 -31 -31 -31 0 -31 -31 0 -31 0 -31 0 -31 0 0 0 0 0 0 0 0 0 0 0 0 -31 0 0 0 -31 0 0 0 -31 0 0 0 0 0 -31 -31 0 0
4048.4677665798c1%L1%Vl1L1%Ul1%TL1l1L1%Yl1L1l1L1%Tl1%L1%Ul1L1%l1L1@
$$ -31 -31 0 0 0 0 0 -31 0 0 0 0 -31 -31 -31 0 -31 0 0 0 0 0 0 0 0 -31 0 -31 0 0 0 -31 -31 0 0 0 0 -31 0 0 -31 0 0
4037.6382795374@%Tl1%TL1%l1%L1l1L1l1L1%l1L1%Tl1%L1%Tl1L1%Tl1%L1%Wl1c1
$$ 0 0 0 -31 -31 -31 0 0 -31 -31 0 -31 0 -31 0 0 -31 0 0 0 -31 -31 0 0 0 -31 0 0 0 -31 -31 0 0 0 0 0 0 -31 -31
4027.8501840446@%Wl1%WL1%Wl1L1l1L1%l1L1%l1%TL1l1L1%Tl1L1%Tl1%VL1l1@
$$ 0 0 0 0 0 0 -31 -31 -31 -31 -31 -31 0 0 0 0 0 0 -31 0 -31 0 0 -31 0 0 -31 -31 -31 0 -31 0 0 0 -31 0 0 0 -31 -31 -31 -31 -31 0 -31 0
4016.3677665798@%l1L1%Tl1L1%l1%UL1l1L1%l1L1l1L1%Zl1%L1l1L1%Ul1%TL1@
$$ 0 0 -31 0 0 0 -31 0 0 -31 -31 -31 -31 0 -31 0 0 -31 0 -31 0 0 0 0 0 0 0 0 0 -31 -31 0 -31 0 0 0 0 -31 -31 -31 0 0
4005.7892563449c1L1%Ul1L1%Tl1L1%l1L1%Tl1L1%l1%TL1%l1L1%Ul1%VL1%Tl1@
$$ -31 0 0 0 0 -31 0 0 0 -31 0 0 -31 0 0 0 -31 0 0 -31 -31 -31 0 0 -31 0 0 0 0 -31 -31 -31 -31 -31 0 0 0 -31 0
3996.0011608521c1%TL1%Vl1L1l1L1%Vl1%TL1%Tl1L1%Xl1%WL1l1L1%Ul1%L1l1@
$$ -31 -31 -31 0 0 0 0 0 -31 0 -31 0 0 0 0 0 -31 -31 -31 0 0 0 -31 0 0 0 0 0 0 0 -31 -31 -31 -31 -31 -31 0 -31 0 0 0 0 -31 -31 0 -31 0
3984.1677665798@l1L1l1L1%Yl1%TL1l1%L1%Ul1L1%Tl1%L1%Vl1%TL1l1L1%l1@
$$ 0 -31 0 -31 0 0 0 0 0 0 0 0 -31 -31 -31 0 -31 -31 0 0 0 0 -31 0 0 0 -31 -31 0 0 0 0 0 -31 -31 -31 0 -31 0 0 -31 0
3973.6892563449c1L1%Wl1L1%Tl1L1l1L1%l1L1%Xl1L1%l1L1%Ul1%L1l1L1l1%@
$$ -31 0 0 0 0 0 0 -31 0 0 0 -31 0 -31 0 0 -31 0 0 0 0 0 0 0 -31 0 0 -31 0 0 0 0 -31 -31 0 -31 0 -31 -31 0
3963.6501840446@%Ul1L1%l1%UL1l1L1%Wl1L1%Vl1%TL1l1L1%S0l1L1l1L1l1L1c1
$$ 0 0 0 0 -31 0 0 -31 -31 -31 -31 0 -31 0 0 0 0 0 0 -31 0 0 0 0 0 -31 -31 -31 0 -31 0 0 0 0 0 0 0 0 0 0 0 -31 0 -31 0 -31 0 -31
3951.5658129647@%Tl1L1%Vl1L1l1L1l1L1%Ul1L1%Ul1L1%Xl1L1l1L1l1L1%Tl1@
$$ 0 0 0 -31 0 0 0 0 0 -31 0 -31 0 -31 0 0 0 0 -31 0 0 0 0 -31 0 0 0 0 0 0 0 -31 0 -31 0 -31 0 0 0 -31 0
3941.2382795374c1%VL1%Tl1%L1%Wl1L1l1L1%l1L1%Xl1L1l1%L1l1L1%l1L1%Tl1@
$$ -31 -31 -31 -31 -31 0 0 0 -31 -31 0 0 0 0 0 0 -31 0 -31 0 0 -31 0 0 0 0 0 0 0 -31 0 -31 -31 0 -31 0 0 -31 0 0 0 -31 0
3930.4462768146c1%TL1%Yl1L1l1L1l1%UL1%Ul1L1%sl1L1l1L1%Ul1L1%l1L1%@
$$ -31 -31 -31 0 0 0 0 0 0 0 0 -31 0 -31 0 -31 -31 -31 -31 0 0 0 0 -31 0 0 0 0 0 0 0 0 0 0 -31 0 -31 0 0 0 0 -31 0 0 -31 0 0 0
3918.4638593497@l1L1l1%TL1l1L1%l1L1%Zl1L1%Ul1L1%Vl1L1%Tl1L1l1%L1l1@
$$ 0 -31 0 -31 -31 -31 0 -31 0 0 -31 0 0 0 0 0 0 0 0 0 -31 0 0 0 0 -31 0 0 0 0 0 -31 0 0 0 -31 0 -31 -31 0 -31 0
3907.8853491149c1L1%Ul1%UL1%l1L1%Tl1%L1%l1L1l1%L1%Ul1%L1%Tl1%L1%Ul1@
$$ -31 0 0 0 0 -31 -31 -31 -31 0 0 -31 0 0 0 -31 -31 0 0 -31 0 -31 -31 0 0 0 0 -31 -31 0 0 0 -31 -31 0 0 0 0 -31 0
3897.8462768146@l1%L1%S1l1L1l1%L1%Ul1L1l1%L1%Tl1L1%l1L1l1%L1%Vl1L1c1
$$ 0 -31 -31 0 0 0 0 0 0 0 0 0 0 0 0 -31 0 -31 -31 0 0 0 0 -31 0 -31 -31 0 0 0 -31 0 0 -31 0 -31 -31 0 0 0 0 0 -31 0 -31
3886.6148361572c1L1l1L1%l1%L1l1L1l1%L1%l1%L1%Zl1%L1l1L1%l1%L1%Tl1@
$$ -31 0 -31 0 0 -31 -31 0 -31 0 -31 -31 0 0 -31 -31 0 0 0 0 0 0 0 0 0 -31 -31 0 -31 0 0 -31 -31 0 0 0 -31 0
3877.0402331525@l1%L1%l1%L1%Ul1L1%Zl1L1l1L1l1%L1%l1%UL1%Yl1L1l1%TL1@
$$ 0 -31 -31 0 0 -31 -31 0 0 0 0 -31 0 0 0 0 0 0 0 0 0 -31 0 -31 0 -31 -31 0 0 -31 -31 -31 -31 0 0 0 0 0 0 0 0 -31 0 -31 -31 -31 0 0
3864.993346392c1L1%Ul1L1l1%L1%sl1L1l1L1l1%VL1l1L1%S1l1L1%Zl1L1l1c1
$$ -31 0 0 0 0 -31 0 -31 -31 0 0 0 0 0 0 0 0 0 0 -31 0 -31 0 -31 -31 -31 -31 -31 0 -31 0 0 0 0 0 0 0 0 0 0 0 0 -31 0 0 0 0 0 0 0 0 0 -31 0 -31 -31
3850.9011608521c1L1%l1L1%l1%L1%Yl1L1%Ul1L1%Vl1L1%Vl1L1%l1L1%Tl1L1@
$$ -31 0 0 -31 0 0 -31 -31 0 0 0 0 0 0 0 0 -31 0 0 0 0 -31 0 0 0 0 0 -31 0 0 0 0 0 -31 0 0 -31 0 0 0 -31 0 0
3840.1716738098@l1%TL1l1L1%Yl1L1l1L1l1L1%l1L1%l1L1%l1L1%Vl1L1%Vl1@
$$ 0 -31 -31 -31 0 -31 0 0 0 0 0 0 0 0 -31 0 -31 0 -31 0 0 -31 0 0 -31 0 0 -31 0 0 0 0 0 -31 0 0 0 0 0 -31 0
3829.8441403825@%S1l1L1l1L1%Vl1L1%Ul1L1%Xl1%L1%Zl1L1%l1%VL1%Tl1L1@
$$ 0 0 0 0 0 0 0 0 0 0 0 0 -31 0 -31 0 0 0 0 0 -31 0 0 0 0 -31 0 0 0 0 0 0 0 -31 -31 0 0 0 0 0 0 0 0 0 -31 0 0 -31 -31 -31 -31 -31 0 0 0 -31 0 0
3815.287485547@%Vl1L1%l1L1l1L1%Tl1%L1l1L1%Tl1L1l1L1l1L1%Ul1L1%l1@
$$ 0 0 0 0 0 -31 0 0 -31 0 -31 0 0 0 -31 -31 0 -31 0 0 0 -31 0 -31 0 -31 0 0 0 0 -31 0 0 -31 0
3806.4658129647@%l1%L1%l1%L1%l1L1%Vl1L1%Tl1%L1l1L1l1L1%l1L1l1L1%S3l1@
$$ 0 0 -31 -31 0 0 -31 -31 0 0 -31 0 0 0 0 0 -31 0 0 0 -31 -31 0 -31 0 -31 0 0 -31 0 -31 0 0 0 0 0 0 0 0 0 0 0 0 0 0 -31 0
3794.7343723074@%l1L1%Tl1L1%l1L1%Tl1L1%Tl1L1l1L1l1L1%Tl1L1%Ul1L1%@
$$ 0 0 -31 0 0 0 -31 0 0 -31 0 0 0 -31 0 0 0 -31 0 -31 0 -31 0 0 0 -31 0 0 0 0 -31 0 0 0
3786.2011608521@%l1O2o2L1l1L1l1%TL1%Xl1L1%Tl1L1%Zl1L1%Wl1L1%l1L1l1@
$$ 0 0 -31 31 -31 0 -31 0 -31 -31 -31 0 0 0 0 0 0 0 -31 0 0 0 -31 0 0 0 0 0 0 0 0 0 -31 0 0 0 0 0 0 -31 0 0 -31 0 -31 0
3774.6187433873@%Wl1%L1%Vl1L1%Ul1L1%l1%TL1%Tl1%TL1%Vl1%TL1%l1L1l1c1
$$ 0 0 0 0 0 0 -31 -31 0 0 0 0 0 -31 0 0 0 0 -31 0 0 -31 -31 -31 0 0 0 -31 -31 -31 0 0 0 0 0 -31 -31 -31 0 0 -31 0 -31 -31
3763.5382795374c1L1l1L1%l1L1%l1L1l1L1%l1L1%l1L1l1L1%Tl1L1%l1%TL1%@
$$ -31 0 -31 0 0 -31 0 0 -31 0 -31 0 0 -31 0 0 -31 0 -31 0 0 0 -31 0 0 -31 -31 -31 0 0 0
3755.7579985047@%l1%L1%Yl1L1%Tl1L1%Vl1L1l1%L1%Wl1L1l1L1%Tl1L1%l1%@
$$ 0 0 -31 -31 0 0 0 0 0 0 0 0 -31 0 0 0 -31 0 0 0 0 0 -31 0 -31 -31 0 0 0 0 0 0 -31 0 -31 0 0 0 -31 0 0 -31 -31 0
3744.7775346548c1%L1l1%L1%l1L1%Ul1L1l1L1%sl1L1%Ul1L1l1L1%Ul1L1l1%@
$$ -31 -31 0 -31 -31 0 0 -31 0 0 0 0 -31 0 -31 0 0 0 0 0 0 0 0 0 0 -31 0 0 0 0 -31 0 -31 0 0 0 0 -31 0 -31 -31 0
3734.2365087395@%sl1L1%Ul1L1%S3l1L1%Tl1%L1%Tl1L1%Xl1L1%S0l1L1%Yl1@
$$ 0 0 0 0 0 0 0 0 0 0 -31 0 0 0 0 -31 0 0 0 0 0 0 0 0 0 0 0 0 0 0 -31 0 0 0 -31 -31 0 0 0 -31 0 0 0 0 0 0 0 -31 0 0 0 0 0 0 0 0 0 0 0 -31 0 0 0 0 0 0 0 0 -31 0
3716.693163575@%sl1L1%Yl1L1%Wl1L1l1L1%VL1l1%T6l1%TL1%Wl1L1l1L1%l1@
$$ 0 0 0 0 0 0 0 0 0 0 -31 0 0 0 0 0 0 0 0 -31 0 0 0 0 0 0 -31 0 -31 0 0 0 0 0 31 0 0 0 0 0 0 0 0 0 0 0 0 0 0 0 0 0 0 0 0 0 0 0 0 0 0 0 -31 -31 -31 0 0 0 0 0 0 -31 0 -31 0 0 -31 0
3697.0794882699@%Tl1L1%l1%TL1%S3l1L1%S0l1%L1%l1L1%Wl1L1%l1L1%Ul1L1@
$$ 0 0 0 -31 0 0 -31 -31 -31 0 0 0 0 0 0 0 0 0 0 0 0 0 0 -31 0 0 0 0 0 0 0 0 0 0 0 -31 -31 0 0 -31 0 0 0 0 0 0 -31 0 0 -31 0 0 0 0 -31 0 0
3682.7363259224@%Ul1L1%Tl1L1l1L1l1%L1%Ul1L1%Vl1%L1%Tl1L1%l1L1%Wl1@
$$ 0 0 0 0 -31 0 0 0 -31 0 -31 0 -31 -31 0 0 0 0 -31 0 0 0 0 0 -31 -31 0 0 0 -31 0 0 -31 0 0 0 0 0 0 -31 0
3672.4462768146c1L1%Ul1L1%Xl1%TL1l1L1%Xl1L1%l1L1%S0l1%L1l1%L1%Tl1@
$$ -31 0 0 0 0 -31 0 0 0 0 0 0 0 -31 -31 -31 0 -31 0 0 0 0 0 0 0 -31 0 0 -31 0 0 0 0 0 0 0 0 0 0 0 -31 -31 0 -31 -31 0 0 0 -31 0
3659.9619057347c1L1l1L1%Zl1%UL1%l1%L1l1L1l1L1%Ul1L1l1%TL1l1L1l1L1c1
$$ -31 0 -31 0 0 0 0 0 0 0 0 0 -31 -31 -31 -31 0 0 -31 -31 0 -31 0 -31 0 0 0 0 -31 0 -31 -31 -31 0 -31 0 -31 0 -31
3650.1363259224c1L1%Xl1L1%l1L1%l1%L1l1L1l1L1%S1l1L1%S2l1L1%Tl1L1%c1
$$ -31 0 0 0 0 0 0 0 -31 0 0 -31 0 0 -31 -31 0 -31 0 -31 0 0 0 0 0 0 0 0 0 0 0 0 -31 0 0 0 0 0 0 0 0 0 0 0 0 0 -31 0 0 0 -31 0 0 -31
3636.5835783169@%S5l1L1%Ul1L1l1L1%Wl1%L1%Vl1L1%Vl1L1%Wl1L1l1L1%Tl1@
$$ 0 0 0 0 0 0 0 0 0 0 0 0 0 0 0 0 -31 0 0 0 0 -31 0 -31 0 0 0 0 0 0 -31 -31 0 0 0 0 0 -31 0 0 0 0 0 -31 0 0 0 0 0 0 -31 0 -31 0 0 0 -31 0
3621.989439162@%Vl1L1%S9l1L1l1L1%l1L1%Yl1L1%S4l1L1%Ul1L1%Zl1L1%S8l1@
$$ 0 0 0 0 0 -31 0 0 0 0 0 0 0 0 0 0 0 0 0 0 0 0 0 0 0 0 -31 0 -31 0 0 -31 0 0 0 0 0 0 0 0 -31 0 0 0 0 0 0 0 0 0 0 0 0 0 0 0 -31 0 0 0 0 -31 0 0 0 0 0 0 0 0 0 -31 0 0 0 0 0 0 0 0 0 0 0 0 0 0 0 0 0 0 0 -31 0
3598.6736274248@%Vl1L1%S2l1L1%l1L1%S0l1L1%T6l1L1%Vl1L1%Tl1%L1%Xl1@
$$ 0 0 0 0 0 -31 0 0 0 0 0 0 0 0 0 0 0 0 0 -31 0 0 -31 0 0 0 0 0 0 0 0 0 0 0 -31 0 0 0 0 0 0 0 0 0 0 0 0 0 0 0 0 0 0 0 0 0 0 0 0 0 0 0 -31 0 0 0 0 0 -31 0 0 0 -31 -31 0 0 0 0 0 0 0 -31 0
3577.9050680821c1L1%Vl1L1%Tl1L1%Wl1L1%S8l1L1%Vl1L1%S0l1%L1%Tl1%L1@
$$ -31 0 0 0 0 0 -31 0 0 0 -31 0 0 0 0 0 0 -31 0 0 0 0 0 0 0 0 0 0 0 0 0 0 0 0 0 0 0 -31 0 0 0 0 0 -31 0 0 0 0 0 0 0 0 0 0 0 -31 -31 0 0 0 -31 -31 0 0
3561.8050680821@%Tl1L1%Vl1L1%Tl1L1%l1L1l1L1%Wl1L1%T3l1L1%Ul1L1l1L1c1
$$ 0 0 0 -31 0 0 0 0 0 -31 0 0 0 -31 0 0 -31 0 -31 0 0 0 0 0 0 -31 0 0 0 0 0 0 0 0 0 0 0 0 0 0 0 0 0 0 0 0 0 0 0 0 -31 0 0 0 0 -31 0 -31 0 -31
3546.7089753122@%S2l1L1%sl1L1%l1L1%Ul1L1l1L1l1L1%Wl1L1%Wl1L1%S6l1@
$$ 0 0 0 0 0 0 0 0 0 0 0 0 0 -31 0 0 0 0 0 0 0 0 0 0 -31 0 0 -31 0 0 0 0 -31 0 -31 0 -31 0 0 0 0 0 0 -31 0 0 0 0 0 0 -31 0 0 0 0 0 0 0 0 0 0 0 0 0 0 0 0 0 -31 0
3529.2050680821@%Tl1L1%S3l1L1l1L1%Vl1L1%T8l1L1%Yl1L1%S7l1L1%Zl1L1@
$$ 0 0 0 -31 0 0 0 0 0 0 0 0 0 0 0 0 0 0 -31 0 -31 0 0 0 0 0 -31 0 0 0 0 0 0 0 0 0 0 0 0 0 0 0 0 0 0 0 0 0 0 0 0 0 0 0 0 0 -31 0 0 0 0 0 0 0 0 -31 0 0 0 0 0 0 0 0 0 0 0 0 0 0 0 0 0 0 -31 0 0 0 0 0 0 0 0 0 -31 0 0
3504.7853491149@%Yl1L1%Ul1L1%S0l1L1%S1l1L1%sl1L1%l1L1%T1l1L1%Yl1L1@
$$ 0 0 0 0 0 0 0 0 -31 0 0 0 0 -31 0 0 0 0 0 0 0 0 0 0 0 -31 0 0 0 0 0 0 0 0 0 0 0 0 -31 0 0 0 0 0 0 0 0 0 0 -31 0 0 -31 0 0 0 0 0 0 0 0 0 0 0 0 0 0 0 0 0 0 0 0 0 0 -31 0 0 0 0 0 0 0 0 -31 0 0
3483.0128825422@%Zl1L1%Vl1L1%S4l1L1%S8l1L1%S1l1L1%VL1l1%Tl1L1%S8l1@
$$ 0 0 0 0 0 0 0 0 0 -31 0 0 0 0 0 -31 0 0 0 0 0 0 0 0 0 0 0 0 0 0 0 -31 0 0 0 0 0 0 0 0 0 0 0 0 0 0 0 0 0 0 0 -31 0 0 0 0 0 0 0 0 0 0 0 0 -31 0 0 0 0 0 31 0 0 0 -31 0 0 0 0 0 0 0 0 0 0 0 0 0 0 0 0 0 0 0 -31 0
3458.9441403825@l1L1%l1L1%Tl1L1l1L1%S4l1L1%S0l1L1%W9l1L1%l1L1%Tl1@
$$ 0 -31 0 0 -31 0 0 0 -31 0 -31 0 0 0 0 0 0 0 0 0 0 0 0 0 0 0 -31 0 0 0 0 0 0 0 0 0 0 0 -31 0 0 0 0 0 0 0 0 0 0 0 0 0 0 0 0 0 0 0 0 0 0 0 0 0 0 0 0 0 0 0 0 0 0 0 0 0 0 0 0 0 0 0 0 0 0 0 0 0 0 0 0 0 0 0 0 0 0 0 0 -31 0 0 -31 0 0 0 -31 0
3431.8011608521@%Ul1L1%S1l1L1%Tl1L1%S0l1L1%l1L1l1L1%T2l1%L1%Vl1L1@
$$ 0 0 0 0 -31 0 0 0 0 0 0 0 0 0 0 0 0 -31 0 0 0 -31 0 0 0 0 0 0 0 0 0 0 0 -31 0 0 -31 0 -31 0 0 0 0 0 0 0 0 0 0 0 0 0 0 0 0 0 0 0 0 0 0 0 -31 -31 0 0 0 0 0 -31 0 0
3413.693346392@%T4l1L1%Y8L1l1%S05L1l1%S1L1l1%S7L1l1%U8l1L1%ZL1l1@
3339.1677665798@%L1l1%S0L1l1%YL1l1%S21L1l1%S2L1l1%S5L1l1%UL1l1%TL1@
3291.9716738098@%VL1l1%VL1l1%S9L1l1%S6L1l1L1l1%UL1%Ul1%S7L1o2O2%l1@
$$ 0 0 0 0 0 31 0 0 0 0 0 31 0 0 0 0 0 0 0 0 0 0 0 0 0 0 0 0 0 0 0 0 31 0 0 0 0 0 0 0 0 0 0 0 0 0 0 0 0 0 31 0 31 0 0 0 0 31 31 31 31 0 0 0 0 0 0 0 0 0 0 0 0 0 0 0 0 0 0 31 -31 31 31 0 0
3270.7031144671@%TL1%Tl1%UL1l1%sL1l1%VL1l1%L1l1%TL1%YL1L2O2R4O2l1B19
$$ 0 0 0 31 31 31 0 0 0 0 31 0 0 0 0 0 0 0 0 0 0 31 0 0 0 0 0 31 0 0 31 0 0 0 31 31 31 31 31 31 31 31 62 94 156 250 312 281 219
3258.3677665798A56%L1J25%l1r4o2o3%Tl1%sL1%l1O3L1O2R4O3l2o2o3l1O3O2C12
$$ 156 156 187 312 312 281 187 125 62 62 62 31 31 31 31 31 31 31 31 31 31 62 62 31 94 125 187 281 344 312 250 187 156 219 281 312
3249.3402331525C12r3r4o3%l1%S3l1L1%Ul1L1l1L1%l1L1l1L1%Ul1%L1l1%L1@
$$ 312 219 125 62 62 31 31 31 31 31 31 31 31 31 31 31 31 31 31 0 31 31 31 31 0 31 0 31 31 0 31 0 31 31 31 31 0 0 31 0 0 31 0
3238.5482304296C1%Ul1L1%sl1L1%Tl1L1l1L1%Vl1L1%Ul1%TL1%Vl1L1%Tl1%L1C1
$$ 31 31 31 31 0 31 31 31 31 31 31 31 31 31 31 0 31 31 31 0 31 0 31 31 31 31 31 0 31 31 31 31 0 0 0 31 31 31 31 31 0 31 31 31 0 0 31 31
3226.4619057347C1%Xl1%L1l1L1%l1L1%VL1l1L1l1%ZL1l1L1L2%Tl2l1L1%L2%I4
$$ 31 31 31 31 31 31 31 0 0 31 0 31 31 0 31 31 31 31 31 62 31 62 31 31 31 31 31 31 31 31 31 62 31 62 94 94 94 62 31 62 62 94 94 94
3215.4833954999F2%l1%L1%l1L1%l1%XL1l1L1%L2L1l1%l2%UL2%Tl2%l1L1l1%C1
$$ 62 62 31 31 62 62 31 62 62 31 31 31 31 31 31 31 62 31 62 62 94 125 94 94 62 62 62 62 94 94 94 62 62 31 62 31 31 31
3205.9462768146F2l1%L1%l1L1%Vl1L1%Vl1%L1%S0L2L1T%l1%l1L1U%l1U%Yl2F2
$$ 62 31 31 62 62 31 62 62 62 62 62 31 62 62 62 62 62 31 31 62 62 62 62 62 62 62 62 62 62 62 94 125 156 156 125 125 94 125 156 187 187 156 125 94 94 94 94 94 94 94 94 62 62
3192.6070216972I4%Tl2L2%TL1%L1O3%Tl2%TO3%L1l1T%l2%TL2%VL1%TL1T%L2D06
$$ 94 94 94 62 94 94 94 125 125 156 219 219 219 187 187 187 250 250 281 250 219 219 187 187 187 219 219 219 219 219 250 250 250 281 312 312 344 406
3183.0324186924D69J56L12J57l2k18r4R4J87M38K18K50o2R3J57M37J031K281A0842
$$ 469 625 937 1094 1062 844 750 844 1031 1469 1687 1937 1875 1968 2125 2562 3593 5874 10842
3178.2638593497B3215L4401J0061O2l5057j5997m69R905M0462N624l249l8619A1342
$$ 23215 57616 67677 67739 32682 16685 16216 26121 66583 72207 68958 30339 11342
3175.0343723074F312j938r37n00m06o3J57o3R4j25O2r3J56K50L75Q43K063M874B3684
$$ 6312 4374 3437 2937 2531 2468 2625 2562 2656 2531 2593 2500 2656 2906 3281 4124 6187 11061 23684
3170.2873027299F3178J0842M187m3400j7810%J1030L9056Q561k968l9525k0934F280
$$ 63178 74020 78207 34807 16997 16997 28027 67083 75644 72676 33151 12217 6280
3167.0441403825C812j187n94j56R3J25l12n62l75j57%R4J88o3j87k82j25l1A87
$$ 3812 2625 2031 1875 1968 2093 1781 1219 844 687 687 781 969 906 719 437 312 281 187
3162.2755810398A56%l1T%l2%Vl1%l1%UL1%Ul1%UL1%Tl1%UL1l1%Yl1%L1%Tl1c1
$$ 156 156 125 94 94 62 62 62 62 62 31 31 0 0 0 0 31 31 31 31 0 0 0 0 31 31 31 0 0 0 0 31 0 0 0 0 0 0 0 0 -31 -31 0 0 0 -31 -31
3150.4226506173@%Vl1%O2l1L1%l1%Zl1%TL1l1L1%l1L1l1L1%Tl1%L1l1L1l1L1@
$$ 0 0 0 0 0 -31 -31 31 0 31 31 0 0 0 0 0 0 0 0 0 -31 -31 -31 0 -31 0 0 -31 0 -31 0 0 0 -31 -31 0 -31 0 -31 0 0
3140.19511719@%VL1%TL1O3L1l1Tl2%L2O2%o2l2l1%Ul1%Ul1L1%VL1%L1L2O2B19
$$ 0 0 0 0 0 31 31 31 62 125 156 125 94 62 62 94 156 156 94 62 31 31 31 31 0 0 0 0 -31 0 0 0 0 0 31 31 62 94 156 219
3130.1560448896B50%Tl1l2%L2L1l1%o3o2l2l1%Tl1L1l1%ZL1%L1O3L1To2l1l2I4
$$ 250 250 250 219 187 187 219 250 219 219 156 94 62 31 31 31 0 31 0 0 0 0 0 0 0 0 0 31 31 62 125 156 187 125 94 62 94
3120.8324186924A25O2l1To3l1%l1%UL1l1%TL1%l1%ZL1l1%VL1%Ul1%UL1l1%XL1@
$$ 125 187 156 125 62 31 31 0 0 0 0 31 0 0 0 31 31 0 0 0 0 0 0 0 0 0 31 0 0 0 0 0 31 31 31 31 0 0 0 0 31 0 0 0 0 0 0 0 31 0
3108.2835783169C1l1%S3L1l1%WL1l1%UL1%Xl1L1%Vl1L1%TL1%VL2L1J25O2%o2A56
$$ 31 0 0 0 0 0 0 0 0 0 0 0 0 0 0 31 0 0 0 0 0 0 31 0 0 0 0 31 31 31 31 31 31 31 0 31 31 31 31 31 0 31 31 31 62 62 62 62 62 94 125 250 312 312 250 156
3094.191392777A56L1O3O2%r3o3l1o3%Tl1%L1l1%L1%O3l1%VL1O2R4TL1r4r3A87
$$ 156 187 250 312 312 219 156 125 62 62 62 31 31 62 31 31 62 62 125 94 94 94 94 94 125 187 281 375 406 312 219 187
3086.2206970023A87R4O3%o3j25l1o3%Xl1%TL1L2%l2l1L1%TL2%l2%l1%L1l1L1F2
$$ 187 281 344 344 281 156 125 62 62 62 62 62 62 62 31 31 31 62 94 94 62 31 62 62 62 94 94 62 62 31 31 62 31 62 62
3077.4441403825F2L2%l2%TL2%L1l1%l2%XL2l2%ZL2%L1Tl1L1%l1%O2%l1L1%l1A25
$$ 62 94 94 62 62 62 94 94 125 94 94 62 62 62 62 62 62 62 94 62 62 62 62 62 62 62 62 62 94 94 125 156 125 156 156 125 125 187 187 156 187 187 156 125
3066.4011608521A25%XL1%WO3L1O2J57%o3R4L1o2L1J56l1TJ25R3l1O3J25K81A718
$$ 125 125 125 125 125 125 125 156 156 156 156 156 156 219 250 312 469 469 406 500 531 469 500 656 625 594 719 812 781 844 969 1250 1718
3058.0794882699B656K093M343J3217K8714k2621j7966l343K81L156J2123L0620B7933
$$ 2656 4749 9092 22309 51023 28402 10436 7093 7374 10530 22653 53273 27933
3054.793163575H874m000j437q12n94k50%R4o3%R4J25%J25K81M69Q43K000L968A8403
$$ 8874 4874 3437 2625 2031 1781 1781 1875 1812 1812 1906 2031 2031 2156 2437 2906 3749 5749 9717 18403
3049.7736274248D8024J6310k4746J9778j6154k0559J874K3403J2311k1591K3122D0837
$$ 48024 64334 39588 59366 43212 22653 24527 47930 60241 38650 61772 40837
3046.8363259224A3623o468k499j313o56l75k19l1r4l1j87J25%j25J56M69P50D593
$$ 13623 7155 4656 3343 2687 2312 2093 2062 1968 1937 1750 1875 1875 1750 1906 2375 3125 4593
3042.2402331525G655P093K5183K6871m1962j4404k187J437O030K2715K4309B3371
$$ 7655 14748 39931 66802 24840 10436 8249 9686 15716 38431 62740 23371
3039.2285114624H186l780j656r38n62k50j56%o3j87%J56k19r4%l1o2L1J87j56C12
$$ 8186 4406 2750 1812 1250 1000 844 844 781 594 594 750 531 437 437 406 344 375 562 406 312
3033.9794882699C75l1r4l1%O2O3o3j25o2%l2l1%S1L1l1L1L2L1R4R3L2r4o3L2B81
$$ 375 344 250 219 219 281 344 281 156 94 94 62 31 31 31 31 31 31 31 31 31 31 31 31 62 31 62 94 125 219 312 344 250 187 219 281
3024.9402331525C75r4j25o2o3%Vl1%UL1%l1%UL1%TL1%O3%l1l2L2%Tl2%l1T%@
$$ 375 281 156 94 31 31 31 31 31 0 0 0 0 31 31 0 0 0 0 31 31 31 62 62 125 125 94 62 94 94 94 62 62 31 0 0 0
3015.6540912746@%Tl1L1%Vl1L1l1L1%l1L1%T6l1L1%l1L1%YL1o2L1%XL1l1%XL1@
$$ 0 0 0 -31 0 0 0 0 0 -31 0 -31 0 0 -31 0 0 0 0 0 0 0 0 0 0 0 0 0 0 0 0 0 0 0 0 0 0 0 0 0 0 0 -31 0 0 -31 0 0 0 0 0 0 0 0 31 -31 0 0 0 0 0 0 0 31 0 0 0 0 0 0 0 31 0
2997.393346392@%ZL1%l1L1l1%L1Tl1%UL1%l1%Tl1%L1l1L1%Tl1%UL1%l1L1l1C1
$$ 0 0 0 0 0 0 0 0 0 31 31 0 31 0 0 31 62 31 31 31 31 62 62 31 31 31 0 0 31 0 31 31 31 0 0 0 0 31 31 0 31 0 31
2986.5638593497C1%L1L2l2%VL2o3%Ul1L1%l1L1%Tl1L1%S0L1%l1%TL1L2o3%L1F2
$$ 31 31 62 94 62 62 62 62 62 94 31 31 31 31 0 31 31 0 31 31 31 0 31 31 31 31 31 31 31 31 31 31 31 62 62 31 31 31 62 94 31 31 62 62
2975.4833954999I4L1l1%Tl2L2L1O2L2o3o2L1%Tl1l2%sL2%O2L1R4L1o2l1l2%B19
$$ 94 125 94 94 94 62 94 125 187 219 156 94 125 125 125 94 62 62 62 62 62 62 62 62 62 62 94 94 156 187 281 312 250 219 187 187 219
2966.1972536221C12R4L1o2r4l1L1l1To3%Vl1L1%L1l1L1L2L1O2R4J25O3%TL1F87
$$ 312 406 437 375 281 250 281 250 219 156 156 156 156 156 125 156 156 187 156 187 219 250 312 406 531 594 594 594 625 687
2958.6755810398H12O3R4o3j25J56J25r3r4l1K18O3o3L2J56L12N63J000J937H874
$$ 812 875 969 906 781 937 1062 969 875 844 1062 1125 1062 1094 1250 1562 2125 3125 5062 8874
2953.693163575A8685L0651L687l1026n250R155L4651j2592l2526q155k687C281
$$ 18685 49336 53023 21997 16747 25902 60553 47961 15435 7280 4593 3281
2950.6814418849B875k19j25l1l2R4l44k81J88K50K18k81l1M06Q44J624L062A4779
$$ 2875 2656 2531 2500 2468 2562 2218 1937 2125 2375 2593 2312 2281 2687 3531 5155 8217 14779
2946.1363259224C2401M0900K343j1998k6995R967K9651M875k5809l6588r467E968
$$ 32401 73301 75644 63646 36651 46618 76269 81144 55335 18747 9280 5968
2943.1441403825D281r07n31m06O3%k82k81j87K81l1j88k50j25J57M37R69J905I124
$$ 4281 3374 2843 2437 2500 2500 2218 1937 1750 2031 2000 1812 1562 1437 1594 2031 3000 4905 9124
2938.3755810398B2028L2120k3465j7060Q75J4622K4778l0683j5372l719j531A812
$$ 22028 54148 30683 13623 14498 29120 53898 23215 7843 4124 2593 1812
2935.3892563449A375k81k19r4L1J57k82j87%R4O2k81j25o3%l1T%l1%Ul2%l1F2
$$ 1375 1094 875 781 812 969 687 500 500 594 656 375 250 187 187 156 125 125 94 94 94 94 62 62 31 62
2928.8638593497F2%l1%S2l1L1%Ul1%UL1l1%VL1l1%L1l1L1%Ul1L1T%L2o3%L1F2
$$ 62 62 31 31 31 31 31 31 31 31 31 31 31 31 31 0 31 31 31 31 0 0 0 0 31 0 0 0 0 0 31 0 0 31 0 31 31 31 31 0 31 62 62 94 31 31 62 62
2916.8070216972F2l1T%sL1%Wl1%XL1T%l1%TL1l1%l1%sL1l1L1%Ul1%S8L1%TL1A25
$$ 62 31 0 0 0 0 0 0 0 0 0 0 31 31 31 31 31 31 0 0 0 0 0 0 0 31 62 62 31 31 31 62 31 31 0 0 0 0 0 0 0 0 0 0 31 0 31 31 31 31 0 0 0 0 0 0 0 0 0 0 0 0 0 0 0 0 0 0 0 31 31 31 62 125
2898.1972536221A25L1o2L1T%o2l2%Tl1%UL1l1%sL1%VL2O2L1%l1%O3%l2l1%l1A25
$$ 125 156 94 125 156 156 94 62 62 62 31 31 31 31 62 31 31 31 31 31 31 31 31 31 31 62 62 62 62 62 94 156 187 187 156 156 219 219 187 156 156 125 125
2887.4677665798A25%L1%l1L1T%VL2%TO2L1L2O2O3J25TR3L2L1J25L75L43J88A875
$$ 125 125 156 156 125 156 187 187 187 187 187 219 219 219 281 312 344 406 469 594 719 812 844 875 1000 1375 1718 1906 1875
2880.1421867675B218Q44R37J563L530Q936K6465L2839N468k0810k4246K5184H1800
$$ 2218 3062 3999 5562 9092 18028 44493 77332 82800 61990 37744 62928 81800
2876.8794882699G5269l4182k6839o562k468j562q13k50%L2l44k81k82o2J25B000
$$ 75269 41087 14248 7686 5218 3656 2843 2593 2593 2625 2281 2000 1718 1656 1781 2000
2872.8833954999B125o3j56K19O56P50J218K656O843K0653L7650L781j0998l2183D8930
$$ 2125 2062 1906 2125 2781 3531 4749 7405 14248 34901 72551 76332 65334 33151 48930
2869.093163575G4020n749k4247k9276p437k468j594q74l75j57%k81l12l13G81
$$ 74020 68271 44024 14748 7311 4843 3249 2375 2000 1843 1843 1562 1250 937 781
2865.3285114624G81o2r4j56r4l1l2O3J25O2r3r4o3L2%o3r4o2l1l2%Tl1%Tl1@
$$ 781 719 625 469 375 344 312 375 500 562 469 375 312 344 344 281 187 125 94 62 62 62 31 31 31 0 0
2858.5265578473F2l1%l1L1%TL1%UO3O2%o2l1L1O2o2o3l1%l1%Tl1L1%l1%TL1@
$$ 62 31 31 0 31 31 31 62 62 62 62 125 187 187 125 94 125 187 125 62 31 31 0 0 0 -31 0 0 -31 -31 -31 0 0
2850.2443231995@%Zl1L1%Tl1L1l1L1%l1L1%Ul1%sL1l1%WL1l1%WL1l1L1l1L1@
$$ 0 0 0 0 0 0 0 0 0 -31 0 0 0 -31 0 -31 0 0 -31 0 0 0 0 -31 -31 -31 -31 -31 -31 -31 -31 -31 -31 0 -31 -31 -31 -31 -31 -31 0 -31 -31 -31 -31 -31 -31 0 -31 0 -31 0 0
2836.9482304296@l1L1%Tl1%sL1l1%VL1l1%L1l1L1l1%UL1l1%S0L1l1%S2L1l1c1
$$ 0 -31 0 0 0 -31 -31 -31 -31 -31 -31 -31 -31 -31 -31 0 -31 -31 -31 -31 -31 0 -31 -31 0 -31 0 -31 -31 -31 -31 0 -31 -31 -31 -31 -31 -31 -31 -31 -31 -31 -31 0 -31 -31 -31 -31 -31 -31 -31 -31 -31 -31 -31 -31 -31 0 -31 -31
2821.9540912746c1L1l1L1l1%sL1l1%S1L1%Tl1L1l1L1%l1%WL1l1%S3L1l1%YL1c1
$$ -31 0 -31 0 -31 -31 -31 -31 -31 -31 -31 -31 -31 -31 0 -31 -31 -31 -31 -31 -31 -31 -31 -31 -31 -31 -31 0 0 0 -31 0 -31 0 0 -31 -31 -31 -31 -31 -31 0 -31 -31 -31 -31 -31 -31 -31 -31 -31 -31 -31 -31 -31 -31 0 -31 -31 -31 -31 -31 -31 -31 -31 0 -31
2805.1011608521c1L1l1%UL1l1%WL1l1L1l1%WL1%Tl1L1l1L1%WL1TR4TO2%l1TO2C12
$$ -31 0 -31 -31 -31 -31 0 -31 -31 -31 -31 -31 -31 0 -31 0 -31 -31 -31 -31 -31 -31 0 0 0 -31 0 -31 0 0 0 0 0 0 31 62 156 250 312 312 281 250 312 312
2794.0206970023B81j25o2o3%Tl1%S5L1TO3R4R3L2r4%L1Tl1j25o2o3%Tl1%Xl1@
$$ 281 156 94 31 31 31 0 0 0 0 0 0 0 0 0 0 0 0 0 0 0 0 31 62 125 219 312 344 250 250 281 312 281 156 94 31 31 31 0 0 0 0 0 0 0 -31 0
2782.2304650774@l1L1%Tl1%L1l1L1l1%L1l1%VL1%l1L1%Wl1L1%Tl1%sL1l1%Wl1c1
$$ 0 -31 0 0 0 -31 -31 0 -31 0 -31 -31 0 -31 -31 -31 -31 -31 0 0 -31 0 0 0 0 0 0 -31 0 0 0 -31 -31 -31 -31 -31 -31 -31 -31 -31 -31 0 -31 -31 -31 -31 -31 -31 -62 -31
2769.6816247019c1%UL1%l1L1%l1%UL1%Ul1L1%l1%L1l1%UL1l1L1l1%S2L1l1%@
$$ -31 -31 -31 -31 0 0 -31 0 0 -31 -31 -31 -31 0 0 0 0 -31 0 0 -31 -31 0 -31 -31 -31 -31 0 -31 0 -31 -31 -31 -31 -31 -31 -31 -31 -31 -31 -31 -31 -31 0 -31 -31 0
2757.9501840446c1%UL1l1%sL1l1%VL1l1%UL1%l1L1l1%T0L1l1%WL1l1%XL1l1c1
$$ -31 -31 -31 -31 0 -31 -31 -31 -31 -31 -31 -31 -31 -31 -31 0 -31 -31 -31 -31 -31 0 -31 -31 -31 -31 0 0 -31 0 -31 -31 -31 -31 -31 -31 -31 -31 -31 -31 -31 -31 -31 -31 -31 -31 -31 -31 -31 -31 -31 0 -31 -31 -31 -31 -31 -31 0 -31 -31 -31 -31 -31 -31 -31 0 -31 -31
2740.5953000071c1L1l1%S3L1l1%T2L1l1L1l1L1l1%L1%l1%L1l1%T2L1l1%L1l1c1
$$ -31 0 -31 -31 -31 -31 -31 -31 -31 -31 -31 -31 -31 -31 -31 -31 0 -31 -31 -31 -31 -31 -31 -31 -31 -31 -31 -31 -31 -31 -31 -31 -31 -31 -31 -31 -31 -31 -31 -31 0 -31 0 -31 0 -31 -31 0 0 -31 -31 0 -31 -31 -31 -31 -31 -31 -31 -31 -31 -31 -31 -31 -31 -31 -31 -31 -31 -31 -31 -31 -31 -31 -31 0 -31 -31 0 -31 -31
2720.29120996@%Ul1%WL1%Tl1%TL1l1%TL1%l1%ZL1l1%WL1%l1L1l1%TL1l1L1c1
$$ 0 0 0 0 -31 -31 -31 -31 -31 -31 0 0 0 -31 -31 -31 0 -31 -31 -31 0 0 -31 -31 -31 -31 -31 -31 -31 -31 -31 0 -31 -31 -31 -31 -31 -31 0 0 -31 0 -31 -31 -31 0 -31 0 -31
2707.993346392c1%L1%l1%XL1l1%XL1%l1%L1l1L1l1%L1l1%XL1l1%VL1l1%S1L1c1
$$ -31 -31 0 0 -31 -31 -31 -31 -31 -31 -31 0 -31 -31 -31 -31 -31 -31 -31 0 0 -31 -31 0 -31 0 -31 -31 0 -31 -31 -31 -31 -31 -31 -31 0 -31 -31 -31 -31 -31 0 -31 -31 -31 -31 -31 -31 -31 -31 -31 -31 -31 -31 0 -31
2693.6501840446c1%ZL1l1%TL1l1%UL1l1%XL1%l1L1l1%L1l1%VL1%Tl1L1%l1L1c1
$$ -31 -31 -31 -31 -31 -31 -31 -31 -31 0 -31 -31 -31 0 -31 -31 -31 -31 0 -31 -31 -31 -31 -31 -31 -31 0 0 -31 0 -31 -31 0 -31 -31 -31 -31 -31 0 0 0 -31 0 0 -31 0 -31
2681.9167897722c1%YL1l1L1%l1%XL1%l1%L1l1%L1l1%TL1%Tl1L1l1%TL1l1%L1c1
$$ -31 -31 -31 -31 -31 -31 -31 -31 0 -31 0 0 -31 -31 -31 -31 -31 -31 -31 0 0 -31 -31 0 -31 -31 0 -31 -31 -31 0 0 0 -31 0 -31 -31 -31 0 -31 -31 0 -31
2671.0873027299c1%L1l1%L1%Tl1%L1l1%TL1l1L1l1%L1%l1%TL1l1%UL1l1L1%c1
$$ -31 -31 0 -31 -31 0 0 0 -31 -31 0 -31 -31 -31 0 -31 0 -31 -31 0 0 -31 -31 -31 0 -31 -31 -31 -31 0 -31 0 0 -31
2662.5540912746c1L1%Tl1L1%l1%S0L1l1%UL1%l1%XL1l1%UL1l1L1l1%YL1l1%c1
$$ -31 0 0 0 -31 0 0 -31 -31 -31 -31 -31 -31 -31 -31 -31 -31 -31 0 -31 -31 -31 -31 0 0 -31 -31 -31 -31 -31 -31 -31 0 -31 -31 -31 -31 0 -31 0 -31 -31 -31 -31 -31 -31 -31 -31 0 -31 -31 -31
2649.4658129647@l1L1l1%XL1l1%T7L1l1%VL1%l1%VL1l1%L1l1%TL1%Wl1L1l1c1
$$ 0 -31 0 -31 -31 -31 -31 -31 -31 -31 0 -31 -31 -31 -31 -31 -31 -31 -31 -31 -31 -31 -31 -31 -31 -31 -31 -31 -31 -31 -31 -31 -31 -31 -31 -31 -31 -31 -31 0 -31 -31 -31 -31 -31 0 0 -31 -31 -31 -31 -31 0 -31 -31 0 -31 -31 -31 0 0 0 0 0 0 -31 0 -31 -31
2632.2128825422c1%XL1l1L1l1%L1l1%TL1l1%ZL1l1%L1l1%sL1l1%UL1%l1%L1@
$$ -31 -31 -31 -31 -31 -31 -31 0 -31 0 -31 -31 0 -31 -31 -31 0 -31 -31 -31 -31 -31 -31 -31 -31 -31 0 -31 -31 0 -31 -31 -31 -31 -31 -31 -31 -31 -31 -31 0 -31 -31 -31 -31 0 0 -31 -31 0 0
2619.3755810398c1L1%Tl1%TL1%l1L1l1%S0L1l1%UL1l1%VL1l1%WL1l1%UL1l1c1
$$ -31 0 0 0 -31 -31 -31 0 0 -31 0 -31 -31 -31 -31 -31 -31 -31 -31 -31 -31 -31 0 -31 -31 -31 -31 0 -31 -31 -31 -31 -31 0 -31 -31 -31 -31 -31 -31 0 -31 -31 -31 -31 0 -31 -31
2607.29120996c1%L1l1%L1l1%L1%l1%sL1l1%TL1l1%S4L1l1L1l1%YL1l1L1%@
$$ -31 -31 0 -31 -31 0 -31 -31 0 0 -31 -31 -31 -31 -31 -31 -31 -31 -31 -31 0 -31 -31 -31 0 -31 -31 -31 -31 -31 -31 -31 -31 -31 -31 -31 -31 -31 -31 -31 0 -31 0 -31 -31 -31 -31 -31 -31 -31 -31 0 -31 0 0 0
2593.2365087395@l1%VL1l1L1l1L1l1L1l1L1%l1%L1l1L1l1%XL1%Vl1%S0L1%l1c1
$$ 0 -31 -31 -31 -31 -31 0 -31 0 -31 0 -31 0 -31 0 0 -31 -31 0 -31 0 -31 -31 -31 -31 -31 -31 -31 0 0 0 0 0 -31 -31 -31 -31 -31 -31 -31 -31 -31 -31 -31 0 0 -31 -31
2581.2521376596c1%WL1l1%UL1%Tl1L1%Tl1L1l1%TL1l1%WL1l1%TL1l1%ZL1l1@
$$ -31 -31 -31 -31 -31 -31 0 -31 -31 -31 -31 0 0 0 -31 0 0 0 -31 0 -31 -31 -31 0 -31 -31 -31 -31 -31 -31 0 -31 -31 -31 0 -31 -31 -31 -31 -31 -31 -31 -31 -31 0 -31 0
2569.4187433873c1%YL1l1L1l1%TL1l1%UL1%l1L1l1%VL1l1L1%l1%L1l1L1l1%c1
$$ -31 -31 -31 -31 -31 -31 -31 -31 0 -31 0 -31 -31 -31 0 -31 -31 -31 -31 0 0 -31 0 -31 -31 -31 -31 -31 0 -31 0 0 -31 -31 0 -31 0 -31 -31 -31
2559.4421867675c1%TL1l1L1l1L1l1%TL1%l1L1%l1%WL1l1%VL1l1%WL1%Tl1L1@
$$ -31 -31 -31 0 -31 0 -31 0 -31 -31 -31 0 0 -31 0 0 -31 -31 -31 -31 -31 -31 0 -31 -31 -31 -31 -31 0 -31 -31 -31 -31 -31 -31 0 0 0 -31 0 0
2549.1521376596@l1%L1l1%WL1l1L1l1%TL1l1L1%Ul1%L1l1L1l1L1%l1%UL1%l1c1
$$ 0 -31 -31 0 -31 -31 -31 -31 -31 -31 0 -31 0 -31 -31 -31 0 -31 0 0 0 0 -31 -31 0 -31 0 -31 0 0 -31 -31 -31 -31 0 0 -31 -31
2539.5775346548c1L1%l1%TL1l1%L1l1%L1l1L1l1%UL1%Tl1L1%l1%WL1l1L1%l1@
$$ -31 0 0 -31 -31 -31 0 -31 -31 0 -31 -31 0 -31 0 -31 -31 -31 -31 0 0 0 -31 0 0 -31 -31 -31 -31 -31 -31 0 -31 0 0 -31 0
2530.291392777c1%TL1l1%TL1l1%VL1l1%ZL1l1%VL1l1%L1l1L1l1%VL1l1L1%@
$$ -31 -31 -31 0 -31 -31 -31 0 -31 -31 -31 -31 -31 0 -31 -31 -31 -31 -31 -31 -31 -31 -31 0 -31 -31 -31 -31 -31 0 -31 -31 0 -31 0 -31 -31 -31 -31 -31 0 -31 0 0 0
2518.9599521197@l1%L1%l1%L1%Ul1%WL1l1%UL1%l1%L1l1L1l1L1l1%L1%l1%ZL1@
$$ 0 -31 -31 0 0 -31 -31 0 0 0 0 -31 -31 -31 -31 -31 -31 0 -31 -31 -31 -31 0 0 -31 -31 0 -31 0 -31 0 -31 -31 0 0 -31 -31 -31 -31 -31 -31 -31 -31 -31 0 0
2507.4794882699c1%L1%l1L1%Ul1%S1L1l1%L1l1%TL1l1L1l1L1%l1%TL1l1%L1c1
$$ -31 -31 0 0 -31 0 0 0 0 -31 -31 -31 -31 -31 -31 -31 -31 -31 -31 -31 -31 0 -31 -31 0 -31 -31 -31 0 -31 0 -31 0 0 -31 -31 -31 0 -31 -31 0 -31
2496.9384623545c1L1l1%L1%l1L1%Tl1%UL1%Tl1%WL1l1%UL1l1L1%l1L1%Tl1%c1
$$ -31 0 -31 -31 0 0 -31 0 0 0 -31 -31 -31 -31 0 0 0 -31 -31 -31 -31 -31 -31 0 -31 -31 -31 -31 0 -31 0 0 -31 0 0 0 -31 -31 -31
2487.1128825422c1%XL1%Vl1%TL1l1L1%l1%UL1%l1L1l1%S2L1l1%L1%l1%L1l1c1
$$ -31 -31 -31 -31 -31 -31 -31 0 0 0 0 0 -31 -31 -31 0 -31 0 0 -31 -31 -31 -31 0 0 -31 0 -31 -31 -31 -31 -31 -31 -31 -31 -31 -31 -31 -31 -31 0 -31 -31 0 0 -31 -31 0 -31 -31
2474.5265578473c1L1l1%L1%l1%TL1%l1L1%l1L1%l1L1%l1%L1l1L1l1L1%Tl1L1@
$$ -31 0 -31 -31 0 0 -31 -31 -31 0 0 -31 0 0 -31 0 0 -31 0 0 -31 -31 0 -31 0 -31 0 0 0 -31 0 0
2466.4953000071@l1%L1l1%TL1l1%L1l1%TL1%l1%L1l1%TL1%Tl1L1l1%TL1l1%c1
$$ 0 -31 -31 0 -31 -31 -31 0 -31 -31 0 -31 -31 -31 0 0 -31 -31 0 -31 -31 -31 0 0 0 -31 0 -31 -31 -31 0 -31 -31 -31
2458.0246042323c1L1l1%UL1l1%UL1l1%TL1l1%YL1l1L1%l1%L1l1%WL1l1%L1%c1
$$ -31 0 -31 -31 -31 -31 0 -31 -31 -31 -31 0 -31 -31 -31 0 -31 -31 -31 -31 -31 -31 -31 -31 0 -31 0 0 -31 -31 0 -31 -31 -31 -31 -31 -31 0 -31 -31 0 0 -31
2447.19511719@l1%UL1l1%UL1l1L1l1L1l1L1%l1L1l1L1l1L1%l1L1%l1%TL1c1
$$ 0 -31 -31 -31 -31 0 -31 -31 -31 -31 0 -31 0 -31 0 -31 0 0 -31 0 -31 0 -31 0 0 -31 0 0 -31 -31 -31 0 -31
2438.9128825422@l1L1l1%L1%l1L1%l1%L1l1%L1l1%TL1l1%TL1l1%UL1l1%TL1c1
$$ 0 -31 0 -31 -31 0 0 -31 0 0 -31 -31 0 -31 -31 0 -31 -31 -31 0 -31 -31 -31 0 -31 -31 -31 -31 0 -31 -31 -31 0 -31
2430.4421867675@%l1L1%l1L1%l1L1%Tl1L1l1L1%l1%XL1l1%UL1l1L1l1L1l1L1c1
$$ 0 0 -31 0 0 -31 0 0 -31 0 0 0 -31 0 -31 0 0 -31 -31 -31 -31 -31 -31 -31 0 -31 -31 -31 -31 0 -31 0 -31 0 -31 0 -31
2421.1560448896@l1%VL1l1%L1l1L1%l1%UL1%l1%UL1l1%UL1l1L1l1%L1%Tl1%c1
$$ 0 -31 -31 -31 -31 -31 0 -31 -31 0 -31 0 0 -31 -31 -31 -31 0 0 -31 -31 -31 -31 0 -31 -31 -31 -31 0 -31 0 -31 -31 0 0 0 -31 -31 -31
2411.3304650774c1L1l1%TL1l1L1%Ul1%TL1l1%WL1%l1L1%Ul1%UL1%Ul1L1l1%c1
$$ -31 0 -31 -31 -31 0 -31 0 0 0 0 -31 -31 -31 0 -31 -31 -31 -31 -31 -31 0 0 -31 0 0 0 0 -31 -31 -31 -31 0 0 0 0 -31 0 -31 -31 -31
2401.0404159695@l1%TL1%Tl1%L1l1%L1%l1L1l1L1l1%L1%l1%L1%Ul1L1l1%L1c1
$$ 0 -31 -31 -31 0 0 0 -31 -31 0 -31 -31 0 0 -31 0 -31 0 -31 -31 0 0 -31 -31 0 0 0 0 -31 0 -31 -31 0 -31
2392.4697201948c1%UL1l1L1%Ul1L1l1%TL1l1L1l1%UL1l1%UL1l1%L1l1%YL1l1c1
$$ -31 -31 -31 -31 0 -31 0 0 0 0 -31 0 -31 -31 -31 0 -31 0 -31 -31 -31 -31 0 -31 -31 -31 -31 0 -31 -31 0 -31 -31 -31 -31 -31 -31 -31 -31 0 -31 -31
2381.993163575c1L1l1%TL1l1%TL1l1L1%l1%L1l1L1l1L1%l1%VL1%l1%L1l1L1c1
$$ -31 0 -31 -31 -31 0 -31 -31 -31 0 -31 0 0 -31 -31 0 -31 0 -31 0 0 -31 -31 -31 -31 -31 0 0 -31 -31 0 -31 0 -31
2373.4599521197@l1%VL1l1%UL1l1%L1%Tl1%WL1l1%UL1%Wl1%VL1l1%XL1l1%L1c1
$$ 0 -31 -31 -31 -31 -31 0 -31 -31 -31 -31 0 -31 -31 0 0 0 -31 -31 -31 -31 -31 -31 0 -31 -31 -31 -31 0 0 0 0 0 0 -31 -31 -31 -31 -31 0 -31 -31 -31 -31 -31 -31 -31 0 -31 -31 0 -31
2360.3716738098@l1%WL1%Tl1L1%Tl1%L1%Ul1L1l1L1l1%TL1l1%UL1%Tl1L1%Ul1@
$$ 0 -31 -31 -31 -31 -31 -31 0 0 0 -31 0 0 0 -31 -31 0 0 0 0 -31 0 -31 0 -31 -31 -31 0 -31 -31 -31 -31 0 0 0 -31 0 0 0 0 -31 0
2349.793163575@l1%VL1l1L1l1L1%Ul1L1l1L1%l1L1%l1L1l1%TL1l1%L1%l1%c1
$$ 0 -31 -31 -31 -31 -31 0 -31 0 -31 0 0 0 0 -31 0 -31 0 0 -31 0 0 -31 0 -31 -31 -31 0 -31 -31 0 0 -31 -31 -31
2341.0089753122c1%YL1l1%UL1l1L1%l1L1l1L1l1%UL1%Vl1%L1l1%L1l1L1%l1c1
$$ -31 -31 -31 -31 -31 -31 -31 -31 0 -31 -31 -31 -31 0 -31 0 0 -31 0 -31 0 -31 -31 -31 -31 0 0 0 0 0 -31 -31 0 -31 -31 0 -31 0 0 -31 -31
2330.7814418849@%l1L1l1%VL1%l1%ZL1l1%L1l1%VL1l1L1l1%L1%Tl1%UL1%Ul1c1
$$ 0 0 -31 0 -31 -31 -31 -31 -31 0 0 -31 -31 -31 -31 -31 -31 -31 -31 -31 0 -31 -31 0 -31 -31 -31 -31 -31 0 -31 0 -31 -31 0 0 0 -31 -31 -31 -31 0 0 0 0 -31 -31
2318.985531932@%l1L1%Tl1%VL1l1%L1l1L1%l1L1l1%L1%l1L1l1L1%Tl1L1l1c1
$$ 0 0 -31 0 0 0 -31 -31 -31 -31 -31 0 -31 -31 0 -31 0 0 -31 0 -31 -31 0 0 -31 0 -31 0 0 0 -31 0 -31 -31
2310.4148361572c1%YL1%Tl1%L1%Ul1%L1l1L1%l1L1l1%L1%l1%L1l1%L1l1%L1@
$$ -31 -31 -31 -31 -31 -31 -31 -31 0 0 0 -31 -31 0 0 0 0 -31 -31 0 -31 0 0 -31 0 -31 -31 0 0 -31 -31 0 -31 -31 0 -31 -31 0 0
2300.6892563449@l1L1%l1L1l1%UL1%l1L1l1L1l1L1%l1%L1%l1%TL1%l1%L1%l1@
$$ 0 -31 0 0 -31 0 -31 -31 -31 -31 0 0 -31 0 -31 0 -31 0 0 -31 -31 0 0 -31 -31 -31 0 0 -31 -31 0 0 -31 0
2292.1560448896@%l1%L1l1L1l1%TL1l1%L1l1%L1l1%TL1%Tl1%TL1%l1%L1l1%c1
$$ 0 0 -31 -31 0 -31 0 -31 -31 -31 0 -31 -31 0 -31 -31 0 -31 -31 -31 0 0 0 -31 -31 -31 0 0 -31 -31 0 -31 -31 -31
2283.5853491149c1%TL1l1%L1%Tl1L1l1L1l1%VL1l1L1%Ul1L1%l1%L1l1L1%Xl1c1
$$ -31 -31 -31 0 -31 -31 0 0 0 -31 0 -31 0 -31 -31 -31 -31 -31 0 -31 0 0 0 0 -31 0 0 -31 -31 0 -31 0 0 0 0 0 0 0 -31 -31
2273.5462768146c1L1%l1L1l1L1l1L1l1%L1l1L1%Tl1L1%l1L1l1%L1l1%UL1l1c1
$$ -31 0 0 -31 0 -31 0 -31 0 -31 -31 0 -31 0 0 0 -31 0 0 -31 0 -31 -31 0 -31 -31 -31 -31 0 -31 -31
2265.7285114624@l1%L1l1%WL1l1%L1l1L1%Tl1L1l1L1l1%VL1%Tl1L1l1%WL1l1@
$$ 0 -31 -31 0 -31 -31 -31 -31 -31 -31 0 -31 -31 0 -31 0 0 0 -31 0 -31 0 -31 -31 -31 -31 -31 0 0 0 -31 0 -31 -31 -31 -31 -31 -31 0 -31 0
2255.4384623545@%l1%TL1l1L1%Tl1%L1%Ul1L1l1L1l1%TL1%Tl1%L1%Ul1L1l1@
$$ 0 0 -31 -31 -31 0 -31 0 0 0 -31 -31 0 0 0 0 -31 0 -31 0 -31 -31 -31 0 0 0 -31 -31 0 0 0 0 -31 0 -31 0
2246.4677665798c1L1l1%TL1l1L1%l1L1%l1%L1%Tl1%UL1%Tl1L1l1L1%l1%TL1@
$$ -31 0 -31 -31 -31 0 -31 0 0 -31 0 0 -31 -31 0 0 0 -31 -31 -31 -31 0 0 0 -31 0 -31 0 0 -31 -31 -31 0 0
2237.9345551245c1%VL1l1%UL1l1L1l1%WL1l1%L1l1%L1l1L1%Tl1%UL1%l1%TL1@
$$ -31 -31 -31 -31 -31 0 -31 -31 -31 -31 0 -31 0 -31 -31 -31 -31 -31 -31 0 -31 -31 0 -31 -31 0 -31 0 0 0 -31 -31 -31 -31 0 0 -31 -31 -31 0 0
2227.6070216972c1%L1l1L1l1L1%Tl1%L1l1L1l1%L1l1%TL1l1L1%l1%TL1%l1L1@
$$ -31 -31 0 -31 0 -31 0 0 0 -31 -31 0 -31 0 -31 -31 0 -31 -31 -31 0 -31 0 0 -31 -31 -31 0 0 -31 0 0
2219.5382795374c1L1l1%ZL1%Tl1L1l1%UL1%Tl1%WL1%l1L1%Ul1%TL1%l1%L1l1c1
$$ -31 0 -31 -31 -31 -31 -31 -31 -31 -31 -31 0 0 0 -31 0 -31 -31 -31 -31 0 0 0 -31 -31 -31 -31 -31 -31 0 0 -31 0 0 0 0 -31 -31 -31 0 0 -31 -31 0 -31 -31
2207.993346392c1%WL1%l1L1%l1%L1l1%L1l1L1l1%TL1l1%TL1l1%TL1l1%YL1@
$$ -31 -31 -31 -31 -31 -31 0 0 -31 0 0 -31 -31 0 -31 -31 0 -31 0 -31 -31 -31 0 -31 -31 -31 0 -31 -31 -31 0 -31 -31 -31 -31 -31 -31 -31 -31 0 0
2197.7658129647c1L1l1%L1%Tl1%L1%l1L1l1L1%l1%TL1%l1%TL1l1L1l1L1l1L1c1
$$ -31 0 -31 -31 0 0 0 -31 -31 0 0 -31 0 -31 0 0 -31 -31 -31 0 0 -31 -31 -31 0 -31 0 -31 0 -31 0 -31
2189.7345551245c1%L1%Tl1%UL1%l1%L1l1L1l1L1%l1%UL1l1%VL1l1L1l1%WL1c1
$$ -31 -31 0 0 0 -31 -31 -31 -31 0 0 -31 -31 0 -31 0 -31 0 0 -31 -31 -31 -31 0 -31 -31 -31 -31 -31 0 -31 0 -31 -31 -31 -31 -31 -31 0 -31
2179.6579985047c1%TL1%l1L1%l1L1%l1L1l1L1%Tl1L1%l1L1%Ul1%L1%l1L1l1@
$$ -31 -31 -31 0 0 -31 0 0 -31 0 0 -31 0 -31 0 0 0 -31 0 0 -31 0 0 0 0 -31 -31 0 0 -31 0 -31 0
2171.4382795374@l1L1%l1%VL1%l1L1%l1L1l1L1l1%TL1l1L1%l1%L1l1L1%Ul1@
$$ 0 -31 0 0 -31 -31 -31 -31 -31 0 0 -31 0 0 -31 0 -31 0 -31 -31 -31 0 -31 0 0 -31 -31 0 -31 0 0 0 0 -31 0
2162.6540912746c1L1l1%WL1l1L1l1L1l1L1l1L1l1L1l1%UL1l1L1l1%TL1%Vl1c1
$$ -31 0 -31 -31 -31 -31 -31 -31 0 -31 0 -31 0 -31 0 -31 0 -31 0 -31 -31 -31 -31 0 -31 0 -31 -31 -31 0 0 0 0 0 -31 -31
2153.5814418849c1L1%Ul1%L1l1%WL1l1%UL1%Vl1%L1l1%L1%l1L1l1%TL1%Vl1c1
$$ -31 0 0 0 0 -31 -31 0 -31 -31 -31 -31 -31 -31 0 -31 -31 -31 -31 0 0 0 0 0 -31 -31 0 -31 -31 0 0 -31 0 -31 -31 -31 0 0 0 0 0 -31 -31
2142.789439162@%Wl1L1l1%L1%Tl1L1l1L1%Ul1%L1l1%TL1l1L1l1%UL1%l1%L1c1
$$ 0 0 0 0 0 0 -31 0 -31 -31 0 0 0 -31 0 -31 0 0 0 0 -31 -31 0 -31 -31 -31 0 -31 0 -31 -31 -31 -31 0 0 -31 -31 0 -31
2132.9638593497@l1L1l1%WL1%S2l1%L1l1L1%S6l1%L1l1L1%S4l1%VL1l1L1%Tl1@
$$ 0 -31 0 -31 -31 -31 -31 -31 -31 0 0 0 0 0 0 0 0 0 0 0 0 0 -31 -31 0 -31 0 0 0 0 0 0 0 0 0 0 0 0 0 0 0 0 0 -31 -31 0 -31 0 0 0 0 0 0 0 0 0 0 0 0 0 0 0 -31 -31 -31 -31 -31 0 -31 0 0 0 -31 0
2114.4560448896c1%TL1l1L1l1%VL1%Tl1%UL1l1L1%l1%TL1%Ul1L1l1L1l1L1l1@
$$ -31 -31 -31 0 -31 0 -31 -31 -31 -31 -31 0 0 0 -31 -31 -31 -31 0 -31 0 0 -31 -31 -31 0 0 0 0 -31 0 -31 0 -31 0 -31 0
2105.1324186924@l1%VL1l1%L1l1%UL1l1L1%Tl1%UL1%l1L1%l1%L1l1%L1l1%L1c1
$$ 0 -31 -31 -31 -31 -31 0 -31 -31 0 -31 -31 -31 -31 0 -31 0 0 0 -31 -31 -31 -31 0 0 -31 0 0 -31 -31 0 -31 -31 0 -31 -31 0 -31
2095.5953000071c1L1%l1%TL1%l1%TL1%l1%WL1l1L1%l1L1%l1L1%Tl1L1l1L1l1@
$$ -31 0 0 -31 -31 -31 0 0 -31 -31 -31 0 0 -31 -31 -31 -31 -31 -31 0 -31 0 0 -31 0 0 -31 0 0 0 -31 0 -31 0 -31 0
2086.5226506173@l1%TL1l1L1l1%XL1%Ul1L1l1%TL1%Ul1%UL1%Tl1%TL1%Tl1%c1
$$ 0 -31 -31 -31 0 -31 0 -31 -31 -31 -31 -31 -31 -31 0 0 0 0 -31 0 -31 -31 -31 0 0 0 0 -31 -31 -31 -31 0 0 0 -31 -31 -31 0 0 0 -31 -31 -31
2075.793163575@%Tl1L1%l1%TL1%Tl1%TL1l1%UL1l1%L1l1L1%Tl1L1%Ul1L1l1c1
$$ 0 0 0 -31 0 0 -31 -31 -31 0 0 0 -31 -31 -31 0 -31 -31 -31 -31 0 -31 -31 0 -31 0 0 0 -31 0 0 0 0 -31 0 -31 -31
2066.5070216972@l1%YL1l1L1l1%TL1%l1%WL1l1L1l1L1l1L1l1L1l1%L1l1L1l1c1
$$ 0 -31 -31 -31 -31 -31 -31 -31 -31 0 -31 0 -31 -31 -31 0 0 -31 -31 -31 -31 -31 -31 0 -31 0 -31 0 -31 0 -31 0 -31 -31 0 -31 0 -31 -31
2056.6814418849@%Vl1%UL1%l1L1l1L1l1L1l1%TL1%l1L1%Ul1L1l1%VL1l1%L1@
$$ 0 0 0 0 0 -31 -31 -31 -31 0 0 -31 0 -31 0 -31 0 -31 -31 -31 0 0 -31 0 0 0 0 -31 0 -31 -31 -31 -31 -31 0 -31 -31 0 0
2046.893346392@l1L1l1%L1%l1L1%Ul1L1%Ul1%TL1l1%L1l1%UL1l1%TL1l1%L1c1
$$ 0 -31 0 -31 -31 0 0 -31 0 0 0 0 -31 0 0 0 0 -31 -31 -31 0 -31 -31 0 -31 -31 -31 -31 0 -31 -31 -31 0 -31 -31 0 -31
2037.6697201948c1L1l1L1l1%L1l1%L1%Ul1L1l1%L1%l1L1%l1L1%l1%TL1l1L1c1
$$ -31 0 -31 0 -31 -31 0 -31 -31 0 0 0 0 -31 0 -31 -31 0 0 -31 0 0 -31 0 0 -31 -31 -31 0 -31 0 -31
2029.6384623545@%Vl1%WL1%l1L1%l1L1%Vl1L1l1%L1%l1L1%l1%UL1l1%L1%l1@
$$ 0 0 0 0 0 -31 -31 -31 -31 -31 -31 0 0 -31 0 0 -31 0 0 0 0 0 -31 0 -31 -31 0 0 -31 0 0 -31 -31 -31 -31 0 -31 -31 0 0 -31 0
2019.0599521197c1%L1%l1%UL1l1%VL1%l1%L1%l1L1l1L1%Ul1%VL1l1%UL1l1L1@
$$ -31 -31 0 0 -31 -31 -31 -31 0 -31 -31 -31 -31 -31 0 0 -31 -31 0 0 -31 0 -31 0 0 0 0 -31 -31 -31 -31 -31 0 -31 -31 -31 -31 0 -31 0 0
2008.7324186924@l1L1l1%WL1l1%UL1%l1%TL1l1L1l1%VL1l1L1%l1L1l1%L1l1@
$$ 0 -31 0 -31 -31 -31 -31 -31 -31 0 -31 -31 -31 -31 0 0 -31 -31 -31 0 -31 0 -31 -31 -31 -31 -31 0 -31 0 0 -31 0 -31 -31 0 -31 0
1999.1953000071@l1%WL1l1L1%l1%YL1%Tl1L1l1L1l1%L1%Ul1%VL1%l1L1%l1%@
$$ 0 -31 -31 -31 -31 -31 -31 0 -31 0 0 -31 -31 -31 -31 -31 -31 -31 -31 0 0 0 -31 0 -31 0 -31 -31 0 0 0 0 -31 -31 -31 -31 -31 0 0 -31 0 0 -31 -31 0
1987.9658129647@%Wl1L1%l1L1%Tl1%WL1l1L1l1L1l1%L1l1%UL1l1%ZL1%Tl1%c1
$$ 0 0 0 0 0 0 -31 0 0 -31 0 0 0 -31 -31 -31 -31 -31 -31 0 -31 0 -31 0 -31 -31 0 -31 -31 -31 -31 0 -31 -31 -31 -31 -31 -31 -31 -31 -31 0 0 0 -31 -31 -31
1976.1324186924@%Tl1L1l1L1%Tl1%L1l1%UL1l1%TL1%Ul1%WL1%l1L1%l1%L1l1@
$$ 0 0 0 -31 0 -31 0 0 0 -31 -31 0 -31 -31 -31 -31 0 -31 -31 -31 0 0 0 0 -31 -31 -31 -31 -31 -31 0 0 -31 0 0 -31 -31 0 -31 0
1966.093346392@l1L1l1%TL1%Ul1L1l1%UL1l1%UL1%Vl1L1%Tl1L1l1L1l1L1l1c1
$$ 0 -31 0 -31 -31 -31 0 0 0 0 -31 0 -31 -31 -31 -31 0 -31 -31 -31 -31 0 0 0 0 0 -31 0 0 0 -31 0 -31 0 -31 0 -31 -31
1956.5187433873@l1L1%Ul1%VL1l1%TL1%Tl1%L1%Tl1L1l1L1l1L1%l1%VL1%l1@
$$ 0 -31 0 0 0 0 -31 -31 -31 -31 -31 0 -31 -31 -31 0 0 0 -31 -31 0 0 0 -31 0 -31 0 -31 0 0 -31 -31 -31 -31 -31 0 0 -31 0
1946.793163575c1L1l1%L1l1L1l1%UL1l1L1l1%L1l1L1%l1L1l1%TL1%Tl1%L1c1
$$ -31 0 -31 -31 0 -31 0 -31 -31 -31 -31 0 -31 0 -31 -31 0 -31 0 0 -31 0 -31 -31 -31 0 0 0 -31 -31 0 -31
1938.7619057347c1L1%Vl1L1%l1%L1%Ul1L1%Vl1L1%l1L1%l1L1%Tl1L1l1%L1%@
$$ -31 0 0 0 0 0 -31 0 0 -31 -31 0 0 0 0 -31 0 0 0 0 0 -31 0 0 -31 0 0 -31 0 0 0 -31 0 -31 -31 0 0 0
1929.1873027299@l1L1l1L1l1L1%Tl1L1%Wl1%TL1%Tl1%UL1%l1%L1%Vl1%L1%Tl1@
$$ 0 -31 0 -31 0 -31 0 0 0 -31 0 0 0 0 0 0 -31 -31 -31 0 0 0 -31 -31 -31 -31 0 0 -31 -31 0 0 0 0 0 -31 -31 0 0 0 -31 0
1918.6462768146@l1L1l1L1%l1%L1%l1%VL1l1%L1%l1L1l1L1%l1%TL1%l1%VL1c1
$$ 0 -31 0 -31 0 0 -31 -31 0 0 -31 -31 -31 -31 -31 0 -31 -31 0 0 -31 0 -31 0 0 -31 -31 -31 0 0 -31 -31 -31 -31 -31 0 -31
1909.3226506173c1%UL1l1L1%Ul1%L1l1%L1%Tl1%VL1%l1L1%l1L1l1L1l1%TL1c1
$$ -31 -31 -31 -31 0 -31 0 0 0 0 -31 -31 0 -31 -31 0 0 0 -31 -31 -31 -31 -31 0 0 -31 0 0 -31 0 -31 0 -31 -31 -31 0 -31
1900.0365087395c1L1%Ul1L1%l1%L1%l1%L1%l1L1%Vl1%L1l1L1%Tl1%TL1%Ul1@
$$ -31 0 0 0 0 -31 0 0 -31 -31 0 0 -31 -31 0 0 -31 0 0 0 0 0 -31 -31 0 -31 0 0 0 -31 -31 -31 0 0 0 0 -31 0
1890.5619057347c1%L1%Tl1%TL1%l1%L1%l1L1%Ul1%L1%l1L1%Ul1L1%l1L1l1%@
$$ -31 -31 0 0 0 -31 -31 -31 0 0 -31 -31 0 0 -31 0 0 0 0 -31 -31 0 0 -31 0 0 0 0 -31 0 0 -31 0 -31 -31 0
1881.4892563449c1L1l1%TL1%l1%L1%l1L1%Wl1%L1l1L1l1L1%l1%UL1l1L1l1L1c1
$$ -31 0 -31 -31 -31 0 0 -31 -31 0 0 -31 0 0 0 0 0 0 -31 -31 0 -31 0 -31 0 0 -31 -31 -31 -31 0 -31 0 -31 0 -31
1872.4540912746@l1%L1%l1L1%Tl1%UL1%Ul1%VL1l1%WL1%S0l1L1%l1L1%Xl1%@
$$ 0 -31 -31 0 0 -31 0 0 0 -31 -31 -31 -31 0 0 0 0 -31 -31 -31 -31 -31 0 -31 -31 -31 -31 -31 -31 0 0 0 0 0 0 0 0 0 0 0 -31 0 0 -31 0 0 0 0 0 0 0 -31 -31 0
1858.9658129647@l1L1l1%L1%Ul1%TL1%l1%L1l1%TL1%Tl1%ZL1l1L1l1%VL1%S0l1@
$$ 0 -31 0 -31 -31 0 0 0 0 -31 -31 -31 0 0 -31 -31 0 -31 -31 -31 0 0 0 -31 -31 -31 -31 -31 -31 -31 -31 -31 0 -31 0 -31 -31 -31 -31 -31 0 0 0 0 0 0 0 0 0 0 0 -31 0
1845.6265578473@%Tl1%L1%Tl1L1%l1%UL1l1L1l1%TL1l1L1%Ul1L1%Vl1L1%l1@
$$ 0 0 0 -31 -31 0 0 0 -31 0 0 -31 -31 -31 -31 0 -31 0 -31 -31 -31 0 -31 0 0 0 0 -31 0 0 0 0 0 -31 0 0 -31 0
1836.089439162c1L1%l1%TL1%l1L1l1L1%l1%L1%l1L1%Wl1%L1%l1L1l1L1%Tl1@
$$ -31 0 0 -31 -31 -31 0 0 -31 0 -31 0 0 -31 -31 0 0 -31 0 0 0 0 0 0 -31 -31 0 0 -31 0 -31 0 0 0 -31 0
1827.0167897722@%Tl1L1l1%TL1%Xl1L1%Vl1L1l1%L1%l1L1%S0l1L1l1%L1%l1@
$$ 0 0 0 -31 0 -31 -31 -31 0 0 0 0 0 0 0 -31 0 0 0 0 0 -31 0 -31 -31 0 0 -31 0 0 0 0 0 0 0 0 0 0 0 -31 0 -31 -31 0 0 -31 0
1815.2833954999@%Tl1%TL1l1L1l1L1%Ul1L1%S0l1L1%Vl1L1%Vl1%L1%S0l1L1@
$$ 0 0 0 -31 -31 -31 0 -31 0 -31 0 0 0 0 -31 0 0 0 0 0 0 0 0 0 0 0 -31 0 0 0 0 0 -31 0 0 0 0 0 -31 -31 0 0 0 0 0 0 0 0 0 0 0 -31 0 0
1801.693163575@%Ul1L1%Tl1L1l1L1%T0l1L1%l1L1%ZL1l1%Wl1L1%W9L1l1%U1L1@
1764.5736274248C1l1%VL1l1L1l1L1l1L1%l1%VL1l1L1l1%TL1%Tl1L1%Ul1L1%C1
$$ 31 0 0 0 0 0 31 0 31 0 31 0 31 31 0 0 0 0 0 31 0 31 0 0 0 31 31 31 0 31 31 31 31 0 31 31 31
1755.287485547@L1%Tl1L1%Vl1L1%sl1L1%Ul1L1%l1L1l1L1%T3l1L1%Tl1L1%C1
$$ 0 31 31 31 0 31 31 31 31 31 0 31 31 31 31 31 31 31 31 31 31 0 31 31 31 31 0 31 31 0 31 0 31 31 31 31 31 31 31 31 31 31 31 31 31 31 31 31 31 31 31 31 31 31 31 31 0 31 31 31 0 31 31 31
1739.187485547C1%l1L1%Ul1L1%S0l1L1l1L1l1%L1%Vl1L1%l1L1l1L1%Tl1L1@
$$ 31 31 0 31 31 31 31 0 31 31 31 31 31 31 31 31 31 31 31 0 31 0 31 0 0 31 31 31 31 31 0 31 31 0 31 0 31 31 31 0 31 0
1728.7109289272C1%l1%L1l1L1l1L1l1%L1%Tl1%L1%l1L1l1%S5L1l1%UL1l1%YL1@
$$ 31 31 0 0 31 0 31 0 31 0 0 31 31 31 0 0 31 31 0 31 0 0 0 0 0 0 0 0 0 0 0 0 0 0 0 0 31 0 0 0 0 31 0 0 0 0 0 0 0 0 31 0
1715.6226506173@L1l1%ZL1l1%S4l1L1%X9L1l1TL1%T0l1L1%S1l1L1%T2l1L1%C1
1674.7384623545@%Zl1L1%Ul1L1l1L1%Tl1L1%Ul1%L1%S2l1L1%Xl1L1%l1L1%Tl1c1
$$ 0 0 0 0 0 0 0 0 0 -31 0 0 0 0 -31 0 -31 0 0 0 -31 0 0 0 0 -31 -31 0 0 0 0 0 0 0 0 0 0 0 0 0 -31 0 0 0 0 0 0 0 -31 0 0 -31 0 0 0 -31 -31
1660.3953000071@%Zl1L1%sl1%L1%S1l1L1%Vl1L1%l1L1%S0l1L1%Vl1L1l1%L1c1
$$ 0 0 0 0 0 0 0 0 0 -31 0 0 0 0 0 0 0 0 0 0 -31 -31 0 0 0 0 0 0 0 0 0 0 0 0 -31 0 0 0 0 0 -31 0 0 -31 0 0 0 0 0 0 0 0 0 0 0 -31 0 0 0 0 0 -31 0 -31 -31 0 -31
1643.5423695845@%Tl1L1%Tl1L1l1L1l1L1%Ul1L1l1L1%Xl1L1%Tl1L1%Tl1L1%@
$$ 0 0 0 -31 0 0 0 -31 0 -31 0 -31 0 0 0 0 -31 0 -31 0 0 0 0 0 0 0 -31 0 0 0 -31 0 0 0 -31 0 0 0
1634.0677665798@l1L1%Tl1L1%Tl1L1%Ul1L1l1%L1l1%TL1l1L1%Xl1L1%Vl1L1@
$$ 0 -31 0 0 0 -31 0 0 0 -31 0 0 0 0 -31 0 -31 -31 0 -31 -31 -31 0 -31 0 0 0 0 0 0 0 -31 0 0 0 0 0 -31 0 0
1623.99120996@%l1L1l1L1%Vl1%L1l1L1%Vl1L1%Tl1L1%Tl1L1%l1%L1%S1l1@
$$ 0 0 -31 0 -31 0 0 0 0 0 -31 -31 0 -31 0 0 0 0 0 -31 0 0 0 -31 0 0 0 -31 0 0 -31 -31 0 0 0 0 0 0 0 0 0 0 0 0 -31 0
1612.4462768146@%Tl1L1%Ul1L1l1L1%Xl1L1%Tl1L1%l1L1%l1L1%Tl1L1%Tl1L1@
$$ 0 0 0 -31 0 0 0 0 -31 0 -31 0 0 0 0 0 0 0 -31 0 0 0 -31 0 0 -31 0 0 -31 0 0 0 -31 0 0 0 -31 0 0
1602.7226506173c1L1%Vl1L1%S7l1L1%S8l1%L1%Tl1L1l1L1%sl1L1l1%VL1%S3l1@
$$ -31 0 0 0 0 0 -31 0 0 0 0 0 0 0 0 0 0 0 0 0 0 0 0 0 0 -31 0 0 0 0 0 0 0 0 0 0 0 0 0 0 0 0 0 0 0 -31 -31 0 0 0 -31 0 -31 0 0 0 0 0 0 0 0 0 0 -31 0 -31 -31 -31 -31 -31 0 0 0 0 0 0 0 0 0 0 0 0 0 0 -31 0
1581.1011608521c1%L1%S6l1L1%l1L1%VL1o2L1%sl1L1%sl1L1%S0l1%L1%Wl1L1@
$$ -31 -31 0 0 0 0 0 0 0 0 0 0 0 0 0 0 0 0 0 -31 0 0 -31 0 0 0 0 0 31 -31 0 0 0 0 0 0 0 0 0 0 -31 0 0 0 0 0 0 0 0 0 0 -31 0 0 0 0 0 0 0 0 0 0 0 -31 -31 0 0 0 0 0 0 -31 0 0
1562.491392777@%S4L1l1%Wl1L1%Zl1L1%S2l1%TL1%Ul1L1%Tl1%TL1%S1l1L1@
$$ 0 0 0 0 0 0 0 0 0 0 0 0 0 0 0 31 0 0 0 0 0 0 -31 0 0 0 0 0 0 0 0 0 -31 0 0 0 0 0 0 0 0 0 0 0 0 0 -31 -31 -31 0 0 0 0 -31 0 0 0 -31 -31 -31 0 0 0 0 0 0 0 0 0 0 0 0 -31 0 0
1543.693163575@%T6l1L1%S9l1L1%S9l1L1%Ul1%L1%U1l1L1%Xl1L1%S0l1L1%@
1510.5892563449@%S2l1L1%U2L1l1%T0L1l1%U1L1l1%YL1l1%UL1%l1L1l1%UL1@
1478.993163575@L1l1L1l1%L1%l1L1l1%TL1l1%YL1l1L1l1%L1l1%YL1l1L1%Tl1C1
$$ 0 31 0 31 0 0 31 31 0 31 0 0 0 31 0 0 0 0 0 0 0 0 31 0 31 0 0 31 0 0 0 0 0 0 0 0 31 0 31 31 31 0 31
1468.2011608521C1l1%UL1%l1L1%l1L1l1%TL1l1L1l1L1l1L1%Wl1L1%Tl1L1%l1@
$$ 31 0 0 0 0 31 31 0 31 31 0 31 0 0 0 31 0 31 0 31 0 31 31 31 31 31 31 0 31 31 31 0 31 31 0 0
1459.1285114624C1%U9L1l1%T2L1%l1%UL1%l1%UL1l1L1l1%TL1l1%TL1l1L1%l1C1
$$ 31 31 31 31 31 31 31 31 31 31 31 31 31 31 31 31 31 31 31 31 31 31 31 31 31 31 31 31 31 31 31 31 31 31 31 31 31 31 31 31 62 31 31 31 31 31 31 31 31 31 31 31 31 31 31 31 31 31 31 31 31 31 31 31 62 62 31 31 31 31 62 62 31 31 31 31 62 31 62 31 31 31 62 31 31 31 62 31 62 62 31 31
1436.0011608521F2l1%L1%Tl1L1%l1L1%Ul1%L1l1L1%Wl1L1%l1L1%S3L2%l2L2F2
$$ 62 31 31 62 62 62 31 62 62 31 62 62 62 62 31 31 62 31 62 62 62 62 62 62 31 62 62 31 62 62 62 62 62 62 62 62 62 62 62 62 62 62 94 94 62 94 62
1424.2677665798F2%YL2l2%L2l2%WL2l2%TL2%Wl2L2%Zl2L2%l2L2%S2L1l1%TL1I4
$$ 62 62 62 62 62 62 62 62 94 62 62 94 62 62 62 62 62 62 94 62 62 62 94 94 94 94 94 94 62 94 94 94 94 94 94 94 94 94 62 94 94 62 94 94 94 94 94 94 94 94 94 94 94 94 94 125 94 94 94 125 94
1408.9206970023A25%l1L1l1L1l1L1l1L1%S4L1l1%XL1%S3L1l1%XL1%Tl1L1%l1A87
$$ 125 125 94 125 94 125 94 125 94 125 125 125 125 125 125 125 125 125 125 125 125 125 125 125 156 125 125 125 125 125 125 125 156 156 156 156 156 156 156 156 156 156 156 156 156 156 187 156 156 156 156 156 156 156 187 187 187 156 187 187 156 187
1393.3226506173A87%YL2%l2%L2%XL1%TO2L2J25J87J88j25j88j56l1l2l1%Tl1B50
$$ 187 187 187 187 187 187 187 187 219 219 187 187 219 219 219 219 219 219 219 250 250 250 312 344 469 656 844 719 531 375 344 312 281 281 281 250 250
1384.0402331525B50L1%WL1%L2%L1O2R4J56L75O25N00m37o88l43j57r3l2l1T%C44
$$ 250 281 281 281 281 281 281 312 312 344 344 375 437 531 687 1062 1687 2187 1750 1062 719 562 469 437 406 375 375 344
1377.0128825422C44l2L2%WL1%L1TO3J25J87L44O56M38n63o25l12j56r4o3l1D06
$$ 344 312 344 344 344 344 344 344 375 375 406 437 500 625 812 1156 1812 2250 1687 1062 750 594 500 437 406 406
1370.5246042323D06l1%l1%L1l1L1%WL1%L1O3J56K19J25k19Tr3l2l1T%l1L1l1C75
$$ 406 375 375 344 344 375 344 375 375 375 375 375 375 406 406 437 500 656 875 1000 781 562 469 437 406 375 375 344 375 344 375
1362.7755810398C44%sl2L2%Vl2L2l2%UL2l2%ZL2l2%sl1L1%Ul1%S3l1L1l1L1B50
$$ 344 344 344 344 344 344 344 344 344 344 312 344 344 344 344 344 312 344 312 312 312 312 344 312 312 312 312 312 312 312 312 312 344 312 312 312 312 312 312 312 312 312 312 281 312 312 312 312 281 281 281 281 281 281 281 281 281 281 281 281 281 281 250 281 250 281 250
1345.9736274248B81l1L1l1%TL1l1%Ul1L1l1L1%l1%L1l1%Zl2L2l2%L2%Ul2%L2A87
$$ 281 250 281 250 250 250 281 250 250 250 250 219 250 219 250 250 219 219 250 219 219 219 219 219 219 219 219 219 187 219 187 187 219 219 219 219 187 187 219 187
1335.8441403825A87%S0l1L1l1%TL1l1%S8l1L1%l1%UL1%l1%S4l1L1%l1L1%Tl1I4
$$ 187 187 187 187 187 187 187 187 187 187 187 156 187 156 156 156 187 156 156 156 156 156 156 156 156 156 156 156 156 156 156 156 156 156 156 156 125 156 156 125 125 125 125 156 156 125 125 125 125 125 125 125 125 125 125 125 125 125 125 125 94 125 125 94 125 125 125 94 94
1318.5892563449I4L1l1%ZL1l1%S3l2L2%S5l2%UL2l2L2l2L2l2%sL2l2%TL2l2F2
$$ 94 125 94 94 94 94 94 94 94 94 94 125 94 94 94 94 94 94 94 94 94 94 94 94 94 94 62 94 94 94 94 94 94 94 94 94 94 94 94 94 94 94 94 62 62 62 62 94 62 94 62 94 62 62 62 62 62 62 62 62 62 62 94 62 62 62 94 62 62
1301.2343723074F2l1L1%Yl1L1%S2l1%TL1%Vl1%L1%l1%ZL1l1%U0l1L1%Ul1L1C1
$$ 62 31 62 62 62 62 62 62 62 62 31 62 62 62 62 62 62 62 62 62 62 62 62 62 31 31 31 62 62 62 62 62 31 31 62 62 31 31 31 31 31 31 31 31 31 62 31 31 31 31 31 31 31 31 31 31 31 31 31 31 31 31 31 31 31 31 31 31 31 31 31 31 31 31 31 31 31 0 31 31 31 31 0 31 31
1279.9658129647C1%Xl1%UL1%Tl1%L1%l1L1%l1L1l1L1%l1L1l1L1%Yl1L1l1%TL1C1
$$ 31 31 31 31 31 31 31 0 0 0 0 31 31 31 0 0 31 31 0 31 31 0 31 0 31 31 0 31 0 31 31 31 31 31 31 31 31 0 31 0 0 0 31 31
1268.8853491149C1l1%TL1l1%L1l1L1%Tl1L1l1L1l1%L1l1L1%l1%VL1l1L1l1L1@
$$ 31 0 0 0 31 0 0 31 0 31 31 31 0 31 0 31 0 0 31 0 31 31 0 0 0 0 0 31 0 31 0 31 0
1260.6031144671@%YL1l1%sL1l1L1l1%YL1l1%ZL1l1%V5L1l1%U7l1L1%Ul1L1%c1
1226.7462768146@%S8l1L1%S6l1L1%Yl1%L1%S3l1L1%Xl1L1%Vl1L1%l1L1%Zl1@
$$ 0 0 0 0 0 0 0 0 0 0 0 0 0 0 0 0 0 0 0 -31 0 0 0 0 0 0 0 0 0 0 0 0 0 0 0 0 0 -31 0 0 0 0 0 0 0 0 -31 -31 0 0 0 0 0 0 0 0 0 0 0 0 0 0 -31 0 0 0 0 0 0 0 -31 0 0 0 0 0 -31 0 0 -31 0 0 0 0 0 0 0 0 0 -31 0
1203.8324186924@%sl1L1%Tl1L1%Xl1L1%S8l1L1%Zl1L1%l1%L1%l1%L1l1L1%Ul1@
$$ 0 0 0 0 0 0 0 0 0 0 -31 0 0 0 -31 0 0 0 0 0 0 0 -31 0 0 0 0 0 0 0 0 0 0 0 0 0 0 0 0 0 0 0 -31 0 0 0 0 0 0 0 0 0 -31 0 0 -31 -31 0 0 -31 -31 0 -31 0 0 0 0 -31 0
1186.5775346548@%Tl1%L1%S6l1%L1l1%L1%Tl1%TL1%Tl1L1%Ul1%L1l1L1%l1L1c1
$$ 0 0 0 -31 -31 0 0 0 0 0 0 0 0 0 0 0 0 0 0 0 0 0 -31 -31 0 -31 -31 0 0 0 -31 -31 -31 0 0 0 -31 0 0 0 0 -31 -31 0 -31 0 0 -31 0 -31
1173.99120996@%l1L1%l1L1%l1L1%l1%TL1l1%L1l1%L1l1%TL1%l1L1l1L1%l1c1
$$ 0 0 -31 0 0 -31 0 0 -31 0 0 -31 -31 -31 0 -31 -31 0 -31 -31 0 -31 -31 -31 0 0 -31 0 -31 0 0 -31 -31
1165.7089753122@%Tl1L1l1%TL1l1L1l1%TL1%l1L1%l1%L1l1L1l1L1l1%TL1l1c1
$$ 0 0 0 -31 0 -31 -31 -31 0 -31 0 -31 -31 -31 0 0 -31 0 0 -31 -31 0 -31 0 -31 0 -31 -31 -31 0 -31 -31
1157.7421867675@l1L1l1%TL1l1%WL1%l1%YL1l1%S1L1l1%l1L1Tl1%TL1l1%T0L1c1
$$ 0 -31 0 -31 -31 -31 0 -31 -31 -31 -31 -31 -31 0 0 -31 -31 -31 -31 -31 -31 -31 -31 0 -31 -31 -31 -31 -31 -31 -31 -31 -31 -31 -31 -31 0 -31 -31 -62 -31 0 -31 -31 -31 0 -31 -31 -31 -31 -31 -31 -31 -31 -31 -31 -31 -31 -31 -31 -31 -31 -31 -31 -31 -31 -31 0 -31
1140.3873027299c1%S1l1L1%S5L1l1%Xl1L1%ZL1%l1%VL1l1%VL1l1%WL1l1%TL1c1
$$ -31 -31 -31 -31 -31 -31 -31 -31 -31 -31 -31 -31 -62 -31 -31 -31 -31 -31 -31 -31 -31 -31 -31 -31 -31 -31 -31 -31 -31 0 -31 -31 -31 -31 -31 -31 -31 -62 -31 -31 -31 -31 -31 -31 -31 -31 -31 0 0 -31 -31 -31 -31 -31 0 -31 -31 -31 -31 -31 0 -31 -31 -31 -31 -31 -31 0 -31 -31 -31 0 -31
1122.0285114624c1%WL1l1%XL1l1%S5L1%Vl1%T7L1l1L1l1%XL1l1%XL1l1%UL1@
$$ -31 -31 -31 -31 -31 -31 0 -31 -31 -31 -31 -31 -31 -31 0 -31 -31 -31 -31 -31 -31 -31 -31 -31 -31 -31 -31 -31 -31 -31 -31 0 0 0 0 0 -31 -31 -31 -31 -31 -31 -31 -31 -31 -31 -31 -31 -31 -31 -31 -31 -31 -31 -31 -31 -31 -31 -31 -31 -31 -31 -31 -31 0 -31 0 -31 -31 -31 -31 -31 -31 -31 0 -31 -31 -31 -31 -31 -31 -31 0 -31 -31 -31 -31 0 0
1099.7540912746@l1%VL1l1%L1l1%VL1l1%TL1%Ul1%S1L1l1%TL1l1%UL1%l1%TL1c1
$$ 0 -31 -31 -31 -31 -31 0 -31 -31 0 -31 -31 -31 -31 -31 0 -31 -31 -31 0 0 0 0 -31 -31 -31 -31 -31 -31 -31 -31 -31 -31 -31 -31 0 -31 -31 -31 0 -31 -31 -31 -31 0 0 -31 -31 -31 0 -31
1086.9167897722c1%S1L1l1%VL1l1%L1l1%S1L1l1%L1l1%YL1l1%T1L1l1%VL1%@
$$ -31 -31 -31 -31 -31 -31 -31 -31 -31 -31 -31 -31 0 -31 -31 -31 -31 -31 0 -31 -31 0 -31 -31 -31 -31 -31 -31 -31 -31 -31 -31 -31 -31 0 -31 -31 0 -31 -31 -31 -31 -31 -31 -31 -31 0 -31 -31 -31 -31 -31 -31 -31 -31 -31 -31 -31 -31 -31 -31 -31 -31 -31 -31 -31 -31 -31 -31 0 -31 -31 -31 -31 -31 0 0 0
1067.3031144671c1L1%UL1%Tl1%UL1T%l1T%UL1%Tl1%Xl1L1l1L1l1%L1l1%sl1c1
$$ -31 0 0 0 0 31 31 31 0 0 0 0 31 62 62 31 0 0 0 0 31 31 31 0 0 0 0 0 0 0 -31 0 -31 0 -31 -31 0 -31 -31 -31 -31 -31 -31 -31 -31 -31 -31 -62 -31
1055.0677665798c1%L1%Tl1%Vl1%L1%Wl1L1%Vl1L1l1%L1%Ul1L1%l1L1%l1L1%c1
$$ -31 -31 0 0 0 -31 -31 -31 -31 -31 -62 -62 -31 -31 -31 -31 -31 -31 -62 -31 -31 -31 -31 -31 -62 -31 -62 -62 -31 -31 -31 -31 -62 -31 -31 -62 -31 -31 -62 -31 -31 -31
1044.4892563449c1%Wl1L1%Yl1L1%Ul1L1%S1l1L1%Tl1L1l1O2l1%Ul1L1l1L1l1f2
$$ -31 -31 -31 -31 -31 -31 -62 -31 -31 -31 -31 -31 -31 -31 -31 -62 -31 -31 -31 -31 -62 -31 -31 -31 -31 -31 -31 -31 -31 -31 -31 -31 -31 -62 -31 -31 -31 -62 -31 -62 0 -31 -31 -31 -31 -62 -31 -62 -31 -62 -62
1031.689439162f2%WL1%Wl1%L1l1L1l1%S8L1l1O2l1%Tl1%ZL1l1%XL1%ZL1l1c1
$$ -62 -62 -62 -62 -62 -62 -31 -31 -31 -31 -31 -31 -62 -62 -31 -62 -31 -62 -62 -62 -62 -62 -62 -62 -62 -62 -62 -62 -62 -62 -62 -62 -62 -62 -62 -62 -31 -62 0 -31 -31 -31 -62 -62 -62 -62 -62 -62 -62 -62 -62 -31 -62 -62 -62 -62 -62 -62 -62 -31 -31 -31 -31 -31 -31 -31 -31 -31 0 -31 -31
1013.9345551245c1l1%XL1l1%T2L1%L1%Tl1L1l1L1%L1%UL1L2O2R4TJ87M06P19B843
$$ -31 -62 -62 -62 -62 -62 -62 -62 -31 -62 -62 -62 -62 -62 -62 -62 -62 -62 -62 -62 -62 -62 -62 -62 -62 -62 -62 -62 -62 -62 -62 -62 -31 -31 0 0 0 -31 0 -31 0 0 31 31 31 31 62 94 156 250 344 531 937 1656 2843
1000.093346392D281M68q43p19l1Q12J875L062K031j656k437j125K81J750L437A5154
$$ 4281 4749 3906 3187 3156 3968 5843 8905 10936 9280 6843 5718 5999 7749 11186 15154
996.0814418849A4279m406k937j156K19J500K437O25k750k749j438m68K50P50D718
$$ 14279 9873 6936 5780 5999 7499 9936 10561 7811 5062 3624 3156 3406 4156 4718
992.3382795374C843j406j000n62l13j56r4o2o3o2l1%l2l1L1l1T%Ul1%Tl1L1@
$$ 3843 2437 1437 875 562 406 312 250 187 125 94 94 62 31 62 31 0 0 0 0 -31 -31 -31 -62 -31 0
985.8128825422c1%YL1l1%l1%L1Tl1%WL1l1%L1l1L1l1%XL1l1L1%l1%L1%l1%@
$$ -31 -31 -31 -31 -31 -31 -31 -31 0 -31 -31 -62 -62 -31 0 -31 -31 -31 -31 -31 -31 0 -31 -31 0 -31 0 -31 -31 -31 -31 -31 -31 -31 0 -31 0 0 -31 -31 0 0 -31 -31 0
974.5109289272C1%l1T%VL1l1%L1l1L1l1TL1%Tl1%VL1%S6l1L1%TL1l1L1l1%@
$$ 31 31 0 -31 -31 -31 -31 -31 0 -31 -31 0 -31 0 -31 -62 -31 -31 -31 -62 -62 -62 -62 -62 -31 -31 -31 -31 -31 -31 -31 -31 -31 -31 -31 -31 -31 -31 -31 -31 -31 -62 -31 -31 -31 0 -31 0 -31 -31 0
961.7246042323C1l1L1%TL1L2L1R4J56L12P19J750K937k562k125o87l13j25A87
$$ 31 0 31 31 31 62 94 125 219 375 687 1406 3156 6093 3531 1406 719 406 281 187
956.7050680821A25l1l2l1%VL1l1%l1%Tl1%S4l1%L1%Ul1%L1%l1%S0L1%Vl1%f2
$$ 125 94 62 31 31 31 31 31 62 31 31 0 0 0 -31 -31 -31 -31 -31 -31 -31 -31 -31 -31 -31 -31 -31 -31 -31 -62 -62 -31 -31 -31 -31 -62 -62 -31 -31 -62 -62 -62 -62 -62 -62 -62 -62 -62 -62 -62 -31 -31 -31 -31 -31 -62 -62 -62
942.1521376596f2%YL1%l1%TL1l1%L1TR4l2r3%YO2J25J56M69J88n00l13j25c1
$$ -62 -62 -62 -62 -62 -62 -62 -62 -31 -31 -62 -62 -62 -31 -62 -62 -31 0 94 62 -31 -31 -31 -31 -31 -31 -31 -31 31 156 312 781 969 469 156 31 -31
932.7794882699c1%l1%WL1%Ul1%L1Ul1U%L1%L1l1Tl2l1%L1L2L1l1L1l1l2%L2i4
$$ -31 -31 -62 -62 -62 -62 -62 -62 -31 -31 -31 -31 -62 -62 -31 0 31 0 -31 -62 -62 -31 -31 0 -31 -62 -94 -125 -125 -94 -62 -31 -62 -31 -62 -94 -94 -62 -94
922.991392777i4%UL2l2l1%l1O2L2%Tl2%TL2O2%r4%o2%L1O3l2%l1%L1O3L1I4
$$ -94 -94 -94 -94 -62 -94 -125 -125 -156 -94 -62 -62 -62 -94 -94 -94 -62 0 0 -94 -94 -156 -156 -125 -62 -94 -94 -125 -125 -94 -31 0 94
914.7187433873B81L75J000j25j000k81r4To2l1%O2l1Uo3L1L2l2L2l2l1L1L2f2
$$ 281 656 1656 1531 531 250 156 62 0 -31 -31 31 0 -31 -62 -125 -94 -62 -94 -62 -94 -125 -94 -62 -62
908.4443231995i4l1L1O3O2%Tr3L1R3l1R4TL1l1%l2O3L1%O3R3O3l1o3L1R4J25G19
$$ -94 -125 -94 -31 31 31 31 -62 -31 62 31 125 219 250 219 219 187 250 281 281 344 437 500 469 406 437 531 656 719
901.1755810398G81R4J25J56J25O3J87K19K50M68N00L13M68J125K062M531n00I561
$$ 781 875 1000 1156 1281 1344 1531 1750 2000 2468 2968 3281 3749 4874 6936 11467 10967 9561
896.693163575A0748K375L562N655Q593J4341K7027N7397J21700K75801M72645G68067
$$ 10748 13123 16685 22340 30933 45274 72301 129698 251398 527199 999844 768067
893.6814418849C19606j62818o4646l1370j7841j0749o905m749l593k469j624A1904
$$ 319606 156788 92142 60772 42931 32182 25277 20528 16935 14466 12842 11904
890.6363259224A2154K687k687l874j750r06l75m06n00l75l44l43k19j25Uk19B281
$$ 12154 14841 12154 8280 6530 5624 5249 4843 4343 3968 3624 3281 3062 2937 2812 2687 2468 2281
886.1892563449B187j25j87j88r3l2l1o2j25L1r4To2o3%O3o3l1L1o2r4l1%L1I06
$$ 2187 2062 1875 1687 1594 1562 1531 1469 1344 1375 1281 1187 1125 1062 1062 1125 1062 1031 1062 1000 906 875 875 906 906
879.9148361572H75o3l1L1l1To3l1%l1O2o2o3l1T%O2l1U%R3J57J56k50j56l2D37
$$ 875 812 781 812 781 750 687 656 656 625 687 625 562 531 500 500 562 531 500 469 469 562 719 875 625 469 437 437
872.8697201948D37%TL2l2l1T%L1%l1T%Tl2%Ul1T%L1TL2o3l1L1l1L1%Ul1TL1B19
$$ 437 437 437 469 437 406 375 375 406 406 375 344 344 344 312 312 312 312 281 250 250 281 312 344 281 250 281 250 281 281 281 281 250 219 250 219
863.8167897722B19%L1Tl1%L1%l1T%l2%Vl1T%L1%L1%l1%S1L1L2%Uo3L1%Ul1A56
$$ 219 219 250 281 250 250 281 281 250 219 219 187 187 187 187 187 156 125 125 156 156 187 187 156 156 156 156 156 156 156 156 156 156 156 156 187 219 219 219 219 156 187 187 187 187 156 156
851.9716738098A25%Tl1%VL1%Xl1L1l1L1%l1%TL1l1%S2L1l1%TL1l1%Ul2%TL2I4
$$ 125 125 125 94 94 94 94 94 125 125 125 125 125 125 125 94 125 94 125 125 94 94 94 125 94 94 94 94 94 94 94 94 94 94 94 94 94 125 94 94 94 125 94 94 94 94 62 62 62 94 94
839.1873027299I4%Tl2L2l2L2l2%L2l2L2%Vl2L2%l2%WL2l2L2%TL1%UL1%L1O3C44
$$ 94 94 94 62 94 62 94 62 62 94 62 94 94 94 94 94 62 94 94 62 62 62 62 62 62 94 62 94 94 94 125 125 125 125 156 156 187 250 344
829.3992072371E00L75Q12K125K343l062j781n62k81j25r4o3%l1%Ul1%L1l1I4
$$ 500 875 1687 3812 6155 3093 1312 750 469 344 250 187 187 156 156 156 156 125 125 156 125 94
823.8814418849I4%Wl2%L2%Xl2%TL2%Ul2%UL2l2%Tl1L1%UL2%l2L2l2L2%l2%F2
$$ 94 94 94 94 94 94 62 62 94 94 94 94 94 94 94 62 62 62 94 94 94 94 62 62 62 62 94 62 62 62 31 62 62 62 62 94 94 62 94 62 94 94 62 62 62
812.587485547F2%YL2l2%UL2l2L2%l2L2%S3l2%L2l2L2%XL1l1%L1%l1%Xl2L2F2
$$ 62 62 62 62 62 62 62 62 94 62 62 62 62 94 62 94 94 62 94 94 94 94 94 94 94 94 94 94 94 94 94 94 62 62 94 62 94 94 94 94 94 94 94 125 94 94 125 125 94 94 94 94 94 94 94 62 94 62
798.0423695845F2%Xl1%L1%Z0l1L1%Xl1%L1%Vl1%VL1%Tl1%TL1l1%L1%l1%L1C1
766.6972536221C1%TL1%l1L1l1%VL1l1L1l1%L1%l1L1R4o2l2l1%S3L1l1%S6L1C1
$$ 31 31 31 62 62 31 62 31 31 31 31 31 62 31 62 31 31 62 62 31 62 156 94 62 31 31 31 31 31 31 31 31 31 31 31 31 31 31 62 31 31 31 31 31 31 31 31 31 31 31 31 31 31 31 31 31 62 31
752.1560448897C1%T6l1L1l1L1l1L1%T3l1L1%Vl1%TL1%Ul1L1%l1L1l1%L1%Xl1C1
$$ 31 31 31 31 31 31 31 31 31 31 31 31 31 31 31 31 31 31 31 31 31 31 31 31 31 31 31 0 31 0 31 0 31 31 31 31 31 31 31 31 31 31 31 31 31 31 31 31 31 31 31 31 31 31 31 31 0 31 31 31 31 31 0 0 0 31 31 31 31 0 31 31 0 31 0 0 31 31 31 31 31 31 31 0 31
730.7365087395C1l1%UL1%Ul1%TL1%l1L1%Tl1%L1l1%L1%l1%L1%l1%TL1l1%L1C1
$$ 31 0 0 0 0 31 31 31 31 0 0 0 31 31 0 31 31 31 0 0 31 0 0 31 31 0 0 31 31 0 0 0 31 0 0 31 31
721.4638593497@%TL1%l1%WL1l1%L1l1%VL1l1L1%l1%L1%l1%L1l1L1%Tl1%UL1C1
$$ 0 0 0 31 31 0 0 0 0 0 0 31 0 0 31 0 0 0 0 0 31 0 31 31 0 0 31 31 0 0 31 0 31 31 31 0 0 0 0 31 31
711.1873027299@%L1l1%L1l1L1l1%VL1%l1L1l1%UL1l1L1%Tl1%TL1l1%L1l1%@
$$ 0 0 31 0 0 31 0 31 0 0 0 0 0 31 31 0 31 0 0 0 0 31 0 31 31 31 0 0 0 31 0 0 31 0 0 0
702.1521376596C1l1%L1%Vl1L1l1L1l1%TL1l1L1l1L1%Wl1%TL1%Tl1%UL1l1%C1
$$ 31 0 0 31 31 31 31 31 0 31 0 31 0 0 0 31 0 31 0 31 31 31 31 31 31 0 0 0 31 31 31 0 0 0 0 31 0 0 31
692.3775346548C1%Tl1L1l1%L1%Tl1L1l1%L1l1L1l1L1%l1%ZL1l1L1l1L1l1L1@
$$ 31 31 31 0 31 0 0 31 31 31 0 31 0 0 31 0 31 0 31 31 0 0 0 0 0 0 0 0 0 31 0 31 0 31 0 31 0
683.091392777C1l1%VL1%Wl1L1%S6l1%VL1%l1%TL1%Wl1%L1l1%L1%Wl1L1%Ul1C1
$$ 31 0 0 0 0 0 31 31 31 31 31 31 0 31 31 31 31 31 31 31 31 31 31 31 31 31 31 31 31 31 0 0 0 0 0 31 31 0 0 0 31 31 31 31 31 31 0 0 31 0 0 31 31 31 31 31 31 0 31 31 31 31 0 31
667.0423695845C1%Tl1%S0L1%Ul1%L1l1L1%l1%UL1l1L1l1L1%sl1%XL1%Zl1%C1
$$ 31 31 31 0 0 0 0 0 0 0 0 0 0 0 31 31 31 31 0 0 31 0 31 31 0 0 0 0 31 0 31 0 31 31 31 31 31 31 31 31 31 31 0 0 0 0 0 0 0 31 31 31 31 31 31 31 31 31 0 0 31
651.7462768146@%L1%Yl1L1l1%TL1l1%L1l1%L1l1L1%Wl1L1l1L1l1L1l1L1l1C1
$$ 0 0 31 31 31 31 31 31 31 31 0 31 0 0 0 31 0 0 31 0 0 31 0 31 31 31 31 31 31 0 31 0 31 0 31 0 31 0 31
641.9716738098@%VL1l1L1l1L1l1%VL1l1%sL1l1%sL1l1%L1l1L1l1%YL1l1%TL1@
$$ 0 0 0 0 0 31 0 31 0 31 0 0 0 0 0 31 0 0 0 0 0 0 0 0 0 0 31 0 0 0 0 0 0 0 0 0 0 31 0 0 31 0 31 0 0 0 0 0 0 0 0 31 0 0 0 31 0
627.6814418849C1l1%TL1l1%TL1l1%TL1%l1%S5L1l1%UL1l1%T9L1l1%V9L1l1@
$$ 31 0 0 0 31 0 0 0 31 0 0 0 31 31 0 0 0 0 0 0 0 0 0 0 0 0 0 0 0 0 31 0 0 0 0 31 0 0 0 0 0 0 0 0 0 0 0 0 0 0 0 0 0 0 0 0 0 0 0 0 0 0 0 0 0 0 31 0 0 0 0 0 0 0 0 0 0 0 0 0 0 0 0 0 0 0 0 0 0 0 0 0 0 0 0 0 0 0 0 0 0 0 0 0 0 0 0 0 0 0 0 0 0 0 0 0 0 31 0 0
597.49120996@%VL1l1%ZL1l1L1l1%S0L1l1L1l1%VL1%l1%L1l1%S1L1l1%L1C1
$$ 0 0 0 0 0 31 0 0 0 0 0 0 0 0 0 31 0 31 0 0 0 0 0 0 0 0 0 0 0 31 0 31 0 0 0 0 0 31 31 0 0 31 0 0 0 0 0 0 0 0 0 0 0 0 31 0 0 31 31
582.683578317@%L1l1%TL1l1L1l1%L1l1%TL1l1%UL1%Tl1%VL1l1%TL1l1L1l1@
$$ 0 0 31 0 0 0 31 0 31 0 0 31 0 0 0 31 0 0 0 0 31 31 31 0 0 0 0 0 31 0 0 0 31 0 31 0 0
573.4109289272@%TL1l1%T6L1%l1L1l1%XL1l1%UL1l1%TL1l1%S2L1l1L1l1%L1@
$$ 0 0 0 31 0 0 0 0 0 0 0 0 0 0 0 0 0 0 0 0 0 0 0 0 0 0 0 0 0 0 0 31 31 0 31 0 0 0 0 0 0 0 31 0 0 0 0 31 0 0 0 31 0 0 0 0 0 0 0 0 0 0 0 0 0 31 0 31 0 0 31 0
555.3540912746@%UL1l1%S1L1l1%UL1l1%S6L1l1%WL1l1%L1l1L1l1%TL1l1%WL1@
$$ 0 0 0 0 31 0 0 0 0 0 0 0 0 0 0 0 0 31 0 0 0 0 31 0 0 0 0 0 0 0 0 0 0 0 0 0 0 0 0 0 31 0 0 0 0 0 0 31 0 0 31 0 31 0 0 0 31 0 0 0 0 0 0 31 0
539.0540912746C1l1%XL1l1%UL1l1%TL1l1%TL1l1L1%l1%UL1l1%L1l1%S0L1%@
$$ 31 0 0 0 0 0 0 0 31 0 0 0 0 31 0 0 0 31 0 0 0 31 0 31 31 0 0 0 0 31 0 0 31 0 0 0 0 0 0 0 0 0 0 0 31 31 0
527.2716738098C1%Tl1%VL1%l1%VL1l1L1l1%Ul1L1%sL1l1%XL1%Wl1%UL1l1%@
$$ 31 31 31 0 0 0 0 0 31 31 0 0 0 0 0 31 0 31 0 0 0 0 -31 0 0 0 0 0 0 0 0 0 0 31 0 0 0 0 0 0 0 31 31 31 31 31 31 0 0 0 0 31 0 0 0
513.4814418849@L1%Tl1%L1l1L1l1%WL1%l1%TL1l1%L1%Tl1%L1%Ul1L1l1%L1C1
$$ 0 31 31 31 0 0 31 0 31 0 0 0 0 0 0 31 31 0 0 0 31 0 0 31 31 31 0 0 31 31 31 31 0 31 0 0 31 31
503.9443231995@L1%Vl1L1l1%L1l1L1l1L1%Ul1L1%Vl1L1%S3L1%Vl1%L1%S1l1F2
$$ 0 31 31 31 31 31 0 31 0 0 31 0 31 0 31 31 31 31 0 31 31 31 31 31 0 31 31 31 31 31 31 31 31 31 31 31 31 31 31 62 62 62 62 62 31 31 62 62 62 62 62 62 62 62 62 62 62 62 31 62
488.8011608521F2L2%Tl2L2%S0L1l1%L1Tl1%l1%Tl2%TL2l2l1%S0l1%TL1l1%@
$$ 62 94 94 94 62 94 94 94 94 94 94 94 94 94 94 94 125 94 94 125 156 125 125 94 94 94 62 62 62 94 62 31 31 31 31 31 31 31 31 31 31 31 0 0 0 31 0 0 0
476.5167897722@%L1l1%VL1l1%UL1l1%X0L1%Ul1%S3L1l1%YL1l1L1%O3o3%l1@
$$ 0 0 31 0 0 0 0 0 31 0 0 0 0 31 0 0 0 0 0 0 0 0 0 0 0 0 0 0 0 0 0 0 0 0 0 0 0 0 0 0 0 0 0 0 0 0 0 0 0 0 0 0 0 0 0 0 0 0 0 0 0 0 0 0 0 0 0 0 0 0 0 0 0 0 0 31 31 31 31 0 0 0 0 0 0 0 0 0 0 0 0 0 0 31 0 0 0 0 0 0 0 0 31 0 31 31 94 31 31 0 0
448.6853491149@%T0L1l1%L1%Tl1%YL1l1%TL1l1%S1L1l1%S7L1l1%WL1%VL1J25D69
$$ 0 0 0 0 0 0 0 0 0 0 0 0 0 0 0 0 0 0 0 0 0 31 0 0 31 31 31 0 0 0 0 0 0 0 0 31 0 0 0 31 0 0 0 0 0 0 0 0 0 0 0 0 31 0 0 0 0 0 0 0 0 0 0 0 0 0 0 0 0 0 0 31 0 0 0 0 0 0 31 31 31 31 31 62 187 469
427.1148361572A594K999l062j125j87r4l1%l2l1L1%l1%Tl1L1%UL1L2l2%L2A87
$$ 1594 4593 1531 406 219 125 94 94 62 31 62 62 31 31 31 0 31 31 31 31 62 94 62 62 94 187
420.589439162D37O57K843N030o749j562l44r3r4%l1l2%L2l2%l1%VL1%WO3B81
$$ 437 1094 3937 8967 2218 656 312 219 125 125 94 62 62 94 62 62 31 31 31 31 31 62 62 62 62 62 62 125 281
413.2677665798F87J781J625l218n94j25o2l2%l1%TL1l1%Vl1L1%l1%UL1%Tl1@
$$ 687 2468 4093 875 281 156 94 62 62 31 31 31 62 31 31 31 31 31 0 31 31 0 0 0 0 31 31 31 0 0
405.7892563449C1%l1%UL1l1%T0L1l1%U8L1l1%Zl1L1%S0L1l1%Zl1L1%V5l1L1@
368.1716738098@%S6L1l1%S6l1L1%Ul1L1%UL1%l1%Vl1L1%Zl1L1%Ul1L1%S2l1@
$$ 0 0 0 0 0 0 0 0 0 0 0 0 0 0 0 0 0 31 0 0 0 0 0 0 0 0 0 0 0 0 0 0 0 0 0 -31 0 0 0 0 -31 0 0 0 0 31 31 0 0 0 0 0 -31 0 0 0 0 0 0 0 0 0 -31 0 0 0 0 -31 0 0 0 0 0 0 0 0 0 0 0 0 0 -31 0
347.2540912746@%Wl1L1%S1L1l1%S0L1l1%L1l1L1l1%UL1l1%VL1l1%XL1l1L1C1
$$ 0 0 0 0 0 0 -31 0 0 0 0 0 0 0 0 0 0 0 0 31 0 0 0 0 0 0 0 0 0 0 0 31 0 0 31 0 31 0 0 0 0 31 0 0 0 0 0 31 0 0 0 0 0 0 0 31 0 31 31
332.4599521197F2l1%l1%S7L1l1%L1l1%L1%Ul1%VL1l1%U1L1l1%T4l1%L1%V1l1@
297.0992072371@%X5l1L1%l1L1%Tl1L1%YL1l1%Ul1L1%l1L1%Xl1L1%Zl1L1%Yl1@
$$ 0 0 0 0 0 0 0 0 0 0 0 0 0 0 0 0 0 0 0 0 0 0 0 0 0 0 0 0 0 0 0 0 0 0 0 0 0 0 0 0 0 0 0 0 0 0 0 0 0 0 0 0 0 0 0 0 0 0 0 0 0 0 0 0 0 0 -31 0 0 -31 0 0 0 -31 0 0 0 0 0 0 0 0 31 0 0 0 0 -31 0 0 -31 0 0 0 0 0 0 0 -31 0 0 0 0 0 0 0 0 0 -31 0 0 0 0 0 0 0 0 -31 0
267.2599521197@%Tl1L1%Tl1L1%Ul1L1%T2l1L1%U8l1L1%Ul1L1%Vl1%L1%Vl1@
$$ 0 0 0 -31 0 0 0 -31 0 0 0 0 -31 0 0 0 0 0 0 0 0 0 0 0 0 0 0 0 0 0 0 0 0 0 0 0 -31 0 0 0 0 0 0 0 0 0 0 0 0 0 0 0 0 0 0 0 0 0 0 0 0 0 0 0 0 0 0 0 0 0 0 0 0 0 0 0 -31 0 0 0 0 -31 0 0 0 0 0 -31 -31 0 0 0 0 0 -31 0
243.09511719@%S5l1L1%Tl1L1%S6l1L1%Yl1L1%Vl1L1%Zl1L1%Wl1L1%Yl1L1c1
$$ 0 0 0 0 0 0 0 0 0 0 0 0 0 0 0 0 -31 0 0 0 -31 0 0 0 0 0 0 0 0 0 0 0 0 0 0 0 0 0 -31 0 0 0 0 0 0 0 0 -31 0 0 0 0 0 -31 0 0 0 0 0 0 0 0 0 -31 0 0 0 0 0 0 -31 0 0 0 0 0 0 0 0 -31 0 -31
222.5285114624c1L1%Ul1L1%sl1%L1%Yl1L1%S3l1L1%Tl1L1%Tl1L1%U0l1L1%@
$$ -31 0 0 0 0 -31 0 0 0 0 0 0 0 0 0 0 -31 -31 0 0 0 0 0 0 0 0 -31 0 0 0 0 0 0 0 0 0 0 0 0 0 0 -31 0 0 0 -31 0 0 0 -31 0 0 0 0 0 0 0 0 0 0 0 0 0 0 0 0 0 0 0 0 0 0 0 0 0 0 0 0 0 0 0 -31 0 0 0
201.2089753122c1L1%S5l1L1%S1l1L1%Tl1L1%S5l1L1l1L1%T1l1L1l1L1l1L1@
$$ -31 0 0 0 0 0 0 0 0 0 0 0 0 0 0 0 0 -31 0 0 0 0 0 0 0 0 0 0 0 0 -31 0 0 0 -31 0 0 0 0 0 0 0 0 0 0 0 0 0 0 0 0 -31 0 -31 0 0 0 0 0 0 0 0 0 0 0 0 0 0 0 0 0 0 0 0 0 0 -31 0 -31 0 -31 0 0
180.391392777@%S4l1L1l1L1%sl1L1%sl1L1l1L1%l1L1%Tl1L1%Yl1L1%Wl1L1@
$$ 0 0 0 0 0 0 0 0 0 0 0 0 0 0 0 -31 0 -31 0 0 0 0 0 0 0 0 0 0 -31 0 0 0 0 0 0 0 0 0 0 -31 0 -31 0 0 -31 0 0 0 -31 0 0 0 0 0 0 0 0 -31 0 0 0 0 0 0 -31 0 0
163.589439162@%Zl1L1%Ul1L1%Vl1L1%Tl1L1l1L1%S2l1L1%Tl1L1%S9l1L1%@
$$ 0 0 0 0 0 0 0 0 0 -31 0 0 0 0 -31 0 0 0 0 0 -31 0 0 0 -31 0 -31 0 0 0 0 0 0 0 0 0 0 0 0 0 -31 0 0 0 -31 0 0 0 0 0 0 0 0 0 0 0 0 0 0 0 0 0 0 0 0 -31 0 0 0
146.285531932c1L1%Yl1%L1%Tl1L1%S3l1L1l1L1%Ul1L1%Xl1%TL1%l1%TL1%@
$$ -31 0 0 0 0 0 0 0 0 -31 -31 0 0 0 -31 0 0 0 0 0 0 0 0 0 0 0 0 0 0 -31 0 -31 0 0 0 0 -31 0 0 0 0 0 0 0 -31 -31 -31 0 0 -31 -31 -31 0 0 0
132.4953000071@l1L1%sl1L1%Xl1L1%Tl1L1%Ul1L1%l1L1l1L1l1L1%Vl1%L1%@
$$ 0 -31 0 0 0 0 0 0 0 0 0 0 -31 0 0 0 0 0 0 0 -31 0 0 0 -31 0 0 0 0 -31 0 0 -31 0 -31 0 -31 0 0 0 0 0 -31 -31 0 0 0
120.6128825422@l1L1%Wl1L1%Ul1L1%Tl1L1%Ul1%L1%Xl1L1%l1%TL1%S0l1L1@
$$ 0 -31 0 0 0 0 0 0 -31 0 0 0 0 -31 0 0 0 -31 0 0 0 0 -31 -31 0 0 0 0 0 0 0 -31 0 0 -31 -31 -31 0 0 0 0 0 0 0 0 0 0 0 -31 0 0
107.8265578473@l1L1%l1%L1%Vl1L1%Xl1%L1%Vl1L1%Zl1L1l1L1%Ul1L1%Zl1@
$$ 0 -31 0 0 -31 -31 0 0 0 0 0 -31 0 0 0 0 0 0 0 -31 -31 0 0 0 0 0 -31 0 0 0 0 0 0 0 0 0 -31 0 -31 0 0 0 0 -31 0 0 0 0 0 0 0 0 0 -31 0
94.0363259224@%l1%L1l1%TL1l1%TL1%l1L1l1L1%S1l1L1%Tl1L1%Wl1L1l1L1@
$$ 0 0 -31 -31 0 -31 -31 -31 0 -31 -31 -31 0 0 -31 0 -31 0 0 0 0 0 0 0 0 0 0 0 0 -31 0 0 0 -31 0 0 0 0 0 0 -31 0 -31 0 0
82.7423695845@%sl1L1l1L1%l1L1%l1L1%l1L1%Vl1L1%sl1L1%S3l1L1%l1L1@
$$ 0 0 0 0 0 0 0 0 0 0 -31 0 -31 0 0 -31 0 0 -31 0 0 -31 0 0 0 0 0 -31 0 0 0 0 0 0 0 0 0 0 -31 0 0 0 0 0 0 0 0 0 0 0 0 0 0 -31 0 0 -31 0 0
67.9992072371@%Wl1L1%Wl1L1To2L1%S9l1L1%Tl1L1%Ul1%TL1%S1l1L1%l1L1c1
$$ 0 0 0 0 0 0 -31 0 0 0 0 0 0 -31 0 31 -31 0 0 0 0 0 0 0 0 0 0 0 0 0 0 0 0 0 0 0 0 -31 0 0 0 -31 0 0 0 0 -31 -31 -31 0 0 0 0 0 0 0 0 0 0 0 0 -31 0 0 -31 0 -31
51.1482304296@%Wl1L1l1L1%Yl1L1%Tl1L1%S3l1L1%Ul1L1%Tl1L1l1L1%Tl1@
$$ 0 0 0 0 0 0 -31 0 -31 0 0 0 0 0 0 0 0 -31 0 0 0 -31 0 0 0 0 0 0 0 0 0 0 0 0 0 0 -31 0 0 0 0 -31 0 0 0 -31 0 -31 0 0 0 -31 0
37.8109289272@%sl1L1%Tl1L1l1L1%Vl1%L1%Tl1L1%l1L1%Tl1L1l1%TL1l1%@
$$ 0 0 0 0 0 0 0 0 0 0 -31 0 0 0 -31 0 -31 0 0 0 0 0 -31 -31 0 0 0 -31 0 0 -31 0 0 0 -31 0 -31 -31 -31 0 -31 -31 0
27.0833954999@l1L1%l1L1l1L1l1L1l1%L1%Wl1L1%Ul1L1%l1L1%Tl1L1%Zl1@
$$ 0 -31 0 0 -31 0 -31 0 -31 0 -31 -31 0 0 0 0 0 0 -31 0 0 0 0 -31 0 0 -31 0 0 0 -31 0 0 0 0 0 0 0 0 0 -31 0
16.5423695845@%Ul1L1%Ul1L1%Tl1L1l1L1%Tl1L1l1L1%l1%L1l1%TL1%Ul1L1@
$$ 0 0 0 0 -31 0 0 0 0 -31 0 0 0 -31 0 -31 0 0 0 -31 0 -31 0 0 -31 -31 0 -31 -31 -31 0 0 0 0 -31 0 0
7.2206970023@%Wl1L1l1L1%Zl1L1%l1L1%Tl1%L1%Ul1L1%l1L1%l1L1%Yl1L1@
$$ 0 0 0 0 0 0 -31 0 -31 0 0 0 0 0 0 0 0 0 -31 0 0 -31 0 0 0 -31 -31 0 0 0 0 -31 0 0 -31 0 0 -31 0 0 0 0 0 0 0 0 -31 0 0
-5.1126972701@l1L1%l1%L1%Vl1L1%l1L1l1L1%l1L1l1L1l1L1%Vl1%L1%Ul1@
$$ 0 -31 0 0 -31 -31 0 0 0 0 0 -31 0 0 -31 0 -31 0 0 -31 0 -31 0 -31 0 0 0 0 0 -31 -31 0 0 0 0 -31 0
-14.3988391479@%l1L1%Xl1%L1%Zl1L1%sl1L1%Yl1L1%S9l1L1%l1L1%Tl1L1%@
$$ 0 0 -31 0 0 0 0 0 0 0 -31 -31 0 0 0 0 0 0 0 0 0 -31 0 0 0 0 0 0 0 0 0 0 -31 0 0 0 0 0 0 0 0 -31 0 0 0 0 0 0 0 0 0 0 0 0 0 0 0 0 0 0 0 0 -31 0 0 -31 0 0 0 -31 0 0 0
-32.6556768005c1L1%Tl1L1l1L1l1L1l1%L1%Vl1%L1%l1L1l1L1%l1%L1l1L1l1c1
$$ -31 0 0 0 -31 0 -31 0 -31 0 -31 -31 0 0 0 0 0 -31 -31 0 0 -31 0 -31 0 0 -31 -31 0 -31 0 -31 -31
-40.9244189602c1L1l1L1l1L1%Xl1L1%S3l1%L1%Ul1L1%Yl1%L1%sl1L1l1%TL1@
$$ -31 0 -31 0 -31 0 0 0 0 0 0 0 -31 0 0 0 0 0 0 0 0 0 0 0 0 0 0 -31 -31 0 0 0 0 -31 0 0 0 0 0 0 0 0 -31 -31 0 0 0 0 0 0 0 0 0 0 -31 0 -31 -31 -31 0 0
-56.3205117301@%l1L1%l1L1%l1L1l1L1l1L1%Tl1L1%Ul1L1%l1%TL1%Xl1L1%@
$$ 0 0 -31 0 0 -31 0 0 -31 0 -31 0 -31 0 0 0 -31 0 0 0 0 -31 0 0 -31 -31 -31 0 0 0 0 0 0 0 -31 0 0 0
-65.8576304155@%Xl1L1%l1L1l1L1l1L1%Zl1L1%sl1L1%Tl1%L1l1L1%Xl1L1%@
$$ 0 0 0 0 0 0 0 -31 0 0 -31 0 -31 0 -31 0 0 0 0 0 0 0 0 0 -31 0 0 0 0 0 0 0 0 0 0 -31 0 0 0 -31 -31 0 -31 0 0 0 0 0 0 0 -31 0 0 0
-79.3968855329c1L1%Ul1L1l1L1%sl1L1%Tl1L1l1L1%Vl1L1%l1L1l1%TL1%Xl1@
$$ -31 0 0 0 0 -31 0 -31 0 0 0 0 0 0 0 0 0 0 -31 0 0 0 -31 0 -31 0 0 0 0 0 -31 0 0 -31 0 -31 -31 -31 0 0 0 0 0 0 0 -31 0
-91.1793029977@l1L1%l1L1%l1L1%Vl1L1%Ul1%L1%l1L1%Tl1L1l1L1%Wl1%L1@
$$ 0 -31 0 0 -31 0 0 -31 0 0 0 0 0 -31 0 0 0 0 -31 -31 0 0 -31 0 0 0 -31 0 -31 0 0 0 0 0 0 -31 -31 0 0
-100.9673984906@l1%TL1l1L1%l1L1%Ul1%TL1%l1L1l1L1%l1L1%Tl1L1%l1L1%@
$$ 0 -31 -31 -31 0 -31 0 0 -31 0 0 0 0 -31 -31 -31 0 0 -31 0 -31 0 0 -31 0 0 0 -31 0 0 -31 0 0 0
-109.4871174578@%l1%TL1l1%TL1l1L1%l1L1l1%UL1%sl1L1%Ul1L1%Wl1%L1l1@
$$ 0 0 -31 -31 -31 0 -31 -31 -31 0 -31 0 0 -31 0 -31 -31 -31 -31 0 0 0 0 0 0 0 0 0 0 -31 0 0 0 0 -31 0 0 0 0 0 0 -31 -31 0 -31 0
-121.0695349226@l1%L1l1%L1l1L1l1L1%Wl1L1l1%L1l1%L1%l1L1%l1L1%Tl1%@
$$ 0 -31 -31 0 -31 -31 0 -31 0 -31 0 0 0 0 0 0 -31 0 -31 -31 0 -31 -31 0 0 -31 0 0 -31 0 0 0 -31 -31 0
-129.8537231854@%Ul1L1%Vl1%L1l1L1%sl1%L1%Vl1L1%Vl1%L1%Tl1L1%Vl1L1@
$$ 0 0 0 0 -31 0 0 0 0 0 -31 -31 0 -31 0 0 0 0 0 0 0 0 0 0 -31 -31 0 0 0 0 0 -31 0 0 0 0 0 -31 -31 0 0 0 -31 0 0 0 0 0 -31 0 0
-142.5910246878c1L1%S2l1L1l1L1%Zl1L1%Ul1%UL1l1L1l1L1l1%TL1%Vl1L1l1c1
$$ -31 0 0 0 0 0 0 0 0 0 0 0 0 0 -31 0 -31 0 0 0 0 0 0 0 0 0 -31 0 0 0 0 -31 -31 -31 -31 0 -31 0 -31 0 -31 -31 -31 0 0 0 0 0 -31 0 -31 -31
-155.6793029977@l1%TL1%Ul1L1l1L1%Tl1%L1%l1L1%Zl1%L1%Tl1L1%l1%L1%Tl1@
$$ 0 -31 -31 -31 0 0 0 0 -31 0 -31 0 0 0 -31 -31 0 0 -31 0 0 0 0 0 0 0 0 0 -31 -31 0 0 0 -31 0 0 -31 -31 0 0 0 -31 0
-166.40879004@l1%L1%Zl1L1%Tl1L1l1L1%l1L1%S1l1%L1l1L1%Xl1L1%Yl1L1@
$$ 0 -31 -31 0 0 0 0 0 0 0 0 0 -31 0 0 0 -31 0 -31 0 0 -31 0 0 0 0 0 0 0 0 0 0 0 0 -31 -31 0 -31 0 0 0 0 0 0 0 -31 0 0 0 0 0 0 0 0 -31 0 0
-180.714468068@%Ul1L1l1L1%S1l1L1l1L1%Tl1L1l1L1l1%L1%Ul1L1%Xl1L1%c1
$$ 0 0 0 0 -31 0 -31 0 0 0 0 0 0 0 0 0 0 0 0 -31 0 -31 0 0 0 -31 0 -31 0 -31 -31 0 0 0 0 -31 0 0 0 0 0 0 0 -31 0 0 -31
-192.5478623404c1%UL1l1L1l1L1%Ul1L1l1%L1%l1L1%Ul1%L1%l1L1%l1L1l1L1c1
$$ -31 -31 -31 -31 0 -31 0 -31 0 0 0 0 -31 0 -31 -31 0 0 -31 0 0 0 0 -31 -31 0 0 -31 0 0 -31 0 -31 0 -31
-201.3695349226@l1%L1%l1L1l1L1l1%L1%l1%L1%Tl1%L1l1%TL1%l1L1%Ul1L1c1
$$ 0 -31 -31 0 0 -31 0 -31 0 -31 -31 0 0 -31 -31 0 0 0 -31 -31 0 -31 -31 -31 0 0 -31 0 0 0 0 -31 0 -31
-209.9027463779@%Xl1L1%Tl1L1%Tl1L1%Wl1L1%Ul1L1l1L1%Tl1L1l1L1%l1L1@
$$ 0 0 0 0 0 0 0 -31 0 0 0 -31 0 0 0 -31 0 0 0 0 0 0 -31 0 0 0 0 -31 0 -31 0 0 0 -31 0 -31 0 0 -31 0 0
-220.1302798052@l1%L1%Tl1L1%Xl1%L1%l1L1%Vl1%L1l1L1%Tl1L1%Tl1L1l1%@
$$ 0 -31 -31 0 0 0 -31 0 0 0 0 0 0 0 -31 -31 0 0 -31 0 0 0 0 0 -31 -31 0 -31 0 0 0 -31 0 0 0 -31 0 -31 -31 0
-230.206836425c1L1%Tl1L1l1%L1%l1%TL1%l1L1%Tl1%L1l1%L1l1L1l1%L1l1c1
$$ -31 0 0 0 -31 0 -31 -31 0 0 -31 -31 -31 0 0 -31 0 0 0 -31 -31 0 -31 -31 0 -31 0 -31 -31 0 -31 -31
-238.2380942653@%l1L1%Ul1%UL1%Ul1L1l1L1%l1%UL1l1%TL1%l1L1l1%XL1l1c1
$$ 0 0 -31 0 0 0 0 -31 -31 -31 -31 0 0 0 0 -31 0 -31 0 0 -31 -31 -31 -31 0 -31 -31 -31 0 0 -31 0 -31 -31 -31 -31 -31 -31 -31 0 -31 -31
-248.8166045001@l1%TL1l1L1l1L1l1L1l1%L1l1L1l1L1%l1%TL1%Ul1L1l1L1%@
$$ 0 -31 -31 -31 0 -31 0 -31 0 -31 0 -31 -31 0 -31 0 -31 0 0 -31 -31 -31 0 0 0 0 -31 0 -31 0 0 0
-256.8478623404@l1L1%Zl1%TL1l1L1%Vl1%L1l1L1l1%L1%Tl1L1%l1%L1l1L1%c1
$$ 0 -31 0 0 0 0 0 0 0 0 0 -31 -31 -31 0 -31 0 0 0 0 0 -31 -31 0 -31 0 -31 -31 0 0 0 -31 0 0 -31 -31 0 -31 0 0 -31
-267.0753957677@%l1%L1l1%L1%Tl1%TL1l1L1%l1L1l1L1%Tl1%TL1l1L1l1L1%@
$$ 0 0 -31 -31 0 -31 -31 0 0 0 -31 -31 -31 0 -31 0 0 -31 0 -31 0 0 0 -31 -31 -31 0 -31 0 -31 0 0 0
-275.3576304155c1L1%Yl1%L1l1L1l1%UL1%Tl1L1l1L1%S0l1%TL1%Wl1L1%Tl1@
$$ -31 0 0 0 0 0 0 0 0 -31 -31 0 -31 0 -31 -31 -31 -31 0 0 0 -31 0 -31 0 0 0 0 0 0 0 0 0 0 0 -31 -31 -31 0 0 0 0 0 0 -31 0 0 0 -31 0
-287.9439551103@%Tl1L1l1L1l1L1l1L1%l1L1l1L1%Ul1L1%Vl1L1l1%TL1l1%VL1@
$$ 0 0 0 -31 0 -31 0 -31 0 -31 0 0 -31 0 -31 0 0 0 0 -31 0 0 0 0 0 -31 0 -31 -31 -31 0 -31 -31 -31 -31 -31 0 0
-297.4185581151c1L1%Wl1L1%Xl1L1%Ul1L1l1L1%Ul1L1%Vl1L1l1L1%Yl1L1%l1@
$$ -31 0 0 0 0 0 0 -31 0 0 0 0 0 0 0 -31 0 0 0 0 -31 0 -31 0 0 0 0 -31 0 0 0 0 0 -31 0 -31 0 0 0 0 0 0 0 0 -31 0 0 -31 0
-309.716421683@l1L1%Yl1L1%Ul1%TL1%l1%L1%l1L1l1%L1%l1L1%l1%TL1l1L1c1
$$ 0 -31 0 0 0 0 0 0 0 0 -31 0 0 0 0 -31 -31 -31 0 0 -31 -31 0 0 -31 0 -31 -31 0 0 -31 0 0 -31 -31 -31 0 -31 0 -31
-319.7929783028c1L1%l1L1%Tl1L1%l1L1l1L1l1%L1%Tl1%TL1%Ul1%L1%Tl1L1@
$$ -31 0 0 -31 0 0 0 -31 0 0 -31 0 -31 0 -31 -31 0 0 0 -31 -31 -31 0 0 0 0 -31 -31 0 0 0 -31 0 0
-328.3617204626c1L1%l1L1%l1%L1%Ul1L1l1L1l1%L1l1L1%l1%TL1l1L1%l1L1@
$$ -31 0 0 -31 0 0 -31 -31 0 0 0 0 -31 0 -31 0 -31 -31 0 -31 0 0 -31 -31 -31 0 -31 0 0 -31 0 0
-336.3929783028c1%WL1l1L1l1L1l1L1%Tl1L1l1L1%l1L1l1L1%Ul1L1%l1L1l1@
$$ -31 -31 -31 -31 -31 -31 0 -31 0 -31 0 -31 0 0 0 -31 0 -31 0 0 -31 0 -31 0 0 0 0 -31 0 0 -31 0 -31 0
-344.8636740776c1L1l1%UL1%l1%TL1l1%TL1l1L1l1%L1%Tl1L1%Tl1L1l1%WL1@
$$ -31 0 -31 -31 -31 -31 0 0 -31 -31 -31 0 -31 -31 -31 0 -31 0 -31 -31 0 0 0 -31 0 0 0 -31 0 -31 -31 -31 -31 -31 -31 0 0
-354.1498159554c1%L1l1%L1%Tl1L1l1%TL1%l1%L1l1L1l1L1l1%TL1l1L1%l1L1@
$$ -31 -31 0 -31 -31 0 0 0 -31 0 -31 -31 -31 0 0 -31 -31 0 -31 0 -31 0 -31 -31 -31 0 -31 0 0 -31 0 0
-362.2185581151@%l1%L1l1%L1%l1%TL1%l1L1%Ul1L1%l1L1%Tl1%VL1%l1%VL1c1
$$ 0 0 -31 -31 0 -31 -31 0 0 -31 -31 -31 0 0 -31 0 0 0 0 -31 0 0 -31 0 0 0 -31 -31 -31 -31 -31 0 0 -31 -31 -31 -31 -31 0 -31
-372.2576304155c1%L1%l1%VL1%l1L1%l1L1l1%TL1%Tl1%L1%Tl1%TL1%l1%TL1c1
$$ -31 -31 0 0 -31 -31 -31 -31 -31 0 0 -31 0 0 -31 0 -31 -31 -31 0 0 0 -31 -31 0 0 0 -31 -31 -31 0 0 -31 -31 -31 0 -31
-381.5812566127@l1%TL1%Tl1%L1%l1%TL1%l1%L1%l1L1%Tl1L1%Ul1L1%Wl1%L1c1
$$ 0 -31 -31 -31 0 0 0 -31 -31 0 0 -31 -31 -31 0 0 -31 -31 0 0 -31 0 0 0 -31 0 0 0 0 -31 0 0 0 0 0 0 -31 -31 0 -31
-391.5578132325c1%VL1l1%UL1l1%TL1l1%L1l1%L1%l1%TL1l1L1%Tl1L1%c1
$$ -31 -31 -31 -31 -31 0 -31 -31 -31 -31 0 -31 -31 -31 0 -31 -31 0 -31 -31 0 0 -31 -31 -31 0 -31 0 0 0 -31 0 0 -31
-400.0910246878@  $$checkpoint
##END= $$ end of aspirin
##TITLE= acetophenone
##JCAMP-DX= 5.01 $$ JDXView vs 1
##DATA TYPE= NMR SPECTRUM
##DATA CLASS= XYDATA
##BLOCK_ID=2
##ORIGIN= Dept of Chemistry, UWI, Mona, JAMAICA
##OWNER= public domain
##SPECTROMETER/DATA SYSTEM= TECMAG APOLLO NTNMR
##$MODELS=
<Models>
 <ModelData id="acetophenone" type="MOL">
acetophenone
  DSViewer          3D                             0

 17 17  0  0  0  0  0  0  0  0999 V2000
   -1.6931    0.0078    0.0000 C   0  0  0  0  0  0  0  0  0  1
   -0.2141    0.0078    0.0000 C   0  0  0  0  0  0  0  0  0  2
    2.5839    0.0872    0.0000 C   0  0  0  0  0  0  0  0  0  3
    0.4615    1.2373   -0.0005 C   0  0  0  0  0  0  0  0  0  4
    0.5257   -1.1809    0.0001 C   0  0  0  0  0  0  0  0  0  5
    1.9188   -1.1393    0.0005 C   0  0  0  0  0  0  0  0  0  6
    1.8539    1.2756   -0.0001 C   0  0  0  0  0  0  0  0  0  7
   -0.1262    2.1703   -0.0009 H   0  0  0  0  0  0  0  0  0  8
    0.0144   -2.1556    0.0002 H   0  0  0  0  0  0  0  0  0  9
    2.4947   -2.0764    0.0009 H   0  0  0  0  0  0  0  0  0 10
    2.3756    2.2439   -0.0001 H   0  0  0  0  0  0  0  0  0 11
    3.6838    0.1161    0.0003 H   0  0  0  0  0  0  0  0  0 12
   -2.3403    1.0639    0.0008 O   0  0  0  0  0  0  0  0  0 13
   -2.3832   -1.3197   -0.0010 C   0  0  0  0  0  0  0  0  0 14
   -2.0973   -1.8988    0.9105 H   0  0  0  0  0  0  0  0  0 15
   -2.0899   -1.9018   -0.9082 H   0  0  0  0  0  0  0  0  0 16
   -3.4920   -1.1799   -0.0059 H   0  0  0  0  0  0  0  0  0 17
  1  2  1  0  0  0
  2  5  4  0  0  0
  2  4  4  0  0  0
  3 12  1  0  0  0
  4  7  4  0  0  0
  5  6  4  0  0  0
  6 10  1  0  0  0
  6  3  4  0  0  0
  7  3  4  0  0  0
  7 11  1  0  0  0
  8  4  1  0  0  0
  9  5  1  0  0  0
 13  1  2  0  0  0
 14 16  1  0  0  0
 14  1  1  0  0  0
 14 15  1  0  0  0
 17 14  1  0  0  0
M  END
  </ModelData>
</Models>
##$PEAKS=
<Peaks type="HNMR" xUnits="ppm" yUnits="arbitrary units" >
<PeakData id="1" title="methyl group ~2.6" peakShape="singlet" model="acetophenone" atoms="15,16,17"  xMax="2.7" xMin="2.5"  yMax="10000" yMin="0" />
<PeakData id="2" title="meta H's ~7.4" peakShape="multiplet" model="acetophenone"  atoms="10,11"  xMax="7.5" xMin="7.3"  yMax="10000" yMin="0" />
<PeakData id="3" title="para H ~7.5" peakShape="multiplet" model="acetophenone" atoms="12"   xMax="7.6" xMin="7.4"  yMax="10000" yMin="0" />
<PeakData id="4" title="ortho H's ~7.9" peakShape="multiplet" model="acetophenone" atoms="8,9"   xMax="8.0" xMin="7.9"  yMax="10000" yMin="0" />
</Peaks>
##.OBSERVE FREQUENCY= 199.584124
##INSTRUMENTAL PARAMETERS= ^1H
##.OBSERVE NUCLEUS= ^1H
##XUNITS= HZ
##YUNITS= ARBITRARY UNITS
##XFACTOR= 1.8885498E-3
##YFACTOR= 2.37106182E-1
##FIRSTX= -54.07711881
##LASTX= 1834.47268573
##NPOINTS= 15472
##FIRSTY= -10.386102
##XYDATA= (X++(Y..Y))
-28634d4L1p1L9k3mM8n2Q7q4K8n0O4Kn6P4p4J7QJ0J1Q4o3m3N7K1o1m1N8KJ7o7a12
$$ -44 -13 -84 -45 -68 -72 -24 -76 11 -73 -45 -95 -31 -29 -85 -11 -85 -68 -60 -50 -39 45 -18 -61 -4 17 -44 -85 -27 -25 -8 -75 -112
-26501a01O2rm0J2k0P9j10ON0m0O8k0m3J8M1j5lK9L2l6M2o3PJ2m5N9j1M9o8L5c6
$$ -101 -39 -48 -88 -76 -96 -17 -127 -121 -71 -111 -43 -63 -106 -88 -47 -62 -65 -36 -4 -40 2 -61 -54 -42 -87 -28 -39 10 -58 -23 -36
-24433A4j63J36k2K2j0J2oL8m5k3j5J3j8J4j0N9j03Q6M7r0l1Q7q6LJ2R9Qm4n0E7
$$ 14 -149 -13 -35 -13 -23 -11 -17 21 -24 -47 -62 -49 -67 -53 -63 -4 -107 -21 26 -64 -95 -8 -94 -91 -79 20 28 -16 -66 57
-22429b7rL0J9QP7j24J8J3l6Om8N1L3nkrl0j5k4J24m3m8L5M1j03L9l5J3L2nj7c4
$$ -27 -36 -6 13 21 98 -26 -8 5 -31 -25 -73 -22 11 6 4 -5 -35 -50 -74 50 7 -41 -6 35 -68 -29 -64 -51 -19 -24 -41 -34
-20296d2o4L2Kl4Q8p2K4QoJ4k5J8J7q2O1L2n4llN6o3P2p7N2M5l8n0O9o9nj6J07A3
$$ -42 -106 -74 -72 -106 -18 -90 -66 -58 -64 -50 -75 -57 -40 -122 -61 -29 -83 -86 -89 -33 -96 -24 -101 -49 -4 -42 -92 -23 -92 -97 -113 -6 13
-18098i5m1N3J6Rj8M2K5m3M5o8L1K0o3M6l6N8m9j1qJ4j8K2l2KO1P1m4j04N6N6e6
$$ -95 -136 -83 -67 -58 -76 -34 -9 -52 -7 -75 -44 -24 -87 -41 -77 -19 -68 -79 -87 -73 -91 -69 -101 -99 -38 33 -11 -115 -59 -3 -56
-16030a4p6k4J0n1K6N6J2o7L2J15r9j9P3jk6l2N4p2L1L9j8LJ1j6NoL9o7k8P8J6c4
$$ -14 -90 -114 -104 -155 -129 -73 -61 -128 -96 19 -80 -99 -26 -27 -53 -85 -31 -103 -72 -33 -51 -48 -37 -53 -48 -54 -15 -82 -110 -32 -16 -34
-13897d2l7J3j7k0O0m0oJ8M9k3ml2M2k8J1K6K0J8r4J7k2N5k6L2j12P2L1qJL4o6c7
$$ -42 -79 -66 -83 -103 -43 -83 -89 -71 -22 -45 -49 -81 -39 -67 -56 -30 -10 8 -86 -69 -91 -36 -62 -30 -142 -70 -39 -47 -46 -12 -78 -37
-11764e7qK2Qr5J00n0N1r1O1n5O4RL3k4L2n9J4J4k3m5O0n5L8lo4L1k8j1M3j1O8d7
$$ -57 -65 -43 -35 -130 -30 -80 -29 -120 -59 -114 -50 -41 -8 -32 0 -59 -45 -31 -54 -99 -39 -94 -56 -59 -123 -92 -120 -131 -88 -99 -31 -47
-9631b6k7J4m3N8J9p6M8p6L9K6m2P8j6N2o9k2P4k2l7l1k8L4qp3J06m0k0J4RMc1
$$ -26 -53 -39 -82 -24 -5 -81 -33 -109 -70 -44 -86 -8 -24 28 -41 -63 11 -11 -48 -79 -107 -73 -81 -154 -48 -88 -108 -94 -85 -81 -31
-7563c4J8m4k5Q1Nj3m8OM8%m1rM9p5O4L3p3R3n2k1J8m9M7k5M6LK0j8%M4j05J31c6
$$ -34 -16 -60 -85 -4 1 -12 -60 -54 -6 -6 -47 -56 -7 -82 -18 15 -58 35 -17 -38 -20 -69 -22 -47 -1 2 22 4 4 48 -57 74 -36
-5365e6O9q9K5L6Ol2N8k4o5M6o8K6P3K6N1K2r7K1L1J6K0J7n7k0L1nk8k7L3MJ26B27
$$ -56 13 -76 -51 -15 -9 -41 17 -7 -72 -26 -94 -68 5 31 82 104 7 28 59 75 95 112 55 35 66 61 33 6 39 43 169 227
-3232A11M5l1Q1n9J10m1Q6m2N8j28P0O2O6L6J16J54K35L00O34J019J579p09j749A099
$$ 111 156 125 206 147 257 216 302 260 318 190 260 322 388 424 540 694 929 1229 1863 2882 4461 3752 2003 1099
-1616G70ql9K2K3J10P4L28K64M90N27O49O07P67J135J064J188K935M307N479B9776
$$ 770 762 723 745 768 878 952 1280 1544 2034 2561 3210 3817 4584 5719 6783 7971 10906 15213 20692 29776
-259D9517L7688N5238K4650p4616n1689j8623n645l279j805j206q59j367j601E085
$$ 49517 87205 142443 167093 92477 40788 22165 16520 13241 11436 10230 9371 8004 6403 5085
711D197n20m94k20k30r3k09k68JK45m5K05M91R52J687k08k122j341n59j98A223
$$ 4197 3677 3183 2963 2733 2640 2431 2163 2164 2409 2364 2569 3060 4012 5699 5491 3369 2028 1469 1271 1223
2068A176K6l7j33j27Pj5o3n9l4m8kQJ2oj3m0k7p0K5R4p6km0L2j0jj02k1M4o6D72
$$ 1176 1202 1165 1032 905 912 897 834 775 741 693 691 699 711 705 692 652 625 555 580 674 598 596 556 588 578 577 475 454 498 432 472
4137D31j0j7J10l7%K0j32L5O0nk0j6l5l1j6n4J01k1m5m2ro7N3o9j4M8M2l0m9B55
$$ 431 421 404 514 477 477 497 365 400 460 455 435 419 384 353 337 283 384 363 318 276 267 200 253 184 170 218 260 230 181 255
6140B56o1rL0q6R0K4p7P0r7L4L4j29L6j5M2kL3l8j7j2o0J00l1oN6j7O6o5lNA24
$$ 256 195 186 216 130 220 244 167 237 140 174 208 79 115 100 142 140 173 135 118 106 46 146 115 109 165 148 214 149 146 151 124
8209A54J5k1K0k1p1O0p8L4oN6j8Nn7m4Q8m2l3P4l0L4n8%l4RJ07j12L4K9o1O7E0
$$ 154 169 148 168 147 76 136 58 92 86 142 124 129 72 28 116 74 41 115 85 119 61 61 27 36 143 31 65 94 33 100 50
10277I2K4o8kj6L0Q3q0k2M8K1n9J55Q5M8J19l2k10q2j18R0m5O3r9l1P4p5N5N1I0
$$ 92 116 48 46 30 60 143 63 41 89 110 51 206 291 339 458 426 216 134 16 106 61 124 25 -6 68 -7 48 99 90
12216E6n3p4O6J6J4oK3njJ1n1J1MP3k8k7K9n3J0qj7K7Jk5M0L1l9l8mK9P8j08b1
$$ 56 3 -71 -5 11 25 19 42 37 36 47 -4 7 11 84 56 29 58 5 15 7 -10 17 18 -7 33 64 25 -13 -17 12 90 -18 -21
14414b3KO0j14Q1QL4k4O2k0l3l5R1l8jk1p0N5J9L0pj07j6J9K0l3L2j0J2Jj5ob0
$$ -23 -21 39 -75 6 14 48 24 86 66 33 -2 89 51 50 29 -41 14 33 63 56 -51 -67 -48 -28 -61 -29 -39 -27 -26 -41 -47 -20
16547g6k9R5K8q9Q8j04K7j4NO1J9o3l7P1pKL0ol5nJ9n7J06r9O0j9N6k2J4n4m0c4
$$ -76 -105 -10 18 -71 17 -87 -60 -74 -69 -8 11 -52 -89 -18 -25 -23 7 1 -34 -39 -20 -77 29 -70 -10 -29 27 5 19 -35 -75 -34
18680g3L3m0O1k1l2J6J8k0Q7j00N4jr4O0n6R0n0P9k5M7o3qL4j02K8J0k7O9j7f0
$$ -73 -40 -80 -19 -40 -72 -56 -38 -58 29 -71 -17 -18 -112 -52 -108 -18 -68 11 -14 33 -30 -38 -4 -106 -78 -68 -95 -26 -43 -60
20684B6r0KJ1PJ4j1k2O3l8L1kj3P3p2N8j2J2n3p6J01Q1m5rj7lK1p8P2l5K0l6d5
$$ 26 -64 -62 -51 -44 -30 -41 -63 0 -38 -7 -9 -22 51 -21 37 25 37 -16 -92 9 90 45 36 19 16 37 -41 31 -4 16 -20 -45
22817Cl9j9NN3o4P0l4n7N3o9J02k5ol6N2j00QJ5j9Q7o7J03n7L7j04Q2o4L2l7d9
$$ 3 -36 -55 -50 3 -61 9 -25 -82 -29 -98 4 -21 -27 -63 -11 -111 -103 -88 -107 -20 -87 16 -41 -4 -108 -26 -90 -58 -95 -49
24821F1j06o0J13k7j2J3j9j8j8R5mp5J05j30L0K0k5J2Q8j01K6J4l6L8l0J4n7b1
$$ 61 -45 -105 8 -19 -31 -18 -37 -55 -73 22 18 -57 48 -82 -52 -32 -57 -45 43 -58 -32 -18 -54 -16 -46 -32 -89 -21
26695f2J33j10j9jK8m9J17p7j1M1o3pL4PJ5N2k8O7n5n7m1JL4m4P0O2q3K1k0of8
$$ -62 71 -39 -58 -59 -31 -80 37 -40 -51 -10 -73 -80 -46 -39 -24 28 0 67 12 -45 -86 -85 -51 -95 -25 37 -46 -25 -45 -51 -68
28763b2m5NlM8L9k6K8m6Ql2J5K9n7R8m5O3q5nM6K2j7n2l8M4oK9m7K9J10M2J17C37
$$ -22 -67 -62 -65 -17 22 -4 24 -22 -14 -46 -31 -2 -59 39 -6 57 -28 -33 13 35 18 -34 -72 -28 -34 -5 -52 -23 87 129 246 337
30897C74M1L6l1m1j12qr9n4L1rj84l3k5L3Q1n6n8P5j1K0N1p7J4M0m7N8p5K6J2f8
$$ 374 415 451 420 379 267 259 160 106 137 128 -56 -89 -114 -81 0 -56 -114 -39 -50 -30 21 -56 -42 -2 -49 9 -66 -40 -28 -68
32900d1k8J7L9k7Lk2l6mJ2J3Q1j68J25n6J6K9n1K8l4M3l0mM6%L1l8L0m5j9j1e5
$$ -41 -69 -52 -13 -40 -37 -59 -95 -99 -87 -74 7 -161 -36 -92 -76 -47 -98 -70 -104 -61 -91 -95 -49 -49 -18 -56 -26 -71 -90 -101 -55
34969a04N4J7n9K0L5j7%L4l0l5mJ3k1L4K4J0n6J17l7m3k0nNJ7mJ8M5q6R3j4k3F
$$ -104 -50 -33 -92 -72 -37 -54 -54 -20 -50 -85 -89 -76 -97 -63 -39 -29 -85 32 -5 -48 -68 -73 -68 -51 -55 -37 8 -78 15 1 -22 6
37102h9QP8r3N0Op1o2O5L8r1J67p5l2N1M0m3Rm7J5J5J9J8j2L9l1r5J02N4m7K2g3
$$ -89 -81 -3 -96 -46 -40 -111 -173 -108 -70 -161 6 -69 -101 -50 -10 -53 -44 -91 -76 -61 -42 -24 -36 3 -28 -123 -21 33 -14 8 -73
39170Hj01M8m0K8qqJ1L4%Mm8L5j7n3O0M0o9K3LM3l2m5R9n9J00r7k6kK2o0N8K5D1
$$ 8 -93 -45 -85 -57 -65 -73 -62 -28 -28 -24 -72 -37 -54 -107 -47 -7 -76 -53 -50 -7 -39 -84 15 -44 56 -41 -67 -69 -47 -107 -49 -24 41
41368c9orjQN8m1p2Q3M2r1%j4j1MJ3O3k0p8J30q1n1R3J5r4O2l2N3n3pP5p5K8a69
$$ -39 -45 -54 -55 -47 11 -30 -102 -19 23 -68 -68 -82 -93 -89 -76 -13 -33 -111 19 -62 -113 -20 -5 -99 -37 -69 -16 -69 -76 -1 -76 -48 -169
43565a10N5l4L7K1pp5J12Rp1mj7m0R2m3L9J3on0m3K9J9j3NJ2j7lN2l7j4O4k4g6
$$ -110 -55 -89 -52 -31 -38 -113 -1 8 -63 -67 -84 -124 -32 -75 -36 -23 -29 -79 -122 -93 -74 -87 -82 -70 -87 -90 -38 -75 -89 -25 -49 -76
45698b9K6r0k3J02k1J5m2K7L7q9NO9q6Q4k8qJ3l2M4q1R0o3M8lm1j7P1l9L1j34c3
$$ -29 -3 -93 -116 -14 -35 -20 -62 -35 2 -87 -82 -13 -99 -15 -43 -51 -38 -70 -26 -107 -17 -80 -32 -35 -76 -93 -22 -61 -30 -164 -33
47767a59J29j0p2N4n8N4L0j8L1k5MK2o9N9k0l1O5m5Q1m4K5l4L7L9k6j08Q6k1a25
$$ -159 -30 -40 -112 -58 -116 -62 -32 -50 -19 -44 -40 -18 -87 -28 -48 -79 -14 -59 22 -22 3 -31 6 45 19 -89 -3 -24 -125
49706a25p2K6J9P4M1kK0q2O9m1n0K2M8l1J8J4J08j24K1m4N9K2j7KRql2l1J2k9a17
$$ -125 -197 -171 -152 -78 -37 -39 -19 -101 -32 -73 -123 -101 -53 -84 -66 -52 56 -68 -47 -91 -32 -10 -27 -25 -16 -24 -56 -87 -75 -104 -117
51774cJ8q1K1l6K5j7P9j05L3N3n6l4%k4P2rJ6l7R6n9M2j1n3Q3q1n5J36j18J64c8
$$ -3 15 -66 -45 -81 -56 -73 6 -99 -66 -13 -69 -103 -103 -127 -55 -64 -48 -85 11 -48 -6 -17 -70 13 -68 -123 13 -105 59 -38
53778h5M8Oo7j2Q2op9J09J7p9K7J0L2r6K5L4mj8M1jm1jM6K5q0o0P6K2k2L7K7f2
$$ -85 -37 -31 -98 -110 -28 -34 -113 -4 13 -66 -39 -29 3 -93 -68 -34 -38 -56 -15 -16 -57 -58 -12 13 -67 -127 -51 -29 -51 -14 13 -62
55911g9P6q5J7L5L8j00J9RJj6L0L5o0K6J0L3m4k4P3m5L8Mk5Km3Oj2j2N4N2j15f7
$$ -79 -3 -88 -71 -36 2 -98 -79 -70 -69 -85 -55 -20 -80 -54 -44 -11 -55 -79 -6 -51 -13 -9 -34 -32 -75 -69 -81 -93 -39 13 -102 -67
58044e2K4p2J8M4k4N3n5J0O1m5Ln6J4j5N8J5n4L5o1Q4n5Pk1J12n3J0j68K3M7a25
$$ -52 -28 -100 -82 -38 -62 -9 -64 -54 7 -38 -35 -91 -77 -92 -34 -19 -73 -38 -99 -15 -70 -63 -84 28 -25 -15 -183 -160 -113 -125
60048a41J37j00j0K9R4o1k3K3jol1LO7K0r9K7k8M6Mk2m7J03n6K2L5m2K0o8k4f5
$$ -141 -4 -104 -114 -85 9 -52 -75 -52 -53 -59 -90 -87 -20 0 -99 -72 -100 -54 -50 -72 -119 -16 -72 -50 -15 -57 -37 -105 -129 -65
62052a16L4p5J46p5M8r9L4L0R1o2K3J1q9J29l7l5L2o5O2p3O9n0N2j2m9O3n0j3c0
$$ -116 -82 -157 -11 -86 -38 -137 -103 -73 18 -44 -21 -10 -99 30 -7 -42 -10 -75 -13 -86 -17 -67 -15 -27 -76 -13 -63 -76 -30
63991b1k7j5M2o3KP6n9J2l1k2J18q0J7J4M7k5p7m5M9j1N7k8j1N7m5OK3m1L0K4d4
$$ -21 -48 -63 -21 -84 -82 -6 -65 -53 -84 -106 12 -68 -51 -37 10 -15 -92 -137 -88 -99 -42 -70 -81 -24 -69 -63 -40 -81 -51 -27 -44
66059g2P5j02k4R7j12N2k4J17j4l0o3K6K1L5k8L1o5K1NL1k3r2J02l2l6J18k4G
$$ -72 3 -99 -123 -26 -138 -86 -110 7 -7 -37 -100 -74 -53 -18 -46 -15 -80 -59 -54 -23 -46 -138 -36 -68 -104 14 -10 7
67934Fo2L4n0P1j17R0n1J10m5l8m8K0j1L5nk4K1QrP5j0oq4M7m3Q9m2k7L3k5k2c8
$$ 6 -56 -22 -72 -1 -118 -28 -79 31 -14 -52 -100 -80 -91 -56 -61 -85 -64 -56 -65 10 0 -6 -90 -43 -86 3 -39 -66 -33 -58 -80 -38
70067d8K1KJn4rrPKN8j8N7p4N4o9J4o6L2N9m8J1M3n3M1l9O2Qp3k3K5mN8Q2n4@
$$ -48 -27 -25 -24 -78 -87 -96 -89 -87 -29 -47 10 -64 -10 -79 -65 -131 -99 -40 -88 -77 -34 -87 -46 -85 -23 -15 -88 -111 -86 -90 -32 50 -4 0
72329a44J00L4r9M4OrN9j0k6j2K1J6k1k4L0M7k4p7L6J3q9J65j15PL6l3M5m2M6c2
$$ -144 -44 -10 -109 -65 -59 -68 -9 -19 -45 -57 -36 -20 -41 -65 -35 12 -12 -89 -53 -40 -129 36 -79 -72 -36 -69 -24 -66 -20 -32
74333f1J9J6j3KRl4J8l3J8N9m2L6k5j2k7J2j4O1j7m0LJ5l6K0j7n2J45m5k9P4i7
$$ -61 -42 -26 -39 -37 -28 -62 -44 -77 -59 0 -42 -6 -31 -43 -70 -58 -72 -11 -28 -68 -65 -50 -86 -66 -83 -135 10 -35 -64 10 -97
76401f1J4M8j2m5J20j58L5J4n8N6k7N4o2Qn3R3k5mQ2m2kl1jJ3J3k7J9j6m0P5e5
$$ -61 -47 1 -11 -56 64 -94 -59 -45 -103 -47 -74 -20 -82 -74 -127 -34 -59 -63 19 -23 -25 -56 -57 -44 -31 -58 -39 -55 -95 -20 -55
78469a09k3J07K2qm4k1M5J9o1J15j28J10l2p0N2j2%N2k9k8K4k1K5k2j7K0LK0A
$$ -109 -132 -25 -3 -11 -55 -76 -31 -12 -73 42 -86 24 -8 -78 -26 -38 -38 14 -15 -43 -19 -40 -15 -37 -54 -34 -31 -11 1
80408FlRj61J44m0k0j3J44o2j00oj0Q2j7Qm0K6k7R5p8rJ02p2jn1Q1K4o2M3j6f
$$ 6 3 12 -149 -5 -45 -65 -78 66 4 -96 -102 -112 -30 -47 -39 -79 -53 -80 15 -63 -72 30 -42 -43 -94 -13 11 -51 -8 -24 -6
82477d9N1J8J7r1jJ32j37j6P8p1O1l2j3kO9j6l7M6q4N5L9n5K2nK9n0P8p5nJK8h
$$ -49 2 20 37 -54 -55 77 -60 -76 2 -69 -8 -40 -53 -55 14 -2 -39 7 -77 -22 17 -38 -16 -21 8 -42 36 -39 -44 -43 -15 -8
84610a1k9j7j1L2MljL4j04N0Q6n6Q3o6MJ7Nk0M8l6j6J3n1Q0o2rO5Qm0nK6q2J28B
$$ -11 -40 -57 -68 -36 -32 -35 -36 -2 -106 -56 30 -26 57 -9 -5 12 17 -3 45 9 -7 6 -45 35 -27 -36 29 37 -3 -8 18 -64 64 2
86872Fj3J5k5%L7M2o1m7P3j6R6r1k9K6P5r5J9N9m1nJ7J3J9j0j1l3O0lm4k4N7E6
$$ 6 -7 8 -17 -17 20 62 1 -46 27 11 107 16 -13 13 88 -7 12 71 30 25 42 55 74 64 53 20 80 77 33 9 66 56
89005d5R7n9J0KP0o2J2l0K6L0p8l6J51o6K1K7L0n3P6m6r6N6J4J4k2K9l3k8Q8G1
$$ -45 52 -7 3 5 75 13 25 -5 21 51 -27 -63 88 22 43 70 100 47 123 77 -19 37 51 65 43 72 39 11 99 71
91009F4j2j39J44k1O9q4M6m0M6p4L6M3l0j0nJ9o6R1n9jj0N6n3Nl6R8k3m4L5PF4
$$ 64 52 -87 57 36 105 21 67 27 73 -1 35 78 48 38 33 52 -14 77 18 17 7 63 10 15 -21 77 54 10 45 52 64
93077B3l3O5k6L4qL3k6P1m0o3p3P4k5P0j3kqkK1l5K5k5J4Lm5k6l8M3Q8p6PM3A44
$$ 23 -10 55 29 63 55 88 62 133 93 30 -43 31 6 76 63 61 53 51 72 37 62 37 51 54 9 -17 -55 -12 76 0 7 50 144
95275a5L6n0K4o3m5M6J28l9q7P4l6N3k8R8j03K4p0O6L3l6l0Q4j3q5N0k7l6L6B2
$$ -15 21 -29 -5 -68 -113 -67 61 22 -65 9 -27 26 -2 96 -7 17 -53 13 46 10 -20 64 51 -34 16 -11 -47 -11 22
97214b7Q4o5j5L8j5l2N7l7l7N1On2kQJ15j13L2KL3j7o9J04l3k9O0q0N7m9j8M5g5
$$ -27 57 -8 -23 15 0 -32 25 -12 -49 2 8 -44 -46 -38 77 -36 -4 -2 31 14 -55 49 16 -13 47 -33 24 -25 -43 2 -75
99282e2M9k9k5JPm2R5l2m4m4Q9j7j5K1P9p2P0p8R1q8M9k3j7Qm9O3qm0P0j04N5i
$$ -52 -3 -32 -57 -56 -49 -91 4 -28 -72 -116 -27 -44 -59 -38 41 -31 39 -39 52 -36 13 -10 -27 -19 -68 -5 -13 -53 17 -87 -32 -9
101416g6O1J9p1j0P3l6o2N9O9m3K3Lm6K0J9K5L7j95RJ21N1j13L5L3k0Nk7nR3j37D4
$$ -76 -15 4 -67 -77 -4 -40 -102 -43 26 -17 6 9 -37 -17 2 27 64 -131 -122 -1 50 -63 -28 5 -15 -10 -37 -42 51 -86 44
103484a9k8M8O3k7k9J7o2N1K7o0K5n8JK6j2jL7L8o9l3J5l9M7jJ8o5PJ19q5K2N5a1
$$ -19 -47 1 64 37 8 25 -37 14 41 -19 6 -52 -51 -25 -37 -38 -1 37 -32 -65 -50 -89 -42 -43 -25 -90 -83 36 -49 -27 28 -11
105617b5J7k8L4K3n9J7N5L9m0q6R6r7O0l6l4P9q3l2J20M3j30j4R8m4n8N4R1n6A3
$$ -25 -8 -36 -2 21 -38 -21 34 73 33 -53 43 -54 6 -30 -64 15 -68 -100 20 63 -67 -81 17 -27 -85 -31 60 4 13
107556go7Mk9O8J7J3On3P9k0k04J87m2R6j06M5k2k2P2p0O4rk3l0Q0o6k8L6N3L1C
$$ -7 -74 -70 -99 -31 -14 -1 5 -48 31 11 -193 -6 -48 48 -58 -13 -35 -57 15 -55 9 0 -23 -53 27 -39 -67 -31 22 53 3
109624f6k9Q5J4j9J2qp1J07n1K4j4j06N1M1k7k8O0r2qL4j3Q9j6q2ml6N4J07oq6a13
$$ -66 -95 -10 4 -15 -3 -11 -82 25 -26 -2 -16 -122 -71 -30 -57 -85 -25 -117 -125 -91 -104 -15 -31 -113 -117 -153 -99 8 2 -84 -113
111693a07M5M8j2k4K9q8K3K6j8N2o8M1J4Jo3p0J4oMJ7o5J14K34J25K4k8m1p9n2A52
$$ -107 -62 -14 -26 -50 -21 -109 -86 -60 -78 -26 -94 -53 -39 -38 -101 -171 -157 -163 -159 -142 -207 -93 141 266 290 262 221 142 90 152
113697I7J0J5J7q9O7r2O1jj37R3p8Q2k0k3P0o0l8o8O3m0N9PLJ8l4k8R2n7O0o2H1
$$ 97 107 122 139 50 117 25 86 85 -52 41 -37 45 25 2 72 12 -26 -94 -31 -71 -12 -5 -2 16 -18 -46 46 -11 49 -13 81
115765C6q7N9m1N0K9j23J9R3l1n2JKP6km9J3N3pp9K9K9o5M1N4K7k6j32R9kL9m3D1
$$ 36 -51 8 -33 17 46 -77 -58 35 4 -48 -47 -45 31 29 -20 -7 46 39 -40 -11 18 -47 -6 48 75 49 -83 16 14 53 10 41
117898a5N0L4M0O3l8Q8J56qj06q9m3pj15j4p3R8K2j39J02j2lpQoO3mq0oJ27J1f8
$$ -15 35 69 109 172 134 222 378 370 264 175 132 125 10 -4 -77 21 43 -96 6 -6 -9 -16 -8 -14 49 45 -35 -41 86 97 -68
119966Bk1k6J22lm4J15j66mR9q7M1J6l3j4N2KK0n4N9NL9J0K7k8M5K3j42k8MM0A48
$$ 2 -19 -45 77 74 30 145 -21 -25 74 -13 28 44 11 -3 49 51 71 17 76 81 120 130 157 129 174 197 55 27 31 71 148
122035H4R9L9Q1R7K1p0j41j23p9M3k0j2J9Pj8j2j1N5J2n2J1k1J8M2l0N5j08J9G1
$$ 84 183 222 303 400 421 351 210 87 8 51 31 19 38 45 27 15 4 59 71 19 30 9 27 69 39 94 -14 5 71
123974D7N5l5o8K5RJq1P6J1k4j0N5J20L0j6rq8L4j3m4L1p1j6l8lK0L3O3n6k6p5B9
$$ 47 102 67 -1 24 33 34 -47 29 40 16 6 61 181 211 195 186 98 132 119 75 106 35 19 -19 -22 -2 31 94 38 12 -63 29
126107IJ7N9j01O5l3Q0q7k1M5k6o8J22K3n6L6m2K1L1q3K9J2m1P8M4J2j01O8n9A01
$$ 9 26 85 -16 49 16 96 9 -12 33 7 -61 61 84 28 64 22 43 74 -9 20 32 -9 69 113 125 24 92 33 101
128046D3Q2q6J13j62L7M8k2NJ0l0O2mj3k9N1r3J11J8j8j1K9M2j7r3M6J9M2j03A56
$$ 43 125 39 152 -10 27 75 53 58 68 38 100 96 83 54 105 12 123 141 123 112 141 183 166 73 119 138 180 77 156
129985A43j8QJn2J00J5j13O2J0k7k7K4K3p6R3n1KK7o6R9n0nj3m4L4J03p3j1J7A64
$$ 143 125 133 134 82 182 197 84 146 156 129 102 126 149 73 166 115 117 144 78 177 127 122 109 65 99 202 129 118 135 164
131989A24nl8J18j6l4O7m8J12nj9J0J8M1l5MmN1o4l1QJ4N5j12M6o1K6J08j34mB91
$$ 124 119 81 199 183 149 216 168 280 275 256 266 284 325 290 294 290 341 277 246 254 268 323 211 257 196 222 330 196 192 291
133993A89O8j23K9J0K9j17J09o0P2J1r5N3L1K9o0k0J8K3q1n7Q9n0j9L2l9M7l8I6
$$ 189 257 134 163 173 202 85 194 134 206 217 122 175 206 235 175 155 173 196 115 58 147 97 78 110 71 118 80 96
135867I9k9Q6q6L9j0P8k9k9K9p8J10K7j7n5K0L1j00J10o0oM7k9K2oj1l4p3J0j9A17
$$ 99 70 156 70 109 99 177 148 119 148 70 180 207 190 135 155 186 86 196 136 130 177 148 170 164 153 119 46 56 37 117
137871A41j1l5L0J4o2j8N3n5nJ6L8m8K5LN1q6K7k5nO3q1N4l9k6K1J2M9j5n2M4i
$$ 141 130 95 125 139 77 59 112 57 52 68 106 58 83 86 137 51 78 53 48 111 30 84 45 19 40 52 101 86 34 78 -9
139939D8pm6QOJ6K0q2J50l7m7m3N1j4KJ1r3P2ljK3j3O4r9M2N4p0L8M8r8Q8r4O3F6
$$ 48 41 -5 3 9 25 45 -37 113 76 29 -14 37 23 25 36 -57 15 12 11 34 21 85 -14 28 82 12 50 98 0 88 -6 57 66
142137D0K2l3L5r7N2k7l9Q0k8J6l8k3RL4n4L9K9n3P5m1J1K8mm5nK4mN4m0%L8J9E2
$$ 40 62 29 64 -33 19 -8 -47 33 5 21 -17 -40 -31 3 -51 -12 17 -36 39 -2 9 37 33 -12 -17 7 3 57 17 17 55 74 52
144335b2P5m6k6n6L0%P3q4L5J11j35P3p2M0m2K0j1O0j6o9Q6m9J9J3m8m2j8J17G7
$$ -22 53 7 -19 -75 -45 -45 28 -56 -21 90 -45 28 -44 -4 -46 -26 -37 23 7 -62 24 -25 -6 7 -41 -83 -101 16 77
146274c9mM9j07K1PN7L1J9K5q8P9k3k1j2L6k8nL0q1M4J8P6l2r8J39r7J17P0k7A54
$$ -39 -43 6 -101 -80 -73 -16 15 34 59 -29 50 27 6 -6 30 2 -3 27 -54 -10 8 84 52 -46 93 -4 113 183 156 154
148277H8m1r0J16Pj41L1nK7K9j7k7j8O2n7L1k8J9l6P9o3K0k1N2j45Q9RLOK1m1d5
$$ 88 47 -43 73 80 -61 -30 -35 -8 21 4 -23 -41 21 -36 -5 -33 -14 -50 29 -34 -14 -35 17 -128 -39 -30 -27 -21 0 -41 -45
150346il4m8N0o5J24n5L2o1M3Jl5ML8o2R0L4n2J07o8k9J13K9Pj29J66j39N4j43E3
$$ -9 -43 -91 -41 -106 18 -37 -5 -66 -23 -22 -57 -53 -15 -77 13 47 -5 102 34 5 118 147 154 25 191 52 106 -37 53
152285C2l6k3k1m2Q7J6m5K0o2J17m8j8L7N2j4l2L9j33J5NJ6N9m7K9k0nnN3l9j3i
$$ 32 -4 -27 -48 -90 -3 13 -32 -12 -74 43 -5 -23 14 66 52 20 59 -74 -59 -54 -38 21 -26 3 -17 -22 -27 26 -13 -26 -9
154353g7O1J4p7P5N0p2m0Q6Ol7p2J34q1O8p3o4P3l2P7o5k6N9k1N4k2j12J20k0E
$$ -77 -16 -2 -79 -4 46 -26 -66 20 26 -11 -83 51 -30 38 -35 -99 -26 -58 19 -46 -72 -13 -34 20 -2 -114 6 -14 5
156292e9J3mO6RN4l5k1l2P6p6m6K1j8N4n4K2N4k7k0m5N5k4K8l5K4L0Kj13N0Mm6d6
$$ -59 -46 -50 16 25 79 44 23 -9 67 -9 -55 -34 -52 2 -52 -30 24 -3 -23 -68 -13 -37 -9 -44 -20 10 12 -101 -51 -47 -93 -46
158425a0k3j17Q4Rl7P2PK8L5r4J8l1K3P7r7n6J66m3%L0l4J4j9l4M5o5kN7N1j19A0
$$ -10 -33 -150 -66 -57 -94 -22 -15 13 48 -46 -28 -59 -36 41 -56 -112 54 11 11 41 7 21 2 -32 13 -52 -54 3 54 -65 10
160494dK3J0l2l2lj3L9J9m3J24q3L5o6nN8o8kMk1M2OrM4j12M8P2L2j8j29N3J8b5
$$ -4 19 29 -3 -35 -38 -51 -12 7 -36 88 5 40 -26 -31 27 -41 -43 -39 -60 -18 -12 -21 23 -89 -41 31 63 45 -84 -31 -13 -25
162627B1l2l6K6m4J9m3K4J12r6RR4n1R2q8Ok4K6J7q2kJ2Q2n3q3M8MMq1P7K5p0D0
$$ 21 -11 -47 -21 -65 -46 -89 -65 47 -49 -40 54 3 95 7 13 -11 15 32 -50 -52 -40 42 -11 -94 -46 -42 -38 -119 -42 -17 -87 40
164760d5M9pRr5J06n6L7JPN3p0r3L9P2j5j8j3k2Q1j03J06m7P0M3n4p0O6l8L2N4C2
$$ -45 4 -3 6 -89 17 -39 -2 -1 6 59 -11 -104 -65 7 -8 -26 -39 -61 20 -83 23 -24 46 89 35 -35 31 -7 25 79 32
166828C8J3n9J41j3L7Q6K03J75j37j53j78nj09K7J9k3j10R0nq2J15q9%N8K5o9a
$$ 38 51 -8 133 120 157 243 446 621 484 331 153 148 39 66 85 62 -48 42 37 -45 70 -19 -19 39 64 -5 -1
168638f8N8M2K3o3N9j5jM2j08k1lJ5M0k2J1mj2lQ9m9Qq2N9l1m6P9k1R4j1k5L5G5
$$ -68 -10 32 55 -8 51 36 35 77 -31 -52 -55 -40 0 -22 -11 -15 -27 -30 59 10 18 -64 -5 -36 -82 -3 -24 70 59 34 69 75
170771B5J9K8o2K0j4o7N5J6k5L8m7n1J10k4M8r7P3m4qJ0m2O1o3N3%q2L0L7k2jf9
$$ 25 44 72 10 30 16 -51 4 20 -5 33 -14 -65 45 21 69 -28 45 1 -7 3 -39 22 -41 12 12 -70 -40 -3 -25 -26 -69
172840b0J6m8L1Nl9K0K1Jj3JK1L0n9j9J6K3nj2N2q4P3Nk4K2N0oRJ0k0o5N6K1k8F0
$$ -20 -4 -52 -21 -16 -55 -35 -14 -13 -26 -25 -4 26 -33 -52 -36 -13 -18 -30 22 -62 11 16 -8 14 64 58 67 77 57 -8 48 69 41 60
175102B0L4L0L6L7p5j0Q3q8L4JR3J9o2L5l9m8J04L8M1M2p1l8J11J29N0l75j55F3
$$ 20 54 84 120 157 82 72 155 67 101 102 195 214 152 187 148 100 204 242 283 325 254 216 327 456 506 131 -24 63
176976I1j12mj1O6K3j8MJ03q8J6j6J1l2K3qnk6JMJ7n8J2K0pq4N8L5k3p3R2l7J9g7
$$ 91 -21 -25 -36 30 53 35 39 142 54 70 54 65 33 56 48 43 17 18 22 39 -19 -7 13 6 -78 -20 15 -8 -81 11 -26 -7 -77
179174b2j5K2l5p4O6j4R8j09K8m6P7m7Kl4M3l8l5R8LP2j04j0N7m9J03q0o1N8q5a13
$$ -22 -37 -15 -50 -124 -58 -72 26 -83 -55 -101 -24 -71 -69 -103 -60 -98 -133 -35 -32 40 -64 -74 -17 -66 37 -43 -104 -46 -131 -113
181178e3m2J26j24P2n2J6JP7p5M5j0oj1L7l1Ln6K8jJK3p1J00l9j7LJ10p3p4J29f0
$$ -53 -95 31 -93 -21 -73 -57 -56 21 -54 -9 -19 -25 -36 1 -30 -27 -83 -55 -56 -55 -32 -103 -3 -42 -59 -56 54 -19 -93 36 -60
183246e3P3j6l2kK0l1K0j0j2j8J6J3K3m1O1L3j04M6J6KKm8K2JO2q3N0K6l6k3M2a8
$$ -53 20 4 -28 -30 -10 -41 -21 -31 -43 -61 -45 -32 -9 -50 11 44 -60 -14 2 4 6 -42 -20 -19 43 -40 10 36 0 -23 19 -18
185379B5r9K9P3Nk8o3j08K13K9k7m1Rn6j1M4kL6j1n7K2O8j01rJ6L9k1J9o1KL3B4
$$ 25 -74 -45 28 33 5 -58 -166 47 76 49 8 17 -39 -50 -6 -8 28 17 -40 -18 50 -51 -60 -44 -5 -26 -7 -68 -66 -33 24
187448eN7j36L0KJM3L4K2j00%M1Pk3j0PKj5l8M3mN1l1N8o3N1pp9lmlJ01p7Q8Pe3
$$ -5 52 -84 -54 -52 -51 -8 26 48 -52 -52 -11 -4 -27 -37 -30 -28 -43 -81 -38 -42 9 -22 36 -27 24 17 -62 -65 -69 -72 29 -48 40 47 -53
189774b3J2q5P2m8N3M3m4K9p3O6k5P3o5j4OPK5J2k0j38J36r1M0M7l5J09p9l0l4E
$$ -23 -11 -96 -24 -72 -19 24 -20 9 -64 2 -23 50 -15 -29 -23 -16 9 21 1 -137 -1 -92 -52 -5 -40 69 -10 -40 -74 5
191778e4l7oP2K6o3M3J0q2N9j1j3jJ4J5j9n2J49j29Q6n3j2P7p9L6M8pnk5m2J22b3
$$ -54 -91 -97 -25 1 -62 -19 -9 -91 -32 -43 -56 -57 -43 -28 -47 -99 50 -79 7 -46 -58 19 -60 -24 24 17 12 -13 -55 67 -23
193847a4m2O0Nn8N0L7n7l3l9N5m0Q7m7O6k1l2K2k3J6J01p0j1Lo8O7m6L1rn6mJ9a11
$$ -14 -56 4 9 -49 1 38 -19 -52 -91 -36 -76 11 -36 30 9 -23 -1 -24 -8 93 23 12 15 -53 14 -32 -1 -10 -66 -70 -51 -111
195980d4n9J02l1jk7Q0j8n2K8K4m8o0P2N8r8O0o0J9J3RL9K6J0j34kK3J17j21J00h2
$$ -44 -103 -1 -32 -33 -60 20 2 -50 -22 2 -46 -106 -34 24 -74 -14 -74 -55 -42 -33 6 32 42 -92 -94 -71 46 -75 25 -82
197983a6O5q6J1lJ9l7K9J0m6nJ33n8m5M6j5Qo6kJ38p7K2J6n7L8n5O2nq1MJ07r2c6
$$ -16 49 -37 -26 -29 -10 -47 -18 -8 -54 -59 74 16 -29 17 2 10 -56 -58 80 3 25 41 -16 22 -33 29 24 -57 -53 54 -38 -36
200116e0L6KP7k1q2J55j45M3L9o2ko9L7K1N4o3k6%J8PJ5k9N5m6j6J18j2o7O0p2c
$$ -50 -14 -12 65 44 -38 117 -28 15 54 -8 -10 -79 -42 -21 33 -30 -56 -56 -38 -31 -16 -45 10 -36 -52 66 54 -13 47 -25 -3
202185G3n5l8L1r1J65k7Ml3L7j9qO2ko0l4N2K1j7o6Mj0p8R6q2R1L4l1Rk3p4R6H8
$$ 73 18 -20 11 -80 85 58 62 29 66 47 39 101 99 39 5 57 78 61 -5 -1 -11 -89 7 -75 16 50 19 28 5 -69 27 88
204318a9L4P0O6j22M1k1P4j15jN5j14P4j4P4p7O7k8qqJ6N0r9N2m6J7Pm1kM6K6C4
$$ -19 15 85 151 29 70 49 123 8 7 62 -52 22 8 82 5 72 44 36 28 44 94 -5 47 1 18 25 -16 -18 28 54 34
206386B5j31J43L4n7l3L5n4k8O5n4J05o4l7L8rl1M6M2l7kL3n8N8m3M0M7k6n5P0B8
$$ 25 -106 37 71 14 -19 16 -38 -66 -1 -55 50 -14 -51 -13 -22 -53 -7 35 -2 -4 29 -29 29 -14 26 73 47 -8 62 28
208390H5j5M6j8j08kK6L3p6K1L3K0j4K0l4LKP9n1j0J14n0J1N9L8K6L2j42J9OO7B09
$$ 85 70 116 98 -10 -12 14 47 -29 -8 25 45 31 51 17 20 22 101 50 40 154 104 115 174 212 238 270 128 147 153 220 209
210458B53j0m5K0l0K6oO9J3l4Jm0j54Q9J7k6K7Nl1M1m2n1J6K8o2J02l3qm6kM6A38
$$ 253 243 198 218 188 214 208 277 290 256 257 217 63 152 169 143 170 175 144 185 143 92 108 136 74 176 143 135 89 87 133 138
212527H7K4Ko4k7M3j2O8n4m0NK8M1Ko5l6L2K1r4N1l7N8qJ4j7J0lo1J49j31O5p0a5
$$ 87 111 113 49 22 65 53 121 67 27 32 60 101 103 38 2 34 55 -39 12 -25 33 25 39 22 32 29 -32 117 -14 51 -19 -15
214660cL0o2O4j12R5Q8m6j07N3J4N8l0Nr3P2nk4j5P5j7O1j9o5N4k1K0J1n3R3oH6
$$ -3 27 -35 29 -83 12 100 54 -53 0 14 72 42 47 -46 26 21 -3 -18 57 40 101 82 17 71 50 70 81 28 121 115 86
216728I2O2j14n4J5PP6r2J7J4L3n2J0K7o2Q1K4p7N8M7j0q7j5K7K9m4K5k0j0J9f7
$$ 92 154 40 -14 1 8 84 -8 9 23 56 4 14 41 -21 60 84 7 65 112 102 15 0 27 56 12 37 17 7 26 -67
218732G5n7M5n5Q4p3L8N7o0J6K0n2p0J03J5j03P4o2O4K4j15J04pN1j18O7j9l3E9
$$ 75 18 63 8 92 19 57 114 54 70 90 38 -32 71 86 -17 57 -5 59 83 -32 72 65 116 -2 65 46 13 59
220606G5q9N1L4k8K0Nl1O0j01M2M2l0M0r1J06Or6J20j66J47j7Nj03R2j8l3nO4I1
$$ 75 -14 37 71 43 63 68 37 97 -4 38 80 50 90 -1 105 111 15 135 -31 116 99 104 1 93 75 42 37 101 91
222545G7J9l7M7m4p5J57p8J7q2L9o0P2j1p7L0jO3K3j15oL0K1l2P2oOO3p8PlN8F5
$$ 77 96 59 106 62 -13 144 66 83 1 40 -20 52 41 -36 -6 -7 56 79 -36 -42 -12 9 -23 49 43 49 112 34 41 38 96 65
224678F4p2M5P0pq9n7J34l1J9l7M2J5pm5Qm2J3O9l6mJ4J6OP7o1o3j7K8J5Rm7O1F4
$$ 64 -8 37 107 100 11 -46 88 57 76 39 81 96 89 44 52 10 23 92 56 52 66 82 88 165 104 41 24 52 67 76 29 90 64
226876E4o7J43n6k2L5n7K9M5J5m0k0M3P1J0q6R9L8k1j23L3L7o8l1J11q8O9m4O3A67
$$ 54 -13 130 74 52 87 30 59 104 119 79 59 102 173 183 97 196 234 213 90 123 160 92 61 172 84 153 109 172 167
228815I6Q1m0O9o8j4M9j7pK4KK3o4O8j2Q9j31K8N2n2Q1j3K0K7K4j15J33K2l8K0C15
$$ 96 177 137 206 138 124 173 156 149 173 175 198 134 202 190 279 148 176 228 176 257 244 264 291 315 200 333 355 317 337 315
230819C50N7n6K7O3kN4q8J05mo1N5l7L3n0k8P5J3m7k9P0j6j15R0o4j5Oj2o2J33C32
$$ 350 407 351 378 441 439 493 405 510 506 445 500 463 496 446 418 493 506 459 430 500 484 369 459 395 380 386 374 312 445 332
232823C11%k4P6l9J2p5M5M9m2m7o2L2j4QJ3o6l9J42q2N0j8J7n6j0l2N9K5l9M8A78
$$ 311 311 287 363 324 336 261 306 355 313 266 204 236 222 230 243 177 138 280 198 248 230 247 191 181 149 208 233 194 242 178
234826A84rk4M0K1m9qpj7L1r8ML3J2l5J8M9j5j2J0l9j8P2L2k2l0Q4jq2O1q5J11A50
$$ 184 175 151 191 212 163 155 148 131 162 64 68 101 113 78 96 145 130 118 128 89 71 143 175 153 123 207 206 124 185 100 211 150
236959A60kK8p4Q4L7RL7l1M7L1J31J41K44L60N03J091J639J650j450k010j235H99
$$ 160 158 186 112 196 233 242 279 248 295 326 457 598 842 1202 1705 2796 4435 6085 4635 2625 1390 899
238446F87k09Mj63K0j10K3M5r0N2l6Mp2N3J5K3K0PO7l6O5J2k1M0R5j11o8m78j019h90
$$ 687 478 482 319 339 229 252 297 207 259 223 227 155 208 223 246 266 273 340 304 369 381 360 400 495 384 316 -162 -1181 -890
240385e82K64m8J39J21q2P3j8P9m6J00m3mj4P6n5Q9o2K5m9%P5K2p1n5lN6rL2Me6
$$ -582 -318 -366 -227 -106 -188 -115 -133 -54 -100 0 -43 -47 -61 15 -40 49 -13 12 -37 -37 38 60 -11 -66 -69 -13 -22 10 14 -56
242389C9j9L1l1Q0n8m8J09j33J0j7M6j00J20m6L6n2P4J7j0N0k0m1J9j6QL0m0qA00
$$ 39 20 51 20 100 42 -6 103 -30 -20 -37 9 -91 29 -17 19 -33 41 58 48 98 78 37 56 40 48 78 38 30 100
244328H1k1o7P1n7qJ34q3J18J58o3k1j13L9j39M4j5j3K1J2Rn7m2N3K0r9M9q2P7A3
$$ 81 60 -7 64 7 -1 133 50 168 326 263 242 129 168 29 73 58 45 66 78 87 30 -12 41 61 -38 11 -71 6 13
246267I7j6JnK6m8j28K05j19L1L5k4m1O4J6o5N7M1j43R0lJ6j10P4K4k2jJ3KJ18F9
$$ 97 81 82 77 103 55 -73 132 13 44 79 55 14 78 94 29 86 127 -16 74 71 87 -23 51 75 53 52 65 67 185 69
248271A3J9P3K1j03KK7k9J6K3l3J01j02J00J1O8m9LO2j5Nj2L3O7L4J11L4J26j80A73
$$ 13 32 105 126 23 25 52 23 39 62 29 130 28 128 139 207 158 161 223 208 213 201 234 301 335 446 480 606 426 173
250210B12O6j14LJ1L5o2J04k6J8j31j0O5m0J04p8m5Jj01j5j1R8o2l0J21l6j30A2
$$ 212 278 164 167 178 213 151 255 229 247 116 106 171 131 235 157 112 113 12 -3 -14 84 22 -8 113 77 -53 12
252020FK4o4Q2m6n2K5K5K1k8L1L7om3j2L9J8K0k2L4J9j38P4k1m9m0o2n3J51O3A02
$$ 6 30 -34 48 2 -50 -25 0 21 -7 24 61 55 12 0 39 57 77 55 89 108 -30 44 23 -26 -66 -128 -181 -30 33 102
254024F0j02k6l8O5P2M0J06n6o2O5m5R5k4J40l8n1j5k6J4p8Q7rk5R8r6MMl7J4A21
$$ 60 -42 -68 -106 -41 31 71 177 121 59 124 79 174 150 290 252 201 186 160 174 96 183 174 149 247 151 155 159 122 136 121
256027A43Lo0q3k69l4M4K8M7P6m9J26rKM3m2J3J8l3K9j0l6M1L9nO0o6j01L5l2D5
$$ 143 146 86 3 -266 -300 -256 -228 -181 -105 -154 -28 -37 -35 8 -34 -21 -3 -36 -7 -17 -53 -12 27 22 82 16 -85 -50 -82 45
258031HQ9lm2Q7Mr8k9RJ3o8N8q0o3jK31LJn7P8M5j6L9Rj9r0n8k3M6l4J09kq4k5B26
$$ 8 97 94 52 139 143 45 16 25 38 -30 28 -52 -115 -116 115 118 119 62 140 185 169 208 217 198 108 50 27 73 39 148 146 62 37 226
260293B09j4qqJ3j9M5k6n7Q7l5l0K3Kl9N5j3K1j3J27j51j6o8K1l8l5p5k7P5j6F7
$$ 209 195 187 179 192 173 218 192 135 222 187 157 180 182 143 198 185 206 193 320 169 153 85 106 68 33 -42 -69 6 -10 67
262297A23m9RL7l5P3l0Q5P9l9j57j3J1O5M0m9Q0Jp3Rl3l4J9r8k0q3J7O3J61j03A76
$$ 123 74 83 120 85 158 128 213 292 253 96 83 94 159 199 150 230 231 158 167 134 100 119 21 1 -82 -65 -2 159 56 176
264301A87O8j5O3l2L1%M3J02l8p2o3R0O8J9j20j6n8J26J53J7K9l4J00o4nR1LJ03G72
$$ 187 255 240 303 271 302 302 345 447 409 337 274 364 432 451 331 315 257 383 536 553 582 548 648 584 579 670 673 776 772
266240G49J17j19K6p3Q9J8J2j14O7l7M2l2j14o5l2K30p1L7l6L7J19K18J28J70A325
$$ 749 866 747 773 700 789 807 819 705 772 735 777 745 631 566 534 764 693 730 694 731 850 1068 1196 1366 1325
267921A305L2K34q6Q9j30j28j73J65O6m7P5J30L81K84J02j78o1J85J55J74J14B798
$$ 1305 1337 1571 1485 1574 1444 1316 1143 1308 1374 1327 1402 1532 1913 2197 2299 2121 2060 2245 2400 2574 2688 2798
269407B923k01j70J85L53J44R0K80L28L12M14L96k6M37R79K325K485j544j508G937
$$ 2923 2722 2552 2737 3090 3234 3324 3604 3932 4244 4658 5054 5028 5465 6444 8769 11254 9710 8202 7937
270700G948N57O77J066J688K097K676L314L378L254L667N616R007J2687K1752A11998
$$ 7948 8505 9182 10248 11936 14033 16709 20023 23401 26655 30322 35938 44945 57632 79384 111998
271734A55751O3303J11310J83902K73745K10808k40237l19487j98520q6386m3338H4326
$$ 155751 219054 330364 514266 788011 998819 758582 439095 240575 154189 110851 84326
272510F8048j0310r190q090p093n424l661k803k107j798r84j060j226o99P46R22A6590
$$ 68048 57738 48548 40458 33365 27941 24280 21477 19370 17572 16588 15528 14302 13603 14349 15271 16590
273609A6505k917k002j115j044j354j027l24j67j34Pk1n65m68k41l0j13l59m66D064
$$ 16505 13588 11586 10471 9427 8073 7046 6722 6555 6421 6428 6407 5842 5374 5133 5103 4990 4631 4165 4064
274901D028K02n3O2j07k98j28M0N4Kl8rj14j58n0k18j55j03pk63m8pp7Q6J57L3B940
$$ 4028 4230 4177 4239 4132 3834 3706 3746 3800 3802 3764 3755 3641 3483 3433 3215 3060 2957 2950 2687 2639 2632 2555 2641 2798 2831 2940
276647B811j32J12j04%n8r8q5j52o8j16r2m3o0p3Jq9j26j31l1p2M9qK6M7k9r8A254
$$ 2811 2679 2791 2687 2687 2629 2531 2446 2294 2226 2110 2018 1975 1915 1842 1843 1754 1628 1497 1466 1394 1443 1435 1461 1508 1479 1381 1254
278456A114J64K0K8K3j26j4op3p7j02%m0M7m0M9p4r7P5p6J76mk5K6J9J4L8j05I39
$$ 1114 1278 1298 1326 1349 1223 1209 1203 1130 1053 951 951 911 958 918 967 893 796 871 795 971 967 942 968 987 1001 1039 934 939
280331H13L5j55OK9k9j34K8j2k5K7K3k4k3l9%j4k1K4m5Q6j5q3O4J26j53J0k8O1D45
$$ 813 848 693 699 728 699 565 593 581 556 583 606 582 559 520 520 506 485 509 464 550 535 452 516 642 489 499 471 532 445
282270D19j7p6N6p2j03N3j18J39p6R6K2K3p5o1N9n2k1l6J8P3p8op4N4j0O2l4N3B30
$$ 419 402 326 382 310 207 260 142 281 205 301 323 346 271 210 269 217 196 160 178 251 173 167 93 147 137 199 165 218 230
284209B52o9L6n4P2j27J0k9R8n4o2P4k6J22l5jkM3J2q9mj3K8j6p3k6M9L4o4J39A55
$$ 252 183 219 165 237 110 120 91 189 135 73 147 121 243 208 207 205 248 260 171 167 154 182 166 93 67 116 150 86 225 155
286213A71K9j08JL2Rl5J6L8M7K8n9M7rp7nj7N3J2o7J52p4O4J5K02j31k32j5j60e4
$$ 171 200 92 93 125 134 99 115 153 200 228 169 216 207 130 125 108 161 173 106 258 184 248 263 465 334 102 87 -73 -54
288152i0J15q3LL0MJ1pj25R0oNO2j02J7J7%n6J68j02mL9M2j07J30j06J25M1j4B04
$$ -90 25 -58 -55 -25 -21 -10 -17 -142 -52 -58 -53 9 -93 -76 -59 -59 -115 53 -49 -53 -14 28 -79 51 -55 70 111 97 204
290091A32m9M3j5K4Ok1j12J17o7q2Op6J21l5o6p9J20n6O0J7k9M2n9P8p0n2O3L7F6
$$ 132 83 126 111 135 141 120 8 125 58 -24 -18 -94 27 -8 -74 -153 -33 -89 -29 -12 -41 1 -58 20 -50 -102 -39 -2 66
292030a4L7j04N6Q1o5l5k6K1N9p1k5Qj13L1K8l0Q5l6J5Q3j6m4J5N0k4J72l7P0D5
$$ -14 23 -81 -25 56 -9 -44 -70 -49 10 -61 -86 -78 -191 -160 -132 -162 -77 -113 -98 -15 -31 -75 -60 -10 -34 138 101 171 45
293969g3q7L02L08M72l99j57j2r3o8q1L0j4Pn6j02K7M1o7J08j50O8k5K3j3qO0b9
$$ -73 -160 142 450 922 523 366 354 261 193 112 142 128 135 79 -23 4 45 -22 86 -64 4 -21 2 -11 -19 41 -29
295779A6p2Q6Kn6n3M7Pm4N8k3L3k8k9m8M9K1J1k5R5o1m7k4P0J4ol5Jrj9K8P0j11e9
$$ 16 -56 30 32 -24 -77 -30 -23 -67 -9 -32 1 -27 -56 -104 -55 -34 -23 -48 47 -14 -61 -85 -15 -1 -7 -42 -41 -50 -69 -41 29 -82 -59
297977c1n9O1l7P1p0k1K0N3m4l4OL0k7K8jj24k6J15j03n5J08J6K3J6rO5o6M4k8A6
$$ -31 -90 -29 -66 5 -65 -86 -66 -13 -57 -91 -85 -55 -82 -54 -55 -179 -205 -90 -193 -248 -140 -124 -101 -85 -94 -29 -95 -51 -79 16
299981A2j5p1n1O9L9qnm0k1M3J9kK8p9P6k6K1j27P6j6k3j6M3J2o3J39j25M1N0c3
$$ 12 -3 -74 -125 -56 -17 -25 -30 -70 -91 -48 -29 -31 -3 -82 -6 -32 -11 -138 -62 -78 -101 -117 -74 -62 -125 14 -111 -70 -20 -33
301984bR4j66N3k2KJ16n3l4P9j29J7J06J3r9R8KJ3J3kM4J03R8K3o1J27j3n2o29e35
$$ -2 92 -74 -21 -43 -41 75 22 -12 67 -62 -45 61 74 -25 73 75 88 101 99 143 246 344 367 306 433 420 368 -261 -535
303923f44J14J44J92q8R6L7n8m4L0N5J7k9K1M0J8K1j9J08J07J22K28L04L08Q23C410
$$ -644 -530 -386 -194 -282 -186 -149 -207 -251 -221 -166 -149 -178 -157 -117 -99 -78 -97 11 118 240 468 772 1080 1903 3410
305604E409Kk334j602o51l10k43l8r9k8k3j07J9Om2m2O4m1qmM1J2jo0N2m8n3J03a41
$$ 5409 5411 3077 1475 824 514 271 233 134 106 83 -24 -5 1 -41 -83 -19 -60 -68 -72 -31 -19 -20 -80 -28 -76 -129 -26 -141
307478i6J6K5J4n8M1j04N7l0M6J4m4Q3J5m1n9o0mj2M9J13n9j30N9j0L6Rr7R7J1a53
$$ -96 -80 -55 -41 -99 -58 -162 -105 -135 -89 -75 -119 -36 -21 -62 -121 -181 -185 -197 -148 -35 -94 -224 -165 -175 -139 -130 -227 -130 -119 -153
309482a02m3J7n4N0m3Q2K5L1j41N8K9J0j1j6k4o1P1L5j6Pp5P6r9L8L1oL9n9L6a70
$$ -102 -145 -128 -182 -132 -175 -93 -68 -37 -178 -120 -91 -81 -92 -108 -132 -193 -122 -87 -103 -96 -171 -95 -194 -156 -125 -131 -92 -151 -115 -170
311486a62K1MNPj1K1k3k0J04o7M0L9m2j16M6J9L0M9m2M9l7n7mKN0NK0n1l0J23a32
$$ -162 -141 -137 -132 -125 -136 -115 -138 -158 -54 -121 -81 -42 -84 -200 -154 -135 -105 -56 -98 -49 -86 -143 -147 -145 -95 -90 -70 -121 -151 -28 -132
313554i6K6m1J8j4J1m8l8J7K5N4k1PL9l5l6j1N1K8l1k6k5R5o8L5p4QJ6j2J14k7d0
$$ -96 -70 -111 -93 -107 -96 -144 -182 -165 -140 -86 -107 -100 -61 -96 -132 -143 -92 -64 -95 -121 -146 -51 -119 -84 -158 -150 -134 -146 -32 -59 -40
315623a34mK5K4q9K9L2J22o0K00j51m4o7P0l2O1n8qoo4N8K5ln1J6L7p8M3L3j4a00
$$ -134 -138 -113 -89 -178 -149 -117 5 -55 145 -6 -50 -117 -47 -79 -18 -76 -84 -90 -154 -96 -71 -74 -125 -109 -72 -150 -107 -74 -88 -100
317627c9r0mm5K0PL0m1RP3r5M3J6m7M5M7L2q3J9N1Ql2m3M6j0j7N2r9P9op7K8J8a21
$$ -39 -129 -133 -178 -158 -151 -121 -162 -153 -80 -175 -132 -116 -163 -118 -71 -39 -122 -103 -52 -44 -76 -119 -73 -83 -100 -48 -147 -68 -74 -151 -123 -105 -121
319824a34kL1J2K1o3J4K7%O9j01L4l6N6o3J25nj26Q0r0J0n5J55n4j6KqnL9qm3a05
$$ -134 -136 -105 -93 -72 -135 -121 -94 -94 -25 -126 -92 -128 -72 -135 -10 -15 -141 -61 -151 -141 -196 -41 -95 -111 -109 -117 -122 -83 -91 -134 -105
321893a10rJ5k3M5l1l4J20o2o9L4K1m9M2L6j13J40m4n7Q2j2j2P4m6l5n2K3qL6a11
$$ -110 -119 -104 -127 -82 -113 -147 -27 -89 -158 -124 -103 -152 -110 -74 -187 -47 -91 -148 -66 -78 -90 -16 -62 -97 -149 -126 -134 -98 -111
323832g4m6P4r4l3Q1J0P2j19m0J0P0k3n5j2R4m9m9QK5J8q3O5K4KM6k8m7K4P6j1a08
$$ -74 -120 -46 -140 -173 -92 -82 -10 -129 -169 -159 -89 -112 -167 -179 -85 -134 -183 -175 -150 -132 -215 -150 -126 -124 -78 -106 -153 -129 -53 -64 -108
325900i6K8q9QR5j14L1J20j37rM0N2r5O1j4l9P5k0m7K7J8p9P0Rn9MQ3j17N0K9a01
$$ -96 -68 -157 -149 -54 -168 -137 -17 -154 -163 -123 -71 -166 -105 -119 -158 -83 -103 -150 -123 -105 -184 -114 -105 -164 -160 -77 -194 -144 -115 -101
327904a00L8j54J31QM9n8o5M8L3j0n3K4N0j4k3m4J5J0M0k4mM1J4q3O3l7M5n2m8a01
$$ -100 -62 -216 -85 -77 -28 -86 -151 -103 -70 -80 -133 -109 -59 -73 -96 -140 -125 -115 -75 -99 -103 -62 -48 -131 -68 -105 -60 -112 -160 -101
329908i7o0P9q1PR0p2J46p6q0R4r1J33j35P5l5nj6qM7n1K8r5R0M7k4J4j04jN0d6
$$ -97 -157 -78 -159 -152 -62 -134 12 -64 -144 -50 -141 -8 -143 -68 -103 -108 -124 -132 -85 -136 -108 -203 -113 -66 -90 -76 -180 -181 -131 -46
331911g4m5L0j7J3L3l1l8L5N0j44J36k1k1J3n8N8q5L5L0j5M2n8M7Jm4M1j5j4k8a24
$$ -74 -119 -89 -106 -93 -60 -91 -129 -94 -44 -188 -52 -73 -94 -81 -139 -81 -166 -131 -101 -116 -74 -132 -85 -84 -128 -87 -102 -116 -144 -124
333915h1o2J1L4ml5QK4L1j05R1j6L4pk8nML5m2K9K1J0L4j4R3j43r7O8j38J46L2g6
$$ -81 -143 -132 -98 -102 -137 -129 -105 -74 -179 -88 -104 -70 -77 -105 -110 -106 -71 -113 -84 -63 -53 -19 -33 60 -83 -180 -112 -250 -104 -72 -76
335983a27q4J17m2M9m3J5N0k1m3K8Q3l9Lj41R4mJJ15j06L7J8p3L7k2o0Q2J9j75a21
$$ -127 -211 -94 -136 -87 -130 -115 -65 -86 -129 -101 -18 -57 -54 -195 -101 -105 -104 11 -95 -58 -40 -113 -76 -98 -158 -76 -57 -232 -121
337923a84R4n2O3j1j3M9o3opJ22j30l6M6J3l6l9MJ14O%r2j3N4K5n4R6r7L0j2J8a15
$$ -184 -90 -142 -79 -90 -103 -54 -117 -123 -130 -8 -138 -174 -128 -115 -151 -190 -186 -72 -66 -66 -158 -171 -117 -92 -146 -50 -147 -117 -129 -111 -115
339991f0m0l6L4j2M8oJ9j3o3K2K3J6m7j3p7R7mJ06o2n6M9pj7K6j1PL3J5r1J8q2i2
$$ -60 -100 -136 -102 -114 -66 -72 -53 -66 -129 -107 -84 -68 -115 -128 -205 -108 -112 -6 -68 -124 -75 -82 -99 -73 -84 -77 -44 -29 -120 -102 -184 -92
342124f9p2M9K0p0N6J0k3M7k2pm5P7J2k0m5ok4K0k3O5l0J8n6lKO9p3m3R7L3r3a27
$$ -69 -141 -92 -72 -142 -86 -76 -99 -52 -74 -81 -126 -49 -37 -57 -102 -108 -132 -112 -135 -70 -100 -82 -138 -141 -139 -70 -143 -186 -89 -56 -149 -127
344257a70P2J5Qj04J10n8N7MJl4rM9j8l3oM5r0R0Pl0K0k5O8n4J9j5oJ7l2j7K1a05
$$ -170 -98 -83 -75 -179 -69 -127 -70 -66 -65 -99 -108 -59 -77 -110 -116 -71 -161 -71 -64 -94 -74 -99 -31 -85 -66 -81 -87 -70 -102 -119 -98 -105
346390a01L2m1j4L0Mm1J9k7k3L4kk0R5k7o7K9Pqk0MQ1r1P6RL3m3j3mL5j16J26f4
$$ -101 -69 -110 -124 -94 -90 -131 -112 -139 -162 -128 -130 -150 -55 -82 -149 -120 -113 -121 -141 -137 -56 -147 -71 -62 -29 -72 -85 -89 -54 -170 -44 -64
348523a26O3r4J66q4o1J1j5J7Kk3J7J2O5j00R1r2R3n6L2rK0m6m3Q9J9j2m5j6N6i2
$$ -126 -63 -157 9 -75 -136 -125 -140 -123 -121 -144 -127 -115 -50 -150 -59 -151 -58 -114 -82 -91 -71 -117 -160 -71 -52 -64 -109 -125 -69 -92
350527a62M6OK0K3o3R0o2o8J33n3j1k6L6QJ4j4J1j3M3l2l1m8O4mL5p8L5l9Q3m5b8
$$ -162 -116 -110 -90 -67 -130 -40 -102 -170 -37 -90 -101 -127 -91 -83 -69 -83 -72 -85 -42 -74 -105 -153 -89 -93 -58 -136 -101 -140 -57 -102 -28
352595a17k3N5m5L2o3R8j8L4j2l6J4r%j08M6KM8N5m3J8JM3l3p6Q2m6K1K2K2o3a77
$$ -117 -140 -85 -130 -98 -161 -63 -81 -47 -59 -95 -81 -90 -90 -198 -152 -150 -102 -47 -90 -72 -71 -28 -61 -137 -55 -101 -80 -58 -36 -99 -177
354664e2j4O2r2l9N8n6NM8mM8n4M5r6mJ01n7o2J46n9K1r5O2j4k8L7%j9P6p8RJ09g7
$$ -52 -66 -4 -96 -135 -77 -133 -128 -80 -84 -36 -90 -45 -141 -145 -44 -101 -163 -17 -76 -55 -150 -88 -102 -130 -93 -93 -112 -36 -114 -105 4 -77
356797f3qL0qL2oq4K8l4K2k8j8L6M5l9M3K5n0Nl1k9j2P4K6r7Q1K9j03M3JmJ0j8a50
$$ -63 -71 -41 -49 -17 -23 -107 -79 -113 -91 -119 -137 -101 -56 -95 -52 -27 -77 -72 -103 -132 -144 -70 -44 -141 -60 -31 -134 -91 -90 -94 -84 -102 -150
358994a29M1KN2l1m8K2M9P3j02nok6n4J00K4p9O3K0r0J30o5J0ON0n1Rj5oK2L6h0
$$ -129 -88 -86 -34 -65 -113 -91 -42 31 -71 -76 -82 -108 -162 -62 -38 -117 -54 -34 -124 6 -59 -49 -43 7 -44 -35 -50 -56 -34 2 -80
361063h0L0r1R1o6j2Q5j13L7K1N5m4L2o5J2K8l1K0m6N7l7j7N2p9Q3o1J31o0p5a07
$$ -80 -50 -141 -50 -116 -128 -43 -156 -119 -98 -43 -87 -55 -120 -108 -80 -111 -91 -137 -80 -117 -134 -82 -161 -78 -139 -8 -68 -143 -107
363002c5p0J9r1N4N0l1l4PjK9K5LN6n8J2n2o9J22K7k4L7J2m9k7K5j39K01p0L5b8
$$ -35 -105 -86 -177 -123 -73 -104 -138 -131 -132 -103 -78 -75 -19 -77 -65 -117 -186 -64 -37 -61 -24 -12 -61 -88 -63 -202 -1 -71 -36 -28
365005b5o5Jk7J1O4O5q8k2K6j0k0N7l9J2l0nk3R6nLj7K4o4M8mo2j7J18L2j7L4E0
$$ -25 -90 -89 -116 -105 -41 24 -64 -86 -60 -70 -90 -33 -72 -60 -90 -95 -118 -22 -27 -24 -41 -17 -81 -33 -37 -99 -116 2 34 17 51 50
367139D8K1J7K60j12m01j42j4j7P4J49p3J9J0j9L7m1o8J34KL1m2Qo6O4p6J12o9a07
$$ 48 69 86 346 234 -167 -309 -323 -340 -266 -117 -190 -171 -161 -180 -143 -184 -252 -118 -116 -85 -127 -119 -185 -121 -197 -85 -154 -107
369013a48l0L0Qn2J28l2KJ6J7l8l4O2p9Mk6J29j36N3N5p6J13n6k6J1j6l6K9J3c0
$$ -148 -178 -148 -140 -192 -64 -96 -94 -78 -61 -99 -133 -71 -150 -146 -172 -43 -179 -126 -71 -147 -34 -90 -116 -105 -121 -157 -128 -115 -30
370952a23O3p0k8J08K2l1p5k3M1L3jM0n0j10P7M0m7M5m0K8M1j6L2m1r7P1oK2j1d2
$$ -123 -60 -130 -158 -50 -28 -59 -134 -157 -116 -83 -84 -44 -94 -204 -127 -87 -134 -89 -129 -101 -60 -76 -44 -85 -182 -111 -117 -95 -106 -42
372956a04M8n3j5qL1L1m0o0Q3m4n2P4j9J9K2n0M1m6O7nm3J3OO6lq2L0r0kJ16j3a63
$$ -104 -56 -109 -124 -132 -101 -70 -110 -170 -87 -131 -183 -109 -128 -109 -87 -137 -96 -142 -75 -80 -123 -110 -104 -38 -41 -123 -93 -183 -185 -69 -82 -163
375089a28Rl3P0Pr2M0L5M0o4N1p8J20j45P9O6p3J4K0L3n8J4o9L3LN0q2O0j25M8a33
$$ -128 -119 -152 -82 -75 -167 -127 -92 -52 -116 -65 -143 -23 -168 -89 -23 -96 -82 -62 -29 -87 -73 -142 -109 -106 -56 -138 -78 -203 -155 -133
377093a25j26J49n0R5p1N0L3j08PO5o5jo4K15j20k2j5m4J04K7r3K7J34o2o2k9a78
$$ -125 -251 -102 -152 -57 -128 -78 -45 -153 -146 -81 -146 -147 -211 4 -116 -138 -153 -197 -93 -66 -159 -132 2 -60 -122 -151 -178
378902a03Pl3jQ8K0j47L8j1P8op3Q7m2l9J5N0n7L3kj4M4J4k9J6o2kM0q3K3O8k8e6
$$ -103 -96 -129 -130 -42 -22 -169 -131 -142 -64 -70 -143 -56 -98 -137 -122 -72 -129 -96 -98 -112 -68 -54 -83 -67 -129 -131 -91 -174 -151 -83 -111 -56
381036f0o7L3%K5k0pO8k1l8Oo7j3N6k0KK1j1rl0Q3l8J2K5l3nPK2q7R1L5o5L3J6a7
$$ -60 -127 -94 -94 -69 -89 -96 -28 -49 -87 -81 -148 -161 -105 -125 -123 -102 -113 -122 -152 -69 -107 -95 -70 -103 -108 -101 -79 -166 -75 -40 -105 -72 -56 -17
383298a80O6L4%k2K2k7R6r4j0M3q0Q2Po5O8Lm6jk5L0K0j6R7l6p2l9N7l6m2O7K5i8
$$ -180 -114 -80 -80 -102 -80 -107 -11 -105 -115 -72 -152 -70 -63 -128 -60 -57 -103 -104 -129 -99 -79 -95 2 -34 -106 -145 -88 -124 -166 -99 -74 -98
385431b9l1LM9k0j70Q1K0kn0Q1l8l3K1j4qP8k3n2N1L9p2k9j4J04m0L8j5J6l6M9a44
$$ -29 -60 -57 -8 -28 -198 -117 -97 -99 -149 -68 -106 -139 -118 -132 -140 -62 -85 -137 -86 -47 -119 -148 -162 -58 -98 -60 -75 -59 -95 -46 -144
387499a26J06j13N5n6k8M0N1RM7p5o1Rk7Q1Mjl4Q6o3qP1n4l2N0l9kM0m0L9j8Pa02
$$ -126 -20 -133 -78 -134 -162 -122 -71 -62 -15 -90 -151 -142 -169 -88 -84 -85 -119 -33 -96 -104 -33 -87 -119 -69 -108 -110 -70 -110 -71 -89 -82 -102
389632d0l7m6J30j13m2P6p4j1M3mN4l4M7k8j1K6m9N9l0P1r3o5O3KJ13o5%J9j9c3
$$ -40 -77 -123 7 -106 -148 -72 -146 -157 -114 -118 -64 -98 -51 -79 -90 -64 -113 -54 -84 -13 -106 -171 -108 -106 7 -58 -58 -39 -58 -33
391636a09J8Nr7J14l2pJ15j15M4m3M0jj7L0n6ON1k4J7l1N8jk0k5nj8Q5n0j4M8a20
$$ -109 -91 -86 -183 -69 -101 -108 7 -108 -64 -107 -67 -68 -85 -55 -111 -105 -54 -78 -61 -92 -34 -35 -55 -80 -85 -103 -18 -68 -82 -34 -120
393704a02p4M8QP5o4M4L0j3o5K5K7j7k2m6Q3m5mMO6K1l4r2N2L3Rj12J43j3n4K9a32
$$ -102 -176 -128 -120 -45 -109 -65 -35 -48 -113 -88 -61 -78 -100 -146 -63 -108 -112 -108 -42 -21 -55 -147 -95 -62 -53 -165 -22 -35 -89 -60 -132
395773f0n8Q3j11O6Qo0L1K9j2K0o5L5J9o3Lk3L4L6nj1O1j27M3P9k6J1K0k4q6Q7f5
$$ -60 -118 -35 -146 -80 -72 -132 -101 -72 -84 -64 -129 -94 -75 -138 -135 -158 -124 -88 -93 -104 -43 -170 -127 -48 -74 -63 -43 -67 -153 -66 -65
397841a44P1k7N9r4QP4j02J6K7l3Q1j7q4L4P5r1P3l3RN0n2rK0o3O8j6NoM6n6O8a50
$$ -144 -73 -100 -41 -135 -127 -53 -155 -139 -112 -145 -64 -81 -165 -131 -56 -147 -74 -107 -98 -48 -100 -109 -89 -152 -84 -100 -95 -101 -55 -111 -43 -150
399974a29rJK5Rp5J50q5L3o2J11m5o0rM8l7L3l6kjK1J5o1L3Q0j18J30q3L6O8nb7
$$ -129 -138 -137 -112 -103 -178 -28 -113 -80 -142 -31 -76 -136 -145 -97 -134 -101 -137 -139 -140 -119 -104 -165 -132 -52 -170 -40 -123 -87 -19 -24 -27
402042a24k5J5k8M9QL5K6mn4L2M9j06qj4L0J7l4nj0Q1l2J8j8N7m7J3K3j8Nl0k2a18
$$ -124 -149 -134 -162 -113 -105 -70 -44 -48 -102 -70 -21 -127 -135 -149 -119 -102 -136 -141 -151 -70 -102 -84 -102 -45 -92 -79 -56 -74 -69 -99 -121 -118
404176d5m2m4N5l5jM7o1O2m4K4J4q0M3o4J38p3jpQ5nl7M7j09O9o1J11n8J0L1r3a56
$$ -45 -87 -131 -76 -111 -112 -65 -126 -64 -108 -84 -70 -150 -107 -171 -33 -106 -107 -114 -29 -34 -71 -24 -133 -64 -125 -14 -72 -62 -31 -124 -156
406244a67k0P8l1P4k6k6n2N7K0j5M1L6j62O3l8j4M7O5J7q5R1r7RK4Oj4j9J7l4g4
$$ -167 -187 -109 -140 -66 -92 -118 -170 -113 -93 -108 -67 -31 -193 -130 -168 -182 -135 -70 -53 -138 -47 -144 -135 -111 -105 -119 -138 -121 -155 -74
408248c2r0L4j4m8O7k0Rj2K8L7p0R2j06J25j59j1Q4j4L6p3L5N0m4M2M0p7O0r3a43
$$ -32 -122 -88 -102 -150 -83 -103 -94 -106 -78 -41 -111 -19 -125 0 -159 -170 -86 -100 -64 -137 -102 -52 -96 -54 -14 -91 -31 -124 -143
410187g8n1M1Nn9m4Q7k9J01p6M4l5O5k8Oo2QK0jnpK7J7o0O3k9k6j9R7q1P3p9N6i
$$ -78 -129 -88 -83 -142 -186 -99 -128 -27 -103 -59 -94 -29 -57 -51 -113 -105 -85 -86 -91 -98 -71 -54 -114 -51 -80 -106 -125 -28 -109 -36 -115 -59 -9
412384g2l4m2O4j8O4n3J5NNl7jJ3m9M2M1j4M1r7M9o8JK5QK5N6o8M4l4M4n9L7p7e6
$$ -72 -106 -148 -84 -102 -38 -91 -76 -71 -66 -103 -104 -91 -140 -98 -57 -71 -30 -127 -78 -146 -145 -120 -112 -87 -31 -99 -55 -89 -45 -104 -67 -144 -56
414582a67P2n3N1N3j07P9o7N0jj2k8N9k1k4k7pP8k4L9l1n5P1j9J2j7J2m0L0m6f4
$$ -167 -95 -148 -97 -44 -151 -72 -139 -89 -90 -102 -130 -71 -92 -116 -143 -150 -72 -96 -57 -88 -143 -72 -91 -79 -96 -84 -124 -94 -140 -64
416586i6pk2N5q5QM9O1n9p4J07Jk5om2lM2R1r3j7N8l9o0P6j8J1j4J9J4j08P3O5h0
$$ -96 -103 -125 -70 -155 -147 -98 -37 -96 -170 -63 -62 -87 -93 -135 -138 -96 -5 -98 -115 -57 -96 -156 -80 -98 -87 -101 -82 -68 -176 -103 -38 -80
418719a01n3LpL4P5jk8j9K0l7k2L8P7p1r4Q0Ko2RJ31r9l2M1O4n9L7j9j9J5j6M2f0
$$ -101 -154 -151 -158 -124 -49 -50 -78 -97 -77 -114 -136 -98 -21 -92 -186 -106 -104 -166 -157 -26 -125 -157 -116 -52 -111 -74 -93 -112 -97 -113 -71 -60
420852a42J9j4J6k3O9Lk4K0l2KN8j8pPn2L9m4J5J1M1k6lOj6L8p9O7J8n5R0m9p4a45
$$ -142 -123 -137 -121 -144 -75 -72 -96 -76 -108 -106 -48 -66 -73 -66 -118 -79 -123 -108 -97 -56 -82 -85 -79 -95 -57 -136 -69 -51 -106 -16 -65 -139 -145
423050a74Q6p6O9n6j4N9K0J2k8k5%M5k5k6P8r7Q1o4L5L3M8l6q7J67j39P0j09J34E
$$ -174 -88 -164 -95 -151 -165 -106 -86 -74 -102 -127 -127 -82 -107 -133 -55 -152 -71 -135 -100 -67 -19 -55 -142 25 -114 -44 -153 -19 5
424989g8J1j5r0M9RO5Ml2J4LN1l6q8KP7n1j9K1J8J2kq2M0M7l6m2P6k9J8k2J54c0
$$ -78 -67 -82 -172 -123 -114 -49 -45 -77 -63 -60 -9 -45 -133 -131 -54 -105 -124 -103 -85 -73 -75 -157 -117 -70 -106 -148 -72 -101 -83 -105 49 -30
427122e5k2k0pP8m1k0Q0r6Q0j13L1O5n2l7M3pL3n0m3Q3M5o2On8OJ9K4L2J8o6M2e4
$$ -55 -77 -97 -104 -26 -67 -87 -7 -103 -23 -136 -105 -40 -92 -129 -86 -93 -60 -110 -153 -70 -25 -87 -81 -139 -133 -114 -90 -58 -40 -106 -64 -54
429255a21k3J03j0o4j8J01q5%p9J44j9J7o3M3o5m8O2q9K5mJ4j44N2l8J27J37R0A60
$$ -121 -144 -41 -51 -115 -133 -32 -117 -117 -196 -52 -71 -54 -117 -74 -139 -187 -125 -214 -189 -193 -179 -323 -271 -309 -182 -45 45 160
431129A90j23MJ3m7l8l1J09k6m0l2O1j8l0l3R8j49R3J5o8k6L7j6Q6k0J4k1Jk0D1
$$ 190 67 71 84 37 -1 -32 77 51 11 -21 40 22 -8 -41 57 -92 1 16 -52 -78 -41 -57 29 9 23 2 3 -17 41
433068D%OK2k1K6l0J5M8r9j6nM8j0L3km0M8l9K4k9j0k6%L2m7Q3j7N5q1L0m9J14E
$$ 4 4 10 32 11 37 7 22 70 -29 -45 -50 -2 -12 21 19 -21 27 -12 12 -17 -27 -53 -53 -21 -68 15 -2 53 -28 2 -47 67 5
435266em1L0L2K1rm6K2k9m9j2O7k0N7j7m1J2Jl1Q2m3k3QK0J7L6n1l1m0L6M6j9A8
$$ -5 -46 -16 16 37 28 -18 4 -25 -74 -86 -19 -39 18 1 -40 -28 -27 -58 24 -19 -42 -34 -14 3 39 -12 -43 -83 -47 -1 -20 18
437399Dj03M5j3J5R7n0m0M6j9j4k1J7n3J8J4N5o0M6rO3k2K2Mm6n8L8l0J9J3j9f7
$$ 4 -99 -54 -67 -52 45 -5 -45 1 -18 -32 -53 -36 -89 -71 -57 -2 -62 -16 -25 38 16 38 42 -4 -62 -24 -54 -35 -22 -41 -67
439467A1k1K5o3o3L4MJ5k3k7P2Q2j08pk9J4R7N0j71%K9Pl5J2J5P1o4r2M2M9L1d1
$$ 11 -10 15 -48 -111 -77 -73 -58 -81 -108 -36 46 -62 -69 -98 -84 13 63 -108 -108 -79 -72 -107 -95 -80 -9 -73 -165 -123 -74 -43 -41
441536e6J8j7Rl0N2mqJ1n5mk8N6l1M7k4j6K6k2JoO0N5m9m7nJ8N3j02j4J6L4m1g3
$$ -56 -38 -55 -46 -76 -24 -28 -36 -25 -80 -84 -112 -56 -87 -40 -64 -80 -54 -76 -75 -81 -21 34 -15 -62 -67 -49 4 -98 -112 -96 -62 -103 -73
443733d5L2p3O8kj3l8J01r9M6m2L4o9P3k2K8J2j7J9jp1J6m9J7J3l4J8M5n7j3N4a22
$$ -45 -13 -86 -18 -20 -33 -71 30 -69 -23 -65 -31 -100 -27 -49 -21 -9 -26 -7 -8 -79 -63 -112 -95 -82 -116 -98 -53 -110 -123 -69 -122
$$ [...]
971366c0  $$checkpoint
##END=
##END=