##TITLE= t-butyl alcohol and chloride IR
##JCAMP-DX= 5.0
##DATA TYPE= LINK
##BLOCKS=2
##ORIGIN= Department of Chemistry, UWI, JAMAICA
##OWNER= public domain
##TITLE= t-butyl alcohol
##JCAMP-DX= 5.01
##DATA TYPE= INFRARED SPECTRUM
##DATA CLASS= XYDATA
##BLOCK ID=1
##ORIGIN= Department of Chemistry, UWI, Jamaica
##OWNER= public domain
##LONGDATE= 2012/03/22 15:38:25.0156 -0500 $$ export date from JSpecView
##SPECTROMETER/DATA SYSTEM= scan
##$MODELS=
<Models>
<ModelData id="tbuoh" type="MOL">
t-butyl alcohol
__Jmol-14_03191513253D 1   1.00000     0.00000     0
Jmol version 14.3.13_2015.03.13  2015-03-14 09:36 EXTRACT: ({0:14})
 15 14  0  0  0  0              1 V2000
  -0.01019   0.00000   0.03373 C   0  0  0  0  0  0
  -0.22862   1.45193  -0.43081 C   0  0  0  0  0  0
   0.31908   1.62321  -1.35752 H   0  0  0  0  0  0
  -1.29169   1.62321  -0.60010 H   0  0  0  0  0  0
   0.13213   2.13703   0.33638 H   0  0  0  0  0  0
   0.90926  -0.72596  -0.96587 C   0  0  0  0  0  0
   1.18850  -0.04086  -1.76634 H   0  0  0  0  0  0
   1.80693  -1.06852  -0.45117 H   0  0  0  0  0  0
   0.38311  -1.58235  -1.38763 H   0  0  0  0  0  0
  -1.36651  -0.72596   0.10426 C   0  0  0  0  0  0
  -2.16111  -0.04086  -0.19126 H   0  0  0  0  0  0
  -1.35573  -1.58235  -0.56997 H   0  0  0  0  0  0
  -1.54267  -1.06852   1.12393 H   0  0  0  0  0  0
   0.62811   0.00000   1.39115 O   0  0  0  0  0  0
   1.67290   0.00000   1.28662 H   0  0  0  0  0  0
  1 14  1  0  0  0
  1  6  1  0  0  0
  2  3  1  0  0  0
  2  1  1  0  0  0
  2  5  1  0  0  0
  4  2  1  0  0  0
  6  8  1  0  0  0
  6  7  1  0  0  0
  9  6  1  0  0  0
 10 12  1  0  0  0
 10  1  1  0  0  0
 11 10  1  0  0  0
 13 10  1  0  0  0
 14 15  1  0  0  0
M  END
</ModelData>
<ModelData id="1OH" type="XYZVIB" baseModel="tbuoh" vibrationScale=".4">
15
Model[1]: PATH=Calculation 1;Input;Convg=0.6024D-08;-V/T=0.9983;Energy=NaN;E(RPM3)=-0.898460103190E-01 A.U.;Range=M.O.s;PATH=Calculation 1;Input
C       0.00000      0.00000      0.00000
C       0.00000      0.00000      1.54000
H       1.02766      0.00000      1.90333
H      -0.51383      0.88998      1.90333
H      -0.51383     -0.88998      1.90333
C       1.45193      0.00000     -0.51333
H       2.13703      0.00000      0.33444
H       1.62320     -0.88998     -1.11889
H       1.62320      0.88998     -1.11889
C      -0.72596      1.25741     -0.51333
H      -1.06852      1.85073      0.33444
H      -0.04086      1.85073     -1.11889
H      -1.58235      0.96074     -1.11889
O      -0.70711     -1.22475     -0.50000
H      -0.01478     -2.00549     -0.61667
15
Model[2]: PATH=Calculation 1;Standard;Convg=0.6024D-08;-V/T=0.9983;Energy=-0.08984601;E(RPM3)=-0.898460103190E-01 A.U.;Range=M.O.s;PATH=Calculation 1;Standard
C      -0.01019      0.00000      0.03373
C      -0.22862      1.45193     -0.43081
H       0.31908      1.62320     -1.35752
H      -1.29169      1.62320     -0.60009
H       0.13213      2.13703      0.33638
$$ [...]
H       1.18850     -0.04086     -1.76634      0.11000      0.29000     -0.32000
H       1.80693     -1.06852     -0.45116      0.32000     -0.12000      0.20001
H       0.38311     -1.58235     -1.38763     -0.23001     -0.35000     -0.16000
C      -1.36651     -0.72596      0.10426     -0.01000     -0.01000      0.00000
H      -2.16111     -0.04086     -0.19126      0.13000     -0.12000      0.05000
H      -1.35573     -1.58235     -0.56997     -0.01000      0.22000      0.18001
H      -1.54267     -1.06852      1.12393      0.04000      0.07000     -0.24000
O       0.62811      0.00000      1.39115      0.00000      0.00000      0.00000
H       1.67290      0.00000      1.28662     -0.01000      0.00000      0.00000
15
Model[41]: IRIntensity=0.9988 KM/Mole;PATH=Calculation 1;FrequenciesFrequencies;ReducedMass=1.0275 AMU;ForceConstant=6.2683 mDyne/A;FreqValue=3217.8186;Frequency=3217.8186 cm^-1;FrequencyLabel=A;PATH=Calculation 1;FrequenciesFrequencies
C      -0.01019      0.00000      0.03373      0.00000      0.00000      0.00000
C      -0.22862      1.45193     -0.43081     -0.01000      0.03000     -0.01000
H       0.31908      1.62320     -1.35752     -0.18001     -0.04000      0.30001
H      -1.29169      1.62320     -0.60009      0.41000     -0.05000      0.06000
H       0.13213      2.13703      0.33638     -0.14000     -0.24000     -0.28000
C       0.90926     -0.72596     -0.96587      0.00000     -0.01000      0.00000
H       1.18850     -0.04086     -1.76634      0.01000      0.02000     -0.03000
H       1.80693     -1.06852     -0.45116     -0.02000      0.00000     -0.01000
H       0.38311     -1.58235     -1.38763      0.04000      0.06000      0.03000
C      -1.36651     -0.72596      0.10426      0.03000      0.01000      0.00000
H      -2.16111     -0.04086     -0.19126     -0.31000      0.29000     -0.12000
H      -1.35573     -1.58235     -0.56997      0.02000     -0.30001     -0.24000
H      -1.54267     -1.06852      1.12393     -0.06000     -0.13000      0.41000
O       0.62811      0.00000      1.39115      0.00000      0.00000      0.00000
H       1.67290      0.00000      1.28662      0.00000      0.00000      0.00000
</ModelData>
</Models>
##$PEAKS=
<Peaks type="IR" xUnitsExpected="1/cm"  >
<PeakData id="1" title="OH group (~3350 cm-1)" peakShape="broad" model="1OH.32" xMax="3456" xMin="3256"    />
<PeakData id="2" title="asymmetric stretch of CH3 group (~2970 cm-1)" peakShape="broad" model="1OH.33" xMax="3000" xMin="2950"    />
<PeakData id="4" title="symmetric stretch of CH3 group (~2940 cm-1)" peakShape="broad" model="1OH.40" xMax="2940" xMin="2850"    />
<PeakData id="5" title="C-O stretch (~1190 cm-1)" peakShape="broad" model="1OH.19" xMax="1240" xMin="1140"    />
</Peaks>
##XUNITS= 1/CM
##YUNITS= TRANSMITTANCE
##XFACTOR= 1
##YFACTOR= 7.912000E-07
##FIRSTX= 3.813997E+03
##FIRSTY= 8.776999E-01
##LASTX= 2.504620E+02
##NPOINTS= 3551
##MINY= 1.212000E-01
##MAXY= 9.124000E-01
##XYDATA= (X++(Y..Y))
3813.9966A109328K52N06L79N06L79N05L80N05L79TN06L79N06J26%Vj26A114636
$$ 1109328 1109580 1110086 1110465 1110971 1111350 1111855 1112235 1112740 1113119 1113498 1114004 1114383 1114889 1115015 1115015 1115015 1115015 1115015 1114889 1114636
3792.9165A114510k53j27k52j27j26j27j26Tk53Ul79k53k52k53Tj26k53A110212
$$ 1114510 1114257 1114130 1113878 1113751 1113625 1113498 1113372 1113246 1112993 1112740 1112487 1112108 1111855 1111603 1111350 1111097 1110971 1110718 1110212
3772.8403A109580o32j011j137j138j137q85p58p59n05J26P59J011Q84A105157
$$ 1109580 1108948 1107937 1106800 1105662 1104525 1103640 1102882 1102123 1101618 1101744 1102503 1103514 1104398 1105157
3757.7832A105915L79K53TJ26n05l80l79Tj26J26%J27%P58J137j390K53A106421
$$ 1105915 1106294 1106547 1106800 1106926 1106421 1106041 1105662 1105283 1105157 1105283 1105283 1105410 1105410 1106168 1107305 1105915 1106168 1106421
3738.7107A106673L80K52K53J27%Xj27%WK53L79K53L79K53J26%j26l79A107685
$$ 1106673 1107053 1107305 1107558 1107685 1107685 1107685 1107685 1107685 1107685 1107685 1107558 1107558 1107558 1107558 1107558 1107558 1107811 1108190 1108443 1108822 1109075 1109201 1109201 1109075 1108696 1107685
3711.6077A105789k275Tk402k401k402k401j770p58q85q84q85Tp58l79A084176
$$ 1105789 1103514 1101239 1098837 1096436 1094034 1091633 1089863 1089105 1088220 1087336 1086451 1085566 1084808 1084429 1084176
3695.5469A083797l79k53Tj26j27j26K53J011J390J896J517J011P58%A090243
$$ 1083797 1083418 1083165 1082912 1082786 1082659 1082533 1082786 1083797 1085187 1087083 1088600 1089611 1090369 1090369 1090243
3679.4858A090116%j26k53l79Ul80l79Vo32Wp58o32p59q84p59q84p59A077224
$$ 1090116 1090116 1089990 1089737 1089358 1088979 1088600 1088220 1087841 1087462 1087083 1086704 1086072 1085440 1084808 1084176 1083544 1082786 1082154 1081395 1080511 1079752 1078868 1078109 1077224
3654.3904A076466q85j137j138j011q84q85j011j138q721j1249q341m424A033367
$$ 1076466 1075581 1074444 1073306 1072295 1071411 1070526 1069515 1068377 1059656 1048407 1040066 1035642 1033367
3640.3372A031724j517j643k022k528k654l792q342j1501o067k275q85I88119
$$ 1031724 1030207 1028564 1026542 1024014 1021360 1017568 1009226 997725 991658 989383 988498 988119
3627.2876I87867l80%J643K781L033K275K149TK148K402K401K402Q84A012133
$$ 987867 987487 987487 989130 991911 994944 997219 999368 1001517 1003665 1006067 1008468 1010870 1011754 1012133
3612.2302A012639N06K52n05n06n05j138j517j516j517Tj516j770k654I96082
$$ 1012639 1013145 1013397 1012892 1012386 1011881 1010743 1009226 1007710 1006193 1004676 1003160 1001390 998736 996082
3597.173I93428k781k780k655k907Xl033Tk907l034k907l159l160Ul159I33771
$$ 993428 990647 987867 985212 982305 979398 976491 973584 970677 967770 964737 961704 958797 955763 952856 949697 946537 943377 940217 937058 933771
3576.093I29474m171Tm297m171n561n687n688n561m803m676m677m676H65394
$$ 929474 925303 921132 916835 912664 907103 901416 895728 890167 885364 880688 876011 871335 865394
3562.0398H58569o698o699q215r859r732r985o193n940n814Tn688n055G68327
$$ 858569 851871 845172 836957 827098 817366 807381 801188 795248 789434 783620 777932 772877 768327
3547.9863G63524m550m677m803n308Tn435n309n308o319o446To320o319F85162
$$ 763524 758974 754297 749494 744186 738878 733443 728134 722826 716507 710061 703615 697295 690976 685162
3532.9292F79980n182n309n687n688n814n687o573j4029o067l159l160F10086
$$ 679980 674798 669489 663802 658114 652300 646613 640040 626011 619944 616785 613625 610086
3519.8796F05030o066m298m171m297Tm171m297m171m424n308n688n814E42341
$$ 605030 598964 594666 590495 586198 581901 577730 573433 569262 564838 559530 553842 548028 542341
3505.8262E36527o952o951p078o699n308m929m930n055n688n814n561D66380
$$ 536527 529575 522624 515546 508847 503539 498610 493680 488625 482937 477123 471562 466380
3492.7766D62336m045m171Tm044m045m044m045l665l792l791l792Tl791D07356
$$ 462336 458291 454120 449949 445905 441860 437816 433771 430106 426314 422523 418731 414939 411148 407356
3477.7195D03691l919l791l792m044m171m045m044m171m803n308n435C51618
$$ 403691 399772 395981 392189 388145 383974 379929 375885 371714 366911 361603 356168 351618
3464.67C48458k907l033k907l034k907l033Tk907l034k907l033k907C10162
$$ 348458 345551 342518 339611 336577 333670 330637 327604 324697 321663 318756 315723 312816 310162
3450.6165C07381k780k781Tk780k654k781k654k402k275k148k275k022B75278
$$ 307381 304601 301820 299039 296259 293605 290824 288170 285768 283493 281345 279070 277048 275278
3436.5632B73509j770j643j769j770j643Tj517j516j517Tj516j517Tj516B49621
$$ 273509 271739 270096 268327 266557 264914 263271 261754 260238 258721 257204 255688 254171 252654 251138 249621
3420.5022B48104j517j516j517j390j517Tj516j517Tj516j517j643j138B27882
$$ 248104 246587 245071 243554 242164 240647 239130 237614 236097 234580 233064 231547 229904 228766 227882
3405.4448B27250p59p58Tp59o32p58Tq85o32p58p59n05n06l79Vl80n05B15243
$$ 227250 226491 225733 224975 224216 223584 222826 222068 221183 220551 219793 219034 218529 218023 217644 217265 216886 216507 216127 215622 215243
3384.3647B14863n05l79Tn06l79Uk53Tj26k53Tj26k53j643O32L79k53B09429
$$ 214863 214358 213979 213600 213094 212715 212336 211957 211704 211451 211325 211072 210819 210693 210440 208797 209429 209808 209555 209429
3364.2886B09176k53j26k53J26J27J26%J27J26TJ27K52L80K52K53TL79B11451
$$ 209176 208923 208797 208544 208670 208797 208923 208923 209050 209176 209302 209429 209681 210061 210313 210566 210819 211198 211451
3345.216B11704L79TN06N05N06N05N06N05P59J011J137J012J263J138B22952
$$ 211704 212083 212462 212968 213473 213979 214484 214990 215495 216254 217265 218402 219414 220677 221815 222952
3329.1553B23964J137J011J138J011TJ138J011TJ137J011J012J137J390B39889
$$ 223964 225101 226112 227250 228261 229272 230410 231421 232432 233569 234580 235592 236729 238119 239889
3314.098B41532J769J643J770J643TJ769J644K654K780K907TK781K907B73256
$$ 241532 243301 244944 246714 248357 250000 251769 253413 256067 258847 261754 264661 267442 270349 273256
3299.0408B76036K907TK781K907L160L412L413L286L412L287L412L286C17619
$$ 276036 278943 281850 284631 287538 290698 294110 297523 300809 304221 307508 310920 314206 317619
3284.9873C20905L412L413M045L918TM044L918TM045M044M045L918XM045C95096
$$ 320905 324317 327730 331775 335693 339611 343655 347573 351491 355536 359580 363625 367543 371461 375379 379297 383215 387133 391178 395096
3264.9111C99014L918UL792L918L792L918VM171M298M297M171M297M171D67518
$$ 399014 402932 406850 410768 414560 418478 422270 426188 430106 434024 437942 442113 446411 450708 454879 459176 463347 467518
3246.8425D71689M297M044M045M171M044M045M044M045L918M044M045E20602
$$ 471689 475986 480030 484075 488246 492290 496335 500379 504424 508342 512386 516431 520602
3233.793E24646M045M044M045M170M298M297M171VM170M424N308N182E90622
$$ 524646 528691 532735 536780 540950 545248 549545 553716 557887 562058 566229 570399 574823 580131 585313 590622
3217.732E95804N308N309N055M424L539L665TL666L665TL539L666L665F52174
$$ 595804 601112 606421 611476 615900 619439 623104 626769 630435 634100 637765 641304 644970 648635 652174
3202.6748F55966L918M044L918M045M044M045L918M044M045L918TL792G07280
$$ 655966 659884 663928 667846 671891 675935 679980 683898 687942 691987 695905 699823 703615 707280
3188.6213G10945L792L665L792L665L792L665L792L413L033L160L286G53033
$$ 710945 714737 718402 722194 725859 729651 733316 737108 740521 743554 746714 750000 753033
3175.5718G56193L160TL159L034L412L918M550M677M424M550M676M929H08771
$$ 756193 759353 762513 765672 768706 772118 776036 780586 785263 789687 794237 798913 803842 808771
3161.5186H13701M929M803M550UM171L539L286TL413L412L286TL287L286H74621
$$ 813701 818630 823433 827983 832533 837083 841254 844793 848079 851365 854778 858190 861476 864762 868049 871335 874621
3144.4536H77781L286L159L034L160L539L791L792L918M171M676N814I25935
$$ 877781 881067 884226 887260 890420 893959 897750 901542 905460 909631 914307 920121 925935
3131.404I30359L160K022J264N05L80L79N05L79N06O32N06O32O31J012I44135
$$ 930359 933519 935541 936805 937310 937690 938069 938574 938953 939459 940091 940597 941229 941860 942872 944135
3115.343I45399J264TJ390J264UJ517J390TJ391J516J391J390TJ391I67265
$$ 945399 946663 947927 949317 950581 951845 953109 954626 956016 957406 958797 960313 961704 963094 964484 965875 967265
3098.2783I68529J264UJ263J138J264TJ390J138J263J138J137J138TJ137I87993
$$ 968529 969793 971057 972321 973584 974722 975986 977250 978640 979778 981041 982179 983316 984454 985592 986729 987993
3081.2134I89130J138J137J138J011Q85TP58Q85P58Q85P58Q85P58L79A001643
$$ 989130 990268 991405 992543 993554 994439 995324 996082 996967 997725 998610 999368 1000253 1001011 1001390 1001643
3065.1526A001896J26K53J26K53J27J26j26k53k907K275J26j26k53l79A000632
$$ 1001896 1002022 1002275 1002401 1002654 1002781 1002907 1002781 1002528 999621 1001896 1002022 1001896 1001643 1001264 1000632
3049.0916I99747p58q85Tp58q85j011j769j770j769j770j643j769k022I78893
$$ 999747 998989 998104 997219 996461 995576 994565 992796 991026 989257 987487 985844 984075 982053 978893
3034.0342I75733l033l160l033l413l792l539l665Tl539m929m930m929I25303
$$ 975733 972700 969540 966507 963094 959302 955763 952098 948433 944894 939965 935035 930106 925303
3019.981I21259l792l918Tl792l918Tm044n562o066o067Up836j0743H34302
$$ 921259 917467 913549 909631 905839 901921 898003 893959 888397 882331 876264 870197 864130 856294 845551 834302
3003.92H18756k2876k6163k0728j2007j3145j8200k3129l0713Tl0587E59783
$$ 818756 795880 769717 748989 736982 723837 705637 682508 651795 621082 590495 559783
2991.8743E29196l0586l0713Tl0586l0713Tl0587l0712l0713l4505m6259A65445
$$ 529196 498610 467897 437184 406598 375885 345172 314585 283873 253160 218655 172396 165445
2978.8247A61653k275j264j137j011p59o32l79N06j264k53J26J27J011A58873
$$ 161653 159378 158114 156977 155966 155207 154575 154196 154702 153438 153185 153311 153438 154449 158873
2963.7673A64055P330J1123J1248J1375J1502J1628J1754J7063L2103C05106
$$ 164055 171385 182508 193756 205131 216633 228261 240015 257078 289181 305106
2952.7253C21537J2133R480Q215N814L539N05N06L79N06L79O32P58O32C65774
$$ 321537 333670 343150 351365 357179 360718 361223 361729 362108 362614 362993 363625 364383 365015 365774
2937.6682C66532P58J390M677N435N561TN435N308M297M171TM298M423D26567
$$ 366532 367290 368680 373357 378792 384353 389914 395349 400657 404954 409125 413296 417594 422017 426567
2922.611D30991M044P59O32N05k53j26k53j26N05K528N941R984O067D66254
$$ 430991 435035 435794 436426 436931 436678 436552 436299 436173 436678 439206 445147 455131 461198 466254
2907.554D71309N182UN056M676M551M550M676L539L412L287L286TL412E33999
$$ 471309 476491 481673 486855 491911 496587 501138 505688 510364 513903 517315 520602 523888 527174 530586 533999
2891.493E37412K148K149K022J138J263J264UP59j517k275k907k402E40319
$$ 537412 539560 541709 543731 544869 546132 547396 548660 549924 550683 549166 546891 543984 541582 540319
2876.4358E40192%Q85J264TN434O320O319J2008J6557K1107R226Q974F38524
$$ 540192 540192 541077 542341 543605 549039 555359 561678 573686 590243 611350 620576 629550 638524
2862.3823F47497Q595Q342Q594Q595Q721R858R859R985R984R859J1375G62892
$$ 647497 656092 664434 673028 681623 690344 700202 710061 720046 730030 739889 751264 762892
2849.3328G74393J1628J5420J4914J4029K0981O572N056N308N182TM171H85870
$$ 774393 786021 801441 816355 830384 851365 857937 862993 868301 873483 878665 882836 885870
2836.2832H88650K781K907K780K781K780K907K781J896J643J390J643I16456
$$ 888650 891431 894338 897118 899899 902679 905586 908367 910263 911906 913296 914939 916456
2823.2336I17973J643J516J517J643J517TJ516J643J391J390J264J390I37184
$$ 917973 919616 921132 922649 924292 925809 927326 928842 930485 931876 933266 934530 935920 937184
2809.1802I38574J264J391J263J391J390J264J390J264J390J264J391I54499
$$ 938574 939838 941229 942492 943883 945273 946537 947927 949191 950581 951845 953236 954499
2796.1306I55890J264J137J011J138J137J138J137J138J137J138J137I69540
$$ 955890 957154 958291 959302 960440 961577 962715 963852 964990 966127 967265 968402 969540
2783.081I70677J138J137J012J137J138J137J138J137J011Q85J011TQ85I85465
$$ 970677 971815 972952 973964 975101 976239 977376 978514 979651 980662 981547 982558 983569 984454 985465
2768.024I86476Q85J011UQ85J011TQ85J138J137J264J137J264J138J264A003792
$$ 986476 987361 988372 989383 990394 991279 992290 993301 994186 995324 996461 997725 998862 1000126 1001264 1002528 1003792
2750.9592A004929J264J138J264J137J264TJ137J138J137J138J137J138A020222
$$ 1004929 1006193 1007331 1008595 1009732 1010996 1012260 1013397 1014535 1015672 1016810 1017947 1019085 1020222
2736.9058A021234J137J138J137J138J137Q85P58Q85TP58K53J26J27J26A031850
$$ 1021234 1022371 1023509 1024646 1025784 1026921 1027806 1028564 1029449 1030334 1031092 1031345 1031471 1031598 1031724 1031850
2720.8447A031977J26J27J26Tj26Tk53j27j26Tj27J27K52K53L79TP59A034631
$$ 1031977 1032103 1032230 1032356 1032482 1032356 1032230 1031977 1031850 1031724 1031598 1031471 1031598 1031850 1032103 1032482 1032861 1033620 1034631
2701.7722A035642J138J011UJ137J012J011J137J011Q85UQ84P59P58N06A051062
$$ 1035642 1036780 1037791 1038802 1039813 1040950 1041962 1042973 1044110 1045121 1046006 1046891 1047776 1048660 1049419 1050177 1050683 1051062
2683.7036A051314K53L79K53L79L80K52J27l79l80l79k53l79Tk53k52A050809
$$ 1051314 1051567 1051946 1052199 1052578 1052958 1053210 1053337 1052958 1052578 1052199 1051946 1051567 1051188 1050935 1050683 1050809
2666.639A051188K53TK52K53VL79N05P59P58O32P58O32TP58P59O32P58A061552
$$ 1051188 1051441 1051694 1051946 1052199 1052452 1052705 1052958 1053337 1053842 1054601 1055359 1055991 1056749 1057381 1058013 1058771 1059530 1060162 1060920 1061552
2645.5588A062184P58N06N05N06TO32N05N06N05N06L79N06o32n06K275A069515
$$ 1062184 1062942 1063448 1063953 1064459 1064965 1065597 1066102 1066608 1067113 1067619 1067998 1068504 1067872 1067366 1069641 1069515
2628.494A069388l79j011Uj138j011j137j012j011j137j138j137j138A054980
$$ 1069388 1069009 1067998 1066987 1065976 1064838 1063827 1062690 1061678 1060667 1059530 1058392 1057255 1056117 1054980
2613.4368A053842j137j138j137j138j011Tp58p59q84p59p58q85p58p59A040066
$$ 1053842 1052705 1051567 1050430 1049292 1048281 1047270 1046512 1045753 1044869 1044110 1043352 1042467 1041709 1040950 1040066
2597.3757A039307p58q85o32Tn05l79n06l79n06l79n05l80n05n06l79A030966
$$ 1039307 1038549 1037664 1037032 1036400 1035895 1035516 1035010 1034631 1034125 1033746 1033241 1032861 1032356 1031850 1031471 1030966
2580.311A030586n05l79n06l79n06n05l79n06l79n06l79n05l80n05l79A023382
$$ 1030586 1030081 1029702 1029196 1028817 1028311 1027806 1027427 1026921 1026542 1026036 1025657 1025152 1024772 1024267 1023888 1023382
2563.246A022877n06o32n05j517m171L918o32n05o32n06l79j26k53L79A017315
$$ 1022877 1022371 1021739 1021234 1019717 1015546 1019464 1018832 1018327 1017695 1017189 1016810 1016684 1016431 1016810 1017315
2547.185A017947N06TN05O32N06N05J264J896J769J770J896J769J896A035137
$$ 1017947 1018453 1018959 1019464 1020096 1020602 1021107 1022371 1024267 1026036 1027806 1029702 1031471 1033367 1035137
2532.128A037159J896K022TJ896K022TJ896K023K022TJ643J770J643A063827
$$ 1037159 1039055 1041077 1043099 1044995 1047017 1049039 1050935 1052958 1054980 1057002 1058645 1060415 1062058 1063827
2517.0708A065597J643J769J643J770J769J643J264J138J011J137J138A082659
$$ 1065597 1067240 1069009 1070652 1072422 1074191 1075834 1077098 1078236 1079247 1080384 1081522 1082659
2504.0212A083797J137J138O32WO31O32N06O32VN05N06O32N05N06TO32A097826
$$ 1083797 1084934 1086072 1086704 1087336 1087968 1088600 1089232 1089863 1090495 1091001 1091633 1092265 1092897 1093529 1094034 1094540 1095172 1095677 1096183 1096689 1097321 1097826
2480.9336A098458O32P58P59P58TP59P58O32P58P59P58O32P58O32P59A109960
$$ 1098458 1099090 1099848 1100607 1101365 1102123 1102882 1103640 1104272 1105030 1105789 1106547 1107179 1107937 1108569 1109328 1109960
2463.8687A110718O32P58O32UP58K53TJ26K53J27K52J264p58%K53J26A117164
$$ 1110718 1111350 1112108 1112740 1113372 1114004 1114762 1115015 1115268 1115394 1115647 1115774 1116026 1117290 1116532 1116532 1116785 1116911 1117164
2444.7964A117290K53J26%j26k53j26k53Tj26k53Tj26k53j26l79l80n05A113751
$$ 1117290 1117543 1117669 1117669 1117543 1117290 1117164 1116911 1116658 1116532 1116279 1116026 1115900 1115647 1115521 1115142 1114762 1114257 1113751
2425.7239A113372n05n06Tl79n05n06n05n06l79n06n05n06n05l80n05A105662
$$ 1113372 1112867 1112361 1111855 1111476 1110971 1110465 1109960 1109454 1109075 1108569 1108064 1107558 1107053 1106673 1106168 1105662
2408.659A105157n06n05l80n05n06n05n06l79Vl80l79n05l80l79Wl80A095804
$$ 1105157 1104651 1104146 1103766 1103261 1102755 1102250 1101744 1101365 1100986 1100607 1100228 1099848 1099469 1098964 1098584 1098205 1097826 1097447 1097068 1096689 1096309 1095804
2385.5713A095425l79l80k52k53Uj26k53Tk907J264Q85k53Tk52k53j27A090875
$$ 1095425 1095046 1094666 1094414 1094161 1093908 1093655 1093529 1093276 1093023 1090116 1091380 1092265 1092012 1091759 1091507 1091254 1091127 1090875
2366.499A090875K52L80K52L80K52L79K53L79K53L79K53L79K53N06O32A096562
$$ 1090875 1091127 1091507 1091759 1092139 1092391 1092770 1093023 1093402 1093655 1094034 1094287 1094666 1094919 1095425 1096057 1096562
2349.434A097068L79N05N06TN05N06N05N06N05N06TN05O32P58P59Q84A106800
$$ 1097068 1097447 1097952 1098458 1098964 1099469 1099975 1100480 1100986 1101491 1101997 1102503 1103008 1103640 1104398 1105157 1106041 1106800
2331.3655A107558Q85P58Q85P58Q85P58Q85P58N06TL79TN05L80L79N05A118049
$$ 1107558 1108443 1109201 1110086 1110844 1111729 1112487 1113372 1114130 1114636 1115142 1115521 1115900 1116405 1116785 1117164 1117669 1118049
2313.2969A118428L79K53K52L80K52K53UK275L79j390L79VN06L79TJ27A124874
$$ 1118428 1118807 1119060 1119312 1119692 1119944 1120197 1120450 1120703 1122978 1123357 1121967 1122346 1122725 1123104 1123483 1123989 1124368 1124747 1124874 1124874
2292.2168A124874%k53p59p58q85p58Tj138j264Tj263j264j012j137j011A110465
$$ 1124874 1124874 1124621 1123862 1123104 1122219 1121461 1120703 1119565 1118301 1117037 1115774 1114510 1113498 1112361 1111350 1110465
2275.1519A110212k52k53j27%K53j769p59L034N05J264K022K023K148A119944
$$ 1110212 1109960 1109707 1109580 1109580 1109833 1108064 1107305 1110339 1110844 1112108 1114130 1116153 1118301 1119944
2260.0947A120956J011Q84J011Q85J011Q85O32K53L79VK53L79L80L79A130814
$$ 1120956 1121967 1122851 1123862 1124747 1125758 1126643 1127275 1127528 1127907 1128286 1128665 1129044 1129297 1129676 1130056 1130435 1130814
2242.0261A131067L79TK53TK52K53VK52K53UK52K53VK52K53UK52K53VJ26A138397
$$ 1131067 1131446 1131825 1132078 1132331 1132583 1132836 1133089 1133342 1133595 1133847 1134100 1134353 1134606 1134858 1135111 1135364 1135617 1135870 1136122 1136375 1136628 1136881 1137133 1137386 1137639 1137892 1138145 1138271 1138397
2211.9119A138397%WJ27%S0J26J27%J26TJ27%J26T%J27J26%J27J26T%A140167
$$ 1138397 1138397 1138397 1138397 1138397 1138397 1138524 1138524 1138524 1138524 1138524 1138524 1138524 1138524 1138524 1138524 1138524 1138650 1138777 1138777 1138903 1139029 1139156 1139156 1139282 1139408 1139408 1139535 1139661 1139661 1139788 1139914 1140040 1140040 1140167
2176.7783A140293J27%J26j26j012J391J26%Tj26%j27%j26%j26%j27%A140167
$$ 1140293 1140420 1140420 1140546 1140420 1139408 1140799 1140925 1140925 1140925 1140799 1140799 1140672 1140672 1140546 1140546 1140420 1140420 1140293 1140293 1140167
2155.6982A140167j27%j26%j26%j27%j26%j27%j26%j26%j27j26Tj27j26A138397
$$ 1140167 1140040 1140040 1139914 1139914 1139788 1139788 1139661 1139661 1139535 1139535 1139408 1139408 1139282 1139282 1139156 1139156 1139029 1138903 1138777 1138650 1138524 1138397
2132.6106A138271j26q85p58p59p58q85p58p59p58Tp59p58o32p58p59A126643
$$ 1138271 1138145 1137260 1136502 1135743 1134985 1134100 1133342 1132583 1131825 1131067 1130308 1129550 1128918 1128160 1127401 1126643
2115.5457A126011p58p59p58o32Tl79Tn06l79UK53N05N06O32N05N06N05A123989
$$ 1126011 1125253 1124494 1123736 1123104 1122472 1122093 1121714 1121208 1120829 1120450 1120071 1120324 1120829 1121335 1121967 1122472 1122978 1123483 1123989
2095.4695A124621O32VN05O32XN05O32TN06N05N06TL79N05N06N05N06A138145
$$ 1124621 1125253 1125885 1126517 1127149 1127654 1128286 1128918 1129550 1130182 1130814 1131446 1131951 1132583 1133215 1133721 1134226 1134732 1135238 1135617 1136122 1136628 1137133 1137639 1138145
2070.3743A138524N05L79L80K52L80K52L80L79K53L79K52L80L79%UJ26A143200
$$ 1138524 1139029 1139408 1139788 1140040 1140420 1140672 1141052 1141431 1141684 1142063 1142315 1142695 1143074 1143074 1143074 1143074 1143200 1143200
2051.3018A143200%J27%VJ26%VJ26%S3j26%Tj26j27j26j27j26Tj27%j26A142315
$$ 1143200 1143200 1143327 1143327 1143327 1143327 1143327 1143453 1143453 1143453 1143453 1143453 1143579 1143579 1143579 1143579 1143579 1143579 1143579 1143579 1143579 1143579 1143579 1143579 1143579 1143579 1143453 1143453 1143453 1143327 1143200 1143074 1142947 1142821 1142695 1142568 1142568 1142442 1142315
2012.1531A142189j26j27L79O32TP59P58TO32P59P58TP59O32P58N06O32A152553
$$ 1142189 1142063 1141936 1142315 1142947 1143579 1144338 1145096 1145854 1146486 1147245 1148003 1148761 1149520 1150152 1150910 1151416 1152048 1152553
1993.0807A153059J26n06p58l79Un06o32n05o32Tl80l79Wk53Vj26k53A143959
$$ 1153059 1153185 1152679 1151921 1151542 1151163 1150784 1150278 1149646 1149141 1148509 1147877 1147497 1147118 1146739 1146360 1145981 1145602 1145349 1145096 1144843 1144590 1144464 1144211 1143959
1967.9854A143706n06l79n06n05n06l79Tk53l79k53l79k53l79k53l79A137639
$$ 1143706 1143200 1142821 1142315 1141810 1141304 1140925 1140546 1140293 1139914 1139661 1139282 1139029 1138650 1138397 1138018 1137639
1950.9205A136881l286q089j4283r858j643Q85L665N940O446O699M803A130814
$$ 1136881 1133595 1125506 1111223 1101365 1099722 1100607 1104272 1110212 1116658 1123357 1128160 1130814
1937.871A132204O32J27J26K53J26J27J26TJ27J26TJ27J26%J27J26TJ27A135111
$$ 1132204 1132836 1132963 1133089 1133342 1133468 1133595 1133721 1133847 1133974 1134100 1134226 1134353 1134479 1134479 1134606 1134732 1134858 1134985 1135111
1917.7947A135238%TJ26T%J27%S5J26%Tj26j27j26Tj27j26j27j26Tj27A134353
$$ 1135238 1135238 1135238 1135364 1135490 1135490 1135617 1135617 1135617 1135617 1135617 1135617 1135617 1135617 1135617 1135617 1135617 1135617 1135617 1135617 1135617 1135617 1135743 1135743 1135743 1135617 1135490 1135364 1135238 1135111 1134985 1134858 1134732 1134606 1134479 1134353
1881.6575A134226j26TJ390P58k527j27j26j27j26T%j27j26%j27%j26A132331
$$ 1134226 1134100 1133974 1135364 1136122 1133595 1133468 1133342 1133215 1133089 1132963 1132963 1132836 1132710 1132710 1132583 1132583 1132457 1132331
1862.585A132331j27j26%j27%j26%j26%j27j26Tk53Tj26k53Vk52k53A128792
$$ 1132331 1132204 1132078 1132078 1131951 1131951 1131825 1131825 1131699 1131699 1131572 1131446 1131320 1131067 1130814 1130688 1130435 1130182 1129929 1129676 1129424 1129171 1128792
1839.4973A128413j138k907Ul033l792m171l286k907k022j770j769j643A092897
$$ 1128413 1127275 1124368 1121461 1118554 1115521 1111729 1107558 1104272 1101365 1099343 1097573 1095804 1094161 1092897
1824.4402A092644J26N06j011L79P58K149TK148J896VJ769J896TJ769A115900
$$ 1092644 1092770 1093276 1092265 1092644 1093402 1095551 1097700 1099848 1101744 1103640 1105536 1107432 1109201 1111097 1112993 1114762 1115900
1806.3715A117037J264J138J137J138J264J137J138J137J264J138J011A130435
$$ 1117037 1118301 1119439 1120576 1121714 1122978 1124115 1125253 1126390 1127654 1128792 1129803 1130435
1793.3219A130940O32N06N05O32N06O32N05O32N06L79J27J26TJ27%J26A137133
$$ 1130940 1131572 1132078 1132583 1133215 1133721 1134353 1134858 1135490 1135996 1136375 1136502 1136628 1136754 1136881 1136881 1137007 1137133
1775.2533A137260J26%J27J26j26k53Uk52k53Ul79k53Tk52k53Uk52k53A133089
$$ 1137260 1137386 1137386 1137513 1137639 1137513 1137260 1137007 1136754 1136502 1136249 1135996 1135743 1135364 1135111 1134858 1134606 1134353 1134100 1133847 1133595 1133342 1133089
1752.1656A132963k53Vk52j27k52k53Uj26k53Tj26K654l160k53k52k53A128286
$$ 1132963 1132710 1132457 1132204 1131951 1131699 1131572 1131320 1131067 1130814 1130561 1130435 1130182 1129929 1129803 1132457 1129297 1129044 1128792 1128539 1128286
1731.0856A128160k53Uk52j27k53k52k53Uk52k53Vk52j27k53k52k53Uk52A122346
$$ 1128160 1127907 1127654 1127401 1127149 1127022 1126769 1126517 1126264 1126011 1125758 1125506 1125253 1125000 1124747 1124494 1124242 1124115 1123862 1123610 1123357 1123104 1122851 1122599 1122346
1705.9902A122093k53l79k53k52l80k52l80l79k53l79k53l79Tk53l79A117037
$$ 1122093 1121840 1121461 1121208 1120956 1120576 1120324 1119944 1119565 1119312 1118933 1118680 1118301 1117922 1117669 1117290 1117037
1688.9254A116658l79p58q85p58q85Tp58q85Tj769k022k149k022k149A097321
$$ 1116658 1116279 1115521 1114636 1113878 1112993 1112108 1111350 1110465 1109580 1107811 1105789 1103640 1101618 1099469 1097321
1672.8644A095172k149k148k023k148k023k022Tj769j644j769j390j138A071663
$$ 1095172 1093023 1090875 1088852 1086704 1084681 1082659 1080637 1078868 1077224 1075455 1074065 1072927 1071663
1658.811A070526j138j264j137j138j011n05K52N06J011J390J517J390A071790
$$ 1070526 1069388 1068124 1066987 1065849 1064838 1064333 1064585 1065091 1066102 1067492 1069009 1070399 1071790
1644.7577A073180J390J391J390UJ138J011VJ012J011YJ012J137J011A097573
$$ 1073180 1074570 1075961 1077351 1078741 1080131 1081269 1082280 1083291 1084302 1085313 1086325 1087336 1088347 1089358 1090369 1091380 1092391 1093402 1094414 1095551 1096562 1097573
1621.6699A098711J011UJ138J011TJ137J012Q84O32UP59O31O32VL79%A114130
$$ 1098711 1099722 1100733 1101744 1102882 1103893 1104904 1106041 1107053 1107937 1108569 1109201 1109833 1110592 1111223 1111855 1112487 1113119 1113751 1114130 1114130 1114130
1599.586A114004%j26%j27%j26%j27j26%j26L665j643k275j26j27%j26A112487
$$ 1114004 1114004 1113878 1113878 1113751 1113751 1113625 1113625 1113498 1113372 1113372 1113246 1116911 1115268 1112993 1112867 1112740 1112740 1112614 1112487
1579.5099A112361j26k53j27k52k53j27k52j27k52j27k53k52l80l79Wl80A106926
$$ 1112361 1112235 1111982 1111855 1111603 1111350 1111223 1110971 1110844 1110592 1110465 1110212 1109960 1109580 1109201 1108822 1108443 1108064 1107685 1107305 1106926
1558.4298A106547l79n06o32q84q85p58q85Uj137j390j391j264j390Tj391A088852
$$ 1106547 1106168 1105662 1105030 1104146 1103261 1102503 1101618 1100733 1099848 1098711 1097321 1095930 1094666 1093276 1091886 1090495 1088852
1540.3612A086830k149k148k149j643j137j138j011j138j137j138j137A069767
$$ 1086830 1084681 1082533 1080384 1078741 1077604 1076466 1075455 1074317 1073180 1072042 1070905 1069767
1527.3116A068756j137j138j137j517j896k275Vk148k907l792l918m045A032103
$$ 1068756 1067619 1066481 1065344 1063827 1061931 1059656 1057381 1055106 1052831 1050683 1047776 1043984 1040066 1036021 1032103
1511.2506A028185m424n182Tn308n182Tn308n182Tn309n182n308n561I51593
$$ 1028185 1023761 1018579 1013397 1008089 1002907 997725 992417 987235 982053 976744 971562 966254 960693 951593
1496.1934I38322j3271j2008r858r479r606r732r985j0111j1249j6936H06496
$$ 938322 925051 913043 903185 893706 884100 874368 864383 854272 843023 826087 806496
1484.1477G92846j2007r858r606q468o446o699k0096m2972m0698Tm0697E13777
$$ 792846 780839 770981 761375 752907 746461 739762 719666 676694 635996 595298 554601 513777
1471.0981D73079l2482r859J264Q468K7427L3746UL3873L3746L3747L3872G38119
$$ 473079 440597 430738 432002 440470 467897 501643 535389 569135 603008 636754 670501 704373 738119
1457.0447G71866K9448J5167N688L160K654K780K655K780K654K655K780H46689
$$ 771866 801314 816481 822169 825329 827983 830763 833418 836198 838852 841507 844287 846689
1443.9951H48458J390J138O32K53L79N05J391J643K148L539TJ896TK907H75885
$$ 848458 849848 850986 851618 851871 852250 852755 854146 855789 857937 861476 865015 866911 868807 871714 875885
1427.9342H73736N06j643k528Tk654m297n814n688n814n688o825j1122H08266
$$ 873736 874242 872599 870071 867543 864889 860592 854778 849090 843276 837588 830763 819641 808266
1413.8807G96891j1754j3019j3144j2513q974q089p962p963q089q215F88827
$$ 796891 785137 772118 758974 746461 737487 729398 721436 713473 705384 697169 688827
1401.8351F80612q468r732j0364Uj0617j1502j1754j2007j1754j3019E40824
$$ 680612 672144 662412 652048 641684 631320 620703 609201 597447 585440 573686 560667 540824
1388.7855E14282l0334k4519l5263l7538l2988l2861l0840j7442j643B70096
$$ 514282 483948 459429 424166 386628 353640 320779 289939 272497 270854 270096
1377.7435B70096J896M171P710N182L412L918J517P58P59J26m044j9465B51769
$$ 270096 271992 276163 283873 289055 292467 296385 297902 298660 299419 299545 295501 276036 251769
1363.6902B27629k0096k149J391J5419L3114L2988UL2861L3115L2988D86223
$$ 227629 207533 205384 206775 222194 255308 288296 321284 354272 387133 420248 453236 486223
1350.6406E19211L2988L6274M6385L3747K6668J8327J0869J0870J0869G57078
$$ 519211 552199 588473 634858 668605 695273 713600 724469 735339 746208 757078
1339.5986G67947J0364Q595TQ720Q089P205P078P077P205O951O952O951H68807
$$ 767947 778311 786906 795501 804221 812310 819515 826593 833670 840875 847826 854778 861729 868807
1325.5453H76264P710P836P583O573N561UN435N308M677M297M171L412I52224
$$ 876264 883974 891810 899393 905966 911527 917088 922649 928084 933392 938069 942366 946537 949949 952224
1310.488I54499K402K275K401K023J137J138J137J264J138J137J138I72700
$$ 954499 956901 959176 961577 963600 964737 965875 967012 968276 969414 970551 971689 972700
1297.4385I73837J011TJ012J137J011TQ85N06N05L79N06L79N06N05L79I84833
$$ 973837 974848 975859 976871 978008 979019 980030 980915 981421 981926 982305 982811 983190 983696 984201 984580 984833
1280.3737I84960%J26%Tk53J27%j27k53l79n05n06o32j264Tj643l159I72068
$$ 984960 984960 985086 985086 985086 984833 984960 984960 984833 984580 984201 983696 983190 982558 981294 980030 978387 975228 972068
1261.3013I68908l665n182Tn056n561o952p709p837q341r100r101r100H77149
$$ 968908 965243 960061 954879 949823 944262 937310 929601 921764 913423 904323 895222 886122 877149
1247.2479H68428r227j1249j3902l3494q2659q8726m6385m6386m9165D46916
$$ 868428 859201 847952 834050 800556 717897 629171 582786 536400 487235 446916
1236.2059D47042p58J896Q468J7063TJ7062J7063J7189J7063J7062J4662E98079
$$ 447042 446284 448180 456648 473711 490774 507836 524899 542088 559151 576213 590875 598079
1223.1564F00480j26l79j896k907o952j6557l1092l1724Tl1597l1851C81951
$$ 600480 600354 599975 598079 595172 588220 571663 540571 508847 477123 445526 413675 381951
1210.1068C50354l1724l7285m4110k3003n182l666p58q85p58n06j137A99823
$$ 350354 318630 281345 237235 214232 209050 205384 204626 203741 202983 202477 201340 199823
1197.0573B01593%K52O32TP59O31J138J011J138J390J896TJ895K023J896B21057
$$ 201593 201593 201845 202477 203109 203868 204499 205637 206648 207786 209176 211072 212968 214863 216886 218782 221057
1179.9924B25101N435N561O193P836Q848Q847R606J0869J0743R480Q215C24823
$$ 225101 230536 236097 242290 250126 258974 267821 277427 288296 299039 308519 316734 324823
1166.9429C32912Q215R227J1628J2260J8073K5405J6936J7063J8453J9338E08595
$$ 332912 341127 350354 361982 374242 392315 417720 434656 451719 470172 489510 508595
1154.8971E27427J7189J3018J4408J5167J5041J5167J5040J5167UJ5040G08165
$$ 527427 544616 557634 572042 587209 602250 617417 632457 647624 662791 677958 692998 708165
1141.8475G23964K0348K6669K2244J3651J1880J1755J1248J0996J1249H76011
$$ 723964 744312 770981 793225 806876 818756 830511 841759 852755 864004 876011
1130.8057H89029J4282J1881N435L665K907J643VK023L159M298O572Q215I64990
$$ 889029 903311 915192 920627 924292 927199 928842 930485 932128 933771 935794 938953 943251 949823 958038 964990
1114.7446I71057N940TN435M297L918M045L792L286K907XK780K528K149A034757
$$ 971057 976997 982937 988372 992669 996587 1000632 1004424 1007710 1010617 1013524 1016431 1019338 1022245 1025152 1027932 1030460 1032609 1034757
1095.6722A037032K023K148K149TK148K149K148K149J896UJ895J896VJ769A072422
$$ 1037032 1039055 1041203 1043352 1045501 1047649 1049798 1051946 1054095 1055991 1057887 1059783 1061678 1063574 1065470 1067366 1069262 1071031 1072422
1076.5997A073812J390J391J263J391J390TJ391J263J138P58P59O32P58A089484
$$ 1073812 1075202 1076593 1077856 1079247 1080637 1082027 1083418 1084681 1085819 1086577 1087336 1087968 1088726 1089484
1061.5426A090116P59N05N06L79N05J391O32j770j26j27j26Tj27k52l80A091254
$$ 1090116 1090875 1091380 1091886 1092265 1092770 1094161 1094793 1093023 1092897 1092770 1092644 1092518 1092391 1092139 1091759 1091254
1044.4778A090748n05n06q85j390Tj391j516k022k275k402m044p331j0617A041962
$$ 1090748 1090243 1089737 1088852 1087462 1086072 1084681 1083165 1081143 1078868 1076466 1072422 1065091 1054474 1041962
1029.4205A030713q721j3145k4140k7048k7047k7048k7047k7048k7174G95248
$$ 1030713 1021992 1008847 984707 957659 930612 903564 876517 849469 822295 795248
1018.3786G69970j3650q85%J8832M4742M8028N7761M3352J0616J0238I97978
$$ 769970 756320 755435 755435 774267 819009 867037 924798 968150 978766 989004 997978
1006.3329A006193Q215Q216P710P330P457O446N182M677M803L918L159A076340
$$ 1006193 1014408 1022624 1030334 1037664 1045121 1051567 1056749 1061426 1066229 1070147 1073306 1076340
993.2833A079499K781K022J643TJ770J643UJ011N06N05L80N05N06n06A096941
$$ 1079499 1082280 1084302 1085945 1087588 1089358 1091001 1092644 1094287 1095298 1095804 1096309 1096689 1097194 1097700 1097194 1096941
976.2185A097573k52k53l79k53Tn06n05o32n06o32n05o32n06q84j138A088726
$$ 1097573 1097321 1097068 1096689 1096436 1096183 1095677 1095172 1094540 1094034 1093402 1092897 1092265 1091759 1090875 1089737 1088726
959.1537A087588j769k781k907k654k022Uk023k148k149k654l034l033A053463
$$ 1087588 1085819 1083038 1080131 1077477 1075455 1073433 1071411 1069388 1067240 1065091 1062437 1059403 1056370 1053463
944.0965A050430l034l159m045m676m803m677m676o446q847j5167k4141I43377
$$ 1050430 1047396 1044237 1040192 1035516 1030713 1026036 1021360 1014914 1006067 990900 966759 943377
931.04694I26062j5546j3777j1249j0743j2892o4206q7588o3954o4080E18074
$$ 926062 910516 896739 885490 874747 861855 797649 710061 646107 582027 518074
920.005D54120o4080m1456j3903q720r101p204n182l791j896j264j011B99039
$$ 454120 390040 348584 334681 325961 316860 309656 304474 300683 298787 297523 296512 299039
906.95544C09783J4787J4535J7063J5672J2007J1123J8705L0208M2088E34884
$$ 309783 324570 339105 356168 371840 383847 394970 413675 443883 485971 534884
895.9135E83670M8913TM8787M8913M3478K9702M3099L9055J8958J7063I85971
$$ 583670 632583 681496 730283 779196 822674 852376 895475 934530 953488 970551 985971
883.86774I98231R226Q721TQ089P457P331N434L539L286L160L286L160A072295
$$ 998231 1007457 1016178 1024899 1032988 1040445 1047776 1053210 1056749 1060035 1063195 1066481 1069641 1072295
869.8144A074191J896UJ769J517J264J390J264TJ137O32TN06N05N06A092897
$$ 1074191 1076087 1077983 1079879 1081648 1083165 1084429 1085819 1087083 1088347 1089484 1090116 1090748 1091254 1091759 1092265 1092897
852.7496A093402N06TL79VK53L79TK53Tj26k53Tj26J26l79n06k53k52A095298
$$ 1093402 1093908 1094414 1094793 1095172 1095551 1095930 1096183 1096562 1096941 1097194 1097447 1097321 1097068 1096815 1096689 1096815 1096436 1095930 1095677 1095425 1095298
830.66565A095046k53l79l80l79n05l80l79n05l79l80n05l79n06o32Up58A086451
$$ 1095046 1094793 1094414 1094034 1093655 1093150 1092770 1092391 1091886 1091507 1091127 1090622 1090243 1089737 1089105 1088473 1087841 1087083 1086451
811.59326A085819o32Vp58Tj012q84j011q85j011q85j011q85j011q85A071284
$$ 1085819 1085187 1084555 1083923 1083291 1082533 1081775 1080763 1079879 1078868 1077983 1076972 1076087 1075076 1074191 1073180 1072295 1071284
793.5246A070273j011Tj138j011Tj138j011Tj390Tj517Tj516j517j643A049924
$$ 1070273 1069262 1068251 1067113 1066102 1065091 1063953 1062942 1061931 1060541 1059151 1057634 1056117 1054601 1053084 1051441 1049924
776.4598A048407j516j770j769j770j895j770j769j770k022k528Tk654A021992
$$ 1048407 1046891 1045121 1043352 1041582 1039687 1037917 1036148 1034378 1032356 1029828 1027300 1024646 1021992
762.40643A019211l033k907Ul286l413l539l412m550o320j3018n8266H22169
$$ 1019211 1016178 1013271 1010364 1007457 1004171 1000758 997219 993807 989257 982937 969919 911653 822169
748.353G28514r3656m0444m045K1866M3225M7902WK7679J2892J5925I63600
$$ 728514 634858 594414 590369 612235 655460 703362 751264 799166 847068 894970 922649 935541 951466 963600
733.29584I72321Q089N182L412K401J264L80%j27%Tj264j516j138j137I86729
$$ 972321 980410 985592 989004 991405 992669 993049 993049 992922 992922 992922 991658 990142 989004 987867 986729
717.23486I85592j138j011j138j137j264j517j516j517Tj516j517Uj516I64737
$$ 985592 984454 983443 982305 981168 979904 978387 976871 975354 973837 972321 970804 969287 967770 966254 964737
701.1738I63220j390j643Uj770j643Vj769j643Tj644j769j643j390j138I34656
$$ 963220 961830 960187 958544 956901 955131 953488 951845 950202 948559 946790 945147 943504 941860 940091 938448 937058 935920 934656
682.1014I33392j264j263j138j264j390Tj391j264j390Tj770k780l160I09378
$$ 933392 932128 930865 929727 928463 927073 925683 924292 923028 921638 920248 918478 915698 912538 909378
667.04425I05966m171m550m424l918l539l413j895q85Tp58q85p58q85H74115
$$ 905966 901795 897245 892821 888903 885364 881951 880056 879171 878286 877528 876643 875885 875000 874115
651.98706H73357l79k53j26j27k53j26Tj27j26k53j26j27j26Tk53j27H69186
$$ 873357 872978 872725 872599 872472 872219 872093 871967 871840 871714 871461 871335 871208 871082 870956 870703 870576 869186
633.9184H70197O32J27J26TJ27J26TJ27J26J27J26TQ85UJ011Q84Q85H78539
$$ 870197 870829 870956 871082 871208 871335 871461 871587 871714 871840 871967 872093 872219 873104 873989 874874 875885 876769 877654 878539
613.84216H79550Q85TQ84J011Q85TJ011J264J769J770J896J769J896J769I00025
$$ 879550 880435 881320 882204 883215 884100 884985 885996 887260 889029 890799 892695 894464 896360 898129 900025
597.7811I01795J896J769J896J769J896J770J896J769K022K023K022I24545
$$ 901795 903691 905460 907356 909125 911021 912791 914687 916456 918478 920501 922523 924545
584.73157I26567K149K022TK023K148K022K023K022TK149K022TK023K022I57154
$$ 926567 928716 930738 932760 934783 936931 938953 940976 942998 945020 947169 949191 951213 953236 955258 957154
568.6706I59176K022TJ896K023J895K023J643S0J770J643VJ264J138I99368
$$ 959176 961198 963220 965116 967139 969034 971057 972700 974343 975986 977629 979272 980915 982558 984201 985844 987487 989257 990900 992543 994186 995829 997093 998231 999368
543.57526A000379J138J137J138J011J137J138J137J011J138TJ137J011A014788
$$ 1000379 1001517 1002654 1003792 1004803 1005940 1007078 1008215 1009226 1010364 1011502 1012639 1013650 1014788
529.5219A015799Q85Q84Q85TQ84P59Q85Q84Q85TQ84O32P59P58O32P58A029575
$$ 1015799 1016684 1017568 1018453 1019338 1020222 1020981 1021866 1022750 1023635 1024520 1025404 1026036 1026795 1027553 1028185 1028943 1029575
511.45328A030334O32P58O32P58O32P59N05L79J27K52J27J26K53J26J27A036021
$$ 1030334 1030966 1031724 1032356 1033114 1033746 1034505 1035010 1035389 1035516 1035768 1035895 1036021 1036274 1036400 1036527 1036021
494.38846A036527k53n06l79n05n06p58j390j517Uj516j517Tj516k528A016052
$$ 1036527 1036274 1035768 1035389 1034884 1034378 1033620 1032230 1030713 1029196 1027679 1026163 1024646 1023129 1021613 1019085 1016052
477.32364A013018l160l033Tm424n056n182n055m297l666l160j895j770I67518
$$ 1013018 1009858 1006825 1003792 999368 994312 989130 984075 979778 976112 972952 971057 969287 967518
463.27026I65875o32k528J264L79J011K149K401K402K275L665L918M044I90268
$$ 965875 965243 962715 963979 964358 965369 967518 969919 972321 974596 978261 982179 986223 990268
449.2169I94312M045L792L665TL666K780K402K275J895J012J011Q84A026289
$$ 994312 998357 1002149 1005814 1009479 1013145 1015925 1018327 1020602 1022497 1023509 1024520 1025404 1026289
435.1635A029196j769%K52o31j644m297p457q215o699o193p710l286I80536
$$ 1029196 1027427 1027427 1027679 1027048 1025404 1021107 1013650 1005435 998736 992543 984833 981547 980536
421.11014I80410j517M297P710J0869J1755O319N688N561M929TM298K780A050430
$$ 980410 978893 983190 990900 1001769 1013524 1019843 1025531 1031092 1036021 1040950 1045248 1048028 1050430
407.05676A051441Q85P58O32N05L80J011J137J138J137J643K402K401A072042
$$ 1051441 1052326 1053084 1053716 1054221 1054601 1055612 1056749 1057887 1059024 1060667 1063069 1065470 1072042
393.0034A092139L286O32N05n05j264n561n941n814j264q84p59p58J26A074191
$$ 1092139 1095425 1096057 1096562 1096057 1094793 1089232 1083291 1077477 1076213 1075329 1074570 1073812 1073938 1074191
377.9462A074570K53TL79K53N05O32TP59O32P58L79K53N05%o32n05p58A077604
$$ 1074570 1074823 1075076 1075455 1075708 1076213 1076845 1077477 1078236 1078868 1079626 1080005 1080258 1080763 1080763 1080131 1079626 1078868 1077604
358.87375A076340j138j264Tj137j390j517j390j517j390j517j011o32A060541
$$ 1076340 1075202 1073938 1072674 1071537 1070147 1068630 1067240 1065723 1064333 1062816 1061805 1061173 1060541
344.82037A059909p58o32n06l79Tk53l79J390J770J769K401K781K907A072422
$$ 1059909 1059151 1058519 1058013 1057634 1057255 1057002 1056623 1058013 1059783 1061552 1063953 1066734 1069641 1072422
329.76318A074317J770J769J770J769J264P59P58Q85P58TO32K53L79K53A088220
$$ 1074317 1076087 1077856 1079626 1081395 1082659 1083418 1084176 1085061 1085819 1086577 1087209 1087462 1087841 1088094 1088220
313.7022A087968k53j27k52l79l80l79Vp59p58q85p58Tq85j770j895A074570
$$ 1087968 1087715 1087588 1087336 1086957 1086577 1086198 1085819 1085440 1085061 1084302 1083544 1082659 1081901 1081143 1080258 1078488 1076593 1074570
294.62976A072548k022j896k022k402k401k402k401Tk528k907Tl034k906A037412
$$ 1072548 1070526 1068630 1066608 1064206 1061805 1059403 1057002 1054601 1052073 1049166 1046259 1043225 1040319 1037412
279.57257A034378l033k907l034l412l665l792l918l792l665l792l665I92417
$$ 1034378 1031345 1028438 1025404 1021992 1018327 1014535 1010617 1006825 1003160 999368 995703 992417
266.523I89004l412l413Tl412l413l286l160l286l159l287l159l792I44894
$$ 989004 985592 982179 978766 975354 971941 968655 965495 962209 959050 955763 952604 948812 944894
252.46962I42113I39333
$$ 942113 939333
250.462I35667  $$checkpoint
##END=   $$end of t-butyl alcohol
##TITLE= t-butyl chloride
##JCAMP-DX= 5.01
##DATA TYPE= INFRARED SPECTRUM
##DATA CLASS= XYDATA
##ORIGIN= Department of Chemistry, UWI, Jamaica
##OWNER= public domain
##BLOCK ID=2
##LONGDATE= 2012/03/22 15:38:25.0156 -0500 $$ export date from JSpecView
##SPECTROMETER/DATA SYSTEM= NIST converted file
##$MODELS=
<Models>
<ModelData id="chloro" type="MOL">
t-butyl chloride
__Jmol-14_03191513173D 1   1.00000     0.00000     0
Jmol version 14.3.13_2015.03.13  2015-03-14 09:36 EXTRACT: ({0:13})
 14 13  0  0  0  0              1 V2000
   0.00000   0.00000  -0.29940 C   0  0  0  0  0  0
   0.00000   1.45193  -0.81273 C   0  0  0  0  0  0
   0.88998   1.62321  -1.41829 H   0  0  0  0  0  0
  -0.88998   1.62321  -1.41829 H   0  0  0  0  0  0
   0.00000   2.13703   0.03504 H   0  0  0  0  0  0
   1.25741  -0.72596  -0.81273 C   0  0  0  0  0  0
   1.85073  -0.04086  -1.41829 H   0  0  0  0  0  0
   1.85073  -1.06852   0.03504 H   0  0  0  0  0  0
   0.96074  -1.58235  -1.41829 H   0  0  0  0  0  0
  -1.25741  -0.72596  -0.81273 C   0  0  0  0  0  0
  -1.85073  -0.04086  -1.41829 H   0  0  0  0  0  0
  -0.96074  -1.58235  -1.41829 H   0  0  0  0  0  0
  -1.85073  -1.06852   0.03504 H   0  0  0  0  0  0
   0.00000   0.00000   1.46060 Cl  0  0  0  0  0  0
  1  2  1  0  0  0
  1  6  1  0  0  0
  1 14  1  0  0  0
  2  3  1  0  0  0
  2  5  1  0  0  0
  4  2  1  0  0  0
  6  7  1  0  0  0
  6  8  1  0  0  0
  9  6  1  0  0  0
 10 12  1  0  0  0
 10  1  1  0  0  0
 11 10  1  0  0  0
 13 10  1  0  0  0
M  END

</ModelData>
<ModelData id="2cl" type="XYZVIB" baseModel="chloro" vibrationScale=".4">
14
Model[1]: PATH=Calculation 1;Input;Convg=0.6273D-08;-V/T=0.9991;Energy=NaN;E(RPM3)=-0.493533992182E-01 A.U.;Range=M.O.s;PATH=Calculation 1;Input
C       0.00000      0.00000      0.00000
C       0.00000      0.00000      1.54000
H       1.02766      0.00000      1.90333
H      -0.51383      0.88998      1.90333
H      -0.51383     -0.88998      1.90333
C       1.45193      0.00000     -0.51333
H       2.13703      0.00000      0.33444
H       1.62320     -0.88998     -1.11889
H       1.62320      0.88998     -1.11889
C      -0.72596      1.25741     -0.51333
H      -1.06852      1.85073      0.33444
H      -0.04086      1.85073     -1.11889
H      -1.58235      0.96074     -1.11889
Cl     -0.82967     -1.43703     -0.58667
14
Model[2]: PATH=Calculation 1;Standard;Convg=0.6273D-08;-V/T=0.9991;Energy=-0.049353402;E(RPM3)=-0.493533992182E-01 A.U.;Range=M.O.s;PATH=Calculation 1;Standard
C       0.00000      0.00000     -0.29940
C       0.00000      1.45193     -0.81273
H       0.88998      1.62320     -1.41829
H      -0.88998      1.62320     -1.41829
H       0.00000      2.13703      0.03504
C       1.25741     -0.72596     -0.81273
H       1.85073     -0.04086     -1.41829
H       1.85073     -1.06852      0.03504
H       0.96074     -1.58235     -1.41829
C      -1.25741     -0.72596     -0.81273
H      -1.85073     -0.04086     -1.41829
H      -0.96074     -1.58235     -1.41829
H      -1.85073     -1.06852      0.03504
Cl      0.00000      0.00000      1.46060
14
Model[3]: IRIntensity=0.0604 KM/Mole;PATH=Calculation 1;FrequenciesFrequencies;ReducedMass=1.0295 AMU;ForceConstant=0.0384 mDyne/A;FreqValue=-251.5028;Frequency=-251.5028 cm^-1;FrequencyLabel=E;PATH=Calculation 1;FrequenciesFrequencies
C       0.00000      0.00000     -0.29940      0.00000      0.00000      0.00000
C       0.00000      1.45193     -0.81273     -0.01000      0.01000      0.02000
H       0.88998      1.62320     -1.41829      0.11000      0.09000      0.20001
H      -0.88998      1.62320     -1.41829      0.11000     -0.06000     -0.18001
H       0.00000      2.13703      0.03504     -0.24000      0.00000      0.02000
C       1.25741     -0.72596     -0.81273     -0.01000      0.01000     -0.02000
H       1.85073     -0.04086     -1.41829     -0.13000     -0.05000     -0.20001
H       1.85073     -1.06852      0.03504      0.12000      0.21000     -0.02000
H       0.96074     -1.58235     -1.41829     -0.01000     -0.13000      0.18001
C      -1.25741     -0.72596     -0.81273     -0.01000      0.01000      0.00000
H      -1.85073     -0.04086     -1.41829      0.23001     -0.12000     -0.38000
H      -0.96074     -1.58235     -1.41829     -0.01000     -0.26000      0.38000
H      -1.85073     -1.06852      0.03504     -0.24000      0.42000      0.00000
Cl      0.00000      0.00000      1.46060      0.01000     -0.02000      0.00000
14
Model[4]: IRIntensity=0.0604 KM/Mole;PATH=Calculation 1;FrequenciesFrequencies;ReducedMass=1.0295 AMU;ForceConstant=0.0384 mDyne/A;FreqValue=-251.5028;Frequency=-251.5028 cm^-1;FrequencyLabel=E;PATH=Calculation 1;FrequenciesFrequencies
C       0.00000      0.00000     -0.29940      0.00000      0.00000      0.00000
C       0.00000      1.45193     -0.81273      0.01000      0.01000      0.01000
H       0.88998      1.62320     -1.41829     -0.19000     -0.12000     -0.32000
H      -0.88998      1.62320     -1.41829     -0.19000      0.13000      0.34000
H       0.00000      2.13703      0.03504      0.42000      0.00000      0.01000
C       1.25741     -0.72596     -0.81273      0.01000      0.01000      0.01000
H       1.85073     -0.04086     -1.41829     -0.20001     -0.11000     -0.32000
H       1.85073     -1.06852      0.03504      0.21000      0.36001      0.01000
H       0.96074     -1.58235     -1.41829      0.02000     -0.23001      0.34000
C      -1.25741     -0.72596     -0.81273      0.01000      0.01000     -0.02000
H      -1.85073     -0.04086     -1.41829      0.01000      0.01000     -0.02000
H      -0.96074     -1.58235     -1.41829      0.02000      0.01000     -0.02000
H      -1.85073     -1.06852      0.03504      0.00000      0.00000     -0.02000
Cl      0.00000      0.00000      1.46060     -0.02000     -0.01000      0.00000
14
Model[5]: IRIntensity=0.0000 KM/Mole;PATH=Calculation 1;FrequenciesFrequencies;ReducedMass=1.0149 AMU;ForceConstant=0.0267 mDyne/A;FreqValue=-211.3326;Frequency=-211.3326 cm^-1;FrequencyLabel=A2;PATH=Calculation 1;FrequenciesFrequencies
C       0.00000      0.00000     -0.29940      0.00000      0.00000      0.00000
C       0.00000      1.45193     -0.81273      0.01000      0.00000      0.00000
H       0.88998      1.62320     -1.41829      0.18001      0.09000      0.27001
H      -0.88998      1.62320     -1.41829      0.18001     -0.09000     -0.27001
H       0.00000      2.13703      0.03504     -0.32000      0.00000      0.00000
C       1.25741     -0.72596     -0.81273     -0.01000     -0.01000      0.00000
H       1.85073     -0.04086     -1.41829     -0.17000     -0.11000     -0.27001
H       1.85073     -1.06852      0.03504      0.16000      0.28000      0.00000
H       0.96074     -1.58235     -1.41829     -0.01000     -0.20001      0.27001
C      -1.25741     -0.72596     -0.81273     -0.01000      0.01000      0.00000
H      -1.85073     -0.04086     -1.41829     -0.17000      0.11000      0.27001
H      -0.96074     -1.58235     -1.41829     -0.01000      0.20001     -0.27001
H      -1.85073     -1.06852      0.03504      0.16000     -0.28000      0.00000
Cl      0.00000      0.00000      1.46060      0.00000      0.00000      0.00000
14
Model[6]: IRIntensity=0.7578 KM/Mole;PATH=Calculation 1;FrequenciesFrequencies;ReducedMass=3.2751 AMU;ForceConstant=0.1931 mDyne/A;FreqValue=316.3617;Frequency=316.3617 cm^-1;FrequencyLabel=E;PATH=Calculation 1;FrequenciesFrequencies
C       0.00000      0.00000     -0.29940      0.04000     -0.07000      0.00000
C       0.00000      1.45193     -0.81273      0.09000      0.01000      0.23001
H       0.88998      1.62320     -1.41829      0.11000      0.09000      0.29000
H      -0.88998      1.62320     -1.41829      0.10000      0.15001      0.26000
H       0.00000      2.13703      0.03504      0.10000     -0.12000      0.34000
C       1.25741     -0.72596     -0.81273     -0.05000     -0.07000     -0.23001
H       1.85073     -0.04086     -1.41829     -0.14000     -0.05000     -0.29000
H       1.85073     -1.06852      0.03504      0.05000     -0.15001     -0.34000
H       0.96074     -1.58235     -1.41829     -0.19000     -0.01000     -0.26000
C      -1.25741     -0.72596     -0.81273      0.09000     -0.15001      0.00000
H      -1.85073     -0.04086     -1.41829      0.05000     -0.21000     -0.03000
H      -0.96074     -1.58235     -1.41829      0.16000     -0.15001      0.03000
H      -1.85073     -1.06852      0.03504      0.10000     -0.18001      0.00000
Cl      0.00000      0.00000      1.46060     -0.07000      0.11000      0.00000
14
Model[7]: IRIntensity=0.7578 KM/Mole;PATH=Calculation 1;FrequenciesFrequencies;ReducedMass=3.2751 AMU;ForceConstant=0.1931 mDyne/A;FreqValue=316.3617;Frequency=316.3617 cm^-1;FrequencyLabel=E;PATH=Calculation 1;FrequenciesFrequencies
C       0.00000      0.00000     -0.29940      0.07000      0.04000      0.00000
C       0.00000      1.45193     -0.81273      0.15001      0.00000     -0.13000
H       0.88998      1.62320     -1.41829      0.18001     -0.12000     -0.13000
H      -0.88998      1.62320     -1.41829      0.19000     -0.02000     -0.19000
H       0.00000      2.13703      0.03504      0.18001      0.07000     -0.20001
C       1.25741     -0.72596     -0.81273      0.07000      0.13000     -0.13000
H       1.85073     -0.04086     -1.41829     -0.02000      0.22000     -0.13000
H       1.85073     -1.06852      0.03504      0.15001      0.12000     -0.20001
H       0.96074     -1.58235     -1.41829      0.08000      0.17000     -0.19000
C      -1.25741     -0.72596     -0.81273     -0.01000      0.00000      0.26000
H      -1.85073     -0.04086     -1.41829     -0.13000     -0.07000      0.31000
H      -0.96074     -1.58235     -1.41829     -0.12000     -0.07000      0.31000
H      -1.85073     -1.06852      0.03504      0.12000      0.07000      0.39000
Cl      0.00000      0.00000      1.46060     -0.11000     -0.07000      0.00000
14
Model[8]: IRIntensity=0.7670 KM/Mole;PATH=Calculation 1;FrequenciesFrequencies;ReducedMass=3.5191 AMU;ForceConstant=0.3369 mDyne/A;FreqValue=403.1107;Frequency=403.1107 cm^-1;FrequencyLabel=A1;PATH=Calculation 1;FrequenciesFrequencies
C       0.00000      0.00000     -0.29940      0.00000      0.00000     -0.07000
C       0.00000      1.45193     -0.81273      0.00000      0.08000      0.16000
H       0.88998      1.62320     -1.41829      0.01000      0.22000      0.22000
H      -0.88998      1.62320     -1.41829     -0.01000      0.22000      0.22000
H       0.00000      2.13703      0.03504      0.00000     -0.08000      0.30001
C       1.25741     -0.72596     -0.81273      0.07000     -0.04000      0.16000
H       1.85073     -0.04086     -1.41829      0.19000     -0.10000      0.22000
H       1.85073     -1.06852      0.03504     -0.07000      0.04000      0.30001
H       0.96074     -1.58235     -1.41829      0.18001     -0.11000      0.22000
C      -1.25741     -0.72596     -0.81273     -0.07000     -0.04000      0.16000
H      -1.85073     -0.04086     -1.41829     -0.19000     -0.10000      0.22000
H      -0.96074     -1.58235     -1.41829     -0.18001     -0.11000      0.22000
H      -1.85073     -1.06852      0.03504      0.07000      0.04000      0.30001
Cl      0.00000      0.00000      1.46060      0.00000      0.00000     -0.20001
14
Model[9]: IRIntensity=0.0046 KM/Mole;PATH=Calculation 1;FrequenciesFrequencies;ReducedMass=2.4608 AMU;ForceConstant=0.2769 mDyne/A;FreqValue=436.9880;Frequency=436.9880 cm^-1;FrequencyLabel=E;PATH=Calculation 1;FrequenciesFrequencies
C       0.00000      0.00000     -0.29940      0.16000      0.09000      0.00000
C       0.00000      1.45193     -0.81273     -0.14000      0.09000     -0.04000
H       0.88998      1.62320     -1.41829     -0.27001      0.32000     -0.14000
H      -0.88998      1.62320     -1.41829     -0.27001     -0.18001      0.06000
H       0.00000      2.13703      0.03504     -0.28000      0.10000     -0.05000
C       1.25741     -0.72596     -0.81273      0.01000     -0.16000     -0.04000
H       1.85073     -0.04086     -1.41829      0.14000     -0.39000     -0.14000
H       1.85073     -1.06852      0.03504     -0.05000     -0.29000     -0.05000
H       0.96074     -1.58235     -1.41829     -0.28000     -0.14000      0.06000
C      -1.25741     -0.72596     -0.81273      0.15001      0.09000      0.07000
H      -1.85073     -0.04086     -1.41829      0.12000      0.07000      0.08000
H      -0.96074     -1.58235     -1.41829      0.12000      0.07000      0.08000
H      -1.85073     -1.06852      0.03504      0.17000      0.10000      0.10000
Cl      0.00000      0.00000      1.46060     -0.05000     -0.03000      0.00000
14
Model[10]: IRIntensity=0.0046 KM/Mole;PATH=Calculation 1;FrequenciesFrequencies;ReducedMass=2.4608 AMU;ForceConstant=0.2769 mDyne/A;FreqValue=436.9880;Frequency=436.9880 cm^-1;FrequencyLabel=E;PATH=Calculation 1;FrequenciesFrequencies
C       0.00000      0.00000     -0.29940     -0.09000      0.16000      0.00000
C       0.00000      1.45193     -0.81273      0.08000      0.15001     -0.06000
H       0.88998      1.62320     -1.41829      0.15001     -0.02000     -0.01000
H      -0.88998      1.62320     -1.41829      0.16000      0.26000     -0.13000
H       0.00000      2.13703      0.03504      0.16000      0.17000     -0.08000
C       1.25741     -0.72596     -0.81273     -0.17000      0.01000      0.06000
H       1.85073     -0.04086     -1.41829     -0.06000     -0.14000      0.01000
H       1.85073     -1.06852      0.03504     -0.23001     -0.05000      0.08000
H       0.96074     -1.58235     -1.41829     -0.31000     -0.01000      0.13000
C      -1.25741     -0.72596     -0.81273      0.08000     -0.14000      0.00000
H      -1.85073     -0.04086     -1.41829     -0.09000     -0.41000     -0.11000
H      -0.96074     -1.58235     -1.41829      0.40000     -0.13000      0.11000
H      -1.85073     -1.06852      0.03504      0.16000     -0.28000      0.00000
Cl      0.00000      0.00000      1.46060      0.03000     -0.05000      0.00000
14
Model[11]: IRIntensity=13.3256 KM/Mole;PATH=Calculation 1;FrequenciesFrequencies;ReducedMass=2.9935 AMU;ForceConstant=0.6296 mDyne/A;FreqValue=597.4707;Frequency=597.4707 cm^-1;FrequencyLabel=A1;PATH=Calculation 1;FrequenciesFrequencies
C       0.00000      0.00000     -0.29940      0.00000      0.00000      0.31000
C       0.00000      1.45193     -0.81273      0.00000     -0.09000      0.05000
H       0.88998      1.62320     -1.41829      0.00000     -0.33001     -0.04000
H      -0.88998      1.62320     -1.41829      0.00000     -0.33001     -0.04000
H       0.00000      2.13703      0.03504      0.00000      0.18001     -0.19000
C       1.25741     -0.72596     -0.81273     -0.08000      0.05000      0.05000
H       1.85073     -0.04086     -1.41829     -0.29000      0.16000     -0.04000
H       1.85073     -1.06852      0.03504      0.16000     -0.09000     -0.19000
H       0.96074     -1.58235     -1.41829     -0.28000      0.17000     -0.04000
C      -1.25741     -0.72596     -0.81273      0.08000      0.05000      0.05000
H      -1.85073     -0.04086     -1.41829      0.29000      0.16000     -0.04000
H      -0.96074     -1.58235     -1.41829      0.28000      0.17000     -0.04000
H      -1.85073     -1.06852      0.03504     -0.16000     -0.09000     -0.19000
Cl      0.00000      0.00000      1.46060      0.00000      0.00000     -0.13000
14
Model[12]: IRIntensity=0.0284 KM/Mole;PATH=Calculation 1;FrequenciesFrequencies;ReducedMass=2.6659 AMU;ForceConstant=1.2562 mDyne/A;FreqValue=894.2798;Frequency=894.2798 cm^-1;FrequencyLabel=A1;PATH=Calculation 1;FrequenciesFrequencies
C       0.00000      0.00000     -0.29940      0.00000      0.00000      0.11000
C       0.00000      1.45193     -0.81273      0.00000      0.21000     -0.01000
H       0.88998      1.62320     -1.41829     -0.01000      0.03000     -0.08000
H      -0.88998      1.62320     -1.41829      0.01000      0.03000     -0.08000
H       0.00000      2.13703      0.03504      0.00000      0.47000     -0.23001
C       1.25741     -0.72596     -0.81273      0.19000     -0.11000     -0.01000
H       1.85073     -0.04086     -1.41829      0.02000     -0.02000     -0.08000
H       1.85073     -1.06852      0.03504      0.40000     -0.23001     -0.23001
H       0.96074     -1.58235     -1.41829      0.03000      0.00000     -0.08000
C      -1.25741     -0.72596     -0.81273     -0.19000     -0.11000     -0.01000
H      -1.85073     -0.04086     -1.41829     -0.02000     -0.02000     -0.08000
H      -0.96074     -1.58235     -1.41829     -0.03000      0.00000     -0.08000
H      -1.85073     -1.06852      0.03504     -0.40000     -0.23001     -0.23001
Cl      0.00000      0.00000      1.46060      0.00000      0.00000      0.01000
14
Model[13]: IRIntensity=2.3375 KM/Mole;PATH=Calculation 1;FrequenciesFrequencies;ReducedMass=1.5697 AMU;ForceConstant=0.7900 mDyne/A;FreqValue=924.2441;Frequency=924.2441 cm^-1;FrequencyLabel=E;PATH=Calculation 1;FrequenciesFrequencies
C       0.00000      0.00000     -0.29940      0.06000      0.04000      0.00000
C       0.00000      1.45193     -0.81273      0.10000     -0.06000      0.02000
H       0.88998      1.62320     -1.41829     -0.11000      0.39000     -0.14000
H      -0.88998      1.62320     -1.41829     -0.10000     -0.47000      0.18001
H       0.00000      2.13703      0.03504     -0.12000     -0.05000      0.02000
C       1.25741     -0.72596     -0.81273      0.00000      0.12000      0.02000
H       1.85073     -0.04086     -1.41829      0.28000     -0.29000     -0.14000
H       1.85073     -1.06852      0.03504     -0.10000     -0.07000      0.02000
H       0.96074     -1.58235     -1.41829     -0.46001      0.15001      0.18001
C      -1.25741     -0.72596     -0.81273     -0.10000     -0.06000     -0.04000
H      -1.85073     -0.04086     -1.41829     -0.08000     -0.03000     -0.03000
H      -0.96074     -1.58235     -1.41829     -0.06000     -0.05000     -0.03000
H      -1.85073     -1.06852      0.03504     -0.09000     -0.05000     -0.03000
Cl      0.00000      0.00000      1.46060      0.00000      0.00000      0.00000
14
Model[14]: IRIntensity=2.3375 KM/Mole;PATH=Calculation 1;FrequenciesFrequencies;ReducedMass=1.5697 AMU;ForceConstant=0.7900 mDyne/A;FreqValue=924.2441;Frequency=924.2441 cm^-1;FrequencyLabel=E;PATH=Calculation 1;FrequenciesFrequencies
C       0.00000      0.00000     -0.29940     -0.04000      0.06000      0.00000
C       0.00000      1.45193     -0.81273     -0.06000     -0.10000      0.03000
H       0.88998      1.62320     -1.41829      0.05000     -0.32000      0.12000
H      -0.88998      1.62320     -1.41829      0.07000      0.18001     -0.07000
H       0.00000      2.13703      0.03504      0.07000     -0.09000      0.03000
C       1.25741     -0.72596     -0.81273      0.12000      0.00000     -0.03000
H       1.85073     -0.04086     -1.41829      0.25000     -0.20001     -0.12000
H       1.85073     -1.06852      0.03504      0.05000     -0.10000     -0.03000
H       0.96074     -1.58235     -1.41829     -0.19000      0.03000      0.07000
C      -1.25741     -0.72596     -0.81273     -0.06000      0.10000      0.00000
H      -1.85073     -0.04086     -1.41829     -0.37000     -0.35000     -0.19000
H      -0.96074     -1.58235     -1.41829      0.49001      0.14000      0.19000
H      -1.85073     -1.06852      0.03504      0.07000     -0.12000      0.00000
Cl      0.00000      0.00000      1.46060      0.00000      0.00000      0.00000
14
Model[15]: IRIntensity=0.1579 KM/Mole;PATH=Calculation 1;FrequenciesFrequencies;ReducedMass=1.2215 AMU;ForceConstant=0.7061 mDyne/A;FreqValue=990.5177;Frequency=990.5177 cm^-1;FrequencyLabel=E;PATH=Calculation 1;FrequenciesFrequencies
C       0.00000      0.00000     -0.29940      0.03000      0.02000      0.00000
C       0.00000      1.45193     -0.81273     -0.01000      0.00000      0.05000
H       0.88998      1.62320     -1.41829      0.00000     -0.23001     -0.01000
H      -0.88998      1.62320     -1.41829      0.02000     -0.16000     -0.03000
H       0.00000      2.13703      0.03504     -0.01000      0.25000     -0.15001
C       1.25741     -0.72596     -0.81273      0.00000     -0.01000      0.05000
H       1.85073     -0.04086     -1.41829     -0.20001      0.11000     -0.01000
H       1.85073     -1.06852      0.03504      0.21000     -0.13000     -0.15001
H       0.96074     -1.58235     -1.41829     -0.13000      0.09000     -0.03000
C      -1.25741     -0.72596     -0.81273      0.01000      0.00000     -0.11000
H      -1.85073     -0.04086     -1.41829     -0.35000     -0.18001      0.05000
H      -0.96074     -1.58235     -1.41829     -0.33001     -0.21000      0.05000
H      -1.85073     -1.06852      0.03504      0.43000      0.25000      0.31000
Cl      0.00000      0.00000      1.46060      0.00000      0.00000      0.00000
14
Model[16]: IRIntensity=0.1579 KM/Mole;PATH=Calculation 1;FrequenciesFrequencies;ReducedMass=1.2215 AMU;ForceConstant=0.7061 mDyne/A;FreqValue=990.5177;Frequency=990.5177 cm^-1;FrequencyLabel=E;PATH=Calculation 1;FrequenciesFrequencies
C       0.00000      0.00000     -0.29940     -0.02000      0.03000      0.00000
C       0.00000      1.45193     -0.81273      0.01000      0.01000      0.09000
H       0.88998      1.62320     -1.41829     -0.02000     -0.32000     -0.05000
H      -0.88998      1.62320     -1.41829      0.01000     -0.36001     -0.04000
H       0.00000      2.13703      0.03504      0.00000      0.43000     -0.27001
C       1.25741     -0.72596     -0.81273     -0.01000      0.00000     -0.09000
H       1.85073     -0.04086     -1.41829      0.29000     -0.14000      0.05000
H       1.85073     -1.06852      0.03504     -0.37000      0.21000      0.27001
H       0.96074     -1.58235     -1.41829      0.30001     -0.19000      0.04000
C      -1.25741     -0.72596     -0.81273      0.01000     -0.01000      0.00000
H      -1.85073     -0.04086     -1.41829      0.03000      0.03000      0.01000
H      -0.96074     -1.58235     -1.41829     -0.04000     -0.01000     -0.01000
H      -1.85073     -1.06852      0.03504      0.00000     -0.01000      0.00000
Cl      0.00000      0.00000      1.46060      0.00000      0.00000      0.00000
14
Model[17]: IRIntensity=0.0000 KM/Mole;PATH=Calculation 1;FrequenciesFrequencies;ReducedMass=1.1828 AMU;ForceConstant=0.7072 mDyne/A;FreqValue=1007.3944;Frequency=1007.3944 cm^-1;FrequencyLabel=A2;PATH=Calculation 1;FrequenciesFrequencies
C       0.00000      0.00000     -0.29940      0.00000      0.00000      0.00000
C       0.00000      1.45193     -0.81273     -0.07000      0.00000      0.00000
H       0.88998      1.62320     -1.41829      0.11000     -0.35000      0.15001
H      -0.88998      1.62320     -1.41829      0.11000      0.35000     -0.15001
H       0.00000      2.13703      0.03504      0.14000      0.00000      0.00000
C       1.25741     -0.72596     -0.81273      0.04000      0.06000      0.00000
H       1.85073     -0.04086     -1.41829      0.25000     -0.27001     -0.15001
H       1.85073     -1.06852      0.03504     -0.07000     -0.12000      0.00000
H       0.96074     -1.58235     -1.41829     -0.36001      0.08000      0.15001
C      -1.25741     -0.72596     -0.81273      0.04000     -0.06000      0.00000
H      -1.85073     -0.04086     -1.41829      0.25000      0.27001      0.15001
H      -0.96074     -1.58235     -1.41829     -0.36001     -0.08000     -0.15001
H      -1.85073     -1.06852      0.03504     -0.07000      0.12000      0.00000
Cl      0.00000      0.00000      1.46060      0.00000      0.00000      0.00000
14
Model[18]: IRIntensity=50.2721 KM/Mole;PATH=Calculation 1;FrequenciesFrequencies;ReducedMass=2.0087 AMU;ForceConstant=1.5924 mDyne/A;FreqValue=1159.9810;Frequency=1159.9810 cm^-1;FrequencyLabel=A1;PATH=Calculation 1;FrequenciesFrequencies
C       0.00000      0.00000     -0.29940      0.00000      0.00000      0.26000
C       0.00000      1.45193     -0.81273      0.00000      0.00000     -0.09000
H       0.88998      1.62320     -1.41829     -0.01000      0.34000      0.01000
H      -0.88998      1.62320     -1.41829      0.01000      0.34000      0.01000
H       0.00000      2.13703      0.03504      0.00000     -0.25000      0.13000
C       1.25741     -0.72596     -0.81273      0.00000      0.00000     -0.09000
H       1.85073     -0.04086     -1.41829      0.29000     -0.18001      0.01000
H       1.85073     -1.06852      0.03504     -0.21000      0.12000      0.13000
H       0.96074     -1.58235     -1.41829      0.30001     -0.16000      0.01000
C      -1.25741     -0.72596     -0.81273      0.00000      0.00000     -0.09000
H      -1.85073     -0.04086     -1.41829     -0.29000     -0.18001      0.01000
H      -0.96074     -1.58235     -1.41829     -0.30001     -0.16000      0.01000
H      -1.85073     -1.06852      0.03504      0.21000      0.12000      0.13000
Cl      0.00000      0.00000      1.46060      0.00000      0.00000     -0.01000
14
Model[19]: IRIntensity=2.9305 KM/Mole;PATH=Calculation 1;FrequenciesFrequencies;ReducedMass=2.8945 AMU;ForceConstant=2.6112 mDyne/A;FreqValue=1237.3892;Frequency=1237.3892 cm^-1;FrequencyLabel=E;PATH=Calculation 1;FrequenciesFrequencies
C       0.00000      0.00000     -0.29940     -0.19000      0.32000      0.00000
C       0.00000      1.45193     -0.81273      0.04000     -0.11000      0.00000
H       0.88998      1.62320     -1.41829      0.03000      0.00000      0.05000
H      -0.88998      1.62320     -1.41829     -0.12000     -0.30001      0.17000
H       0.00000      2.13703      0.03504     -0.05000     -0.34000      0.20001
C       1.25741     -0.72596     -0.81273      0.07000     -0.09000      0.00000
H       1.85073     -0.04086     -1.41829     -0.02000     -0.03000     -0.05000
H       1.85073     -1.06852      0.03504      0.33001     -0.13000     -0.20001
H       0.96074     -1.58235     -1.41829      0.32000     -0.05000     -0.17000
C      -1.25741     -0.72596     -0.81273      0.04000     -0.07000      0.00000
H      -1.85073     -0.04086     -1.41829      0.22000      0.22000      0.12000
H      -0.96074     -1.58235     -1.41829     -0.30001     -0.08000     -0.12000
H      -1.85073     -1.06852      0.03504     -0.05000      0.09000      0.00000
Cl      0.00000      0.00000      1.46060      0.00000      0.00000      0.00000
14
Model[20]: IRIntensity=2.9305 KM/Mole;PATH=Calculation 1;FrequenciesFrequencies;ReducedMass=2.8945 AMU;ForceConstant=2.6112 mDyne/A;FreqValue=1237.3892;Frequency=1237.3892 cm^-1;FrequencyLabel=E;PATH=Calculation 1;FrequenciesFrequencies
C       0.00000      0.00000     -0.29940      0.32000      0.19000      0.00000
C       0.00000      1.45193     -0.81273     -0.07000     -0.06000      0.00000
H       0.88998      1.62320     -1.41829      0.12000     -0.34000      0.17000
H      -0.88998      1.62320     -1.41829      0.03000      0.17000     -0.04000
H       0.00000      2.13703      0.03504      0.09000     -0.20001      0.12000
C       1.25741     -0.72596     -0.81273     -0.09000     -0.03000      0.00000
H       1.85073     -0.04086     -1.41829     -0.24000      0.27001      0.17000
H       1.85073     -1.06852      0.03504     -0.13000      0.18001      0.12000
H       0.96074     -1.58235     -1.41829      0.16000     -0.06000     -0.04000
C      -1.25741     -0.72596     -0.81273     -0.11000     -0.06000     -0.01000
H      -1.85073     -0.04086     -1.41829     -0.11000     -0.16000     -0.13000
H      -0.96074     -1.58235     -1.41829     -0.19000     -0.01000     -0.13000
H      -1.85073     -1.06852      0.03504     -0.34000     -0.20001     -0.24000
Cl      0.00000      0.00000      1.46060      0.00000      0.00000      0.00000
14
Model[21]: IRIntensity=2.8239 KM/Mole;PATH=Calculation 1;FrequenciesFrequencies;ReducedMass=1.2676 AMU;ForceConstant=1.3379 mDyne/A;FreqValue=1338.4453;Frequency=1338.4453 cm^-1;FrequencyLabel=A1;PATH=Calculation 1;FrequenciesFrequencies
C       0.00000      0.00000     -0.29940      0.00000      0.00000     -0.03000
C       0.00000      1.45193     -0.81273      0.00000     -0.07000      0.05000
H       0.88998      1.62320     -1.41829     -0.17000      0.25000     -0.14000
H      -0.88998      1.62320     -1.41829      0.17000      0.25000     -0.14000
H       0.00000      2.13703      0.03504      0.00000      0.25000     -0.20001
C       1.25741     -0.72596     -0.81273     -0.06000      0.04000      0.05000
H       1.85073     -0.04086     -1.41829      0.13000     -0.27001     -0.14000
H       1.85073     -1.06852      0.03504      0.22000     -0.12000     -0.20001
H       0.96074     -1.58235     -1.41829      0.30001      0.02000     -0.14000
C      -1.25741     -0.72596     -0.81273      0.06000      0.04000      0.05000
H      -1.85073     -0.04086     -1.41829     -0.13000     -0.27001     -0.14000
H      -0.96074     -1.58235     -1.41829     -0.30001      0.02000     -0.14000
H      -1.85073     -1.06852      0.03504     -0.22000     -0.12000     -0.20001
Cl      0.00000      0.00000      1.46060      0.00000      0.00000      0.00000
14
Model[22]: IRIntensity=5.1009 KM/Mole;PATH=Calculation 1;FrequenciesFrequencies;ReducedMass=1.2277 AMU;ForceConstant=1.3463 mDyne/A;FreqValue=1364.2405;Frequency=1364.2405 cm^-1;FrequencyLabel=E;PATH=Calculation 1;FrequenciesFrequencies
C       0.00000      0.00000     -0.29940     -0.02000      0.03000      0.00000
C       0.00000      1.45193     -0.81273      0.03000     -0.08000      0.02000
H       0.88998      1.62320     -1.41829     -0.11000      0.24000     -0.09000
H      -0.88998      1.62320     -1.41829      0.05000      0.36001      0.07000
H       0.00000      2.13703      0.03504     -0.19000      0.26000     -0.23001
C       1.25741     -0.72596     -0.81273      0.06000     -0.06000     -0.02000
H       1.85073     -0.04086     -1.41829     -0.16000      0.21000      0.09000
H       1.85073     -1.06852      0.03504     -0.13000      0.30001      0.23001
H       0.96074     -1.58235     -1.41829     -0.34000      0.14000     -0.07000
C      -1.25741     -0.72596     -0.81273      0.03000     -0.04000      0.00000
H      -1.85073     -0.04086     -1.41829     -0.13000     -0.02000      0.16000
H      -0.96074     -1.58235     -1.41829      0.08000      0.11000     -0.16000
H      -1.85073     -1.06852      0.03504     -0.19000      0.33001      0.00000
Cl      0.00000      0.00000      1.46060      0.00000      0.00000      0.00000
14
Model[23]: IRIntensity=5.1009 KM/Mole;PATH=Calculation 1;FrequenciesFrequencies;ReducedMass=1.2277 AMU;ForceConstant=1.3463 mDyne/A;FreqValue=1364.2405;Frequency=1364.2405 cm^-1;FrequencyLabel=E;PATH=Calculation 1;FrequenciesFrequencies
C       0.00000      0.00000     -0.29940     -0.03000     -0.02000      0.00000
C       0.00000      1.45193     -0.81273      0.04000      0.05000     -0.01000
H       0.88998      1.62320     -1.41829      0.00000     -0.28000     -0.13000
H      -0.88998      1.62320     -1.41829     -0.09000     -0.07000      0.15001
H       0.00000      2.13703      0.03504     -0.33001     -0.15001      0.13000
C       1.25741     -0.72596     -0.81273      0.06000      0.01000     -0.01000
H       1.85073     -0.04086     -1.41829     -0.24000      0.14000     -0.13000
H       1.85073     -1.06852      0.03504     -0.30001     -0.22000      0.13000
H       0.96074     -1.58235     -1.41829     -0.11000     -0.04000      0.15001
C      -1.25741     -0.72596     -0.81273      0.08000      0.05000      0.03000
H      -1.85073     -0.04086     -1.41829     -0.26000     -0.25000     -0.01000
H      -0.96074     -1.58235     -1.41829     -0.35000     -0.10000     -0.01000
H      -1.85073     -1.06852      0.03504     -0.26000     -0.15001     -0.26000
Cl      0.00000      0.00000      1.46060      0.00000      0.00000      0.00000
14
Model[24]: IRIntensity=0.0000 KM/Mole;PATH=Calculation 1;FrequenciesFrequencies;ReducedMass=1.0611 AMU;ForceConstant=1.1795 mDyne/A;FreqValue=1373.5262;Frequency=1373.5262 cm^-1;FrequencyLabel=A2;PATH=Calculation 1;FrequenciesFrequencies
C       0.00000      0.00000     -0.29940      0.00000      0.00000      0.00000
C       0.00000      1.45193     -0.81273     -0.04000      0.00000      0.00000
H       0.88998      1.62320     -1.41829      0.05000      0.22000      0.16000
H      -0.88998      1.62320     -1.41829      0.05000     -0.22000     -0.16000
H       0.00000      2.13703      0.03504      0.43000      0.00000      0.00000
C       1.25741     -0.72596     -0.81273      0.02000      0.03000      0.00000
H       1.85073     -0.04086     -1.41829     -0.21000      0.06000     -0.16000
H       1.85073     -1.06852      0.03504     -0.21000     -0.37000      0.00000
H       0.96074     -1.58235     -1.41829      0.16000     -0.15001      0.16000
C      -1.25741     -0.72596     -0.81273      0.02000     -0.03000      0.00000
H      -1.85073     -0.04086     -1.41829     -0.21000     -0.06000      0.16000
H      -0.96074     -1.58235     -1.41829      0.16000      0.15001     -0.16000
H      -1.85073     -1.06852      0.03504     -0.21000      0.37000      0.00000
Cl      0.00000      0.00000      1.46060      0.00000      0.00000      0.00000
14
Model[25]: IRIntensity=0.4611 KM/Mole;PATH=Calculation 1;FrequenciesFrequencies;ReducedMass=1.0805 AMU;ForceConstant=1.2017 mDyne/A;FreqValue=1373.9057;Frequency=1373.9057 cm^-1;FrequencyLabel=A1;PATH=Calculation 1;FrequenciesFrequencies
C       0.00000      0.00000     -0.29940      0.00000      0.00000     -0.01000
C       0.00000      1.45193     -0.81273      0.00000     -0.04000     -0.03000
H       0.88998      1.62320     -1.41829      0.19000      0.08000      0.29000
H      -0.88998      1.62320     -1.41829     -0.19000      0.08000      0.29000
H       0.00000      2.13703      0.03504      0.00000      0.21000     -0.19000
C       1.25741     -0.72596     -0.81273     -0.03000      0.02000     -0.03000
H       1.85073     -0.04086     -1.41829      0.17000      0.12000      0.29000
H       1.85073     -1.06852      0.03504      0.18001     -0.10000     -0.19000
H       0.96074     -1.58235     -1.41829     -0.02000     -0.20001      0.29000
C      -1.25741     -0.72596     -0.81273      0.03000      0.02000     -0.03000
H      -1.85073     -0.04086     -1.41829     -0.17000      0.12000      0.29000
H      -0.96074     -1.58235     -1.41829      0.02000     -0.20001      0.29000
H      -1.85073     -1.06852      0.03504     -0.18001     -0.10000     -0.19000
Cl      0.00000      0.00000      1.46060      0.00000      0.00000      0.00000
14
Model[26]: IRIntensity=0.1639 KM/Mole;PATH=Calculation 1;FrequenciesFrequencies;ReducedMass=1.1203 AMU;ForceConstant=1.2469 mDyne/A;FreqValue=1374.4389;Frequency=1374.4389 cm^-1;FrequencyLabel=E;PATH=Calculation 1;FrequenciesFrequencies
C       0.00000      0.00000     -0.29940     -0.02000      0.03000      0.00000
C       0.00000      1.45193     -0.81273     -0.02000     -0.04000      0.04000
H       0.88998      1.62320     -1.41829     -0.20001      0.27001     -0.18001
H      -0.88998      1.62320     -1.41829      0.23001      0.04000     -0.32000
H       0.00000      2.13703      0.03504      0.20001      0.03000     -0.02000
C       1.25741     -0.72596     -0.81273      0.05000     -0.01000     -0.04000
H       1.85073     -0.04086     -1.41829     -0.14000      0.31000      0.18001
H       1.85073     -1.06852      0.03504     -0.12000     -0.16000      0.02000
H       0.96074     -1.58235     -1.41829     -0.15001     -0.18001      0.32000
C      -1.25741     -0.72596     -0.81273     -0.02000      0.03000      0.00000
H      -1.85073     -0.04086     -1.41829      0.22000      0.08000     -0.14000
H      -0.96074     -1.58235     -1.41829     -0.18001     -0.15001      0.14000
H      -1.85073     -1.06852      0.03504      0.20001     -0.34000      0.00000
Cl      0.00000      0.00000      1.46060      0.00000      0.00000      0.00000
14
Model[27]: IRIntensity=0.1639 KM/Mole;PATH=Calculation 1;FrequenciesFrequencies;ReducedMass=1.1203 AMU;ForceConstant=1.2469 mDyne/A;FreqValue=1374.4389;Frequency=1374.4389 cm^-1;FrequencyLabel=E;PATH=Calculation 1;FrequenciesFrequencies
C       0.00000      0.00000     -0.29940      0.03000      0.02000      0.00000
C       0.00000      1.45193     -0.81273      0.03000     -0.02000      0.03000
H       0.88998      1.62320     -1.41829     -0.15001     -0.11000     -0.26000
H      -0.88998      1.62320     -1.41829      0.09000      0.29000     -0.03000
H       0.00000      2.13703      0.03504     -0.34000      0.02000     -0.01000
C       1.25741     -0.72596     -0.81273     -0.01000      0.04000      0.03000
H       1.85073     -0.04086     -1.41829     -0.17000     -0.08000     -0.26000
H       1.85073     -1.06852      0.03504     -0.16000     -0.31000     -0.01000
H       0.96074     -1.58235     -1.41829      0.30001     -0.06000     -0.03000
C      -1.25741     -0.72596     -0.81273     -0.04000     -0.02000     -0.05000
H      -1.85073     -0.04086     -1.41829      0.04000      0.31000      0.29000
H      -0.96074     -1.58235     -1.41829      0.28000     -0.12000      0.29000
H      -1.85073     -1.06852      0.03504      0.03000      0.02000      0.02000
Cl      0.00000      0.00000      1.46060      0.00000      0.00000      0.00000
14
Model[28]: IRIntensity=0.0793 KM/Mole;PATH=Calculation 1;FrequenciesFrequencies;ReducedMass=1.0840 AMU;ForceConstant=1.2193 mDyne/A;FreqValue=1381.6887;Frequency=1381.6887 cm^-1;FrequencyLabel=E;PATH=Calculation 1;FrequenciesFrequencies
C       0.00000      0.00000     -0.29940      0.00000      0.00000      0.00000
C       0.00000      1.45193     -0.81273     -0.02000     -0.04000     -0.03000
H       0.88998      1.62320     -1.41829      0.21000      0.19000      0.36001
H      -0.88998      1.62320     -1.41829     -0.17000      0.04000      0.24000
H       0.00000      2.13703      0.03504      0.15001      0.21000     -0.20001
C       1.25741     -0.72596     -0.81273      0.04000     -0.01000      0.03000
H       1.85073     -0.04086     -1.41829     -0.27001     -0.08000     -0.36001
H       1.85073     -1.06852      0.03504     -0.26000     -0.03000      0.20001
H       0.96074     -1.58235     -1.41829      0.05000      0.17000     -0.24000
C      -1.25741     -0.72596     -0.81273     -0.02000      0.03000      0.00000
H      -1.85073     -0.04086     -1.41829      0.15001      0.05000     -0.12000
H      -0.96074     -1.58235     -1.41829     -0.12000     -0.11000      0.12000
H      -1.85073     -1.06852      0.03504      0.15001     -0.27001      0.00000
Cl      0.00000      0.00000      1.46060      0.00000      0.00000      0.00000
14
Model[29]: IRIntensity=0.0793 KM/Mole;PATH=Calculation 1;FrequenciesFrequencies;ReducedMass=1.0840 AMU;ForceConstant=1.2193 mDyne/A;FreqValue=1381.6887;Frequency=1381.6887 cm^-1;FrequencyLabel=E;PATH=Calculation 1;FrequenciesFrequencies
C       0.00000      0.00000     -0.29940      0.00000      0.00000      0.00000
C       0.00000      1.45193     -0.81273     -0.03000      0.02000      0.02000
H       0.88998      1.62320     -1.41829     -0.08000      0.07000     -0.07000
H      -0.88998      1.62320     -1.41829      0.14000     -0.20001     -0.28000
H       0.00000      2.13703      0.03504      0.27001     -0.12000      0.12000
C       1.25741     -0.72596     -0.81273      0.01000     -0.04000      0.02000
H       1.85073     -0.04086     -1.41829      0.02000     -0.10000     -0.07000
H       1.85073     -1.06852      0.03504      0.03000      0.29000      0.12000
H       0.96074     -1.58235     -1.41829     -0.10000      0.22000     -0.28000
C      -1.25741     -0.72596     -0.81273      0.04000      0.02000     -0.04000
H      -1.85073     -0.04086     -1.41829     -0.23001      0.12000      0.35000
H      -0.96074     -1.58235     -1.41829     -0.01000     -0.26000      0.35000
H      -1.85073     -1.06852      0.03504     -0.21000     -0.12000     -0.23001
Cl      0.00000      0.00000      1.46060      0.00000      0.00000      0.00000
14
Model[30]: IRIntensity=2.1241 KM/Mole;PATH=Calculation 1;FrequenciesFrequencies;ReducedMass=1.1009 AMU;ForceConstant=6.3638 mDyne/A;FreqValue=3132.3431;Frequency=3132.3431 cm^-1;FrequencyLabel=E;PATH=Calculation 1;FrequenciesFrequencies
C       0.00000      0.00000     -0.29940      0.00000      0.00000      0.00000
C       0.00000      1.45193     -0.81273     -0.07000      0.00000      0.01000
H       0.88998      1.62320     -1.41829      0.45000      0.10000     -0.32000
H      -0.88998      1.62320     -1.41829      0.37000     -0.08000      0.27001
H       0.00000      2.13703      0.03504     -0.03000     -0.03000     -0.04000
C       1.25741     -0.72596     -0.81273     -0.02000     -0.05000      0.02000
H       1.85073     -0.04086     -1.41829      0.28000      0.30001     -0.28000
H       1.85073     -1.06852      0.03504     -0.08000      0.02000     -0.10000
H       0.96074     -1.58235     -1.41829      0.07000      0.20001      0.16000
C      -1.25741     -0.72596     -0.81273      0.00000      0.02000     -0.03000
H      -1.85073     -0.04086     -1.41829      0.17000     -0.18001      0.16000
H      -0.96074     -1.58235     -1.41829     -0.01000      0.03000      0.01000
H      -1.85073     -1.06852      0.03504     -0.11000     -0.05000      0.14000
Cl      0.00000      0.00000      1.46060      0.00000      0.00000      0.00000
14
Model[31]: IRIntensity=2.1241 KM/Mole;PATH=Calculation 1;FrequenciesFrequencies;ReducedMass=1.1009 AMU;ForceConstant=6.3638 mDyne/A;FreqValue=3132.3431;Frequency=3132.3431 cm^-1;FrequencyLabel=E;PATH=Calculation 1;FrequenciesFrequencies
C       0.00000      0.00000     -0.29940      0.00000      0.00000      0.00000
C       0.00000      1.45193     -0.81273      0.02000      0.01000      0.03000
H       0.88998      1.62320     -1.41829      0.02000      0.01000      0.00000
H      -0.88998      1.62320     -1.41829     -0.25000      0.06000     -0.17000
H       0.00000      2.13703      0.03504      0.01000     -0.12000     -0.14000
C       1.25741     -0.72596     -0.81273     -0.03000     -0.04000     -0.02000
H       1.85073     -0.04086     -1.41829      0.13000      0.15001     -0.15001
H       1.85073     -1.06852      0.03504      0.07000     -0.06000      0.11000
H       0.96074     -1.58235     -1.41829      0.12000      0.39000      0.28000
C      -1.25741     -0.72596     -0.81273      0.04000     -0.06000     -0.01000
H      -1.85073     -0.04086     -1.41829     -0.26000      0.29000     -0.28000
H      -0.96074     -1.58235     -1.41829     -0.14000      0.43000      0.32000
H      -1.85073     -1.06852      0.03504     -0.01000     -0.04000      0.04000
Cl      0.00000      0.00000      1.46060      0.00000      0.00000      0.00000
14
Model[32]: IRIntensity=10.4279 KM/Mole;PATH=Calculation 1;FrequenciesFrequencies;ReducedMass=1.0993 AMU;ForceConstant=6.3871 mDyne/A;FreqValue=3140.2521;Frequency=3140.2521 cm^-1;FrequencyLabel=A1;PATH=Calculation 1;FrequenciesFrequencies
C       0.00000      0.00000     -0.29940      0.00000      0.00000      0.00000
C       0.00000      1.45193     -0.81273      0.00000     -0.01000     -0.05000
H       0.88998      1.62320     -1.41829     -0.24000     -0.05000      0.14000
H      -0.88998      1.62320     -1.41829      0.24000     -0.05000      0.14000
H       0.00000      2.13703      0.03504      0.00000      0.26000      0.32000
C       1.25741     -0.72596     -0.81273     -0.01000      0.01000     -0.05000
H       1.85073     -0.04086     -1.41829     -0.17000     -0.18001      0.14000
H       1.85073     -1.06852      0.03504      0.23001     -0.13000      0.32000
H       0.96074     -1.58235     -1.41829      0.07000      0.23001      0.14000
C      -1.25741     -0.72596     -0.81273      0.01000      0.01000     -0.05000
H      -1.85073     -0.04086     -1.41829      0.17000     -0.18001      0.14000
H      -0.96074     -1.58235     -1.41829     -0.07000      0.23001      0.14000
H      -1.85073     -1.06852      0.03504     -0.23001     -0.13000      0.32000
Cl      0.00000      0.00000      1.46060      0.00000      0.00000      0.00000
14
Model[33]: IRIntensity=2.7092 KM/Mole;PATH=Calculation 1;FrequenciesFrequencies;ReducedMass=1.0984 AMU;ForceConstant=6.4115 mDyne/A;FreqValue=3147.5940;Frequency=3147.5940 cm^-1;FrequencyLabel=E;PATH=Calculation 1;FrequenciesFrequencies
C       0.00000      0.00000     -0.29940      0.00000      0.00000      0.00000
C       0.00000      1.45193     -0.81273     -0.02000      0.02000      0.05000
H       0.88998      1.62320     -1.41829      0.30001      0.06000     -0.18001
H      -0.88998      1.62320     -1.41829     -0.09000      0.02000     -0.04000
H       0.00000      2.13703      0.03504     -0.01000     -0.32000     -0.39000
C       1.25741     -0.72596     -0.81273     -0.01000      0.02000     -0.06000
H       1.85073     -0.04086     -1.41829     -0.20001     -0.22000      0.17000
H       1.85073     -1.06852      0.03504      0.33001     -0.18001      0.46001
H       0.96074     -1.58235     -1.41829      0.05000      0.17000      0.08000
C      -1.25741     -0.72596     -0.81273     -0.02000      0.02000      0.01000
H      -1.85073     -0.04086     -1.41829      0.08000     -0.10000      0.10000
H      -0.96074     -1.58235     -1.41829      0.07000     -0.19000     -0.14000
H      -1.85073     -1.06852      0.03504      0.04000      0.04000     -0.07000
Cl      0.00000      0.00000      1.46060      0.00000      0.00000      0.00000
14
Model[34]: IRIntensity=2.7092 KM/Mole;PATH=Calculation 1;FrequenciesFrequencies;ReducedMass=1.0984 AMU;ForceConstant=6.4115 mDyne/A;FreqValue=3147.5940;Frequency=3147.5940 cm^-1;FrequencyLabel=E;PATH=Calculation 1;FrequenciesFrequencies
C       0.00000      0.00000     -0.29940      0.00000      0.00000      0.00000
C       0.00000      1.45193     -0.81273      0.02000      0.01000      0.04000
H       0.88998      1.62320     -1.41829      0.02000      0.01000      0.01000
H      -0.88998      1.62320     -1.41829     -0.28000      0.06000     -0.18001
H       0.00000      2.13703      0.03504      0.01000     -0.25000     -0.31000
C       1.25741     -0.72596     -0.81273      0.02000      0.02000      0.02000
H       1.85073     -0.04086     -1.41829     -0.04000     -0.05000      0.06000
H       1.85073     -1.06852      0.03504     -0.12000      0.08000     -0.18001
H       0.96074     -1.58235     -1.41829     -0.08000     -0.24000     -0.16000
C      -1.25741     -0.72596     -0.81273      0.02000      0.02000     -0.06000
H      -1.85073     -0.04086     -1.41829      0.18001     -0.20001      0.15001
H      -0.96074     -1.58235     -1.41829     -0.07000      0.22000      0.12000
H      -1.85073     -1.06852      0.03504     -0.35000     -0.20001      0.49001
Cl      0.00000      0.00000      1.46060      0.00000      0.00000      0.00000
14
Model[35]: IRIntensity=0.0000 KM/Mole;PATH=Calculation 1;FrequenciesFrequencies;ReducedMass=1.0970 AMU;ForceConstant=6.4122 mDyne/A;FreqValue=3149.6669;Frequency=3149.6669 cm^-1;FrequencyLabel=A2;PATH=Calculation 1;FrequenciesFrequencies
C       0.00000      0.00000     -0.29940      0.00000      0.00000      0.00000
C       0.00000      1.45193     -0.81273      0.05000      0.00000      0.00000
H       0.88998      1.62320     -1.41829     -0.33001     -0.06000      0.24000
H      -0.88998      1.62320     -1.41829     -0.33001      0.06000     -0.24000
H       0.00000      2.13703      0.03504      0.02000      0.00000      0.00000
C       1.25741     -0.72596     -0.81273     -0.03000     -0.05000      0.00000
H       1.85073     -0.04086     -1.41829      0.22000      0.25000     -0.24000
H       1.85073     -1.06852      0.03504     -0.01000     -0.02000      0.00000
H       0.96074     -1.58235     -1.41829      0.11000      0.31000      0.24000
C      -1.25741     -0.72596     -0.81273     -0.03000      0.05000      0.00000
H      -1.85073     -0.04086     -1.41829      0.22000     -0.25000      0.24000
H      -0.96074     -1.58235     -1.41829      0.11000     -0.31000     -0.24000
H      -1.85073     -1.06852      0.03504     -0.01000      0.02000      0.00000
Cl      0.00000      0.00000      1.46060      0.00000      0.00000      0.00000
14
Model[36]: IRIntensity=0.0021 KM/Mole;PATH=Calculation 1;FrequenciesFrequencies;ReducedMass=1.0284 AMU;ForceConstant=6.2226 mDyne/A;FreqValue=3204.7020;Frequency=3204.7020 cm^-1;FrequencyLabel=A1;PATH=Calculation 1;FrequenciesFrequencies
C       0.00000      0.00000     -0.29940      0.00000      0.00000      0.00000
C       0.00000      1.45193     -0.81273      0.00000      0.02000      0.00000
H       0.88998      1.62320     -1.41829     -0.24000     -0.04000      0.17000
H      -0.88998      1.62320     -1.41829      0.24000     -0.04000      0.17000
H       0.00000      2.13703      0.03504      0.00000     -0.24000     -0.31000
C       1.25741     -0.72596     -0.81273      0.02000     -0.01000      0.00000
H       1.85073     -0.04086     -1.41829     -0.16000     -0.19000      0.17000
H       1.85073     -1.06852      0.03504     -0.21000      0.12000     -0.31000
H       0.96074     -1.58235     -1.41829      0.09000      0.23001      0.17000
C      -1.25741     -0.72596     -0.81273     -0.02000     -0.01000      0.00000
H      -1.85073     -0.04086     -1.41829      0.16000     -0.19000      0.17000
H      -0.96074     -1.58235     -1.41829     -0.09000      0.23001      0.17000
H      -1.85073     -1.06852      0.03504      0.21000      0.12000     -0.31000
Cl      0.00000      0.00000      1.46060      0.00000      0.00000      0.00000
14
Model[37]: IRIntensity=0.9184 KM/Mole;PATH=Calculation 1;FrequenciesFrequencies;ReducedMass=1.0274 AMU;ForceConstant=6.2647 mDyne/A;FreqValue=3216.9709;Frequency=3216.9709 cm^-1;FrequencyLabel=E;PATH=Calculation 1;FrequenciesFrequencies
C       0.00000      0.00000     -0.29940      0.00000      0.00000      0.00000
C       0.00000      1.45193     -0.81273      0.00000     -0.03000      0.01000
H       0.88998      1.62320     -1.41829      0.36001      0.05000     -0.24000
H      -0.88998      1.62320     -1.41829     -0.31000      0.05000     -0.21000
H       0.00000      2.13703      0.03504      0.00000      0.24000      0.32000
C       1.25741     -0.72596     -0.81273      0.03000     -0.01000     -0.01000
H       1.85073     -0.04086     -1.41829     -0.23001     -0.29000      0.24000
H       1.85073     -1.06852      0.03504     -0.21000      0.12000     -0.32000
H       0.96074     -1.58235     -1.41829      0.12000      0.29000      0.21000
C      -1.25741     -0.72596     -0.81273      0.00000      0.01000      0.00000
H      -1.85073     -0.04086     -1.41829      0.03000     -0.04000      0.03000
H      -0.96074     -1.58235     -1.41829      0.02000     -0.05000     -0.03000
H      -1.85073     -1.06852      0.03504      0.00000      0.00000      0.00000
Cl      0.00000      0.00000      1.46060      0.00000      0.00000      0.00000
14
Model[38]: IRIntensity=0.9184 KM/Mole;PATH=Calculation 1;FrequenciesFrequencies;ReducedMass=1.0274 AMU;ForceConstant=6.2647 mDyne/A;FreqValue=3216.9709;Frequency=3216.9709 cm^-1;FrequencyLabel=E;PATH=Calculation 1;FrequenciesFrequencies
C       0.00000      0.00000     -0.29940      0.00000      0.00000      0.00000
C       0.00000      1.45193     -0.81273      0.01000     -0.02000      0.01000
H       0.88998      1.62320     -1.41829      0.15001      0.02000     -0.10000
H      -0.88998      1.62320     -1.41829     -0.24000      0.03000     -0.16000
H       0.00000      2.13703      0.03504      0.00000      0.14000      0.19000
C       1.25741     -0.72596     -0.81273     -0.01000      0.01000      0.01000
H       1.85073     -0.04086     -1.41829      0.10000      0.12000     -0.10000
H       1.85073     -1.06852      0.03504      0.12000     -0.07000      0.19000
H       0.96074     -1.58235     -1.41829     -0.09000     -0.22000     -0.16000
C      -1.25741     -0.72596     -0.81273     -0.03000     -0.02000     -0.01000
H      -1.85073     -0.04086     -1.41829      0.24000     -0.31000      0.26000
H      -0.96074     -1.58235     -1.41829     -0.14000      0.37000      0.26000
H      -1.85073     -1.06852      0.03504      0.24000      0.14000     -0.37000
Cl      0.00000      0.00000      1.46060      0.00000      0.00000      0.00000
</ModelData>
</Models>
##$PEAKS=
<Peaks type="IR" xUnitsExpected="1/cm"  >
<PeakData id="1" title="methyl C-H asymmetric stretch(~2980 cm-1)" peakShape="broad" model="2cl.35" xMax="3030" xMin="2930"    />
<PeakData id="2" title="methyl C-H symmetric stretch (~2820 cm-1)" peakShape="broad" model="2cl.38" xMax="2920" xMin="2820"    />
<PeakData id="3" title="C-Cl stretch (~560 cm-1)" peakShape="broad" model="2cl.8" xMax="610" xMin="510"    />
</Peaks>
##XUNITS= 1/CM
##YUNITS= TRANSMITTANCE
##XFACTOR= 1
##YFACTOR= 9.999000E-07
##FIRSTX= 3.897228E+03
##FIRSTY= 8.736692E-01
##LASTX= 3.377342E+02
##NPOINTS= 2637
##MINY= 10.000000E-05
##MAXY= 1
##XYDATA= (X++(Y..Y))
3897.228H73757%YJ87J883TL773L592R47J137L792L611R52J142M765I06009
$$ 873757 873757 873757 873757 873757 873757 873757 873757 873944 875827 877710 881483 885075 886022 887159 890951 894562 895514 896656 901421 906009
3868.871I07925J915J920J919%TR62R61%T6J924J927%VJ927J931%TJ932I27178
$$ 907925 909840 911760 913679 913679 913679 914641 915602 915602 915602 915602 915602 915602 915602 915602 915602 915602 915602 915602 915602 915602 915602 915602 915602 915602 915602 915602 915602 915602 915602 915602 915602 915602 915602 917526 919453 919453 919453 919453 919453 921380 923311 923311 923311 925243 927178
3806.7554I28146R67%S2r67r68%S0R68R67%TJ938J939%TJ943TR73T%XJ947I42720
$$ 928146 929113 929113 929113 929113 929113 929113 929113 929113 929113 929113 929113 929113 929113 928146 927178 927178 927178 927178 927178 927178 927178 927178 927178 927178 927178 928146 929113 929113 929113 931051 932990 932990 932990 934933 936876 937849 938822 938822 938822 938822 938822 938822 938822 940769 942720
3744.64I42720%UJ952J953%S0R77R79%S8r79r77%Tj953j952%Xj754I39017
$$ 942720 942720 942720 942720 944672 946625 946625 946625 946625 946625 946625 946625 946625 946625 946625 946625 947602 948581 948581 948581 948581 948581 948581 948581 948581 948581 948581 948581 948581 948581 948581 948581 948581 948581 948581 948581 947602 946625 946625 946625 944672 942720 942720 942720 942720 942720 942720 942720 940966 939017
3677.1228I38822%T3J753J950J95%sj754j949j95%r73p77j945j941Tj939I28146
$$ 938822 938822 938822 938822 938822 938822 938822 938822 938822 938822 938822 938822 938822 938822 938822 938822 938822 938822 938822 938822 938822 938822 938822 938822 940575 942525 942720 942720 942720 942720 942720 942720 942720 942720 942720 942720 940966 939017 938822 938822 937849 937072 935127 933186 931245 929306 928146
3613.6567I27178j742j932l666l851l075k880m405m778k289j904r52Tl611H87348
$$ 927178 925436 923504 919838 915987 912912 910032 905627 900849 898560 896656 895704 894752 891141 887348
3593.4019H82806m908l012k821m504m493l922l727k789k786k040j854H47433
$$ 882806 877898 874886 872065 867561 863068 859146 855419 852630 849844 847804 845950 847433
3575.8474H49287J857TR30R31L351L733K993K809O196O597K455J890J89H85075
$$ 849287 851144 853001 853931 854862 858213 861946 864939 867748 873944 880541 882996 884886 885075 885075
3555.5923H85833R47J894J898K659K853L80%J716J905J91%UJ719J910I04861
$$ 885833 886780 888674 890572 893231 896084 896464 896464 898180 900085 900276 900276 900276 900276 901995 903905 904861
3532.6365I05818J91%J722J918J917J921J92%P70R60J732J925L87%WJ735I23119
$$ 905818 906009 906009 907731 909649 911566 913487 913679 913679 914449 915409 917141 919066 919453 919453 919453 919453 919453 919453 921188 923119
3504.2795I23311%J546J932L89%T1P73R68J94%U9p74r68j93%l095l860I17141
$$ 923311 923311 924857 926789 927178 927178 927178 927178 927178 927178 927178 927178 927178 927178 927178 927178 927178 927178 927178 927178 927178 927178 927178 927178 927178 927178 927951 928919 929113 929113 929113 929113 929113 929113 929113 929113 929113 929113 929113 929113 929113 929113 929113 929113 929113 929113 929113 929113 929113 929113 929113 929113 929113 929113 929113 929113 929113 929113 929113 929113 929113 929113 929113 929113 929113 929113 929113 929113 928339 927371 927178 927178 924083 920223 917141
3403.004I14257l649l833n354n717o460o627o602o391o556o531k234H53372
$$ 914257 910608 906775 901421 895704 889244 882617 876015 869624 863068 856537 854303 853372
3385.4497H53186%j486j856l72%J484J859J116R31L912M482O181O578H80350
$$ 853186 853186 851700 849844 849472 849472 850956 852815 853931 854862 858774 863256 869437 876015 880350
3365.1946H84129L219K654M370M761K671J910J147R57J91%Wk104k865H98180
$$ 884129 887348 890002 894372 899133 901804 903714 904861 905818 906009 906009 906009 906009 906009 906009 903905 901040 898180
3340.8884H95322p60%j521j900l79%J329J900N71%L427M769L442K873I11951
$$ 895322 894562 894562 893041 891141 890762 890762 892091 893991 894562 894562 897989 902758 906200 909073 911951
3319.283I14833K308J733N79%UJ350J928N80%Uj351j930n77%j348j926I14833
$$ 914833 917141 918874 919453 919453 919453 919453 920803 922731 923311 923311 923311 923311 921960 920030 919453 919453 918105 916179 914833
3292.2761I13871l648m787o303o663l036j897r449j2212o730m658q538H35796
$$ 913871 910223 905436 899133 892470 889434 887537 878088 865876 859146 854488 845950 835796
3274.7217H28997n492o203o364m348l615j806r02j80%UP22R01J445J806H05505
$$ 828997 823505 817302 810938 806590 802975 801169 800267 800087 800087 800087 800087 800809 801710 803155 804961 805505
3251.766H05505%TJ266J810N45%J269J814J271R10J81%J273J822N46H18212
$$ 805505 805505 805505 806771 808581 809126 809126 810395 812209 813480 814390 814571 814571 815844 817666 818212 818212
3228.8103H19488J825N47%N49R14J645J831N49%J283J835N50%S3N50R19H34140
$$ 819488 821313 821860 821860 822409 823323 824968 826799 827348 827348 828631 830466 831016 831016 831016 831016 831016 831016 831016 831016 831016 831016 831016 831016 831016 831016 831566 832485 834140
3189.6504H35980K395K767M623N564L719K793N415O368N449M712K832H84509
$$ 835980 838375 841142 845765 851329 855048 857841 863256 869624 875073 879785 882617 884509
3172.096H85075%N69R45L413M750K855J907P62%J910K866K297J917N74I09840
$$ 885075 885075 885644 886589 890002 894752 897607 899514 900276 900276 902186 905052 907349 909266 909840 909840
3150.4905I11183J921J153R60L85%M236O758L679J940TJ944J361R74L88I38822
$$ 911183 913104 914257 915217 915602 915602 919838 926596 930275 932215 934155 936099 937460 938434 938822 938822
3128.8853I38822%Wn84r72l90%Wj167j941p78%Wj164j938p75%Un81r68I27178
$$ 938822 938822 938822 938822 938822 938822 938238 937266 936876 936876 936876 936876 936876 936876 935709 933768 932990 932990 932990 932990 932990 932990 931826 929888 929113 929113 929113 929113 928532 927564 927178
3087.0247I27178j161j934p72%j158j930j926Tk500k880k301j915p66I06009
$$ 927178 926017 924083 923311 923311 922153 920223 918297 916371 913871 910991 908690 906775 906009 906009
3066.7695I05436r57j529j910j907j906k475k851k278j897j326r45m349H74510
$$ 905436 904479 902950 901040 899133 897227 894752 891901 889623 887726 886400 885455 881106 874510
3047.8647H69061m684m670m659n761o481o459o432o227o386p995r040G92354
$$ 869061 864377 859707 855048 849287 842806 836347 829915 823688 817302 809307 800267 792354
3030.3103G85191j0151j2381j1410j0459j3491j5420k2662k7422k6241F09982
$$ 785191 775040 762659 751249 740790 727299 711879 689217 661795 635554 609982
3015.4568E83673k6810k9456l1270m5248n3665l6627k4661k4278k3514B50859
$$ 583673 556863 527407 496137 450889 397224 360597 335936 311658 288144 250859
3000.603B05612m6601m4749l9010l1946j5399o904o091n192l918k833A573
$$ 205612 159011 114262 75252 43306 27907 21003 14912 9720 5802 2969 1573
2984.399I31m08k49r9j5o%Uj5k9j0%UJ5K7Q3J64O28J493J910K221M606A9222
$$ 931 523 274 175 160 154 154 154 154 139 110 100 100 100 100 115 142 225 389 1017 2510 4420 6641 11247 19222
2950.6404B1763l375k612j961j932j858p98%Q20J599L668O163L82m829A3789
$$ 21763 18388 15776 13815 11883 10025 9227 9227 10047 11646 15314 21477 21859 17030 13789
2930.3853A1693j930j742j911j910q00%O71J446J695J910L049M436O451C1922
$$ 11693 9763 8021 6110 4200 3400 3400 4071 5517 7212 9122 12171 16607 23058 31922
2910.1301C8385L424J675%p97j531j801k094j554j006m77%K011M144M903E0933
$$ 38385 41809 43484 43484 42687 41156 39355 37261 35707 34701 34224 34224 36235 40379 45282 50933
2888.5247E7308P004O713O326O281O200O673P308O309N275O633Q163O482A41342
$$ 57308 64312 71025 77351 83632 89832 96505 103813 110122 115397 122030 130193 136675 141342
2869.62A43782%j6289l0727j4410%K621N233P080R039K7430N2059M9179B77098
$$ 143782 143782 127493 96766 82356 82356 84977 90210 97290 106329 133759 185818 234997 277098
2850.7153C28490O2447M5690K3891J8002J1330R731P939R020J0276J5596E64613
$$ 328490 390937 436627 460518 478520 489850 499581 507520 516540 526816 542412 564613
2834.5112E85069J8756J5528J2011R365O497M894L272K131Q21M92%J972F64761
$$ 585069 603825 619353 631364 640729 647226 652120 655392 657523 658344 658836 658836 660808 664761
2815.6064F71208R143N011%L35Q38Q905J7633J6466J4730J1885Q797Q847G82692
$$ 671208 680351 685362 685362 685697 686535 695440 713073 729539 744269 756154 764951 773798 782692
2796.7017G91636Q993Q497Q176M925R12J281J829J099%WL301P358R055H58213
$$ 791636 800629 809126 817302 822227 823139 824420 826249 827348 827348 827348 827348 827348 827348 830649 838007 847062 858213
2772.3958H68124Q455O038K838L219L796L234K856K480J910J145%p63I01421
$$ 868124 876579 882617 885455 888674 892470 895704 898560 901040 902950 904095 904095 903332 901421
2753.491I00276%p62j907j143%Ul80r52n70%j902m743k842%o234j4838H48174
$$ 900276 900276 899514 897607 896464 896464 896464 896464 896084 895132 894562 894562 892660 887917 885075 885075 878841 864003 848174
2727.8345H31383j6993j7005j4335j0672p955m404q79M401J4342K8525H33404
$$ 831383 814390 797385 783050 772378 764423 760019 759140 763541 777883 806408 833404
2711.6304H57283J7603P542O057L796L423K856K480J910J529R57N73%I05627
$$ 857283 874886 882428 888485 892281 895704 898560 901040 902950 904479 905436 906009 906009 905627
2692.7256I04670j338j911k288k859l233l797k274%J515L796L423K856I01040
$$ 904670 903332 901421 899133 896274 893041 889244 886970 886970 888485 892281 895704 898560 901040
2673.8208I02950J529R57N73%UP66J915J918TJ153%J154K885L085L861I28146
$$ 902950 904479 905436 906009 906009 906009 906009 906775 908690 910608 912526 913679 913679 914833 917718 920803 924664 928146
2649.515I31051K717J941J557R72J364J948L89j948m086p759p343o740I08881
$$ 931051 933768 935709 937266 938238 939602 941550 941939 939991 935905 928146 920803 914063 908881
2630.61I06009l633m769k665R52J903L817K865R57J339J915J918TJ537I15025
$$ 906009 902376 897607 894942 895894 897797 901614 904479 905436 906775 908690 910608 912526 914063 915025
2610.355I15602%l85r60j153j921k302k872j530R57J913L834M034N006I24276
$$ 915602 915602 915217 914257 913104 911183 908881 906009 904479 905436 907349 911183 915217 920223 924276
2590.0999I27178L291L880L500K920K535J953J758R78J174J959TJ962I56814
$$ 927178 930469 934349 937849 940769 943304 945257 947015 947993 949167 951126 953085 955047 956814
2571.195I57797J180J966J379%N92J970J975J974J384%UL97R87N95%I72789
$$ 957797 958977 960943 962322 962322 962914 964884 966859 968833 970217 970217 970217 970217 970614 971601 972196 972196 972789
2546.889I74771J388%N95J986J390%YL97R95N95%S7j98r93p96%T1J99I81323
$$ 974771 976159 976159 976754 978740 980130 980130 980130 980130 980130 980130 980130 980130 980527 981522 982117 982117 982117 982117 982117 982117 982117 982117 982117 982117 982117 982117 982117 982117 982117 982117 982117 982117 981919 980926 980130 980130 980130 980130 980130 980130 980130 980130 980130 980130 980130 980130 980130 980130 980130 980130 980130 980130 980130 980130 980130 980130 980329 981323
2467.2188I82117%j98r93p96%n97j985p94J986J390%S9n97j985Tj981I71999
$$ 982117 982117 981919 980926 980130 980130 979533 977548 976754 978740 980130 980130 980130 980130 980130 980130 980130 980130 980130 980130 980130 980130 980130 980130 980130 980130 980130 980130 980130 980130 979533 977548 975563 973582 971999
2419.957I71009j187j977k565l943m131m906l916r77j955m877m866m851I26789
$$ 971009 969822 967845 965280 961337 957206 952300 948384 947407 945452 940575 935709 930858 926789
2401.0522I24857n983j8215j3879r47n69R47K274O647O289M779M791M611I20416
$$ 924857 918874 900659 886780 885833 885264 886211 888485 895132 901421 906200 910991 915602 920416
2382.1477I25243M839M851M278J949TJ953J758R78J564L918L338R83J177I60747
$$ 925243 930082 934933 939211 941160 943109 945062 946820 947798 949362 953280 956618 957601 958778 960747
2361.8926I62717J970J974J975K570M953L971%J99R94J194J989J994J993I90092
$$ 962717 964687 966661 968636 971206 976159 980130 980130 980329 981323 982517 984506 986500 988493 990092
2341.6375I90092%TJ99R98Q00%L99K001J602%Uo00l003k396%m01j995I85702
$$ 990092 990092 990092 990291 991289 992089 992089 992488 994489 996091 996091 996091 996091 995491 992488 990092 990092 989691 987696 985702
2314.6306I83711j594%j98r93j193j987m957j8723j7384j2599j2709j3385H84886
$$ 983711 982117 982117 981919 980926 979733 977746 972789 954066 936682 924083 911374 897989 884886
2295.7258H72441r933%J309P496P717Q507Q357P629P468O727O753O774I37849
$$ 872441 862508 862508 863817 871313 879030 887537 895894 903523 910991 917718 924471 931245 937849
2276.8213I43696N666M900M715L937L747J975K373M952M169%J99R94P94I82117
$$ 943696 949362 954262 958977 962914 966661 968636 971009 975961 980130 980130 980329 981323 982117 982117
2256.5662I82517J989J596%WJ99J993J798%WJ99R98Q00%J99K001J802I96091
$$ 982517 984506 986102 986102 986102 986102 986102 986102 986301 988294 990092 990092 990092 990092 990092 990092 990291 991289 992089 992089 992288 994289 996091 996091
2224.158I96091%UK00K004J805%Wk00k005j804%Wm00l001k598%m01l989I81919
$$ 996091 996091 996091 996091 996291 998295 1000100 1000100 1000100 1000100 1000100 1000100 999900 997895 996091 996091 996091 996091 996091 996091 995691 992690 990092 990092 989691 985702 981919
2187.6987I80926k981j6805j6468j6526j6963k0991j8691l753l183J872H68873
$$ 980926 977945 961140 944672 928146 911183 890192 871501 867748 864565 866437 868873
2171.4946H75449O602P572P604Q591Q823R635Q910J941J945R71J168L898I47015
$$ 875449 882051 889623 897227 905818 914641 924276 933186 935127 937072 938043 939211 943109 947015
2152.59I49951K938K746K947J968K167M930M945L963L575%TR94R93I82117
$$ 949951 952889 955635 958582 960550 962717 967647 972592 976555 980130 980130 980130 981124 982117 982117
2132.335I82117%K01J989J795%UJ99J993J798R97J000%sJ99K001J802I96091
$$ 982117 982117 982318 984307 986102 986102 986102 986102 986301 988294 990092 991089 992089 992089 992089 992089 992089 992089 992089 992089 992089 992089 992288 994289 996091 996091
2097.226I96091%WK00K004J805%Yk00k005j804%W4m002%j997%Tl990I86102
$$ 996091 996091 996091 996091 996091 996091 996291 998295 1000100 1000100 1000100 1000100 1000100 1000100 1000100 1000100 999900 997895 996091 996091 996091 996091 996091 996091 996091 996091 996091 996091 996091 996091 996091 996091 996091 996091 996091 996091 996091 996091 996091 996091 996091 996091 996091 996091 996091 996091 996091 996091 996091 996091 996091 996091 996091 996091 996091 996091 996091 996091 996091 996091 996091 996091 996091 996091 996091 996091 996091 996091 996091 996091 996091 996091 996091 992089 992089 990092 990092 990092 986102 986102
1989.1989I86102%S0l985%j987p934%j979%l952l943%l936%j964%TJ964I58386
$$ 986102 986102 986102 986102 986102 986102 986102 986102 986102 986102 986102 982117 982117 980130 972196 972196 970217 970217 966265 962322 962322 958386 958386 956422 956422 956422 958386 958386
1951.3895I62322L943%L952J979%L963%L971J987%L985%T3l985%Zj987I80130
$$ 962322 966265 966265 970217 972196 972196 976159 976159 980130 982117 982117 986102 986102 986102 986102 986102 986102 986102 986102 986102 986102 986102 986102 986102 986102 986102 986102 986102 986102 986102 986102 986102 986102 986102 986102 982117 982117 982117 982117 982117 982117 982117 982117 982117 980130 980130
1889.2738I80130%Ul971%Tl963%TL963%l963%Xj979l952l943%l936n889I48581
$$ 980130 980130 980130 980130 976159 976159 976159 972196 972196 972196 976159 976159 972196 972196 972196 972196 972196 972196 972196 970217 966265 962322 962322 958386 952497 948581
1854.1649I42720l898n832%l877%TL877N832%L898L905%J956L916%L925I56422
$$ 942720 938822 932990 932990 929113 929113 929113 932990 938822 938822 942720 946625 946625 948581 952497 952497 956422 956422
1829.859I56422%TJ964%Tj964%l925%l916n861l898j946p763j935p725I15602
$$ 956422 956422 956422 958386 958386 958386 956422 956422 952497 952497 948581 942720 938822 936876 929113 927178 919453 915602
1805.5529I13679l839%UL839J923L851P725J935P763J946%L898%sl898I38822
$$ 913679 909840 909840 909840 909840 913679 915602 919453 927178 929113 936876 938822 938822 942720 942720 942720 942720 942720 942720 942720 942720 942720 942720 938822 938822
1771.7944I38822j946p763n802l858l851j923%Xl839%Tl831%j914j3333H73757
$$ 938822 936876 929113 923311 919453 915602 913679 913679 913679 913679 913679 913679 913679 909840 909840 909840 906009 906009 904095 890762 873757
1743.4373H68124r350j3009l699j1050p328n476l641j816p250l613j805G96485
$$ 868124 858774 845765 842066 831016 823688 818212 814571 812755 805505 801892 800087 796485
1725.8828G96485%L602J805L613P250J0933L660N506L679L687N545L707H53186
$$ 796485 796485 800087 801892 805505 812755 823688 827348 832854 836533 840220 845765 849472 853186
1706.978H55048L726L734J869L747L754J879L765%TL773%XL780%WJ895H86970
$$ 855048 858774 862508 864377 868124 871878 873757 877522 877522 877522 881295 881295 881295 881295 881295 881295 881295 885075 885075 885075 885075 885075 885075 886970 886970
1673.2196H86970%L792L800J902L812%L819%J914%TL831%UL839J923L851I19453
$$ 886970 886970 890762 894562 896464 900276 900276 904095 904095 906009 906009 906009 909840 909840 909840 909840 913679 915602 919453 919453
1646.2128I23311L867%UJ935%TL877L886%WJ946%S5j946%J946%WL898I42720
$$ 923311 927178 927178 927178 927178 929113 929113 929113 932990 936876 936876 936876 936876 936876 936876 938822 938822 938822 938822 938822 938822 938822 938822 938822 938822 938822 938822 938822 938822 938822 938822 936876 936876 938822 938822 938822 938822 938822 938822 942720 942720
1590.849I42720L905%UJ956%S7j956%J956j956%Tl905%Tl898j946%l886I32990
$$ 942720 946625 946625 946625 946625 948581 948581 948581 948581 948581 948581 948581 948581 948581 948581 948581 948581 948581 948581 948581 948581 948581 948581 946625 946625 948581 946625 946625 946625 942720 942720 942720 938822 936876 936876 932990 932990
1540.8864I32990%Tr679p709n762%l831j914l819%l812%j902l800l792H81295
$$ 932990 932990 932990 923311 915602 909840 909840 906009 904095 900276 900276 896464 896464 894562 890762 886970 881295
1517.9305H71878j3104l726n576j6618j838p328%j828%p289l2414k1258G39921
$$ 871878 858774 855048 849472 832854 831016 823688 823688 821860 821860 814571 782157 760899 739921
1499.0259G19227q710k5155o845m9083k2140k3466p722k5889n4367l9333C96195
$$ 719227 710517 685362 678517 629434 607294 583828 576106 550217 495850 456517 396195
1482.8217C49008k9626k8472m8959p4538n1589n6982k041j5515J74K8331A06876
$$ 349008 319382 290910 241951 167413 115824 58842 56801 41286 41460 69791 106876
1466.6177A07563p55j2639k2410k2304l261q726r704l812l199j531j476A9252
$$ 107563 106808 94169 71759 49455 46194 37468 27764 23952 20753 19222 17746 19252
1449.0634C8763K6952J6038J9040K2555K4573L0108K4403L0866J7148B68284
$$ 38763 65715 81753 100793 123348 147921 178029 202432 233298 250446 268284
1434.2096B77966J4276K3786O5380K5792L5784L3004J4291K4363J7645E50217
$$ 277966 292242 316028 381408 407200 442984 475988 490279 514642 532287 550217
1419.3557E60808J520J0702%L076L083%Tr226r155j3599j0467q893l391D58584
$$ 560808 562328 573030 573030 576106 579189 579189 579189 569963 560808 547209 536742 527849 524458 458584
1399.1007C47800k8418k7252m9975l9816J867M0085M4626P899K0366M524C05611
$$ 347800 319382 292130 242155 202339 204206 244291 288917 296816 317182 321706 305611
1382.8966B86711j6290j7907j7317j06732m5259m4611j6319j1985n306C019
$$ 286711 270421 252514 235197 128465 83206 38595 22276 10291 4985 3019
1368.0428A905%J00K371K630L3632M1296M0828O8729M3906O8286J08483D56517
$$ 1905 1905 2005 4376 7006 40638 81934 122762 191491 235397 303683 412166 456517
1350.4885E04482M8902J9800K6396K6807J4504K1233J9894N019K0248G10687
$$ 504482 553384 573184 599580 626387 640891 662124 682018 687037 707285 710687
1335.6348G14097N130Q589N176J2148J7519J2381J7852L593J2641N445H21860
$$ 714097 719227 727816 732992 745140 762659 775040 792892 796485 809126 814571 821860
1319.4308H27348N506L679L687J846L699L707N576%L726%TL734%Xl734H58774
$$ 827348 832854 836533 840220 842066 845765 849472 855048 855048 858774 858774 858774 862508 862508 862508 862508 862508 862508 862508 858774 858774
1291.0736H58774%Tl726%Tj862%l714%l707%l699j846p366j838p328j828H18212
$$ 858774 858774 858774 855048 855048 855048 853186 853186 849472 849472 845765 845765 842066 840220 832854 831016 823688 821860 818212
1265.4172H14571n445r039p195q951n346k1211j2244n392k9231k8665F40729
$$ 814571 809126 800087 792892 783941 778595 757384 745140 739748 710517 681852 640729
1249.213E99108p1407m9181j22214n3980m9812j06191q1419l6780o742B1413
$$ 599108 527701 478520 356306 302326 252514 146323 64904 28124 21382 21413
1234.3594C6685J9661K8509L8346K9402L4379K0228K8087K4624K9106C11428
$$ 36685 56346 84855 123201 152603 186982 207210 235297 259921 289027 311428
1219.5056C25324Q239Q340J200j200k393l574m737l531n846m640j154C16028
$$ 325324 333563 341903 343103 341903 339510 335936 331199 327668 321822 317182 316028 316028
1201.9513C16028J154%j154k305k295j145m559l398m502l355l337m531B75801
$$ 316028 317182 317182 316028 313723 311428 310283 305724 302326 297824 294469 291132 286601 275801
1183.0465B67112j4702j9311j7517j7874j7130k7975l0208j5038l2221E4199
$$ 267112 252410 233099 215582 197708 180578 152603 122395 107357 75136 54199
1168.1927C5384j3397q832k842k702j809j859n43%j29%TJ29%K67K76J217F337
$$ 35384 21987 13155 10313 7611 5802 3943 3400 3400 3271 3271 3271 3400 3400 3667 3943 5160 6337
1143.8867H200Q17O38O58J642P267L770N168O064K092J3186Q367J2874H8575
$$ 8200 9017 9655 10313 11955 19222 22992 28160 34224 36316 49502 57869 70743 88575
1124.9818A13908K0538L0593L7300L6274N6079L4622R7661M6347K6979E35404
$$ 113908 134446 165039 202339 238613 294692 329314 426975 473322 500301 535404
1110.1282E73030K9536K7030K7763J6502K1747K8939K4081K2865K1399H00087
$$ 573030 602566 629596 657359 673861 695608 724547 748628 771493 792892 800087
1095.2743H14571J6445J1235J6523N603R380J3213%L792N702P631J914I09840
$$ 814571 831016 842251 858774 864377 873757 886970 886970 890762 896464 904095 906009 909840
1077.7201I09840%YL839%TJ923L851L858L867%Wl867%Ul858%TL858%S5L867I29113
$$ 909840 909840 909840 909840 909840 909840 909840 909840 913679 913679 913679 915602 919453 923311 927178 927178 927178 927178 927178 927178 923311 923311 923311 923311 919453 919453 919453 923311 923311 923311 923311 923311 923311 923311 923311 923311 923311 923311 923311 923311 923311 923311 923311 927178 929113
1016.95483I32990%UL886J946%L898L905J956L916L925J964%VL936%S0L943I66265
$$ 932990 932990 932990 932990 936876 938822 938822 942720 946625 948581 952497 956422 958386 958386 958386 958386 958386 962322 962322 962322 962322 962322 962322 962322 962322 962322 962322 962322 966265 966265
976.4446I66265%l943%VL943%S2l943%S0l936%j964p841j956r749p763I23311
$$ 966265 966265 962322 962322 962322 962322 962322 966265 966265 966265 966265 966265 966265 966265 966265 966265 966265 966265 966265 966265 962322 962322 962322 962322 962322 962322 962322 962322 962322 962322 962322 958386 958386 956422 948581 946625 936876 929113 923311
923.78143I15602n762j3376j8942r398j3076n576p406r212%P366J2966H62508
$$ 915602 909840 896464 877522 868124 855048 849472 842066 832854 832854 840220 853186 862508
906.2269H86970P592J1638J3253P725N812N832L898N861%L916%Ul916I48581
$$ 886970 894562 906200 919453 927178 932990 938822 942720 948581 948581 952497 952497 952497 952497 948581 948581
884.6215I48581%VL916%TL925J964%L936L943%L952%Vl952%Ul943%l936I52497
$$ 948581 948581 948581 948581 948581 952497 952497 952497 956422 958386 958386 962322 966265 966265 970217 970217 970217 970217 970217 966265 966265 966265 966265 962322 962322 958386 952497
848.1624I48581n861l898j946r698j1576j1507r533p592k8382j3008H30833
$$ 948581 942720 938822 936876 927178 915602 904095 894562 886970 858588 845580 830833
831.9583H01710j9731k4595k6119k4150n6466n1226p8051p6351q5161C27551
$$ 801710 781979 757384 731265 707115 650649 599423 521372 445021 359860 327551
817.10455B94134q2663q3155k1508k1400j9693j6355j4738j187J306L4993A13979
$$ 294134 211471 128316 106808 85408 65715 49360 34622 33435 34741 69734 113979
800.9005A71432K40867O6502O6906Q1000N2310M3811K9471M0593J6234H27348
$$ 171432 412299 478801 545707 626707 679017 722828 752299 792892 809126 827348
786.04675H42066J1120J1191R380J3213L792N702P631N745%L839J923I15602
$$ 842066 853186 864377 873757 886970 890762 896464 904095 909840 909840 913679 915602 915602
768.4924I19453%L858%L867J935%L877%Ul877j935j1576n762l831r545H90762
$$ 919453 919453 923311 923311 927178 929113 929113 932990 932990 932990 932990 929113 927178 915602 909840 906009 896464 890762
744.1863H90762l792%Tj895%WJ895%UL792%Vl792%Tj895%p553l765j879H68124
$$ 890762 886970 886970 886970 885075 885075 885075 885075 885075 885075 886970 886970 886970 886970 890762 890762 890762 890762 890762 886970 886970 886970 885075 885075 877522 873757 871878 868124
706.3768H64377j869%l734l726%j862l714l707n545p366j838l668l660H21860
$$ 864377 862508 862508 858774 855048 855048 853186 849472 845765 840220 832854 831016 827348 823688 821860
686.1217H18212%n457p250n418p195j4297l555l547j771p063j760l515G53874
$$ 818212 818212 812755 805505 800087 792892 778595 775040 771493 769722 762659 760899 757384 753874
667.217G48628j2175j7226l422j708%To812j698j0147j685o718n019F70380
$$ 748628 736453 719227 715805 714097 714097 714097 707285 705587 695440 693755 687037 682018 670380
648.3122F65420q224l605m3135p890p842j5535r226r155j0591l008j9508E10131
$$ 665420 657196 653591 610456 602566 594724 579189 569963 560808 550217 547209 527701 510131
630.75775D95850j2813r855j6665q225n444q107q033j0731r168j6766C72492
$$ 495850 483037 473182 456517 448292 442848 434741 426708 415977 406809 390043 372492
614.5537C62566j1012q451r540j7535j0304j9123j9489j4702j4301r970B16542
$$ 362566 351554 343103 333563 316028 305724 286601 267112 252410 238109 228139 216542
598.3497B08910r356o426j9539k0334j7427j7785j1303k1394j5834j5757D3484
$$ 208910 199554 193128 173589 153255 135828 118043 106740 85346 69512 53755 43484
582.14557C2655q670r046k058k590l450l174j236k18%UK18%K28J008M18E989
$$ 32655 23985 14939 12881 10291 6841 3667 2431 2213 2213 2213 2213 2431 2431 2659 3667 4085 5989
557.8395I655L251O316M430M544M072K354K846K954J300Q77L183Q615F9623
$$ 9655 12906 19222 23652 28196 32268 34622 37468 40422 41722 42599 45782 54397 69623
538.9347G7704J9848J3546K8836K7648J9220J7404L3199L1092L7568C66398
$$ 77704 97552 111098 139934 167582 186802 204206 237405 268497 306065 366398
524.081C85207K1732R170K2677K0488K6597R979P188M337K901M366E17563
$$ 385207 406939 416109 438786 459274 485871 495850 503038 507375 510276 514642 517563
507.87695E21960K940J0356J0451J502L008%L016%WJ510L028%L037J520E62328
$$ 521960 524900 535256 545707 547209 550217 550217 553233 553233 553233 553233 553233 553233 554743 557771 557771 560808 562328 562328
482.2205E62328%VL048%YL056%TJ531L067%S1L076%UL083%TJ544%X9E80733
$$ 562328 562328 562328 562328 562328 565376 565376 565376 565376 565376 565376 565376 565376 568432 568432 568432 569963 573030 573030 573030 573030 573030 573030 573030 573030 573030 573030 573030 573030 576106 576106 576106 576106 579189 579189 579189 580733 580733 580733 580733 580733 580733 580733 580733 580733 580733 580733 580733 580733 580733 580733 580733 580733 580733 580733 580733 580733 580733 580733 580733 580733 580733 580733 580733 580733 580733 580733 580733 580733 580733 580733 580733 580733 580733 580733 580733 580733 580733 580733 580733 580733 580733 580733 580733 580733 580733 580733 580733 580733 580733 580733 580733 580733 580733 580733 580733 580733 580733 580733 580733 580733 580733 580733 580733 580733 580733 580733
337.7342E80733  $$checkpoint
##END=  $$ end of t-butyl chloride
##END= $$ end of file