##TITLE= pyrazine
##JCAMP-DX=5.01
##DATA TYPE= LINK
##BLOCKS= 2
##TITLE= pyrazine C4N2H4 D2h
##JCAMP-DX= 5.01
##DATA TYPE= IR SPECTRUM
##DATA CLASS= XYDATA
##ORIGIN= JSpecView Converted
##OWNER= JSpecView Generated
##LONGDATE= Sat, 23 Feb 2019 17:26:06 -0500 $$ export date from JSpecView
##SPECTROMETER/DATA SYSTEM= computed
##$MODELS=
<Models>
<ModelData id="IRP" type="MOL">
pyrazine  C4N2H4
__Jmol-14_02231918003D 1   1.00000     0.00000     0
Jmol version 14.29.31  2019-01-29 15:30 EXTRACT: ({0:9})
 10 10  0  0  0  0            999 V2000
   -1.2337    0.7123    0.0000 C   0  0  0  0  0  0
   -1.2337   -0.7123    0.0000 C   0  0  0  0  0  0
    0.0000   -1.4245    0.0000 N   0  0  0  0  0  0
    1.2337   -0.7123    0.0000 C   0  0  0  0  0  0
    1.2337    0.7123    0.0000 C   0  0  0  0  0  0
    0.0000    1.4245    0.0000 N   0  0  0  0  0  0
    2.1776    1.2573    0.0000 H   0  0  0  0  0  0
    2.1776   -1.2573    0.0000 H   0  0  0  0  0  0
   -2.1776   -1.2573    0.0000 H   0  0  0  0  0  0
   -2.1776    1.2573    0.0000 H   0  0  0  0  0  0
  1  2  2  0  0  0
  2  3  1  0  0  0
  3  4  2  0  0  0
  4  5  1  0  0  0
  5  6  2  0  0  0
  6  1  1  0  0  0
  1 10  1  0  0  0
  2  9  1  0  0  0
  4  8  1  0  0  0
  5  7  1  0  0  0
M  END

</ModelData>
<ModelData id="Mi" type="XYZVIB" baseModel="IRP" vibrationScale=".5">
10
Model[1]: PATH=Calculation 1;Standard;Energy=-262.62772;Range=M.O.s;NFock==Conv=0.22D-08;E(RHF)=-262.627707891 A.U.;PATH=Calculation 1;Standard
C      -1.23365      0.71225      0.00000
C      -1.23365     -0.71225      0.00000
N       0.00000     -1.42450      0.00000
C       1.23365     -0.71225      0.00000
C       1.23365      0.71225      0.00000
N       0.00000      1.42450      0.00000
H       2.17762      1.25725      0.00000
H       2.17762     -1.25725      0.00000
H      -2.17762     -1.25725      0.00000
H      -2.17762      1.25725      0.00000
10
Model[2]: FrequencyLabel=B3U;ForceConstant=0.3174 mDyne/A;ReducedMass=12.4765 AMU;FreqValue=-207.7883;Frequency=-207.7883 cm^-1;Mode=1;PATH=Calculation 1;FrequenciesFrequencies;IRIntensity=39.3446 KM/Mole;PATH=Calculation 1;FrequenciesFrequencies
C      -1.23365      0.71225     -0.00000     -0.25000     -0.28000     -0.00000
C      -1.23365     -0.71225     -0.00000     -0.25000      0.28000     -0.00000
N      -0.00000     -1.42450     -0.00000      0.45000     -0.00000      0.00000
C       1.23365     -0.71225     -0.00000     -0.25000     -0.28000     -0.00000
C       1.23365      0.71225      0.00000     -0.25000      0.28000     -0.00000
N       0.00000      1.42450     -0.00000      0.45000     -0.00000      0.00000
H       2.17762      1.25725      0.00000     -0.08000      0.03000      0.00000
H       2.17762     -1.25725     -0.00000     -0.08000     -0.03000     -0.00000
H      -2.17762     -1.25725      0.00000     -0.08000      0.03000      0.00000
H      -2.17762      1.25725     -0.00000     -0.08000     -0.03000     -0.00000
10
$$ [...]
C      -1.23365     -0.71225     -0.00000     -0.04000     -0.03000     -0.00000
N      -0.00000     -1.42450     -0.00000      0.00000     -0.00000     -0.00000
C       1.23365     -0.71225     -0.00000     -0.04000      0.03000     -0.00000
C       1.23365      0.71225      0.00000     -0.04000     -0.03000     -0.00000
N       0.00000      1.42450     -0.00000      0.00000     -0.00000      0.00000
H       2.17762      1.25725      0.00000      0.42000      0.26000      0.00000
H       2.17762     -1.25725     -0.00000      0.42000     -0.26000      0.00000
H      -2.17762     -1.25725      0.00000      0.42000      0.26000      0.00000
H      -2.17762      1.25725     -0.00000      0.42000     -0.26000     -0.00000
10
Model[25]: FrequencyLabel=AG;ForceConstant=6.9371 mDyne/A;ReducedMass=1.0990 AMU;FreqValue=3273.1294;Frequency=3273.1294 cm^-1;Mode=24;PATH=Calculation 1;FrequenciesFrequencies;IRIntensity=0.0000 KM/Mole;PATH=Calculation 1;FrequenciesFrequencies
C      -1.23365      0.71225     -0.00000      0.04000     -0.03000     -0.00000
C      -1.23365     -0.71225     -0.00000      0.04000      0.03000      0.00000
N      -0.00000     -1.42450     -0.00000     -0.00000     -0.00000      0.00000
C       1.23365     -0.71225     -0.00000     -0.04000      0.03000     -0.00000
C       1.23365      0.71225      0.00000     -0.04000     -0.03000     -0.00000
N       0.00000      1.42450     -0.00000      0.00000      0.00000     -0.00000
H       2.17762      1.25725      0.00000      0.42000      0.26000      0.00000
H       2.17762     -1.25725     -0.00000      0.42000     -0.26000      0.00000
H      -2.17762     -1.25725      0.00000     -0.42000     -0.26000     -0.00000
H      -2.17762      1.25725     -0.00000     -0.42000      0.26000      0.00000
</ModelData>
</Models>
##$PEAKS=
<Peaks type="IR" xUnitsExpected="1/cm"  >
<PeakData id="1" title="24 (3270 cm-1)" peakShape="broad" model="Mi.24" xMax="3280" xMin="3260"    />
<PeakData id="2" title="23 (3250 cm-1)" peakShape="broad" model="Mi.25" xMax="3260" xMin="3240"    />
<PeakData id="3" title="20 (1540 cm-1)" peakShape="broad" model="Mi.20" xMax="1550" xMin="1530"    />
<PeakData id="4" title="18 (1465 cm-1)" peakShape="broad" model="Mi.18" xMax="1480" xMin="1450"    />
<PeakData id="5" title="15 (1125 cm-1)" peakShape="broad" model="Mi.15" xMax="1140" xMin="1110"    />
<PeakData id="6" title="12 (1085 cm-1)" peakShape="broad" model="Mi.12" xMax="1100" xMin="1060"    />
<PeakData id="7" title="10 ( 960 cm-1)" peakShape="broad" model="Mi.10" xMax="975" xMin="945"    />
<PeakData id="8" title="9  ( 930 cm-1)" peakShape="broad" model="Mi.9" xMax="940" xMin="920"    />
<PeakData id="9" title="4  ( 610 cm-1)" peakShape="broad" model="Mi.4" xMax="620" xMin="600"    />
</Peaks>
##XUNITS= 1/CM
##YUNITS= TRANSMITTANCE
##XFACTOR= 1
##YFACTOR= 9.999000E-07
##FIRSTX= 3.471189E+03
##FIRSTY= 1
##LASTX= 1.995753E+02
##NPOINTS= 1687
##MINY= 1.000000E-04
##MAXY= 1
##XYDATA= (X++(Y..Y))
3471.189A000100%T1j800Tj801j800Wj801j800Vj801j800Wj801j800I60496
$$ 1000100 1000100 1000100 1000100 1000100 1000100 1000100 1000100 1000100 1000100 1000100 1000100 1000100 1000100 1000100 1000100 1000100 1000100 1000100 1000100 1000100 1000100 998300 996500 994699 992899 991099 989299 987499 985699 983898 982098 980298 978498 976698 974897 973097 971297 969497 967697 965897 964096 962296 960496
3385.8088I58696j800Tj801j800Vj801q906k432k570k718k878l051l236I15065
$$ 958696 956896 955096 953295 951495 949695 947895 946095 944294 935388 932956 930386 927668 924790 921739 918503 915065
3352.821I11410l892m148m428m732n063n427n823o259o737p264p844H41309
$$ 911410 907518 903370 898942 894210 889147 883720 877897 871638 864901 857637 849793 841309
3327.595H32115r980j0852j1823j2903j4110j5455j6959j8643k0523F78243
$$ 832115 822135 811283 799460 786557 772447 756992 740033 721390 700867 678243
3306.25F53278k7568l0440l3587l6987m0589m4290m7913n1169n3639B32349
$$ 653278 625710 595270 561683 524696 484107 439817 391904 340735 287096 232349
3284.9048A78545n0145m3431l4072k3523j3920o973k962r54K06J410L250A3193
$$ 178545 128400 84969 50897 27374 13454 6481 3519 2565 2771 4181 7431 13193
3259.679B1278R052Q628Q454J0705J6628K5919L6759M6528N3181N6104C49090
$$ 21278 30330 38958 47412 58117 74745 100664 137423 183951 237132 293236 349090
3236.3933D02530M9810M5658M1426L7366L3605L0189K7127K4399K1982G33932
$$ 402530 452340 497998 539424 576790 610395 640584 667711 692110 714092 733932
3215.0483G51879J6270J4783J3463J2288J1241J0305R468Q716Q039P429H70758
$$ 751879 768149 782932 796395 808683 819924 830229 839697 848413 856452 863881 870758
3191.763H77137N926N515N139M797M484M197L934L692L469L265L074I27528
$$ 877137 883063 888578 893717 898514 902998 907195 911129 914821 918290 921555 924629 927528
3166.5369I30265K586K447K316J801J800WJ801J800WJ801J800VJ801J800I73618
$$ 930265 932851 935298 937614 939415 941215 943015 944815 946615 948415 950216 952016 953816 955616 957416 959216 961017 962817 964617 966417 968217 970018 971818 973618
3119.9658I75418J800TJ801J800VJ801J800WJ280%Y33j000l000l001l000I87099
1658.8004I85099j339n48n76o06o38o72p08p48p90q36q84r38r94j057I72642
$$ 985099 983760 983212 982636 982030 981392 980720 980012 979264 978474 977638 976754 975816 974822 973765 972642
1627.753I71445j275j361j456j558j671j794j930k079k245k428k631I48160
$$ 971445 970170 968809 967353 965795 964124 962330 960400 958321 956076 953648 951017 948160
1602.5271I45052l391l706m062m464m917n434o022j2966k0002Uk0474H06627
$$ 945052 941661 937955 933893 929429 924512 919078 913056 900090 880088 860086 840084 819610 806627
1575.3606G92076j6375j8504k0994k3910k7318l1288l5870m1074m6819D77070
$$ 792076 775701 757197 736203 712293 684975 653687 617817 576743 529924 477070
1554.0156D18423o3250o5260o3025n5375m2652k7001j0937M575J9896A50022
$$ 418423 355173 289913 226888 171513 128861 101860 90923 95498 115394 150022
1532.6705A96732N3904N5566N2702M6986L9917L2525K5376J8730J2648E42183
$$ 196732 250636 306202 358904 405890 445807 478332 503708 522438 535086 542183
1511.3256E44177k756p250j1572j5796j9978k4149k8311l2431l6417m0110B82149
$$ 544177 541421 534171 522599 506803 486825 462676 434365 401934 365517 325407 282149
1488.04B36649m6370m5342m1951l6031k8014j9118j1079n315k111p14D20
$$ 236649 190279 144937 102986 66955 38941 19823 8744 3429 1318 604 420
1464.7545E11M94J543M119R181J6888K6152L5207M2565M7504M9999N0434C33933
$$ 511 1005 2548 6667 15848 32736 58888 94095 136660 184164 234163 284597 333933
1439.5286C81142M4470M1425L8293L5211L2266K9508K6955K4617K2487F96929
$$ 381142 425612 467037 505330 540541 572807 602315 629270 653887 676374 696929
1418.1835G26630J7142J5696J4393J3217J2157J1199J0333R549Q837Q192H54950
$$ 726630 743772 759468 773861 787078 799235 810434 820767 830316 839153 847345 854950
1394.898H62021O583O138N730N357N014M700M410M143L896L669L459I18383
$$ 862021 868604 874742 880472 885829 890843 895543 899953 904096 907992 911661 915120 918383
1369.672I21465K914K757K612K477K350K231K121K018J921J829K001I48696
$$ 921465 924379 927136 929748 932225 934575 936806 938927 940945 942866 944695 946696 948696
1344.446I50696K000TK001K000VK001K000VK001K000VK001K000UL400A000100
$$ 950696 952696 954696 956697 958697 960697 962697 964697 966698 968698 970698 972698 974698 976699 978699 980699 982699 984699 986700 988700 990700 992700 996100 1000100
1297.875A000100%S8o001k000p000n001n000n001n000n001l404j412I53799
$$ 1000100 1000100 1000100 1000100 1000100 1000100 1000100 1000100 1000100 1000100 1000100 1000100 1000100 1000100 1000100 1000100 1000100 1000100 1000100 994099 992099 985099 980098 975098 970097 965097 960096 956692 955280 953799
1239.6613I52244j633j717j807j904k006k117k235k362k500k647k806I25531
$$ 952244 950611 948894 947087 945183 943177 941060 938825 936463 933963 931316 928510 925531
1214.4353I22367l367l585l822j2503r001j5001j2012o213o641p110p622H27307
$$ 922367 919000 915415 911593 899090 890089 875088 863076 856863 850222 843112 835490 827307
1189.2094H18509r475j0221j1042j1950j2955j4066j5299j6667j8186F78777
$$ 818509 809034 798813 787771 775821 762866 748800 733501 716834 698648 678777
1167.8643F57036k3811k6096k8606l1342l4292l7418m0650m3859m6842B94826
$$ 657036 633225 607129 578523 547181 512889 475471 434821 390962 344120 294826
1146.5193B44036n0786m8687m4017l6719k7502j7946r940m633j830n39A641
$$ 244036 193250 144563 100546 63827 36325 18379 8439 3806 1976 1437 1641
1123.2338B762K926O270J1146J6417K0315K1459J9372J4392P324q21q928I6827
$$ 2762 5688 11958 23104 39521 59836 81295 100667 115059 122383 121562 112634 96827
1098.0078G6558k1406j9068j4268q878m476j406J106M359R730J7943K5628A02765
$$ 76558 55152 36084 21816 12938 8462 7056 8162 12521 22251 40194 65822 102765
1072.7819A47542M9599N1428N0865M8668M5504M1877L8120L4446L0969E66762
$$ 147542 197141 248569 299434 348102 393606 435483 473603 508049 539018 566762
1051.4368E57324J9685J7266J5069J3067J1241R565Q017O580N234L963F69763
$$ 557324 577009 594275 609344 622411 633652 643217 651234 657814 663048 667011 669763
1028.1512F71351M58o51j748k846l956n085o249p454q714j0040j1441F26487
$$ 671351 671809 671158 669410 666564 662608 657523 651274 643820 635106 625066 613625 626487
1002.9253F10543j7643j9472k1439k3551k5811k8211l0732l3334l5951C35930
$$ 610543 592900 573428 551989 528438 502627 474416 443684 410350 374399 335930
981.58026B95205m2478m3405m3105m1148l7192l1198k3683j5810q794C860
$$ 295205 252727 209322 166217 125069 87877 56679 32996 17186 8392 3860
960.23517A975o44l4M22Q85J204J015J96q25j407j307q24l83j40l3L6C07
$$ 1975 1331 1297 1719 2604 3808 4823 5019 4194 2787 1480 656 273 133 100 136 307
927.2474I02J820M612R511J6241K3755L0816L6518M0471M2689M3425B93773
$$ 902 2722 7334 16845 33086 56841 87657 124175 164646 207335 250760 293773
903.96185C35553M0003L7905L5645L3338L1061K8866K6781K4823K2999F38283
$$ 335553 375556 413461 449106 482444 513505 542371 569152 593975 616974 638283
882.6168F58031J8313J6993J5783J4673J3654J2719J1863J1075J0352G93143
$$ 658031 676344 693337 709120 723793 737447 750166 762029 773104 783456 793143
861.2718H02218Q511P990P510P066O654O274N921N000N001N000N001H77146
$$ 802218 810729 818719 826229 833295 839949 846223 852144 857144 862145 867145 872146 877146
836.04584H82147N000N001N000N001N000N001N000N001N000N001N000I42153
$$ 882147 887147 892148 897148 902149 907149 912150 917150 922151 927151 932152 937152 942153
810.8199I47153N001N000N001K942N000%U6n000k001l000k603j434j506I52969
$$ 947153 952154 957154 962155 965097 970097 970097 970097 970097 970097 970097 970097 970097 970097 970097 970097 970097 970097 970097 970097 970097 970097 970097 970097 970097 970097 970097 970097 970097 970097 970097 970097 970097 970097 970097 970097 970097 970097 970097 970097 970097 970097 965097 963096 960096 957493 956059 954553 952969
715.73737I51302j756j852j953k063k182k308k445k593k753k925l113I22043
$$ 951302 949546 947694 945741 943678 941496 939188 936743 934150 931397 928472 925359 922043
690.5114I18506l777m040m327m639m983n361n775o232o737p296p914H48824
$$ 918506 914729 910689 906362 901723 896740 891379 885604 879372 872635 865339 857425 848824
665.28546H39458j0218j1170j2236j3429j4768j6274j7967j9871k2011F77100
$$ 839458 829240 818070 805834 792405 777637 761363 743396 723525 701514 677100
643.94037F49998l0098l3406l7019m0894m4932m8960n2684n5660n7267A92340
$$ 649998 619900 586494 549475 508581 463649 414689 362005 306345 249078 192340
622.59534A39033m6530l6773k5554j5209p651l239r74M83K351N938J2450D6382
$$ 139033 92503 55730 30176 14967 7316 4077 3103 3586 5937 11875 24325 46382
597.3694G9643M3703N1519N5994N7369N6353N3738N0194M6225M2166E75131
$$ 79643 123346 174865 230859 288228 344581 398319 448513 494738 536904 575131
576.02435F09654L1115K8021K5236K2746K0524J8548J6791J5228J3838H14301
$$ 609654 640769 668790 694026 716772 737296 755844 772635 787863 801701 814301
554.67926H25797J0509R627Q836Q124P486O908O387N916N488N099M746I09346
$$ 825797 836306 845933 854769 862893 870379 877287 883674 889590 895078 900177 904923 909346
529.4533I13474L000TL001L000TL001L000UL001L000TL001L000TL001I64479
$$ 913474 916474 919474 922475 925475 928475 931476 934476 937476 940476 943477 946477 949477 952478 955478 958478 961479 964479
494.52505I67479L000L001L000TL001L000TO619N000%S41A000100
199.57532A000100  $$checkpoint
##END= $$ end of pyrazine IR
##TITLE= pyrazine C4N2H4 D2h
##JCAMP-DX= 5.01
##DATA TYPE= RAMAN SPECTRUM
##DATA CLASS= XYDATA
##ORIGIN= WebMO
##OWNER= public domain
##LONGDATE= Sat, 23 Feb 2019 15:56:21 -0500 $$ export date from JSpecView
##SPECTROMETER/DATA SYSTEM= computed
##$MODELS=
<Models>
<ModelData id="RP" type="MOL">
pyrazine  C4N2H4
__Jmol-14_02231918003D 1   1.00000     0.00000     0
Jmol version 14.29.31  2019-01-29 15:30 EXTRACT: ({0:9})
 10 10  0  0  0  0            999 V2000
   -1.2337    0.7123    0.0000 C   0  0  0  0  0  0
   -1.2337   -0.7123    0.0000 C   0  0  0  0  0  0
   -0.0000   -1.4245    0.0000 N   0  0  0  0  0  0
    1.2337   -0.7123    0.0000 C   0  0  0  0  0  0
    1.2337    0.7123    0.0000 C   0  0  0  0  0  0
    0.0000    1.4245    0.0000 N   0  0  0  0  0  0
    2.1776    1.2573    0.0000 H   0  0  0  0  0  0
    2.1776   -1.2573    0.0000 H   0  0  0  0  0  0
   -2.1776   -1.2573    0.0000 H   0  0  0  0  0  0
   -2.1776    1.2573    0.0000 H   0  0  0  0  0  0
  1  2  2  0  0  0
  2  3  1  0  0  0
  3  4  2  0  0  0
  4  5  1  0  0  0
  5  6  2  0  0  0
  6  1  1  0  0  0
  1 10  1  0  0  0
  2  9  1  0  0  0
  4  8  1  0  0  0
  5  7  1  0  0  0
M  END
</ModelData>
<ModelData id="MR" type="XYZVIB" baseModel="RP" vibrationScale=".5">
10
Model[1]: PATH=Calculation 1;Standard;Energy=-262.62772;Range=M.O.s;NFock==Conv=0.22D-08;E(RHF)=-262.627707891 A.U.;PATH=Calculation 1;Standard
C      -1.23365      0.71225     -0.00000
C      -1.23365     -0.71225     -0.00000
N      -0.00000     -1.42450     -0.00000
C       1.23365     -0.71225     -0.00000
C       1.23365      0.71225      0.00000
N       0.00000      1.42450     -0.00000
H       2.17762      1.25725      0.00000
H       2.17762     -1.25725     -0.00000
H      -2.17762     -1.25725      0.00000
H      -2.17762      1.25725     -0.00000
10
Model[2]: FrequencyLabel=B3U;ForceConstant=0.3174 mDyne/A;ReducedMass=12.4765 AMU;FreqValue=-207.7883;Frequency=-207.7883 cm^-1;Mode=1;PATH=Calculation 1;FrequenciesFrequencies;IRIntensity=39.3446 KM/Mole;PATH=Calculation 1;FrequenciesFrequencies
C      -1.23365      0.71225     -0.00000     -0.25000     -0.28000     -0.00000
C      -1.23365     -0.71225     -0.00000     -0.25000      0.28000     -0.00000
N      -0.00000     -1.42450     -0.00000      0.45000     -0.00000      0.00000
C       1.23365     -0.71225     -0.00000     -0.25000     -0.28000     -0.00000
C       1.23365      0.71225      0.00000     -0.25000      0.28000     -0.00000
N       0.00000      1.42450     -0.00000      0.45000     -0.00000      0.00000
H       2.17762      1.25725      0.00000     -0.08000      0.03000      0.00000
H       2.17762     -1.25725     -0.00000     -0.08000     -0.03000     -0.00000
H      -2.17762     -1.25725      0.00000     -0.08000      0.03000      0.00000
H      -2.17762      1.25725     -0.00000     -0.08000     -0.03000     -0.00000
10
Model[3]: FrequencyLabel=AU;ForceConstant=0.3829 mDyne/A;ReducedMass=2.4223 AMU;FreqValue=517.9443;Frequency=517.9443 cm^-1;Mode=2;PATH=Calculation 1;FrequenciesFrequencies;IRIntensity=0.0000 KM/Mole;PATH=Calculation 1;FrequenciesFrequencies
C      -1.23365      0.71225     -0.00000      0.00000     -0.00000      0.18001
C      -1.23365     -0.71225     -0.00000      0.00000      0.00000     -0.18001
N      -0.00000     -1.42450     -0.00000      0.00000     -0.00000      0.00000
C       1.23365     -0.71225     -0.00000     -0.00000      0.00000      0.18001
C       1.23365      0.71225      0.00000     -0.00000      0.00000     -0.18001
N       0.00000      1.42450     -0.00000      0.00000      0.00000      0.00000
H       2.17762      1.25725      0.00000     -0.00000     -0.00000     -0.47000
H       2.17762     -1.25725     -0.00000     -0.00000      0.00000      0.47000
H      -2.17762     -1.25725      0.00000      0.00000      0.00000     -0.47000
H      -2.17762      1.25725     -0.00000      0.00000     -0.00000      0.47000
10
Model[4]: FrequencyLabel=B1U;ForceConstant=1.6051 mDyne/A;ReducedMass=7.3439 AMU;FreqValue=609.0589;Frequency=609.0589 cm^-1;Mode=3;PATH=Calculation 1;FrequenciesFrequencies;IRIntensity=28.8126 KM/Mole;PATH=Calculation 1;FrequenciesFrequencies
C      -1.23365      0.71225     -0.00000     -0.00000      0.00000     -0.21000
C      -1.23365     -0.71225     -0.00000      0.00000      0.00000     -0.21000
N      -0.00000     -1.42450     -0.00000     -0.00000     -0.00000      0.41000
C       1.23365     -0.71225     -0.00000      0.00000     -0.00000     -0.21000
C       1.23365      0.71225      0.00000     -0.00000     -0.00000     -0.21000
N       0.00000      1.42450     -0.00000     -0.00000      0.00000      0.41000
H       2.17762      1.25725      0.00000     -0.00000     -0.00000     -0.35000
H       2.17762     -1.25725     -0.00000      0.00000     -0.00000     -0.35000
H      -2.17762     -1.25725      0.00000      0.00000      0.00000     -0.35000
H      -2.17762      1.25725     -0.00000     -0.00000      0.00000     -0.35000
10
Model[5]: FrequencyLabel=AG;ForceConstant=2.4960 mDyne/A;ReducedMass=9.7450 AMU;FreqValue=659.3377;Frequency=659.3377 cm^-1;Mode=4;PATH=Calculation 1;FrequenciesFrequencies;IRIntensity=0.0000 KM/Mole;PATH=Calculation 1;FrequenciesFrequencies
C      -1.23365      0.71225     -0.00000     -0.27001     -0.06000      0.00000
C      -1.23365     -0.71225     -0.00000     -0.27001      0.06000     -0.00000
N      -0.00000     -1.42450     -0.00000      0.00000      0.45000     -0.00000
C       1.23365     -0.71225     -0.00000      0.27001      0.06000      0.00000
C       1.23365      0.71225      0.00000      0.27001     -0.06000     -0.00000
N       0.00000      1.42450     -0.00000     -0.00000     -0.45000      0.00000
H       2.17762      1.25725      0.00000      0.10000      0.24000     -0.00000
H       2.17762     -1.25725     -0.00000      0.10000     -0.24000      0.00000
H      -2.17762     -1.25725      0.00000     -0.10000     -0.24000     -0.00000
H      -2.17762      1.25725     -0.00000     -0.10000      0.24000      0.00000
10
Model[6]: FrequencyLabel=B1G;ForceConstant=2.1920 mDyne/A;ReducedMass=7.3024 AMU;FreqValue=713.7850;Frequency=713.7850 cm^-1;Mode=5;PATH=Calculation 1;FrequenciesFrequencies;IRIntensity=0.0000 KM/Mole;PATH=Calculation 1;FrequenciesFrequencies
C      -1.23365      0.71225     -0.00000     -0.21000      0.27001      0.00000
C      -1.23365     -0.71225     -0.00000      0.21000      0.27001      0.00000
N      -0.00000     -1.42450     -0.00000      0.21000     -0.00000     -0.00000
C       1.23365     -0.71225     -0.00000      0.21000     -0.27001      0.00000
C       1.23365      0.71225      0.00000     -0.21000     -0.27001      0.00000
N       0.00000      1.42450     -0.00000     -0.21000      0.00000     -0.00000
H       2.17762      1.25725      0.00000     -0.30001     -0.14000     -0.00000
H       2.17762     -1.25725     -0.00000      0.30001     -0.14000     -0.00000
H      -2.17762     -1.25725      0.00000      0.30001      0.14000     -0.00000
H      -2.17762      1.25725     -0.00000     -0.30001      0.14000     -0.00000
10
Model[7]: FrequencyLabel=B3G;ForceConstant=1.8758 mDyne/A;ReducedMass=4.3101 AMU;FreqValue=859.4510;Frequency=859.4510 cm^-1;Mode=6;PATH=Calculation 1;FrequenciesFrequencies;IRIntensity=0.0000 KM/Mole;PATH=Calculation 1;FrequenciesFrequencies
C      -1.23365      0.71225     -0.00000     -0.00000      0.00000      0.21000
C      -1.23365     -0.71225     -0.00000     -0.00000     -0.00000     -0.21000
N      -0.00000     -1.42450     -0.00000     -0.00000     -0.00000      0.23001
C       1.23365     -0.71225     -0.00000      0.00000     -0.00000     -0.21000
C       1.23365      0.71225      0.00000      0.00000      0.00000      0.21000
N       0.00000      1.42450     -0.00000     -0.00000      0.00000     -0.23001
H       2.17762      1.25725      0.00000      0.00000      0.00000      0.42000
H       2.17762     -1.25725     -0.00000      0.00000     -0.00000     -0.42000
H      -2.17762     -1.25725      0.00000     -0.00000     -0.00000     -0.42000
H      -2.17762      1.25725     -0.00000     -0.00000      0.00000      0.42000
10
Model[8]: FrequencyLabel=AG;ForceConstant=3.4934 mDyne/A;ReducedMass=7.8306 AMU;FreqValue=870.1598;Frequency=870.1598 cm^-1;Mode=7;PATH=Calculation 1;FrequenciesFrequencies;IRIntensity=0.0000 KM/Mole;PATH=Calculation 1;FrequenciesFrequencies
C      -1.23365      0.71225     -0.00000      0.30001     -0.09000      0.00000
C      -1.23365     -0.71225     -0.00000      0.30001      0.09000     -0.00000
N      -0.00000     -1.42450     -0.00000      0.00000      0.31000      0.00000
C       1.23365     -0.71225     -0.00000     -0.30001      0.09000     -0.00000
C       1.23365      0.71225      0.00000     -0.30001     -0.09000      0.00000
N       0.00000      1.42450     -0.00000     -0.00000     -0.31000     -0.00000
H       2.17762      1.25725      0.00000     -0.30001     -0.12000      0.00000
H       2.17762     -1.25725     -0.00000     -0.30001      0.12000     -0.00000
H      -2.17762     -1.25725      0.00000      0.30001      0.12000     -0.00000
H      -2.17762      1.25725     -0.00000      0.30001     -0.12000      0.00000
10
Model[9]: FrequencyLabel=B1U;ForceConstant=0.5785 mDyne/A;ReducedMass=1.1288 AMU;FreqValue=932.6357;Frequency=932.6357 cm^-1;Mode=8;PATH=Calculation 1;FrequenciesFrequencies;IRIntensity=42.1408 KM/Mole;PATH=Calculation 1;FrequenciesFrequencies
C      -1.23365      0.71225     -0.00000     -0.00000      0.00000     -0.05000
C      -1.23365     -0.71225     -0.00000     -0.00000      0.00000     -0.05000
N      -0.00000     -1.42450     -0.00000      0.00000     -0.00000      0.02000
C       1.23365     -0.71225     -0.00000      0.00000     -0.00000     -0.05000
C       1.23365      0.71225      0.00000     -0.00000     -0.00000     -0.05000
N       0.00000      1.42450     -0.00000     -0.00000     -0.00000      0.02000
H       2.17762      1.25725      0.00000     -0.00000      0.00000      0.50000
H       2.17762     -1.25725     -0.00000      0.00000      0.00000      0.50000
H      -2.17762     -1.25725      0.00000     -0.00000      0.00000      0.50000
H      -2.17762      1.25725     -0.00000      0.00000      0.00000      0.50000
10
Model[10]: FrequencyLabel=B2U;ForceConstant=1.8076 mDyne/A;ReducedMass=3.3429 AMU;FreqValue=958.0074;Frequency=958.0074 cm^-1;Mode=9;PATH=Calculation 1;FrequenciesFrequencies;IRIntensity=27.4273 KM/Mole;PATH=Calculation 1;FrequenciesFrequencies
C      -1.23365      0.71225     -0.00000     -0.12000     -0.10000     -0.00000
C      -1.23365     -0.71225     -0.00000      0.12000     -0.10000     -0.00000
N      -0.00000     -1.42450     -0.00000      0.00000      0.22000      0.00000
C       1.23365     -0.71225     -0.00000     -0.12000     -0.10000     -0.00000
C       1.23365      0.71225      0.00000      0.12000     -0.10000     -0.00000
N       0.00000      1.42450     -0.00000      0.00000      0.22000     -0.00000
H       2.17762      1.25725      0.00000      0.28000     -0.35000      0.00000
H       2.17762     -1.25725     -0.00000     -0.28000     -0.35000      0.00000
H      -2.17762     -1.25725      0.00000      0.28000     -0.35000      0.00000
H      -2.17762      1.25725     -0.00000     -0.28000     -0.35000      0.00000
10
Model[11]: FrequencyLabel=B2G;ForceConstant=0.8176 mDyne/A;ReducedMass=1.2442 AMU;FreqValue=1056.1017;Frequency=1056.1017 cm^-1;Mode=10;PATH=Calculation 1;FrequenciesFrequencies;IRIntensity=0.0000 KM/Mole;PATH=Calculation 1;FrequenciesFrequencies
C      -1.23365      0.71225     -0.00000     -0.00000      0.00000      0.07000
C      -1.23365     -0.71225     -0.00000      0.00000      0.00000      0.07000
N      -0.00000     -1.42450     -0.00000     -0.00000     -0.00000     -0.00000
C       1.23365     -0.71225     -0.00000     -0.00000      0.00000     -0.07000
C       1.23365      0.71225      0.00000      0.00000      0.00000     -0.07000
N       0.00000      1.42450     -0.00000      0.00000     -0.00000      0.00000
H       2.17762      1.25725      0.00000      0.00000      0.00000      0.49001
H       2.17762     -1.25725     -0.00000     -0.00000     -0.00000      0.49001
H      -2.17762     -1.25725      0.00000      0.00000      0.00000     -0.49001
H      -2.17762      1.25725     -0.00000     -0.00000      0.00000     -0.49001
10
Model[12]: FrequencyLabel=B2U;ForceConstant=4.6411 mDyne/A;ReducedMass=6.6842 AMU;FreqValue=1085.5717;Frequency=1085.5717 cm^-1;Mode=11;PATH=Calculation 1;FrequenciesFrequencies;IRIntensity=22.9056 KM/Mole;PATH=Calculation 1;FrequenciesFrequencies
C      -1.23365      0.71225     -0.00000      0.28000     -0.13000      0.00000
C      -1.23365     -0.71225     -0.00000     -0.28000     -0.13000      0.00000
N      -0.00000     -1.42450     -0.00000     -0.00000      0.23001     -0.00000
C       1.23365     -0.71225     -0.00000      0.28000     -0.13000     -0.00000
C       1.23365      0.71225      0.00000     -0.28000     -0.13000     -0.00000
N       0.00000      1.42450     -0.00000     -0.00000      0.23001      0.00000
H       2.17762      1.25725      0.00000     -0.35000     -0.05000      0.00000
H       2.17762     -1.25725     -0.00000      0.35000     -0.05000      0.00000
H      -2.17762     -1.25725      0.00000     -0.35000     -0.05000     -0.00000
H      -2.17762      1.25725     -0.00000      0.35000     -0.05000     -0.00000
10
Model[13]: FrequencyLabel=B3G;ForceConstant=0.9259 mDyne/A;ReducedMass=1.2933 AMU;FreqValue=1102.3029;Frequency=1102.3029 cm^-1;Mode=12;PATH=Calculation 1;FrequenciesFrequencies;IRIntensity=0.0000 KM/Mole;PATH=Calculation 1;FrequenciesFrequencies
C      -1.23365      0.71225     -0.00000     -0.00000     -0.00000     -0.08000
C      -1.23365     -0.71225     -0.00000      0.00000      0.00000      0.08000
N      -0.00000     -1.42450     -0.00000     -0.00000     -0.00000     -0.01000
C       1.23365     -0.71225     -0.00000      0.00000     -0.00000      0.08000
C       1.23365      0.71225      0.00000      0.00000      0.00000     -0.08000
N       0.00000      1.42450     -0.00000     -0.00000     -0.00000      0.01000
H       2.17762      1.25725      0.00000     -0.00000      0.00000      0.49001
H       2.17762     -1.25725     -0.00000      0.00000     -0.00000     -0.49001
H      -2.17762     -1.25725      0.00000      0.00000      0.00000     -0.49001
H      -2.17762      1.25725     -0.00000     -0.00000     -0.00000      0.49001
10
Model[14]: FrequencyLabel=AU;ForceConstant=1.1141 mDyne/A;ReducedMass=1.5089 AMU;FreqValue=1119.4454;Frequency=1119.4454 cm^-1;Mode=13;PATH=Calculation 1;FrequenciesFrequencies;IRIntensity=0.0000 KM/Mole;PATH=Calculation 1;FrequenciesFrequencies
C      -1.23365      0.71225     -0.00000     -0.00000      0.00000      0.11000
C      -1.23365     -0.71225     -0.00000     -0.00000     -0.00000     -0.11000
N      -0.00000     -1.42450     -0.00000      0.00000      0.00000      0.00000
C       1.23365     -0.71225     -0.00000     -0.00000      0.00000      0.11000
C       1.23365      0.71225      0.00000     -0.00000     -0.00000     -0.11000
N       0.00000      1.42450     -0.00000      0.00000     -0.00000      0.00000
H       2.17762      1.25725      0.00000      0.00000     -0.00000      0.49001
H       2.17762     -1.25725     -0.00000      0.00000      0.00000     -0.49001
H      -2.17762     -1.25725      0.00000      0.00000     -0.00000      0.49001
H      -2.17762      1.25725     -0.00000      0.00000      0.00000     -0.49001
10
Model[15]: FrequencyLabel=B3U;ForceConstant=1.7195 mDyne/A;ReducedMass=2.3021 AMU;FreqValue=1125.9481;Frequency=1125.9481 cm^-1;Mode=14;PATH=Calculation 1;FrequenciesFrequencies;IRIntensity=31.3704 KM/Mole;PATH=Calculation 1;FrequenciesFrequencies
C      -1.23365      0.71225     -0.00000     -0.07000      0.14000     -0.00000
C      -1.23365     -0.71225     -0.00000     -0.07000     -0.14000      0.00000
N      -0.00000     -1.42450     -0.00000      0.10000      0.00000      0.00000
C       1.23365     -0.71225     -0.00000     -0.07000      0.14000     -0.00000
C       1.23365      0.71225      0.00000     -0.07000     -0.14000      0.00000
N       0.00000      1.42450     -0.00000      0.10000      0.00000     -0.00000
H       2.17762      1.25725      0.00000      0.11000     -0.46001     -0.00000
H       2.17762     -1.25725     -0.00000      0.11000      0.46001      0.00000
H      -2.17762     -1.25725      0.00000      0.11000     -0.46001     -0.00000
H      -2.17762      1.25725     -0.00000      0.11000      0.46001      0.00000
10
Model[16]: FrequencyLabel=AG;ForceConstant=1.3090 mDyne/A;ReducedMass=1.4420 AMU;FreqValue=1241.2350;Frequency=1241.2350 cm^-1;Mode=15;PATH=Calculation 1;FrequenciesFrequencies;IRIntensity=0.0000 KM/Mole;PATH=Calculation 1;FrequenciesFrequencies
C      -1.23365      0.71225     -0.00000      0.02000      0.10000     -0.00000
C      -1.23365     -0.71225     -0.00000      0.02000     -0.10000      0.00000
N      -0.00000     -1.42450     -0.00000      0.00000      0.01000     -0.00000
C       1.23365     -0.71225     -0.00000     -0.02000     -0.10000      0.00000
C       1.23365      0.71225      0.00000     -0.02000      0.10000     -0.00000
N       0.00000      1.42450     -0.00000     -0.00000     -0.01000      0.00000
H       2.17762      1.25725      0.00000     -0.22000      0.44000     -0.00000
H       2.17762     -1.25725     -0.00000     -0.22000     -0.44000     -0.00000
H      -2.17762     -1.25725      0.00000      0.22000     -0.44000     -0.00000
H      -2.17762      1.25725     -0.00000      0.22000      0.44000      0.00000
10
Model[17]: FrequencyLabel=B1G;ForceConstant=3.9928 mDyne/A;ReducedMass=4.3279 AMU;FreqValue=1251.3391;Frequency=1251.3391 cm^-1;Mode=16;PATH=Calculation 1;FrequenciesFrequencies;IRIntensity=0.0000 KM/Mole;PATH=Calculation 1;FrequenciesFrequencies
C      -1.23365      0.71225     -0.00000      0.17000      0.02000     -0.00000
C      -1.23365     -0.71225     -0.00000     -0.17000      0.02000      0.00000
N      -0.00000     -1.42450     -0.00000      0.28000     -0.00000     -0.00000
C       1.23365     -0.71225     -0.00000     -0.17000     -0.02000      0.00000
C       1.23365      0.71225      0.00000      0.17000     -0.02000     -0.00000
N       0.00000      1.42450     -0.00000     -0.28000      0.00000      0.00000
H       2.17762      1.25725      0.00000      0.32000     -0.28000      0.00000
H       2.17762     -1.25725     -0.00000     -0.32000     -0.28000     -0.00000
H      -2.17762     -1.25725      0.00000     -0.32000      0.28000     -0.00000
H      -2.17762      1.25725     -0.00000      0.32000      0.28000     -0.00000
10
Model[18]: FrequencyLabel=B3U;ForceConstant=1.8881 mDyne/A;ReducedMass=1.4922 AMU;FreqValue=1465.4849;Frequency=1465.4849 cm^-1;Mode=17;PATH=Calculation 1;FrequenciesFrequencies;IRIntensity=38.5855 KM/Mole;PATH=Calculation 1;FrequenciesFrequencies
C      -1.23365      0.71225     -0.00000     -0.01000      0.09000     -0.00000
C      -1.23365     -0.71225     -0.00000     -0.01000     -0.09000      0.00000
N      -0.00000     -1.42450     -0.00000      0.07000      0.00000      0.00000
C       1.23365     -0.71225     -0.00000     -0.01000      0.09000     -0.00000
C       1.23365      0.71225      0.00000     -0.01000     -0.09000      0.00000
N       0.00000      1.42450     -0.00000      0.07000      0.00000     -0.00000
H       2.17762      1.25725      0.00000     -0.32000      0.37000     -0.00000
H       2.17762     -1.25725     -0.00000     -0.32000     -0.37000     -0.00000
H      -2.17762     -1.25725      0.00000     -0.32000      0.37000     -0.00000
H      -2.17762      1.25725     -0.00000     -0.32000     -0.37000      0.00000
10
Model[19]: FrequencyLabel=B1G;ForceConstant=1.8033 mDyne/A;ReducedMass=1.3748 AMU;FreqValue=1492.0664;Frequency=1492.0664 cm^-1;Mode=18;PATH=Calculation 1;FrequenciesFrequencies;IRIntensity=0.0000 KM/Mole;PATH=Calculation 1;FrequenciesFrequencies
C      -1.23365      0.71225     -0.00000      0.07000      0.05000     -0.00000
C      -1.23365     -0.71225     -0.00000     -0.07000      0.05000      0.00000
N      -0.00000     -1.42450     -0.00000      0.02000     -0.00000     -0.00000
C       1.23365     -0.71225     -0.00000     -0.07000     -0.05000     -0.00000
C       1.23365      0.71225      0.00000      0.07000     -0.05000     -0.00000
N       0.00000      1.42450     -0.00000     -0.02000      0.00000      0.00000
H       2.17762      1.25725      0.00000     -0.22000      0.44000     -0.00000
H       2.17762     -1.25725     -0.00000      0.22000      0.44000      0.00000
H      -2.17762     -1.25725      0.00000      0.22000     -0.44000     -0.00000
H      -2.17762      1.25725     -0.00000     -0.22000     -0.44000      0.00000
10
Model[20]: FrequencyLabel=B2U;ForceConstant=1.9102 mDyne/A;ReducedMass=1.3662 AMU;FreqValue=1540.4934;Frequency=1540.4934 cm^-1;Mode=19;PATH=Calculation 1;FrequenciesFrequencies;IRIntensity=11.2707 KM/Mole;PATH=Calculation 1;FrequenciesFrequencies
C      -1.23365      0.71225     -0.00000     -0.06000     -0.06000      0.00000
C      -1.23365     -0.71225     -0.00000      0.06000     -0.06000     -0.00000
N      -0.00000     -1.42450     -0.00000      0.00000      0.04000     -0.00000
C       1.23365     -0.71225     -0.00000     -0.06000     -0.06000     -0.00000
C       1.23365      0.71225      0.00000      0.06000     -0.06000     -0.00000
N       0.00000      1.42450     -0.00000      0.00000      0.04000      0.00000
H       2.17762      1.25725      0.00000     -0.23001      0.43000     -0.00000
H       2.17762     -1.25725     -0.00000      0.23001      0.43000      0.00000
H      -2.17762     -1.25725      0.00000     -0.23001      0.43000      0.00000
H      -2.17762      1.25725     -0.00000      0.23001      0.43000     -0.00000
10
Model[21]: FrequencyLabel=AG;ForceConstant=3.9268 mDyne/A;ReducedMass=2.5716 AMU;FreqValue=1609.8611;Frequency=1609.8611 cm^-1;Mode=20;PATH=Calculation 1;FrequenciesFrequencies;IRIntensity=0.0000 KM/Mole;PATH=Calculation 1;FrequenciesFrequencies
C      -1.23365      0.71225     -0.00000      0.02000      0.18001     -0.00000
C      -1.23365     -0.71225     -0.00000      0.02000     -0.18001      0.00000
N      -0.00000     -1.42450     -0.00000     -0.00000      0.08000     -0.00000
C       1.23365     -0.71225     -0.00000     -0.02000     -0.18001      0.00000
C       1.23365      0.71225      0.00000     -0.02000      0.18001     -0.00000
N       0.00000      1.42450     -0.00000      0.00000     -0.08000      0.00000
H       2.17762      1.25725      0.00000      0.32000     -0.33001      0.00000
H       2.17762     -1.25725     -0.00000      0.32000      0.33001      0.00000
H      -2.17762     -1.25725      0.00000     -0.32000      0.33001     -0.00000
H      -2.17762      1.25725     -0.00000     -0.32000     -0.33001      0.00000
10
Model[22]: FrequencyLabel=B1G;ForceConstant=6.7779 mDyne/A;ReducedMass=1.0885 AMU;FreqValue=3250.9838;Frequency=3250.9838 cm^-1;Mode=21;PATH=Calculation 1;FrequenciesFrequencies;IRIntensity=0.0000 KM/Mole;PATH=Calculation 1;FrequenciesFrequencies
C      -1.23365      0.71225     -0.00000     -0.04000      0.02000      0.00000
C      -1.23365     -0.71225     -0.00000      0.04000      0.02000      0.00000
N      -0.00000     -1.42450     -0.00000     -0.00000      0.00000      0.00000
C       1.23365     -0.71225     -0.00000      0.04000     -0.02000      0.00000
C       1.23365      0.71225      0.00000     -0.04000     -0.02000     -0.00000
N       0.00000      1.42450     -0.00000      0.00000     -0.00000      0.00000
H       2.17762      1.25725      0.00000      0.43000      0.26000      0.00000
H       2.17762     -1.25725     -0.00000     -0.43000      0.26000     -0.00000
H      -2.17762     -1.25725      0.00000     -0.43000     -0.26000     -0.00000
H      -2.17762      1.25725     -0.00000      0.43000     -0.26000     -0.00000
10
Model[22]: FrequencyLabel=B2U;ForceConstant=6.7946 mDyne/A;ReducedMass=1.0906 AMU;FreqValue=3251.7540;Frequency=3251.7540 cm^-1;Mode=22;PATH=Calculation 1;FrequenciesFrequencies;IRIntensity=7.0720 KM/Mole;PATH=Calculation 1;FrequenciesFrequencies
C      -1.23365      0.71225     -0.00000      0.04000     -0.02000     -0.00000
C      -1.23365     -0.71225     -0.00000     -0.04000     -0.02000     -0.00000
N      -0.00000     -1.42450     -0.00000      0.00000      0.00000      0.00000
C       1.23365     -0.71225     -0.00000      0.04000     -0.02000      0.00000
C       1.23365      0.71225      0.00000     -0.04000     -0.02000     -0.00000
N       0.00000      1.42450     -0.00000      0.00000      0.00000     -0.00000
H       2.17762      1.25725      0.00000      0.43000      0.26000      0.00000
H       2.17762     -1.25725     -0.00000     -0.43000      0.26000     -0.00000
H      -2.17762     -1.25725      0.00000      0.43000      0.26000      0.00000
H      -2.17762      1.25725     -0.00000     -0.43000      0.26000      0.00000
10
Model[24]: FrequencyLabel=B3U;ForceConstant=6.8967 mDyne/A;ReducedMass=1.0954 AMU;FreqValue=3268.9481;Frequency=3268.9481 cm^-1;Mode=23;PATH=Calculation 1;FrequenciesFrequencies;IRIntensity=28.0616 KM/Mole;PATH=Calculation 1;FrequenciesFrequencies
C      -1.23365      0.71225     -0.00000     -0.04000      0.03000      0.00000
C      -1.23365     -0.71225     -0.00000     -0.04000     -0.03000     -0.00000
N      -0.00000     -1.42450     -0.00000      0.00000     -0.00000     -0.00000
C       1.23365     -0.71225     -0.00000     -0.04000      0.03000     -0.00000
C       1.23365      0.71225      0.00000     -0.04000     -0.03000     -0.00000
N       0.00000      1.42450     -0.00000      0.00000     -0.00000      0.00000
H       2.17762      1.25725      0.00000      0.42000      0.26000      0.00000
H       2.17762     -1.25725     -0.00000      0.42000     -0.26000      0.00000
H      -2.17762     -1.25725      0.00000      0.42000      0.26000      0.00000
H      -2.17762      1.25725     -0.00000      0.42000     -0.26000     -0.00000
10
Model[25]: FrequencyLabel=AG;ForceConstant=6.9371 mDyne/A;ReducedMass=1.0990 AMU;FreqValue=3273.1294;Frequency=3273.1294 cm^-1;Mode=24;PATH=Calculation 1;FrequenciesFrequencies;IRIntensity=0.0000 KM/Mole;PATH=Calculation 1;FrequenciesFrequencies
C      -1.23365      0.71225     -0.00000      0.04000     -0.03000     -0.00000
C      -1.23365     -0.71225     -0.00000      0.04000      0.03000      0.00000
N      -0.00000     -1.42450     -0.00000     -0.00000     -0.00000      0.00000
C       1.23365     -0.71225     -0.00000     -0.04000      0.03000     -0.00000
C       1.23365      0.71225      0.00000     -0.04000     -0.03000     -0.00000
N       0.00000      1.42450     -0.00000      0.00000      0.00000     -0.00000
H       2.17762      1.25725      0.00000      0.42000      0.26000      0.00000
H       2.17762     -1.25725     -0.00000      0.42000     -0.26000      0.00000
H      -2.17762     -1.25725      0.00000     -0.42000     -0.26000     -0.00000
H      -2.17762      1.25725     -0.00000     -0.42000      0.26000      0.00000
</ModelData>
</Models>
##$PEAKS=
<Peaks type="RAMAN" xUnitsExpected="1/cm"  >
<PeakData id="1" title="1 (3270 cm-1)" peakShape="broad" model="MR.25" xMax="3280" xMin="3260"    />
<PeakData id="2" title="2 (3250 cm-1)" peakShape="broad" model="MR.22" xMax="3260" xMin="3240"    />
<PeakData id="3" title="3 (1610 cm-1)" peakShape="broad" model="MR.21" xMax="1620" xMin="1600"    />
<PeakData id="4" title="4 (1495 cm-1)" peakShape="broad" model="MR.19" xMax="1505" xMin="1485"    />
<PeakData id="5" title="5 (1250 cm-1)" peakShape="broad" model="MR.17" xMax="1260" xMin="1245"    />
<PeakData id="6" title="6 (1240 cm-1)" peakShape="broad" model="MR.16" xMax="1245" xMin="1230"    />
<PeakData id="7" title="7 (1100 cm-1)" peakShape="broad" model="MR.13" xMax="1110" xMin="1090"    />
<PeakData id="8" title="8 (1055 cm-1)" peakShape="broad" model="MR.11" xMax="1065" xMin="1045"    />
<PeakData id="9" title="9  (870 cm-1)" peakShape="broad" model="MR.8" xMax="880" xMin="865"    />
<PeakData id="1" title="10 (860 cm-1)" peakShape="broad" model="MR.7" xMax="865" xMin="850"    />
<PeakData id="2" title="11 (715 cm-1)" peakShape="broad" model="MR.6" xMax="725" xMin="705"    />
<PeakData id="3" title="12 (660 cm-1)" peakShape="broad" model="MR.5" xMax="670" xMin="650"    />
</Peaks>
##XUNITS= 1/CM
##YUNITS=RAMAN INTENSITY
##XFACTOR= 1
##YFACTOR= 8.916314E-07
##FIRSTX= 3.467308E+03
##FIRSTY= 0
##LASTX= 7.926687E+01
##NPOINTS= 1747
##MINY= 0
##MAXY= 8.916314E-01
##XYDATA= (X++(Y..Y))
3467.308@%U8O565K18K30K41K54K67K82K98L14L33L52L170M88N18N49A4663
$$ 0 0 0 0 0 0 0 0 0 0 0 0 0 0 0 0 0 0 0 0 0 0 0 0 0 0 0 0 0 0 0 0 0 0 0 0 0 0 0 6565 6783 7013 7254 7508 7775 8057 8355 8669 9002 9354 12524 13012 13530 14079 14663
3360.5828A5283O61P05P53Q06Q63R25R96J071J156J250J353J469J599C0634
$$ 15283 15944 16649 17402 18208 19071 19996 20992 22063 23219 24469 25822 27291 28890 30634
3331.4758C2540K091K300K536K808L118L477L891M375M940N607O397P341H9898
$$ 32540 34631 36931 39467 42275 45393 48870 52761 57136 62076 67683 74080 81421 89898
3304.3096I9752J1536J3610J6190J9428K3524K8749L5454M4069N5080D16279
$$ 99752 111288 124898 141088 160516 184040 212789 248243 292312 347392 416279
3282.9644E01699J03290J18248J21641J01856N3266j1814o7027r3906G34022
$$ 501699 604989 723237 844878 946734 1000000 988186 921159 827253 734022
3263.5598F58032n2307k8355q094M381M387j0041l3259n3728o3372o2391B99880
$$ 658032 605725 577370 569276 573657 578044 568003 534744 481016 417644 355253 299880
3240.2744B53385l8041l0847k5032k0427j6803j3949j1684r876q418p232F4817
$$ 253385 215344 184497 159465 139038 122235 108286 96602 86726 78308 71076 64817
3216.9888E9364m782m215l737l329k979k676k414k186j985j809j654j515B4691
$$ 59364 54582 50367 46630 43301 40322 37646 35232 33046 31061 29252 27598 26083 24691
3189.8225B3409j183j095j016r43q77q18p64p14o69o28n90n54n22m93A2078
$$ 23409 22226 21131 20115 19172 18295 17477 16713 15999 15330 14702 14112 13558 13036 12543 12078
3158.7751A1639m16l93l73o575j44j36j29j22j16j10j05r9r5r0k736%@
$$ 11639 11223 10830 10457 3882 3738 3602 3473 3351 3235 3125 3020 2921 2826 2736 0 0 0
3123.847@%Y18N50J8K0TK1K3TK5K6K8L0L1L3L5L8M0M2M5M9N2N5O0O4A398
1682.0859A472Q1Q8R5J04J13J24J36J50J66J83K03K27K54K85L22L66M17E264
$$ 1472 1553 1641 1736 1840 1953 2077 2213 2363 2529 2712 2915 3142 3396 3681 4003 4369 4786 5264
1645.2172E815O40P48Q80J044J248J506J834K253K793L489M380N500O839D7248
$$ 5815 6455 7203 8083 9127 10375 11881 13715 15968 18761 22250 26630 32130 38969 47248
1616.1102E6712R660P893L814j945o802r350r674q705p291n898m704l742A6979
$$ 56712 66372 74265 78079 76134 69332 59982 50308 41603 34312 28414 23710 19968 16979
1588.9438A4577j948j594j315j094r18p76o60n65m87m21l65l19k79k44C379
$$ 14577 12629 11035 9720 8626 7708 6932 6272 5707 5220 4799 4434 4115 3836 3592 3379
1557.8965C191j64j44j24j08r2p6o3m9l6k2qPK2L9N8P9J04J34J68K10C388
$$ 3191 3027 2883 2759 2651 2559 2483 2420 2371 2335 2313 2305 2312 2334 2373 2431 2510 2614 2748 2916 3126 3388
1515.2064C714M06N10O41Q10J025J296J619J967K252K300J877Q66m86A6623
$$ 3714 4120 4630 5271 6081 7106 8402 10021 11988 14240 16540 18417 19283 18797 16623
1486.0995A4376k325k093j753j419j131r01p20n79m70l85l18k65k23j89A444
$$ 14376 12051 9958 8205 6786 5655 4754 4034 3455 2985 2600 2282 2017 1794 1605 1444
1455.0522A305j20j05r1q1p1o4n6n1m5m1l7l4l1k8k5k4k1k0j9j7j6j4B80
$$ 1305 1185 1080 989 908 837 773 717 666 621 580 543 509 478 450 425 401 380 360 341 324 308 294 280
1408.4812B67j2j1j0TrTqpqopoTnVmnm2LVJ49RUJ0J1TJ2TJ3J4J5J6J7D24
$$ 267 255 244 234 224 215 206 198 191 183 177 170 164 158 153 148 143 138 134 129 87 90 93 96 99 248 257 266 275 285 296 307 319 331 344 358 373 389 406 424
1330.8628D44K0K2K4K6K7L0L2L4L8M1M4M9N4N9O4P2Q0Q8J00J11J26J42A889
$$ 444 464 486 510 536 563 593 625 659 697 738 782 831 885 944 1008 1080 1160 1248 1348 1459 1585 1727 1889
1284.2919B076K14K49K91L42M07M87N88P16Q80J089J353J674K044K415A7506
$$ 2076 2290 2539 2830 3172 3579 4066 4654 5370 6250 7339 8692 10366 12410 14825 17506
1253.2445B0203K386J877J422J072N55m04j666k728l212l146k772k305I415
$$ 20203 22589 24466 25888 26960 27515 27111 25445 22717 19505 16359 13587 11282 9415
1226.078G919j198r65p63o40n28m40l69l13k67k29j99j72j51j33j17A331
$$ 7919 6721 5756 4993 4353 3825 3385 3016 2703 2436 2207 2008 1836 1685 1552 1435 1331
1193.0902A238q2p5o6o1n4m9m5m1Ql2k9k6k4k1j9j7j4j3j0rpmljKMPJ0E81
$$ 1238 1156 1081 1015 954 900 851 806 765 773 741 712 686 662 641 622 605 591 578 568 559 552 548 545 544 546 550 557 567 581
1134.8765E98K2K8m9M5N5O6Q3l6J32J64K04K51L04L47L55K96J51m2k08B474
$$ 598 620 648 599 644 699 765 848 812 944 1108 1312 1563 1867 2214 2569 2865 3016 2974 2766 2474
1094.1268B175k60k02j46r3m7lL7Q0J26J80K43L21M17N29O49P47P65O24F428
$$ 2175 1915 1713 1567 1474 1427 1424 1461 1541 1667 1847 2090 2411 2828 3357 4006 4753 5518 6142 6428
1055.3176F260n59p64p89p10n95m83l85l07k46j99j61j33j09r2p8o6n6D79
$$ 6260 5701 4937 4148 3438 2843 2360 1975 1668 1422 1223 1062 929 820 728 650 584 528 479
1018.449D37l7l2k9k5k3k0j8j7j4Tj2j1TrQ87K2K4K6K8J2M9L7L9M2M5A424
$$ 437 400 368 339 314 291 271 253 236 222 208 196 185 174 165 1052 1074 1098 1124 1152 1164 1213 1250 1289 1331 1376 1424
966.0566A475N5N9O3O7P2P8Q3R0R6J04J12J22J31J43J56J27J87K04K23C894
$$ 1475 1530 1589 1652 1719 1791 1869 1952 2042 2138 2242 2354 2476 2607 2750 2906 3033 3220 3424 3647 3894
925.30695D165L01L35L72M18M68N30O00O85P85R04J050J226J443J711A7039
$$ 4165 4466 4801 5173 5591 6059 6589 7189 7874 8659 9563 10613 11839 13282 14993 17039
894.2596A9507L003L689M572N710P166Q996J1185J3544J5485J5826J2973A27805
$$ 19507 22510 26199 30771 36481 43647 52643 63828 77372 92857 108683 121656 127805
869.0336A24823j0848j4964j5485j3959j1776r666p861o367n149m169B1189
$$ 124823 113975 99011 83526 69567 57791 48125 40264 33897 28748 24579 21189
845.7481A8415k288j902j596j349j148r86p01p34o41n63m96m39l90l48D522
$$ 18415 16127 14225 12629 11280 10132 9146 8445 7711 7070 6507 6011 5572 5182 4834 4522
814.7008D243k52k27k06j86j69j53j39j27j15j05r5q6p7p0o2n6m8m2B059
$$ 4243 3991 3764 3558 3372 3203 3050 2911 2784 2669 2564 2469 2383 2306 2236 2174 2118 2070 2028 2059
775.8916B033k0j4pJQJ7K5L4M6N8P1Q7J06p21J79K10K45K92L47M04N09D534
$$ 2033 2013 1999 1992 1993 2001 2018 2043 2077 2123 2181 2252 2339 2445 1724 1903 2113 2358 2650 2997 3401 3910 4534
731.26105E307R63J209J514J883K277K602K657K176J027n11j836k530A4122
$$ 5307 6270 7479 8993 10876 13153 15755 18412 20588 21615 21104 19268 16738 14122
704.0946A1776j956j570j237r67p52n82m44l32k35j51p2PQ9J80K85M11E011
$$ 11776 9820 8250 7013 6046 5294 4712 4268 3936 3701 3550 3478 3485 3574 3754 4039 4450 5011
669.1664E746R21J072J104Q98L93k82q66j170j205j085r12p41n94m77B419
$$ 5746 6667 7739 8843 9741 10134 9852 8986 7816 6611 5526 4614 3873 3279 2802 2419
638.119B108k54k11j75j48j26j08r3q1p1o2n6m9m4m0l5l3k9k7k5k2C98
$$ 2108 1854 1643 1468 1320 1194 1086 993 912 841 779 723 674 630 590 555 522 493 466 441 419 398
595.42896C79j8j59j1j0rTqpToUnUmVlXklkTo5%T34@
79.26687@  $$checkpoint
##END=$$ End of the RAMAN for pyrazine
##END= $$ end of file