##TITLE= pregnenolone
##JCAMPDX= 6.0         $$ Bruker NMR JCAMP-DX V2.0
##DATA TYPE= nD NMR SPECTRUM
##DATA CLASS= NTUPLES
##NUM DIM= 2
##ORIGIN= UXNMR, Bruker Analytische Messtechnik GmbH
##OWNER= psm
$$ TOPSPIN		Version 1.3
$$ 2012-03-07 07:47:30.890 -0500  nmrsu@CHEM-NMR-002
$$ Compression mode = diff/dup
##.OBSERVE FREQUENCY= 500.133006877526
##.OBSERVE NUCLEUS= ^1H
##.ACQUISITION MODE= SIMULTANEOUS (DQD)
##.ACQUISITION SCHEME= NOT PHASE SENSITIVE
##.AVERAGES= 16
##.DIGITISER RES= 18
##SPECTROMETER/DATA SYSTEM= spect
##.PULSE SEQUENCE= cosygpqf
##.SOLVENT NAME= CDCl3
##.SHIFT REFERENCE= INTERNAL, CDCl3, 1, 12.67713
##AUDIT TRAIL= $$ (NUMBER, WHEN, WHO, WHERE, WHAT)
$$ ##TITLE= Audit trail, TOPSPIN		Version 1.3
$$ ##JCAMPDX= 5.01
$$ ##ORIGIN= Bruker BioSpin GmbH
$$ ##OWNER= nmrsu
$$ $$ c:/nmr/data/Research/nmr/prtj-pregnenolone/4/pdata/1/auditp.txt
$$ ##AUDIT TRAIL=  $$ (NUMBER, WHEN, WHO, WHERE, VERSION, WHAT)
(   1,<2011-10-04 18:24:34.828 -0500>,<nmrsu>,<CHEM-NMR-002>,<TOPSPIN 1.3>,
      <created by zg
	started at 2011-10-04 16:30:42.359 -0500,
	POWCHK disabled, PULCHK disabled
       configuration hash MD5:
       86 73 F2 17 F5 57 29 A3 81 04 46 63 19 1A C0 4E
       data hash MD5: 2K * 256
       6C 25 B4 DF 31 E1 EE 26 33 C3 64 73 51 E2 FF 29>)
(   2,<2011-10-05 09:12:36.046 -0500>,<nmrsu>,<CHEM-NMR-002>,<TOPSPIN 1.3>,
      <Start of raw data processing
       xfb F2: SI = 1K WDW = 3 SSB = 0 FT_mod = 6 PKNL = 1 F1: SI = 1K ME_mod = 2 NCOEF = 32 WDW = 3 SSB = 0 FT_mod = 6 PH_mod = 2
       data hash MD5: 1K * 1K
       F4 E3 59 98 75 4B 76 65 C9 F9 6B 41 14 74 29 D4>)
$$ ##END=
$$ 
$$ $$ hash MD5
$$ $$ 57 01 20 99 A1 D3 D5 AE 4E A5 B3 E4 65 36 28 CF
##$RELAX= 
##$RELAX= 
##$RELAX= 
##$RELAX= 
##$RELAX= 
##$RELAX= 
##$RELAX= 
##$RELAX= 
##$RELAX= 
$$ Bruker specific parameters
$$ --------------------------
##$DU= <c:/nmr>
##$EXPNO= 4
##$NAME= <prtj-pregnenolone>
##$PROCNO= 1
##$TYPE= <nmr>
##$USER= <Research>
##$AMP= (0..31)
100 100 100 100 100 100 100 100 100 100 100 100 100 100 100 100 100 100 
100 100 100 100 100 100 100 100 100 100 100 100 100 100 
##$ANAVPT= -1
##$AQSEQ= 0
##$AQ_mod= 3
##$AUNM= <au_getlcosy>
##$AUTOPOS= <>
##$BF1= 500.13
##$BF2= 500.13
##$BF3= 500.13
##$BF4= 500.13
##$BF5= 299.87
##$BF6= 299.87
##$BF7= 299.87
##$BF8= 299.87
##$BYTORDA= 1
##$CFDGTYP= 2
##$CFRGTYP= 5
##$CHEMSTR= <none>
##$CNST= (0..63)
1 1 145 1 1 1 1 1 1 1 1 1 1 1 1 1 1 1 1 1 1 10 10 30 40 1 1 1 1 1 1 1 
1 1 1 1 1 1 1 1 1 1 1 1 1 1 1 1 1 1 1 1 1 1 1 1 1 1 1 1 1 1 1 1 
##$CPDPRG= <>
##$CPDPRG1= <>
##$CPDPRG2= <>
##$CPDPRG3= <>
##$CPDPRG4= <mlev>
##$CPDPRG5= <mlev>
##$CPDPRG6= <mlev>
##$CPDPRG7= <mlev>
##$CPDPRG8= <mlev>
##$CPDPRGB= <>
##$CPDPRGT= <>
##$D= (0..63)
3e-006 1.486892 0 0 0 0 0 0 0 0.08 0 0.03 2e-005 4e-006 0 0 0.0002 0 0 
0 0 0 0 0 0 0 0 0 0 0 0 0 0 0 0 0 0 0 0 0 0 0 0 0 0 0 0 0 0 0 0 0 0 0 
0 0 0 0 0 0 0 0 0 0 
##$DATE= 1317763874
##$DBL= (0..7)
120 120 120 120 120 120 120 120 
##$DBP= (0..7)
150 150 150 150 150 150 150 150 
$$ [...]
0 0 0 0 0 0 0 0 0 0 0 0 0 0 0 0 
##$SW_h= 6666.66666666667
##$TD= 256
##$TD0= 1
##$TE= 300
##$TE2= 300
##$TE3= 300
##$TEG= 300
##$TL= (0..7)
120 120 120 120 120 120 120 120 
##$TP= (0..7)
150 150 150 150 150 150 150 150 
##$TP07= 0
##$TPNAME0= <gauss>
##$TPNAME1= <gauss>
##$TPNAME2= <gauss>
##$TPNAME3= <gauss>
##$TPNAME4= <gauss>
##$TPNAME5= <gauss>
##$TPNAME6= <gauss>
##$TPNAME7= <gauss>
##$TPOAL= (0..7)
0.5 0.5 0.5 0.5 0.5 0.5 0.5 0.5 
##$TPOFFS= (0..7)
0 0 0 0 0 0 0 0 
##$TUNHIN= 0
##$TUNHOUT= 0
##$TUNXOUT= 0
##$USERA1= <user>
##$USERA2= <user>
##$USERA3= <user>
##$USERA4= <user>
##$USERA5= <user>
##$V9= 5
##$VALIST= <valist>
##$VCLIST= <CCCCCCCCCCCCCCC>
##$VD= 0
##$VDLIST= <DDDDDDDDDDDDDDD>
##$VPLIST= <PPPPPPPPPPPPPPP>
##$VTLIST= <TTTTTTTTTTTTTTT>
##$WBST= 1024
##$WBSW= 10
##$XGAIN= (0..3)
0 0 0 0 
##$XL= 0
##$YL= 0
##$YMAX_a= 0
##$YMIN_a= 0
##$ZGOPTNS= <>
##$ZL1= 120
##$ZL2= 120
##$ZL3= 120
##$ZL4= 120
##$ABSF1= 0
##$ABSF2= 0
##$ABSG= 0
##$ABSL= 0
##$ALPHA= 0
##$AQORDER= 0
##$ASSFAC= 0
##$ASSFACI= 0
##$ASSFACX= 0
##$ASSWID= 0
##$AUNMP= <        >
##$AXLEFT= 0
##$AXRIGHT= 0
##$AXTYPE= 0
##$AXUNIT= <>
##$AZFE= 0.1
##$AZFW= 0.5
##$BCFW= 0
##$BC_mod= 0
##$BYTORDP= 0
##$COROFFS= 0
##$CY= 15
##$DATMOD= 1
##$DC= 0
##$DFILT= <>
##$DTYPP= 0
##$F1P= 0
##$F2P= 0
##$FCOR= 0.5
##$FTSIZE= 1024
##$FT_mod= 6
##$GAMMA= 0
##$GB= 0
##$INTBC= 1
##$INTSCL= 1
##$ISEN= 128
##$LB= 0
##$LEV0= 0
##$LPBIN= 512
##$MAXI= 10000
##$MC2= 0
##$MEAN= 0
##$ME_mod= 2
##$MI= 1
##$NCOEF= 32
##$NC_proc= 2
##$NLEV= 6
##$NOISF1= 0
##$NOISF2= 0
##$NSP= 0
##$NTH_PI= 0
##$NZP= 0
##$OFFSET= 12.67713
##$PC= 4
##$PHC0= 0
##$PHC1= 0
##$PH_mod= 2
##$PKNL= no
##$PPARMOD= 1
##$PPDIAG= 0
##$PPIPTYP= 0
##$PPMPNUM= 100
##$PPRESOL= 1
##$PSCAL= 1
##$PSIGN= 0
##$REVERSE= no
##$SF= 500.13
##$SI= 1024
##$SIGF1= 0
##$SIGF2= 0
##$SINO= 16
##$SIOLD= 256
##$SREGLST= <1H.MeOD>
##$SSB= 0
##$STSI= 1024
##$STSR= 0
##$SW_p= 6666.66666666669
##$SYMM= 0
##$S_DEV= 437
##$TDeff= 512
##$TDoff= 0
##$TI= <        >
##$TILT= no
##$TM1= 0
##$TM2= 0
##$TOPLEV= 0
##$USERP1= <user>
##$USERP2= <user>
##$USERP3= <user>
##$USERP4= <user>
##$USERP5= <user>
##$WDW= 3
##$XDIM= 1024
##$YMAX_p= 466555363
##$YMIN_p= 0
$$ End of Bruker specific parameters
$$ ---------------------------------
##NTUPLES= nD NMR SPECTRUM
##VAR_NAME=  FREQUENCY1,    FREQUENCY2,      SPECTRUM
##SYMBOL=    F1,            F2,              Y
##.NUCLEUS=  1H,            1H
##VAR_TYPE=  INDEPENDENT,   INDEPENDENT,     DEPENDENT
##VAR_FORM=  AFFN,          AFFN,            ASDF
##VAR_DIM=   1024,          1024,            1024
##UNITS=     HZ,            HZ,              ARBITRARY UNITS
##FACTOR=    6.51678071032912, 6.51678071032912, 1
##FIRST=     6340.21289960861, 6666.66666666669, 977
##LAST=      -326.453767058078, 0,           956
##MIN=       -326.453767058078, 0,           0
##MAX=       6340.21289960861, 6666.66666666669, 466555363
##PAGE= F1=6340.212899609
##FIRST=     6340.21289960861, 6666.66666666669, 977
##DATA TABLE= (F2++(Y..Y)), PROFILE
$$ [...]
##PAGE= F1=364.3249882369
##FIRST=     6340.21289960861, 6666.66666666669, 1230
##DATA TABLE= (F2++(Y..Y)), PROFILE
917B83K1J55j88L12l31R3N8k6k23l0L67l88J24L18r1J55j97R4j75O0k61L33j20
$$ 283 304 459 271 583 252 345 403 377 154 124 491 103 227 545 454 609 412 506 331 391 130 463 343
894C43L24N0K47p22j44K32j05rJ14j32K60R0m18R8L09j42mp9P6k53K35N1K20l20
$$ 343 667 717 964 242 98 330 225 216 330 198 458 548 130 228 537 395 391 312 388 135 370 421 641 321
870C21k60M50m7j68O9l3J85J57j31J99l39R5k76RJ65N9j13j50j34K28k3J37j53
$$ 321 61 511 464 296 365 332 517 674 543 742 403 498 222 231 396 455 342 192 58 286 263 400 247
847B47j37N42n3m19R9q6K58k47L01R3l33P3m8j12K98l79L91O4j27j69M7l6j76
$$ 247 110 652 599 180 279 193 451 204 505 598 265 338 290 178 476 97 488 552 425 256 303 267 91
824I1J55N7l5Jj07L07p4m6k51K92L72m09QL67j56k16j29r6K70k37o4L84j59j94
$$ 91 246 303 268 269 162 469 395 349 98 390 762 353 361 728 572 356 227 131 401 164 100 484 325 131
800A31P8LK72p4j19r7j7RN1P7k58JM2J87o6j33K68MQ7j2Rq2j70L96l41L51l14
$$ 131 209 212 484 410 291 194 177 186 237 314 56 57 99 286 220 87 355 359 446 434 443 361 191 587 246 597 283
773B83J78k80o3K33M14m37K52l11J5K71m57K76K53l99L21m21L34J35j60k40K10
$$ 283 461 181 118 351 765 328 580 269 284 555 98 374 627 228 549 128 462 597 437 197 407
752D07j53j4J5p9L51m87J77j8K2K06k67J63J37R4j36m0q6J22K36l84K14l03K36
$$ 407 254 240 255 176 527 40 217 199 221 427 160 323 460 554 418 378 292 414 650 266 480 177 413
729D13K12l93o6J89j14K2K0N95n59j19M97m7k07j23J20K06o3m15o1K55J96j32
$$ 413 625 232 166 355 241 263 283 878 319 200 697 650 443 320 440 646 583 168 107 362 558 426
707D26l32J56J92j91j02J98j37R5j28jP8q4J87Kj59K0J69j55K7j50J57L2R4k5
$$ 426 94 250 442 251 149 347 210 305 177 176 254 170 357 359 200 220 389 234 261 111 268 300 394 369
683C69m8L58k60L3l33K68J03k68o6J23q3J72Ln5J98M9Nj50j10J30O1m01N60k04
$$ 369 321 679 419 452 119 387 490 222 156 279 196 368 371 316 514 563 568 418 308 438 499 98 658 454
659D54j57j34N5r3o5K73j28j15K35J53l74K72j53pL04l19J17K36k27K39q2l97
$$ 454 297 163 218 125 60 333 205 90 325 478 104 376 223 216 520 201 318 554 327 566 484 87
637H7L43P4j17Rp5K41k96J20o7j49L36M9k65o7P6K56l76n5J82K56r4l33j3L13
$$ 87 430 504 387 396 321 562 266 386 319 170 506 555 290 223 299 555 179 124 306 562 468 135 122 435
613D35k68L09K45P54q52o9j59k2J93m92K39Q8p1L78k10j46k80L86K75j06j27K5
$$ 435 167 476 721 1475 623 554 395 373 566 74 313 401 330 708 498 352 72 458 733 627 500 525
591E25K19l15K70j91M0k31P1Q2k96j33J90Q9N7k64N26j96r7k56J38R0J1J2K09
$$ 525 744 429 699 508 548 317 388 470 174 41 231 320 377 113 639 443 346 90 228 318 329 341 550
568E50Q2j52j25p0K5j13j12L13k91K27M33n05N8Q7k40r4K82rk39J69j20n5K84
$$ 550 632 480 355 285 310 197 85 398 107 334 767 262 320 407 167 73 355 346 107 276 156 101 385
545C85k01Oj11M90m32N0M55%l22j73J3R3N20j16P0o56J81Q3L9r7N23m00r5L7k67
$$ 385 184 190 79 569 137 187 642 642 320 147 160 253 773 657 727 71 252 335 374 277 800 400 305 342 75
520G5J95j41J11j20L20k99M41k34k00j4J26P6J54p3k07J93j90J69K29n2l34p8
$$ 75 270 129 240 120 440 141 582 348 148 134 260 336 490 417 210 403 213 382 611 559 225 147
498A47K3N2n9M52m19J61K96m76J99q3K13k87L74l60j13N02j98k92L60l12K03K0
$$ 147 170 222 163 615 196 357 653 177 376 293 506 219 593 233 120 622 424 132 492 180 383 403
476D03O8j73j25J76j92J88lN3j82K61M61J116j124N90K173n72k130M32q10M8r1
$$ 403 471 298 173 349 157 345 342 395 213 474 935 2051 927 1517 3690 3118 988 1420 610 658 567
455E67j50j16k61J17R2j7j2K43jk44lJ80L15m35j27P4j41R9K02J22n8j72M1n8
$$ 567 417 301 40 157 249 232 220 463 462 218 215 395 710 275 148 222 81 180 382 504 446 274 315 257
431B57j04K71k57J30M01j84r5O9m0q0l45M76k79j6J03J39N6k57J25L19j33m25
$$ 257 153 424 167 297 698 514 419 488 448 368 23 499 220 204 307 446 502 245 370 689 556 131
409A31J74J36J15k87k57L36M68k65l01L54l98O0P14o52M0q5P8k81J91j18K24N9
$$ 131 305 441 556 269 12 348 816 551 250 604 206 266 980 328 368 283 361 80 271 153 377 436
387D36L99o71O7J18j09K50m15K47J37k61n9J46k28J53L60k84M17n08M37l51J91
$$ 436 835 164 231 349 240 490 75 322 459 198 139 285 57 210 570 286 703 195 632 281 472
366D72r5k54L89m49M17k36K88M7m15L97k44J37j25K25l72K51l14J90J06L76l97
$$ 472 377 123 512 63 480 244 532 579 164 561 317 454 329 554 182 433 119 309 415 791 394
345C94L66J39o41Q2J13j16k02J49j45M62m43J89k02R7K46kk97J85j26N68m27J582
$$ 394 760 899 258 340 453 337 135 284 139 601 158 347 145 242 488 486 189 374 248 816 389 1971
323A971Q91K481k735O21k112j16m93l78M41k2j15L44k02o2K96k83O3j15L79m32
$$ 1971 2862 5343 2608 3229 1117 1001 508 130 571 549 434 778 576 514 810 527 590 475 854 422
303D22k30O1j5K40j07K83o1j02L17m22q2K57k83j09J05j30J45J83k07K74P9J30
$$ 422 192 253 238 478 371 654 593 491 808 386 304 561 278 169 274 144 289 472 265 539 618 748
281G48L66r62M49l44J21l6J21k14K9J90K02l8n2P33n56j71m1M60l97L22o25L5
$$ 748 1114 152 601 257 378 342 463 249 278 468 670 632 580 1313 757 586 545 1005 608 930 305 340
259C40l02M59J24N43n25J11J71N34m78n04J887M448P477K6613r287j9395q397
$$ 340 38 497 621 1164 639 750 921 1455 977 473 2360 6808 14285 40898 31611 12216 3819
242C819k57j640r57j53J128j411J10R00q19l62J10J468J902K766M307l30J74J
$$ 3819 3562 1922 965 812 1940 529 639 1539 720 358 468 1936 3838 6604 10911 10581 10755 10756
224A0756m898k407K948o61K87p00J2185J685K270K1289J3390l8706K811r480P956
$$ 10756 5858 3451 6399 5738 6025 5325 17510 19195 21465 42754 56144 17438 20249 10769 18725
209A8725O860j6024l187m917J622n60l83J102j104p43j36N43J373k858Q357j835
$$ 18725 25585 9561 6374 1457 3079 2519 2136 3238 2134 1391 1255 1798 3171 313 8670 6835
193F835J6221n509o314r103j388j53M69K3J867J191K359J001L495N000R384q323
$$ 6835 23056 17547 11233 2130 742 589 1058 1081 2948 4139 6498 7499 10994 15994 25378 17055
177A7055P93K91l151r526k94k4l617Q231o396R603r886N056O40M7072J9584P219
$$ 17055 17848 18139 14988 5462 5168 5144 1527 9758 3362 12965 3079 8135 8775 55847 75431 82650
161H2650j2590P378n9207j1136n564O86J139K971k523O305k912Q19P557j0111
$$ 82650 70060 77438 18231 7095 1531 2217 3356 6327 3804 10109 7197 8016 15573 5462
147E462J3476l936k262p626J0354L471j6524N799Q61J2734j2110M3869j4553L408
$$ 5462 18938 15002 12740 5114 15468 18939 2415 8214 9075 21809 9699 53568 39015 42423
133D2423j8822J2187M4045J32127O01589k82615m75555j1951l1406J5979K9319
$$ 42423 23601 35788 79833 211960 813549 530934 55379 43428 12022 28001 57320
122E7320k1723k702j2581J5031l1970P333J0444J5133r195K269K2022J50883M37019
$$ 57320 35597 32895 20314 35345 3375 10708 21152 36285 27090 29359 51381 202264 639283
109F39283M49743o44272k18305j45253m2298L854J48821Q2523N44170N855816
$$ 639283 1089026 444754 226449 81196 38898 42752 191573 274096 818266 6674082
99F674082j437191m871731j92155j26371J2411q954m890q629j2588j2375Q013
$$ 6674082 5236891 365160 173005 46634 59045 50091 45201 36572 23984 11609 19622
88A9622q782j225n221r8o38j258l57J535L94n29R07k111J253k677Q64Q19p44J336
$$ 19622 10840 9615 4394 4296 3658 2400 2043 3578 3972 3443 4350 2239 3492 815 1679 2498 1754 3090
70C090n39j664j48k51N66K2l01l79R90J724o44m58k52P21j830J265q91o76J168
$$ 3090 2551 887 739 488 1054 1076 775 396 1386 3110 2466 2008 1756 2477 647 1912 1021 345 1513
51A513P312o884p14J479j034o26M92k3J175j569L90j106p7J172J36l74j77J162
$$ 1513 8825 1941 1227 2706 1672 1046 1538 1515 2690 1121 1511 405 328 1500 1636 1262 1085 2247
33B247j066P85q16O06j478J579j213L73n11L63m34J594o70j76j08n9L44n79J92
$$ 2247 1181 1966 1150 1756 278 1857 644 1017 506 869 435 2029 1359 1183 1075 1016 1360 781 973
14I73K96m1k50J128m05k97Q0N64L01j016P7J121j200R66
$$ 973 1269 1228 978 2106 1701 1404 1484 2048 2349 1333 1410 2531 1331 2297
0B297
$$ 2297
##PAGE= F1=357.8082075266
##FIRST=     6340.21289960861, 6666.66666666669, 2056
##DATA TABLE= (F2++(Y..Y)), PROFILE
1023B056Q32p46K95L78p62N41j010J001j166J001o34p60R36j027R22j294J31m25
$$ 2056 2888 2142 2437 2815 2053 2594 1584 2585 1419 2420 1786 1026 1962 935 1857 563 694 269
1005B69L9J62p0K13J91j96M9J13n00P03p93M90m74P04o47K58L91p66M52k18J32
$$ 269 308 470 400 613 804 608 657 770 270 973 180 670 196 900 253 511 902 136 588 370 502
984E02R9J49j79L96k72k56j30J13O6j66Q4Q3J04m59L82lj07j8J89m02J89L42j99
$$ 502 601 750 571 967 695 439 309 422 488 322 406 489 593 134 516 513 406 388 577 175 364 706 507
961E07K82j93k95K00j5j56L56l60L10K7J07n86J79K76m53N58m39Qk09P52o77M9
$$ 507 789 596 301 501 486 330 686 326 636 663 770 184 363 639 186 744 305 313 104 856 179 228
939B28K50K5l14M20r4k06L48km48L74K90n56O6J39j74K78k96m8M3k45N0K79OK8
$$ 228 478 503 189 609 515 309 657 655 207 581 871 315 381 520 346 624 328 280 323 78 128 407 413 441
915D41j46M87m76O9j60L40j91j02J69k74K76L8n6J75k24Q0l46J31%L05k28L73
$$ 441 295 782 306 375 215 555 364 262 431 157 433 471 415 590 366 446 100 231 231 536 308 681
893F81j02K69l65j96l0P9p6J21k33K44J53l48j3K62Ok39J40L4j80J18J08J77k41
$$ 681 579 848 483 287 257 336 260 381 148 392 545 197 184 446 452 213 353 387 207 325 433 610 369
870C69k92N93j86r7Jj2P6K36j08J85m56J6j08J03P0K89n02J63k63K90L4J17j68
$$ 369 77 670 484 387 388 376 452 688 580 765 309 325 217 320 390 679 177 340 77 367 401 518 350
847C50k04N19P2n51J15k19L35j75L08Q8k75n8m2j94M86l60K61K72k18j52m0j01
$$ 350 146 665 737 186 301 82 417 242 550 638 363 305 263 69 555 195 456 728 510 358 318 217
825B17j10J19j21J68m8LL48j75k6k71K23M43m29L8L29k53j62Q5k02K53j81j15
$$ 217 107 226 105 273 225 228 576 401 375 104 327 770 341 379 708 455 293 378 176 429 248 133
803A33M54l17j84P3j9K91Jj12j67L5rJ38j13j25M8J16J93k91pK40K8O4J0j7j77
$$ 133 587 270 86 159 140 431 432 320 153 188 179 317 204 79 127 243 436 145 138 378 406 470 480 463 286
778B86n4L29k19K28k66K38m45LK31M05m07M03m09j09K59k61K23J25k60K94l52
$$ 286 232 561 342 570 304 542 97 100 331 736 329 732 323 214 473 212 435 560 300 594 242
757B42J66J44L8m56K81k13J79k64q4N33l85j31R4J9K39k01K19J10J44k73r4P2
$$ 242 408 552 590 134 415 202 381 117 33 566 181 50 144 163 402 201 420 530 674 401 307 379
735C79n3J79l96L58l51K98K49m45J4J20k40J39l9O83m18k53L76J24k53p6J6K59
$$ 379 326 505 109 467 116 414 663 218 232 352 112 251 212 895 477 224 600 724 471 395 411 670
713F70jm05n0K77N1m7m04M27p4j33k8P9j04J72k64oQ7p7R3l0o0J15l2j5N0n4n0
$$ 670 669 264 214 491 542 495 91 518 444 311 283 362 258 430 166 160 247 170 263 233 173 288 256 241 291 237 187
686A87P0K95r1j18J97j25j07k20J04L57l68k3J95j07J00O0k1J08J00j37oj03M0
$$ 187 257 552 461 343 540 415 308 88 192 549 181 158 353 246 346 406 385 493 593 456 450 347 387
663C87l7k37M87k82O3j6k73kM7K59k22m3J59K13l63J37j19k1L53l60K16K13k99
$$ 387 350 113 600 318 381 365 92 90 137 396 174 131 290 503 140 277 158 137 490 130 346 559 260
640B60K21j28j43K13k6n5K0r5L74l99P6m4J21J83j28k07R0k50M59m03k5J08K91
$$ 260 481 353 210 423 397 342 362 267 641 242 318 274 395 578 450 243 333 83 542 139 114 222 513
617E13j47k14J57L0j45L31J19R8l04L0r3Q6J72l92j6J2K13K52j75j76k63K90L55
$$ 513 366 152 309 339 194 525 644 742 438 468 375 461 633 241 225 237 450 702 527 351 88 378 733
594G33k10p6J01K18m24M00k50l4j41J37L5l78k8Q3K26j22j58M96l61J04j52O0
$$ 733 523 447 548 766 342 742 492 458 317 454 489 111 83 166 392 270 112 608 247 351 199 259
572B59M4qj08K96K32l07j13O0l5m3j87K52j29P9M57m20j31L22l46m2J23J14k68
$$ 259 303 295 187 483 715 408 295 355 320 277 90 342 213 292 749 329 198 520 174 132 255 369 101
549A01J09J40k70K52j04k0j23N38m90J44M70K9k65m69N7K26M39k51J49m76jJ76
$$ 101 210 350 80 332 228 208 85 623 133 277 747 776 511 42 99 325 764 513 662 186 185 361
527C61N8j13L94k91q8M7k29L20l36J47j11L66m86L10J4k75mL23l2J4k1j74J63
$$ 361 419 306 700 409 321 368 139 459 123 270 159 525 39 349 363 88 84 407 375 389 368 194 357
504C57r0P4L34m7m09j29J40j0l6M53m50Q5L06m69K15o0K00l50M11l02j45O70k88
$$ 357 267 341 675 628 219 90 230 220 184 637 187 272 578 109 324 264 464 114 525 223 78 748 460
481D60l17M58m12J94J49k5l60L82r2j81K21l22K05k12K69L71J195q24m61J898
$$ 460 143 601 189 383 532 507 147 529 437 256 477 155 360 148 417 788 1983 1159 698 2596
461B596J91j669j56l60P3R4n54n1J2O4l4P9k7J93o1j57J58j9K96m48L9Kj46j6
$$ 2596 2787 1118 962 602 675 769 215 164 176 240 206 285 258 451 390 233 391 372 668 220 259 261 115 99
437I9K24J97k5j80j31q7J41K96l43J17K16O6k00J67j39j4k98L59k74K34m0k9J62
$$ 99 323 520 495 315 184 97 238 534 191 308 524 590 390 557 418 404 106 465 191 425 385 356 518
414E18m47L28M46l58l84K79l5Q7j29j34K28N01l69k17K66l50K5P74p03J23j65
$$ 518 71 399 845 487 103 382 347 434 305 171 399 900 531 314 580 230 255 1029 326 449 284
393B84l5j85J70o1K60o2M79p27J21K03k73K57k31R2J80k67P1P4j58l9M03k37K09
$$ 284 249 64 234 173 433 371 850 123 244 447 174 431 200 292 472 205 276 350 192 153 556 319 528
370E28j97P9L9j1m1k40K86l14L37k70K10K43m99O15n73L44k88L35m77M74m35J85
$$ 528 331 410 449 438 397 157 443 129 466 196 406 649 150 765 192 536 248 583 106 580 145 330
348C30O9K55k56L41Q1l63Q6p3q6j08O2j60L98n29L20j64kJ18J65m7N7k95N97K9
$$ 330 399 654 398 739 820 457 543 470 384 276 338 178 576 47 367 203 201 319 484 437 494 199 796 825
324H25J691O20K298j963K35k475n17j83j34K55r6M2J91j13k23M84m81J52j08L61
$$ 825 2516 3136 5434 3471 3706 1231 714 531 397 652 556 598 789 676 453 937 456 608 500 861
304H61m30j69q6J15K04Q3k7J62p4l3k25l2L07n18j20M38l61K79J98l51L99K24
$$ 861 431 262 176 291 495 578 551 713 639 606 381 349 656 138 18 456 95 374 572 221 620 844
282H44j62N12q29K44m24J36P5K60r8l11J45M36mj2M94l25l36k35O47m25L90o68
$$ 844 682 1194 365 609 185 321 396 656 558 247 392 828 824 812 1306 981 645 410 1057 632 1022 354
260C54o2j10K98L68M93q16O70j39M73j81l70J467J0123J3336L4684j9021k3227
$$ 354 292 182 480 848 1341 525 1195 1056 1529 1348 978 2445 12568 25904 60588 41567 18340
243A8340j2183j478k212j340M5J315j858j21J263q98n92K41Q10J311M939M931
$$ 18340 6157 4679 2467 1127 1172 2487 629 508 1771 873 281 522 1332 2643 7582 12513
227A2513j994n00J448o639j365K266N121m395L360Q465n20N768R406L1476m7179
$$ 12513 10519 10019 11467 4828 3463 5729 10850 6455 9815 18280 17760 23528 32934 64410 17231
212A7231N237j3645R786N273r823p796n175J742r27j060M92Q10k21R7j60J833
$$ 17231 22468 8823 18609 23882 14059 6263 1088 2830 1903 843 1335 2145 1924 2021 1861 3694
196C694j70K552J0481j950l355j257q778m01l92O21j69R54L495q17L172M548m103
$$ 3694 3524 6076 16557 14607 11252 9995 1217 816 424 1045 876 1830 5325 4508 7680 12228 8125
179H125K5060j0430n069K85P33j0235l407k828K698K010l759N009l000R272K583
$$ 8125 33185 22755 17686 17971 18704 8469 5062 2234 4932 6942 3183 8192 5192 14464 17047
164A7047N7782P062J7843k3445L975o1992j3347m151K448J144L278k441O884l707
$$ 17047 74829 81891 99734 76289 80264 18272 4925 774 3222 4366 7644 5203 12087 8380
150H380M58N785n737Q626O494j3872p337J5381K318j9496M948M810R315J0502
$$ 8380 8838 14623 8886 17512 24006 10134 2797 18178 20496 1000 5948 10758 20073 30575
136C0575K0070M057j0237j6776J8M4029L3092P21310j61213o25997M70k5719K9620
$$ 30575 50645 54702 44465 27689 27707 71736 104828 826138 664925 38928 39398 13679 43299
123D3299J0430j7920j6023j6908M0242k3558j2710J4659K4294j2128N26q332Q9252
$$ 43299 53729 35809 19786 2878 43120 19562 6852 21511 45805 33677 34203 25871 115123
110A15123K54960j94399J6269J1804o1831Q641M5105r4583K35616M68888O120402
$$ 115123 370083 175684 191953 203757 141926 150567 195672 101089 336705 805593 6925995
99F925995J03326o291801n99770L2312p5901k2211k2853q465O27n666n24j9097
$$ 6925995 7029321 737520 137750 170062 94161 71950 49097 40632 41259 35593 35069 15972
87A5972j714o736l132j473k33J775j989K024J419j597K482k040J507k383k140
$$ 15972 14258 7522 4390 2917 2684 4459 2470 4494 5913 4316 6798 4758 6265 3882 1742
72A742K955K8p42l140J165K25P75j357J678j70rJ986j280l17n38P83k426J114
$$ 1742 4697 4725 3983 843 2008 2233 3008 1651 3329 3159 3150 5136 3856 3539 3001 3784 1358 2472
54B472j031p20Q24P954o811K47O10j180j83N24j41P80j957M48r98j72J727P8o74
$$ 2472 1441 721 1545 9499 2688 2935 3545 2365 2182 2706 2565 3345 1388 1836 838 666 2393 2471 1797
35A797K13J248j367R61j002P28k197J902j040k40q8J84l70J873q41J17r1j15K62
$$ 1797 2010 3258 1891 2852 1850 2578 381 2283 1243 1003 915 1099 729 2602 1761 1878 1787 1672 1934
16A934l15q4L16J6m20J367n94J53M4P63M91j206L18J311j941J510
$$ 1934 1619 1535 1851 1867 1447 2814 2220 2373 2417 3180 3671 2465 2783 4094 2153 3663
0C663
$$ 3663
##PAGE= F1=351.2914268163
##FIRST=     6340.21289960861, 6666.66666666669, 1850
##DATA TABLE= (F2++(Y..Y)), PROFILE
1023A850J609j501O59N07j029M59p33Q91j151O86j98r13J066j451R71j029J04
$$ 1850 3459 1958 2617 3124 2095 2554 1821 2712 1561 2247 2049 1136 2202 751 1722 693 797
1006G97n07n1J60j00N44l56L03k90J93l18M90n99M53l91O61q76N27J06n65N50
$$ 797 290 239 399 299 843 487 790 500 693 375 865 266 719 328 989 113 640 746 181 731
986G31l02j65M71j25l1K71j63k29j0n9J79j11j90J94L78p65M61l5j45Q9M4k80
$$ 731 429 264 735 610 579 850 687 458 448 389 568 457 267 461 839 74 535 500 355 444 488 208
964B08L64j46m1L77m92R2J27J47l33L69m71O32Nk74m70L62J80m58M23j48k54n4
$$ 208 572 426 385 762 270 362 489 636 303 672 201 833 838 564 94 456 636 178 601 453 199 145
942A45O67m15k12K80J96n48O00m75l9N17pk87Q6L36n63J27J08l40N41n25K68q5
$$ 145 812 397 185 465 661 113 713 238 199 716 709 422 508 844 281 408 516 176 717 192 460 375
920C75l17J46K44k7l0l7N28n51k7j64N13q6k37j01q3M28k47K0J99k85M6l7k6k
$$ 375 58 204 448 421 391 354 882 331 304 140 653 567 330 229 146 574 327 347 546 261 307 270 244 242
896B42K73k32M93l38K25O8k31l79K62r2Q7k27J32J88k07j02J21K16k93K01o3j05
$$ 242 515 283 776 438 663 731 500 121 383 291 378 151 283 471 264 162 283 499 206 407 344 239
874B39M7J09J46r3k77N30k88J25j91Lj2K84k1R7m42j13R3J65lM44o94K66k24K36
$$ 239 286 395 541 448 171 701 413 538 347 350 338 622 601 698 256 143 236 401 398 842 148 414 190 426
850D26m9L13l02j79L37L03n82k3j9J14k7K07M1p3l13R3j78M56k82J34L95k97p0
$$ 426 377 690 388 209 546 849 267 244 225 339 312 519 560 487 174 267 89 545 263 397 792 495 425
827D25j07q3q9R9J6qj37J45L41k38qk63K50L19l67J08J65k30j55K68k71J93j09
$$ 425 318 235 146 245 261 253 116 261 602 364 356 93 343 662 295 403 568 338 183 451 180 373 264
804B64mL97m85Q1p9J25J61n3m3k24M0p0K56l31J04P5J69J64k81j21K47k4J26k5
$$ 264 260 657 172 253 174 299 460 407 364 140 180 110 366 35 139 214 383 547 266 145 392 368 494 469
780D69p0j83N4K20q5O3p9J03m12k3K70K46k70M71m07r3R9n2K00r3j12K13j50n2
$$ 469 399 216 270 490 405 468 389 492 80 57 327 573 303 774 367 274 373 321 521 428 316 529 379 327
756C27J33K16n08J76j28L01l20o9L68j99p1j94M6K62rJ75j0K25l48j71J74j03
$$ 327 460 676 168 344 216 517 197 128 496 297 226 32 78 340 331 506 496 721 373 202 376 273
734B73Jo0J57j92K11K51l78M5Oj86J8J7O53k10l74K21K92k90L3j27K87M5l72K0
$$ 273 274 214 371 179 390 641 263 308 314 128 146 163 816 606 232 453 745 455 488 361 648 693 321 341
710C41K38o4L4l39M70l08L6j3Jn0J74k56l8kj0j09j0Q7Q6k15J97MO3M2j09M20
$$ 341 579 515 549 210 680 372 408 395 396 346 520 264 226 224 214 105 95 182 268 53 250 254 317 359 250 670
684F70r6k36O6kj52j79M4L53k72m4K18n8p0K36q6K3J42k23J36k00J35n4j69L34
$$ 670 574 338 404 402 250 71 115 468 196 152 370 312 242 478 392 415 557 334 470 270 405 351 182 516
660E16k54K26J6m49L1J22J90l07L1J34J68k29J53k34J30J69k71J97J22j80Q7j41
$$ 516 262 488 504 55 86 208 398 91 122 256 424 195 348 114 244 413 142 339 461 281 368 227
638B27J00L5j59R1l3k9M20l03j07l0L15J23l62j8J44j90K02l58O6J35R1o8R7N
$$ 227 327 362 203 294 261 232 652 349 242 212 527 650 288 270 414 224 426 68 134 269 360 292 389 394
614C94k14Q7K55M2j99J68j61J4R8P9r8j30l21N24R8j18j78j31N9L79k73j3J74
$$ 394 180 267 522 564 365 533 372 386 484 563 465 335 14 538 636 518 340 209 268 647 374 361 535
591E35R4l93M52l32J12r0Q5kl92P1%K82k41q2M74m72K08K2q2O2j32j30K75M28
$$ 535 629 236 688 356 468 378 463 461 69 140 140 422 181 99 573 101 309 331 249 311 179 49 324 752
567G52m41j32K13m4m2j1l8J4l7M61l47k77N37m26rr8K45j65k5L15l59J54M1l9
$$ 752 311 179 392 348 306 295 257 271 234 695 348 71 608 182 173 75 320 155 130 445 86 240 281 242
543B42r3M53l72P5M51J9j24n40J05J58K40k72J79j83k35K50J32j98K43r5k03P7
$$ 242 149 602 230 305 756 775 651 111 216 374 614 342 521 338 103 353 485 287 530 435 232 309
521C09j43M11m18J89j20L05l63n2L18m14J73L42j68j42Q2j47J83n0J34J37P1m70
$$ 309 166 577 159 348 228 533 170 118 436 22 195 537 369 227 309 162 345 295 429 566 637 167
499A67p9K60j58N5L42m01j2K50k97J10L1O0k07K14j76j4O78l31l61N36m74J58
$$ 167 88 348 190 245 587 186 174 424 127 237 268 328 121 335 159 145 823 492 131 667 193 351
477C51K77r6m75O91k84n2K08n15J22j08J70J96J104Q2M6M8O4j200j18J16R9L1
$$ 351 628 532 57 748 464 412 620 105 227 119 289 485 1589 1671 1717 1765 1829 629 511 627 726 757
455G57o58o6K43j6j14J82r0J67n1j18K41j82K47k72J9l1o4nP8K54J5k60k43J7
$$ 757 99 33 276 260 146 328 238 405 354 236 477 295 542 270 289 258 194 189 267 521 536 276 33 50
431E0L62J54j72N3p2J67k00J57j53M8j73J84k43M34k46j59K52j93J25M52l72j77
$$ 50 412 566 394 447 375 542 342 499 346 394 221 405 162 596 350 191 443 250 375 827 455 278
409B78J57k00P0Ql7J02N02l52k61J73j21k2O14n32P7o1j15k30J36j8L05p6M08
$$ 278 435 235 305 313 276 378 880 528 267 440 319 297 911 379 456 395 280 50 186 168 473 397 805
386H05p26J90K24k96J75j22J16J13k23J62n4l7k14L23j19L9L7j12K90k68R4n6
$$ 805 79 269 493 197 372 250 366 479 256 418 364 327 113 436 317 356 393 281 571 303 397 341
364C41n9n6J55j75J31K76l46M45n95M31m57M62m24M54k70QK3J28q4K34j7M2K2
$$ 341 282 226 381 206 337 613 267 712 117 548 91 553 129 583 313 321 344 472 388 622 605 647 669
341F69l27p7J16j00KJ39k82K23n7J57k26K61J46j54l64M38R12J200P35K366k113
$$ 669 342 265 381 281 283 422 140 363 306 463 237 498 644 490 126 564 1476 2676 3411 5777 3664
320C664m15k121o14M7M3J59k92R5R1N8l80O15n53J18m5M40m58j97j81K29J70R8
$$ 3664 3249 1128 514 561 604 763 471 566 657 715 335 950 397 515 470 910 452 255 74 303 473 571
298E71r2K56p8k38p1P1K18o06K01K81m97L66J26l02K95M40l19M11o26J70m92K11
$$ 571 479 735 657 419 348 419 637 31 232 513 16 382 508 206 501 941 622 1033 407 577 85 296
276B96R6M12l5p10K13M93N3K65j26k3k44l49N43k67K51m29j71n8Q4P11O55q92
$$ 296 392 804 769 59 272 765 818 1083 957 934 690 341 884 617 868 439 268 210 294 1005 1660 768
254G68O33j90J19O5j3N76J1053J5026L9404j7508k6789j3684l670k788j914J66
$$ 768 1401 1211 1330 1395 1382 1958 13011 28037 67441 49933 23144 9460 5790 3002 1088 1254
238A254J290j883n39J486m70q53K99K71J246N844N855k725l382J447l768j351
$$ 1254 2544 661 122 1608 1138 285 584 855 2101 7945 13800 11075 7693 9140 5372 4021
222D021J59J0678p291O918K703n211J1300N5320L8509j00769O308j2079M232J899
$$ 4021 4180 14858 7567 14485 17188 11977 23277 78597 117106 16337 22645 10566 14798 16697
208A6697M35r428p035K238j450j169J145P4K99Q8p77J196J042M609O006j0383
$$ 16697 17132 7704 669 2907 1457 288 1433 1507 1806 1894 1117 2313 3355 7964 13970 3587
192C587J023J772m540n22q09P8K37m94O205l282L645N741n858K6880p252j0614
$$ 3587 4610 6382 1842 1320 511 589 826 332 6537 3255 6900 12641 6783 33663 26411 15797
176A5797N95J058r959k259p29J21J571l251O583k265j07J0475N7150L4583M759
$$ 15797 16392 17450 7491 5232 4503 4624 6195 2944 9527 7262 7155 17630 74780 109363 114122
161A14122j8737j2860n9892j9236k189J388N23L881l035O879m609M14K841P576
$$ 114122 95385 82525 22633 3397 1208 2596 3119 7000 3965 10844 6235 6649 9490 17066
147A7066j756J7834k4699o965J4303k517j1723J888O799O38K1276O877K7104l9837
$$ 17066 15310 33144 8445 1480 15783 13266 1543 3431 10230 10868 32144 39021 66125 26288
133B6288r48j1614J7633M605K98704J36124m31038l1982J7374p16O540J0539l8992
$$ 26288 25340 13726 31359 35964 334668 470792 39754 7772 25146 24430 30970 41509 2517
120B517J4741M3063l7386j4489K799M6467j1738P98l1092M3720J05482q7753k4247
$$ 2517 17258 60321 22935 8446 11245 57712 45974 46772 15680 59400 164882 77129 52882
107E2882J21496j1801K6295N4417j07100J76436O09517J0473047O38866j0761455
$$ 52882 174378 162577 188872 243289 136189 312625 922142 11395189 12034055 1272600
97A272600r21721o7595j11307m7225l4903k4568j4923q436j424k4038l967o498
$$ 1272600 350879 283284 171977 124752 89849 65281 50358 41922 40498 16460 12493 5995
85E995k966l58L542K506m96N97J016j658J408l631J223k906k750M302j100o16
$$ 5995 3029 2671 6213 8719 8223 8820 9836 8178 9586 5955 7178 4272 1522 5824 4724 4108
69D108j799M96R09J20n88J285o04n74L130k648J12L5M97l061R13r05p0k18R147
$$ 4108 2309 2805 3714 3834 3246 4531 3927 3353 6483 3835 3947 3982 4479 1418 2331 1426 1356 1138 10285
50A0285l793k257m27o95m96J028l67l2k157P42r87l0K031M45j243M39J483j886
$$ 10285 6492 4235 3808 3113 2617 3645 3278 3246 1089 1831 844 814 2845 3290 2047 2486 3969 2083
32B083J122j185J053k546J739q14p05K83l5k47K210j014Q5j3m1J46k00j14N3N1
$$ 2083 3205 2020 3073 527 2266 1452 747 1030 995 748 2958 1944 2029 2016 1975 2121 1921 1807 1860 1911
12A911m49J153j92J74j65R83P30j513M82J503k732K029
$$ 1911 1462 2615 2423 2597 2432 3415 4145 2632 3114 4617 1885 3914
0C914
$$ 3914
##PAGE= F1=344.7746461059
##FIRST=     6340.21289960861, 6666.66666666669, 947
##DATA TABLE= (F2++(Y..Y)), PROFILE
1023I47J093m69j85Q18p99L95p02R42r02N45q4j11L77q89L67m86J62o65j1q6J44
$$ 947 2040 1571 1386 2204 1405 1800 1098 2040 1138 1683 1599 1488 1865 976 1343 857 1019 354 343 257 401
1002D01O10q59O12l65M05k89Q0NK5KK09m99N86n59j0M07j98k67N42n31J97K81
$$ 401 1011 152 764 399 804 515 595 600 625 627 836 337 923 364 354 761 563 296 838 307 504 785
980G85k20J1J13n04M45k5m58J87P91j030L56Q3k72L46j77j2K95n29J58L80m84
$$ 785 565 576 689 185 630 605 147 334 1125 95 451 534 262 608 431 419 714 185 343 723 239
959B39J13R1K19k87K78l06M96J50n42l37L90J30l43Q7K56o27M88J26j1n55K68
$$ 239 352 443 662 375 653 347 843 993 451 114 504 634 291 378 634 7 495 621 610 55 323
938C23M52o71N95m59J66J94K1O8l45L63n45L25n9k03M61m82N03l13k84L92r5N1
$$ 323 775 104 699 240 406 600 621 689 344 707 162 487 428 225 686 204 707 394 110 502 407 458
916D58j62J18M58n28k30L88J30J25m86q8L5L89l51J88P5m01m0L60J03l03J33j25
$$ 458 296 414 872 344 114 502 632 757 271 183 218 607 256 444 519 118 78 438 541 238 371 246
894B46P54p17L24K02j16m67J19O9j13p1j13K98j38l5j98M57n1l0j49p9O5K26p3
$$ 246 1000 283 607 809 693 226 345 414 301 230 117 415 277 242 44 501 450 420 271 192 257 483 410
871D10J25k38K90l82N16n15Q6k7K82N1q1k26j28J86R8L2M50n20k5j0P6k98O97
$$ 410 535 297 587 205 721 206 292 265 547 598 517 291 163 349 447 479 929 409 384 374 450 152 849
848H49m76j19Q7N66n51p8l3J20ON1j14K67m49J91r4K48k03N9M55m00O6j71L6j33
$$ 849 373 254 341 907 356 278 245 365 371 422 308 575 126 317 223 471 268 327 782 382 448 277 313 180
824A80O7K20k65r8J45L54l20N6k49L94K4k58K07j59j5k55M45k93M4OJ86K40o14
$$ 180 247 467 202 104 249 603 283 339 90 484 508 250 457 298 283 28 473 180 224 230 416 656 42
801D2M61k33K71o0j50N4k12J62k94L50j00o8J4K73P3j41l31K87j24K44j13q6k10
$$ 42 503 270 541 481 331 385 173 335 41 391 291 223 237 510 583 442 111 398 274 518 405 319 109
778A09K09J64p6j19J63r7l28j0L37l5p7M73l13j25M7M3K32l63M4Q4J76l03Q6L65
$$ 109 318 482 406 287 450 353 25 15 352 317 240 713 400 275 322 365 597 234 278 362 538 235 321 686
754F86m42k3J0L99j84k49J35L6ok20J32J0J72J17k19L30l20j97J11L0k06K54j03
$$ 686 244 221 231 630 446 197 332 368 362 142 274 284 456 573 354 684 364 167 278 308 102 356 253
731B53J48j8J90j73n1q7lk13Q9N04O6m59K0M66l60J73k48L25Pk69J51R8P2q9l22
$$ 253 401 383 573 400 349 262 259 46 135 639 705 246 266 732 372 545 297 622 629 360 511 609 681 592 270
706B70L97l28J93j15Q0n5Q6j44o1j37J11j70j0J60Mq9P4kM3K89l15M10j5l99J01
$$ 270 667 339 532 417 497 442 528 384 323 186 297 127 117 277 281 192 266 264 307 596 281 691 676 277 378
681C78k0J08l26J78n9p2j7J77M4l07M57k01rJ89k65K14l94L98j34m9K00k04L67
$$ 378 358 466 140 318 259 187 170 347 391 84 541 340 331 520 255 469 75 473 339 290 490 286 653
658F53j37l24n7J35J48l75R8J20K3j16L70m68L01q8j57J74JO3j04j24K77j78n6
$$ 653 516 192 135 270 418 43 141 261 284 168 538 70 371 283 126 300 301 364 260 136 413 235 179
635A79R6m8qL67o0k74k0L01J19n42K25J12q1j44j17R1J72j96P2M09l15k40K15
$$ 179 275 227 219 586 526 252 232 533 652 110 335 447 366 222 105 196 368 172 244 653 338 98 313
612C13J47o6M63J3o02J32M4r8L87k69k15L61j06Kj40Ok39L37l00R6K29j02p7K72
$$ 313 460 394 857 870 268 400 444 346 733 464 249 610 504 506 366 372 133 470 170 266 495 393 316 588
588E88l43K62R4j94rk77L3K2K18k60o8N06m22O7K58l27K34j45k01Q1O08n12j77
$$ 588 245 507 601 407 398 121 154 176 394 134 66 572 150 217 475 148 382 237 36 117 725 213 36
565C6L29N0j50K52k92Q8j22M36l11k41O65n66L5o3R0p1J7K77l35k0K58j1o1K29
$$ 36 365 415 265 517 225 313 191 627 316 75 740 174 209 146 236 165 182 459 124 104 362 351 290 519
541E19j45j08M20l0O6m94k4K19m1k06J29K10l59J16L14l21O7J20l92J70n6M01
$$ 519 374 266 686 656 722 228 204 423 382 176 305 515 156 272 586 265 332 452 60 230 174 575
519E75l25K03j59J38j16o3K70m71K49L71k87l07J68j09L44j63J70k32L87n53K62
$$ 575 250 453 294 432 316 253 523 52 301 672 385 78 246 137 481 318 488 256 643 90 352
498C52J14k11J9K10k69q3J10o3l5J91o2j28j9P2m1O84l32l85N70m74O9L92k05
$$ 352 466 255 274 484 215 132 242 179 144 335 273 145 126 198 157 841 509 124 694 220 289 681 476
475D76l24O88m69K14P5l50k17QK7l9R15P99J671R19j576k545M53j22J73k29j68
$$ 476 152 840 371 585 660 310 93 101 128 89 1004 1803 3474 4393 2817 272 725 603 776 547 379
454C79k89K67j68mJ52k04K12Nj90L45l34J09J62j50n8P1%n5K71M4l94p5K3N24
$$ 379 90 357 189 185 337 133 345 350 160 505 171 280 442 292 234 305 305 250 521 565 171 96 119 643
430F43j71J97j75lm6j39K1m3M1K7rj75N25n24j22L22J17r5K06l7j30k5j78O9J3
$$ 643 472 669 494 491 445 306 327 284 325 352 343 168 693 169 47 369 486 391 597 560 430 405 227 296 309
405C09l3K8M14j50l49N3M4J54J95j69n3J46j76k59j9k5L22N0K58o89M16kk19J62
$$ 309 276 304 718 568 219 272 316 470 665 496 443 589 413 154 135 110 432 482 740 51 467 465 246 408
381D08j57K77r8j19K21k38J52k79O5K14j73R7L57o4n83L32Q5k93N3nL5K2J55J8
$$ 408 251 528 430 311 532 294 446 167 232 446 273 370 727 663 80 412 497 204 257 252 287 309 464 482
357D82m5k00L28l58L75k60J31P5k16o3J0J56Rk07O24q3o77J84K12l93M16l06Q1
$$ 482 437 237 565 207 582 322 453 528 312 249 259 415 424 217 841 758 81 265 477 84 500 194 275
334B75N7R0K95n16M17J22k81l26K7J772R92L82K398k665m25j669m50J06l4L37
$$ 275 332 422 717 201 618 740 459 133 160 1932 2924 3306 5704 3039 2614 945 495 601 567 904
314I04o21P1L48Q5o90R21o59N6j1O12m98l79J40J2K00k8K56l0l2J72n42L61j54
$$ 904 283 354 702 787 97 1018 359 415 404 1016 518 139 279 291 491 463 719 689 657 829 287 648 494
291D94k91K58nk58J70J8O8PM56rq2m41L49n85M07k81N84l0n56k35N29K00P04q55
$$ 494 203 461 456 198 368 386 454 461 917 908 826 385 734 149 556 275 859 829 273 38 567 767 1471 616
267F16M8K38j24kj19n7p3j97j13j35Q76J101p61l5P0m0J4M68M46J1566J5056O2549
$$ 616 664 902 778 776 657 600 527 330 217 82 958 2059 1298 1263 1333 1293 1307 1775 2221 13787 28843 91392
245I1392j8090l7888j8745r454l855k111k15J154r66o66P17M15j045J09K26J267
$$ 91392 73302 35414 16669 7215 3360 1249 1034 2188 1222 556 1273 1688 643 752 978 2245
229B245N103N104j265n321J910k766O32j771J4440j0449Q503Q63j2559J3297R1186
$$ 2245 7348 12452 11187 5866 7776 5010 5642 3871 18311 7862 16365 17228 4669 17966 109152
214A09152M1276j27863R5r015P314N339k065j7520m953K126k588p61O12j15J54
$$ 109152 150428 22565 22660 13645 20959 26298 24233 6713 1760 3886 1298 537 1149 1034 1188
199A188k82m88Q84L683K907k572M899o696R27p4j898j241r9k32K201M085m890
$$ 1188 906 418 1302 4985 7892 5320 10219 3523 4450 4376 2478 1237 1138 906 3107 7192 2302
182B302L397O984j1027K6266L82j4246J01k605q070K005J747k379p96r07J3054
$$ 2302 5699 12683 1656 27922 28304 14058 14159 11554 3484 5489 7236 4857 4061 3154 16208
167A6208p966o254J4653O2515M5864J1948j6566k0514o6535k5359m346k605M46
$$ 16208 8242 1988 16641 79156 125020 136968 120402 99888 33353 7994 3648 1043 1489
154A489M890k027N567l617L370q106K1285j0269K0034k8429J924O015p539K70
$$ 1489 6379 4352 9919 6302 9672 1566 22851 12582 32616 4187 6111 12126 4587 4857
140D857J956L604Q063L142J4477J1508k7959L318o046L6355J7497L43422K80224
$$ 4857 6813 10417 18480 21622 36099 47607 19648 22966 16920 53275 70772 414194 694418
127F94418n93304n7716l4673q94K4200J0094l3790N231N7385n8969k612l775O1105
$$ 694418 101114 43398 8725 7831 32031 42125 8335 13566 70951 11982 9370 5595 66700
114F6700j6245L514k8774M6606L5371q1699R0776m4485K158J00084K97015J49625
$$ 66700 50455 53969 25195 71801 107172 25473 116249 71764 73922 174006 471021 620646
102F20646L83035J018752J3196194l375790j0975852n78942j87961K4309j4993
$$ 620646 1003681 2022433 15218627 11842837 866985 288043 100082 124391 109398
93A09398j5470k1100k8480r418k4868J3358k816l145n474n784k034j298K466M62
$$ 109398 93928 72828 44348 34930 10062 23420 20604 17459 11985 6201 4167 2869 5335 5797
79E797L82K396k266K571k504P45n58l087J653k587l3k73O80k165K660q72m13r20
$$ 5797 6179 8575 6309 8880 6376 7121 6563 3476 5129 2542 2509 2236 2916 751 3411 2539 2126 1206
61A206L854j999o96J794O42l768P31l86q21K516M214l822m38N22j505J3J816r99
$$ 1206 5060 3061 2365 4159 4801 1033 1764 1378 557 3073 7287 3465 3027 3549 2044 2057 3873 2874
43B874M98j926Q48j564j51J719J167j786M87J627j943R28j138J204k462J957o49
$$ 2874 3372 1446 2294 730 579 2298 3465 1679 2166 3793 1850 2778 1640 2844 382 2339 1690
26A690j130K73l98L32K176r01p55M38K36o3n25k9J96R7j78N59J89l54l59J194
$$ 1690 560 833 435 767 2943 2042 1287 1725 1961 1898 1373 1344 1540 1637 1459 2018 2207 1853 1494 2688
6B688L72k169Q56J578k115J357
$$ 2688 3060 891 1747 3325 1210 2567
0B567
$$ 2567
##PAGE= F1=338.2578653956
##FIRST=     6340.21289960861, 6666.66666666669, 5610
##DATA TABLE= (F2++(Y..Y)), PROFILE
1023E610j817J861j143K32p52P77j657R13p77O35p37N1n66q4p90l69m0q80J73
$$ 5610 3793 5654 4511 4743 3991 4768 3111 4024 3247 3882 3145 3196 2630 2546 1756 1387 1347 467 640
1004F40k46N57K85n02J39l8L57j62m37N52n00M09m05K38M26j082M60J24L9p1L14
$$ 640 394 951 1236 734 873 835 1192 1030 593 1145 645 1054 649 887 1313 231 691 815 854 783 1097
983A097q93K80Q11p27L75O3p01L96J19k89k56J244j241K12L88m71N40k29J4R0
$$ 1097 204 484 1295 568 943 1006 305 701 820 531 275 1519 278 490 878 407 947 718 732 822
963H22k21j43M95j43n32K35K26m4R8j06m4N12m48l24L21R7l14k31O47o49O44n70
$$ 822 601 458 953 810 278 513 739 695 793 687 643 1155 707 383 704 801 487 256 903 254 898 328
941C28N87o37J56M46n04L37j49J46k47Q3M05q36N48n85N21p3k7M3N9L79m92k95
$$ 328 915 278 434 880 376 713 564 710 463 546 951 115 663 78 599 526 499 542 601 980 488 193
919A93O48m49L55m55J78L74m26k28P33l95M08p49M75k20R5j84M89k57n00J34K88
$$ 193 841 392 747 292 470 844 418 190 923 528 936 187 662 442 537 353 842 585 85 219 507
898E07L88n36k35J23J066j230P22q1J64l23k91L82m95K33j63L03k91J84j45K51
$$ 507 895 359 124 247 1313 83 805 724 888 565 274 656 161 394 231 534 243 427 282 533
878E33J96l35n1k56J26M94l61K52j47m1k92P77q24K68Q1J71j8l24J86r4J64o2
$$ 533 729 394 343 87 213 707 346 598 451 410 118 895 71 339 420 591 573 249 435 341 505 443
856D43K06L30l11m01L57j31j99O58o26o0J60M91m85N7l06L45r5j53N1K88k16K1
$$ 443 649 979 668 267 624 493 294 952 326 266 426 917 432 489 183 528 433 280 331 619 403 424
834D24pK0k02L3N33n77K22k22J88p0j19M16m51J68j55N34n59K86l50N20j60k32
$$ 424 417 437 235 268 801 224 446 224 412 342 223 639 188 356 201 735 176 462 112 632 472 240
812B40L00m58K38j61M15k74j81J27K97O8m67N93l91M59l71j82J92k47M45m53K38
$$ 240 540 82 320 159 574 300 119 246 543 611 144 737 346 805 434 252 444 197 642 189 427
791D27J75k32j71M57j21N9n21L29p6K18k08Jk18K79K10k15l41M20j87j58j15L69
$$ 427 602 370 199 656 535 594 73 402 326 544 336 337 119 398 608 393 52 472 285 127 12 381
769C81j71q1N33k34k76K82k2K45n72J80q4N05n33lN41l96j60N6N24Om56j25K75
$$ 381 210 129 662 428 152 434 412 657 85 265 181 686 153 150 691 295 135 191 715 721 265 140 415
746D15M1j81K85k85K49Q7m67M39j78j06j51L06r5O4q9L18k34L6J45k96r0J90j26
$$ 415 456 275 560 275 524 611 144 583 405 299 148 454 359 423 334 652 418 454 599 303 213 403 277
723B77q1K22L57m75j18N75n26L19k85L73j64p9L26j55M29l68l46K17j6J88l26
$$ 277 196 418 775 300 182 757 231 550 265 638 474 395 721 566 995 627 281 498 482 670 344
702C44L49j86o8K7K2l48K53k9j9M9M5j1j41J44k24N82m55K61J50n84L51k38M38
$$ 344 693 507 439 466 488 140 393 364 345 394 439 428 287 431 207 789 334 595 745 161 512 274 712
679G12m82L51m19m1J13J32J06k40L34l07N7K54l01J73j96K86l05J83J70l35N97
$$ 712 230 581 162 121 234 366 472 232 566 259 316 570 269 442 246 532 227 410 580 245 842
658H42m70q0m2P4J97l67Q2R4j9k48O54o41M13l17J34n3j21L56k67j34L71l88M08
$$ 842 372 292 250 324 521 154 236 330 311 63 717 76 489 172 306 253 132 488 221 87 458 70 478
635D78j98J58k38K93K25l21l7J25R5m95K96N6K8l73J03J76O0k00j16P44o79J13
$$ 478 280 438 200 493 718 397 360 485 580 85 381 437 465 92 195 371 431 231 115 859 180 293
613B93M0ln8R23p7q78J55Ok99Q98n06K3J81l58K26j41J17m33J39k7m6K93j63K69
$$ 293 333 330 272 1195 1118 240 395 401 102 1000 494 517 698 340 566 425 542 109 248 221 175 468 305 574
589E74o2q4J2M40o00O4j28n8Q7R9j88j01N61k46k33M96n07M02j4m53J19M46m97
$$ 574 512 428 440 880 280 344 216 158 245 344 156 55 616 370 137 633 126 528 514 61 180 626 129
566A29N2R4K58l80N78l96J77l27M25l24j04P51p94J21R6j72L1J18K34l74j09M22
$$ 129 181 275 533 153 731 335 512 185 610 286 182 933 139 260 356 184 215 333 567 193 84 506
544E06M7m7q3J06l42L85j03K69m21j68L49k58lj92O81l44k67O02m16j24K58k62
$$ 506 553 506 423 529 187 572 469 738 317 149 498 240 237 45 726 382 115 717 301 177 435 173
522A73J69j06K32o1J57k29J6J60r1J82m59K26M36l45j36j43l7N23k73M3k26N00
$$ 173 342 236 468 407 564 335 351 511 420 602 143 369 805 460 324 181 144 667 394 437 211 711
500G11o32O32j46j66j27R5j04q8m8J90j59K95P7l13J73n3k62P91l11m81O24m00
$$ 711 79 711 565 399 272 367 263 175 127 317 158 453 530 217 390 337 75 866 555 74 698 298
478B98q0M65l22j12O68p02N55j35j54k27j62L8J56J51J715L250J547l725j946
$$ 298 218 683 361 249 917 215 770 635 481 254 92 130 286 437 2152 5402 6949 3224 1278
459A278J05r35M12o88N25n31K79l16K17k9k50K67M9l02M90l23j4M05j66j42R3
$$ 1278 1383 448 860 172 697 166 445 129 346 317 67 334 383 81 571 248 234 639 473 331 424
438D24j3j22K47P6m70NMP57o71P01n06L60k42k48o9P7j12K76j50r6N35n74J38
$$ 424 411 289 536 612 142 147 151 908 237 938 432 792 550 302 233 310 198 474 324 228 763 189 327
415C27J47K11k1m62N78k46k20O3J5r2p8J0K82J46k04l8o0L72k90K39j68K83k70
$$ 327 474 685 664 202 780 534 314 377 392 300 222 232 514 660 456 418 358 730 440 679 511 794 524
392E24k56j71o8L29K22K63n51N07l81J0J87k84L41l76N4K44m35M10k12j07M63
$$ 524 268 97 29 358 580 843 292 799 418 428 615 331 672 296 350 594 159 569 357 250 713
371G13l51Q9Q33n02l27MJ54k23j82q1K66p0L9L77j70n2J77r6K22k50j98L43l72
$$ 713 362 451 1284 782 455 459 613 390 208 127 393 323 362 739 569 517 694 598 820 570 372 715 343
348C43k10Q1K81k03KP98j68n32L22r9k50M19n02J05j01K29M06q43P75oj35l03
$$ 343 133 214 495 292 294 1092 924 392 714 615 365 784 282 387 286 515 921 78 853 847 712 409
326D09K91J914O48n26K311j953q27q71r62K80m07P87p86K48P13k88n60R18q77
$$ 409 700 2614 3262 2736 5047 3094 2267 1396 434 714 307 1094 308 556 1269 981 421 1339 462
307D62J42k06P43n17n40N75k34L87j26O04l74PN68j005M81n87l0L25k66O6J6J62
$$ 462 604 398 1141 624 84 659 425 812 686 1290 916 923 1491 486 967 380 350 675 409 475 491 653
285F53K93J62n0N11m37l52L51p35N47q41O97n3o7l26M66K91R16p16o58Q01Pj70
$$ 653 946 1108 1058 1569 1132 780 1131 396 943 102 799 746 679 353 819 1110 2026 1310 652 1453 1460 1290
263A290m83j38n7q6k8L1M23J820r46q28Q77R3k27P93K729L1946M2974J23647o4987
$$ 1290 807 669 612 526 498 529 952 2772 1826 998 1875 1968 1741 2534 5263 37209 80183 203830 138843
244A38843o4832m2012k2139n968j691p91Q86p8r97M48P70j308k5J89P12L573M643
$$ 138843 74011 31999 9860 3892 2201 1410 2296 2218 1221 1669 2439 1131 1106 1295 2007 5580 10223
227A0223J162o768K924j473J388l808J4661r986P667k375r627Q249P8364J8112
$$ 10223 11385 4617 7541 6068 7456 3648 18309 8323 15990 13615 3988 12237 90601 108713
213A08713r4784N862n587K2010M865j5228j9742k816J639m197K701k327L78l82
$$ 108713 13929 19791 14204 36214 41079 25851 6109 3293 4932 735 3436 1109 1487 1105
199A105j78J226J503L878O97n908J3323q002j048q4l064j643K75j67K857J553
$$ 1105 927 2153 3656 7534 8231 2323 15646 7644 6596 6512 3448 1805 2080 1913 4770 6323
183F323m205J607Q940p368J2232J0742j5402l222l471k021MK929n809M812K184
$$ 6323 2118 3725 12665 5297 17529 28271 12869 9647 6176 4155 4159 7088 1279 6091 8275
168H275Q020r922K941J9374R1260J7491M5962k5588k1170q2434m1183p108k797
$$ 8275 16295 6373 9314 28688 119948 137439 183401 157813 136643 54209 13026 5918 3121
155C121K148M578j08N233k436M445r416J8431j0262J3321k3232O027j699o567
$$ 3121 5269 9847 9739 14972 12536 16981 7565 25996 15734 29055 5823 11850 10151 3584
141C584O401k02O818J5474l1122M8624l2237K6595j5005J8414N3252J07550N55637
$$ 3584 9985 9783 16601 32075 953 49577 17340 43935 28930 47344 100596 208146 763783
128G63783k56223m17651n1181k8975K5352K7704Q25l4905l809O5737n3321j9706
$$ 763783 507560 89909 38728 9753 35105 62809 63634 28729 24920 90657 37336 17630
116A7630K0713O3974m7481j5751k5412Q4345N2764p2323J17600p9943O2680J67597
$$ 17630 38343 102317 54836 39085 13673 98018 150782 78459 196059 116116 178796 346393
104C46393L86578j01264l0306J319964K6590772k024933k4257335j239853n41255
$$ 346393 732971 631707 601401 1921365 28512137 26487204 2229869 990016 448761
95D48761q1262q9491n0293n1065q6964m1744J8696k9785l131j8843K161J265k831
$$ 448761 367499 278008 227715 176650 89686 47942 66638 36853 33722 14879 17040 18305 15474
82A5474M68N546j750j160J92o031K799o690m87j418P53N642n559o868K24rJ880
$$ 15474 15942 21488 19738 18578 18770 12739 15538 8848 8361 6943 7696 13338 7779 911 1135 1126 3006
65C006J798l580L88J369N812M98k249J016J539n174l56m33r8N107J79p25l265
$$ 3006 4804 1224 1612 2981 8793 9291 7042 8058 9597 4423 4067 3634 3536 8643 8822 8097 4832
48D832L564n361K008J660n73K58k483j08j987l08J531J998r65j66J779j361R40
$$ 4832 8396 3035 5043 6703 6130 6388 3905 3797 1810 1502 3033 5031 4066 3900 5679 4318 5258
31E258j656R54k155J908j219j674j35k75J021K226m88j252J013M50J19j303J3
$$ 5258 3602 4556 2401 4309 3090 1416 1281 1006 2027 4253 3765 2513 3526 3976 4095 2792 2805
14B805J363m37J99N20J45l97M14J187L84j673J144P36k3n55
$$ 2805 4168 3731 3930 4450 4595 4198 4612 5799 6183 4510 5654 6390 6367 5812
0E812
$$ 5812
##PAGE= F1=331.7410846853
##FIRST=     6340.21289960861, 6666.66666666669, 13116
##DATA TABLE= (F2++(Y..Y)), PROFILE
1023A3116j84l84q06k12j990J205k784J369j584M59o60j474m82r95j647p75m65
$$ 13116 12932 12548 11742 11530 9540 10745 7961 9330 7746 8205 7545 6071 5589 4594 2947 2172 1707
1006A707j097L73j28P96q4j79j0J53J32J62p15O98q36N57m57M66J54q60L41q5
$$ 1707 610 983 855 1651 1567 1388 1378 1531 1663 1825 1110 1808 972 1529 1072 1538 1692 832 1173 1088
986A088J59K6K25o31j89J441j209N23j10n29J42J28kn12J385j391K61O04n98N28
$$ 1088 1247 1273 1498 867 678 2119 910 1433 1323 794 936 1064 1062 550 1935 544 805 1409 811 1339
966A339j78r7j01J13l96P62j05j103N34K87J10j2j90l48O95j57m84M23J6l92k58
$$ 1339 1161 1064 963 1076 680 1442 1337 234 768 1055 1165 1153 963 615 1310 1153 669 1092 1108 716 458
945D58P55p10P95r84R79o90L30O4l09K45l9R2l66Q8M44r02N69m56L72J73j08m13
$$ 458 1213 503 1298 314 1293 603 933 997 688 933 894 986 620 708 1152 250 819 363 735 908 800 387
923C87O61J85n62l76Q83o07O24p32N8L72l02k9P22p93O03o68P58m80l00J05Q27
$$ 387 1048 1233 671 295 1178 571 1195 463 521 893 591 562 1284 491 1094 426 1184 704 404 509 1336
902A336o07m67K58L7O60o53l30J76J179j404Q50l63M01j36o13O26r30O00r5K49
$$ 1336 729 262 520 557 1217 564 234 410 1589 185 1035 672 1073 937 324 950 20 620 525 774
882G74n30M14m7O2K94n56J73m51Q8O97l24J4Nj72M2N37o55J31K12M3k10k69M02
$$ 774 244 658 611 673 967 411 584 133 221 918 594 608 613 441 483 1020 365 496 708 751 541 272 674
859F74j32Q5k37M84J75j89p04P37k41J07K19p04j3N46J28m35K27m30M01j83l79
$$ 674 542 627 390 874 1049 860 156 893 652 759 978 274 261 807 935 500 727 297 698 515 136
838A36O88j88P1j40Q2j02k78l7O80o45J91j43J75J13l85N66m71L03m37Q20q63
$$ 136 824 636 707 567 649 547 269 232 912 267 458 315 490 603 218 784 313 616 179 999 136
817A36N73n45N46j14k84L11j37r1n4M71k91j52k6K79Kl10N76n49P07p06q1L08
$$ 136 709 164 710 596 312 623 486 395 341 812 521 369 343 622 624 314 890 341 1048 342 261 569
795E69k78O81o12J48L60k79m66O83l85K70n41K56J68j5j60L3l6J21K37k64k97
$$ 569 291 972 360 508 868 589 123 806 421 691 150 406 574 559 399 432 396 517 754 490 193
774A93K75m3p6k86L30Q5l16O05l17k94M74m6J24m09Q8r2M80o72N8N98m23j31j09
$$ 193 468 425 349 63 393 478 162 767 450 156 630 584 708 299 387 295 775 103 161 759 336 205 96
751I6O87J80n74k17L01J43k73N19n61K27Q3n06L81K0m7k21M08k2j67J10L08l98
$$ 96 783 963 389 172 473 616 343 862 301 528 611 105 486 506 459 238 646 624 457 567 875 477
729D77j97N12o43J7L61k3j41k4M56l93j9M94p58M36k47L74l78R7N16m49Q12o26
$$ 477 280 792 149 166 527 504 363 339 795 402 383 877 119 555 308 682 304 401 917 468 1280 654
707F54l18j0L77J04n74P06m30k41K36J80n87L73R8N0j61J98jl56L59n40P99n35
$$ 654 336 326 703 807 233 939 509 268 504 684 97 470 568 618 457 655 654 298 657 117 916 381
685C81K3L64p26O59n49O96n14N20m19l24K35J48M7n6N8l06J22L33l48N0J64j5
$$ 381 404 768 42 701 152 848 334 854 435 111 346 494 541 485 543 237 359 692 344 394 558 543
663E43k32J95K26o46Q88q75K36P8o0L14m24R7J11J03m09O73n98L78k75K93l92
$$ 543 311 506 732 86 974 99 335 413 353 667 243 340 451 554 145 818 220 598 323 616 224
642B24j80N67l38j99M01k72N36m72M52n13K85L80k81r1M3l2k90J63L1K08k57r5
$$ 224 44 611 273 74 475 203 739 267 719 206 491 871 590 499 542 510 220 383 414 622 365 270
620B70L23j47nk94Q19p32K68j32j96n2Q26K09q78J09L4l5Q15q11L49P2n89M88
$$ 270 593 446 441 147 966 234 502 370 174 122 948 1157 279 388 422 387 1202 391 740 812 223 711
598G11k53K16m44o1L88m63M08K2L48l81K02m10Q01j005K79n1r6J08K6j10j00N47
$$ 711 458 674 230 169 557 94 502 524 872 491 693 283 1084 79 358 307 211 319 345 235 135 682
576F82m9l88N47m59L89O1o85K84R6m22L20k19N33o54Q84l97L23o46M96l71l7Q34
$$ 682 633 245 792 333 722 783 98 382 478 56 376 157 690 36 920 523 846 200 696 325 288 1122
554A122j042K30K04l13J80R9L62n57j6M20J00l5l54K71n43L26j82M53l56m2K79
$$ 1122 80 310 514 201 381 480 842 285 269 689 789 754 400 671 128 454 272 725 369 327 606
533F06k15R7j71O09k75n71P68m67j73J67K9J44j99KK57N0k90K20J67l02K36m38
$$ 606 391 488 317 926 651 80 848 381 208 375 404 548 349 351 608 658 368 588 755 453 689 251
511B51J56M84l48P1m90P3N96k66k50M54R4o51R13m42j13k28j9J7l4p1L30k50L24
$$ 251 407 891 543 614 124 197 793 527 277 731 825 174 1087 645 532 304 285 302 268 197 527 277 601
488F01K50m65L99l35l43Q44l26m78N88l39k28M73k66m1P41p85O49k10j09j51l66
$$ 601 851 386 785 450 107 951 625 147 735 396 168 641 375 334 1075 290 939 729 620 469 103
467A03J75L40K88J543M867m51l968m73m66j731P41o78O89p53L08k30K21k51JJ38
$$ 103 278 618 906 2449 7316 6865 2897 2424 1958 227 968 290 979 226 534 304 525 274 275 413
447D13R2k69M82j80J59J02mk21n0pj56K07J36m18j29J30Q60j032J021o89O51k44
$$ 413 505 236 718 538 697 799 795 574 524 517 361 568 704 286 157 287 1147 115 1136 447 1098 854
425H54n26J46q0l62N24j91n9N62k94M9O2J57K59p96P10m12l04K54r0j82j0l7L37
$$ 854 328 474 394 32 556 365 306 868 574 623 685 842 1101 305 1015 603 299 553 463 281 271 234 571
402E71K14K7o6j31L89n08M11k43K91l87k24k43R4K48K25M84n35N15o31K31J72
$$ 571 785 812 746 615 1004 496 907 664 955 568 344 101 195 443 668 1152 617 1132 501 732 904
381I04l78K14o31K62K24l74M89p1q0M15l65J33R77p63l8l96J86j02m98J4L88r2
$$ 904 526 740 109 371 595 221 710 639 559 974 609 742 1719 956 918 522 708 606 108 122 510 418
359D18J80L75K39l61O9J27J14l56k19K42l94m13M99N4r1L32N75j82l70M07m48
$$ 418 598 973 1212 851 920 1047 1161 805 586 828 434 21 520 574 483 815 1390 1208 838 1245 797
338G97P3J89m91j10k02K98N11r10R54J4M2l39N63J416N45o43K196o2k755M6j804
$$ 797 870 1059 568 458 256 554 1065 155 1109 1123 1165 826 1389 2805 3350 2707 4903 4841 2086 2132 328
317C28N69p11J130n79M17Q62p64k85Q34j118L12m86P23m92l72O65k83N60r6P08
$$ 328 897 186 1316 737 1154 2016 1252 967 1801 683 995 509 1232 740 368 1033 750 1310 1214 1922
297A922m77j5O34j165L66o61j59L94l14K56k3L79L61M35l44O84m44m17J66q94
$$ 1922 1445 1430 2064 899 1265 604 445 839 525 781 758 1137 1498 1933 1589 2273 1829 1412 1578 684
277F84O13j006L45o5N01k36O34K69Q92l18j071R06Rr1j056O5l78O4R7J14L85K380
$$ 684 1297 291 636 571 1072 836 1470 1739 2631 2313 1242 2148 2157 2066 1010 1075 697 761 858 972 1357 3737
255C737j552r66J644P7k36Q62O624Q7600J25736K07007j74874j09696r0324m2179
$$ 3737 2185 1219 2863 2940 2704 3566 10190 97790 223526 430533 255659 145963 55639 13460
241A3460q600j365q74P26r2j500R99L81j619r8Q4J58Q51L865N933p316L28J560
$$ 13460 4860 3495 2621 3347 3255 1755 2754 3135 1516 1418 1502 1660 2511 6376 12309 4993 5321 6881
223F881K224n630J3095p973N222j187J59o388R4106J4278r8168R32l416L3935
$$ 6881 9105 3475 16570 8597 13819 12632 12791 6403 100509 114787 16619 17551 14135 48070
209D8070q047j6779j7584M9k98l336L099k804l66j31P39J035K518J922o085J0445
$$ 48070 40023 23244 5660 5709 5411 2075 5174 2370 2004 1873 2612 3647 6165 8087 2002 12447
193A2447M789r668K096k057l719j966O70j78K725L50j092J707Q322j0530J694
$$ 12447 17236 7568 9664 7607 3888 1922 2592 2414 5139 5489 4397 6104 14426 3896 5590
178E590J9414j3731p453K613L154o294J75J12R63O315L847j0232O363L5730J20486
$$ 5590 25004 11273 3820 6433 9587 3293 3468 3580 4543 10858 14705 4473 10836 46566 167052
163A67052M092P1013l1092l2489r3184o8731r349j463L384N680M44O923l250M183
$$ 167052 171144 242157 211065 178576 85392 16661 7312 5849 9233 14913 15357 22280 19030 23213
149B3213o636R359m088M973j4538L977l902m267P601j18J0261J5360q456J7355
$$ 23213 16577 25936 21848 26821 12283 16260 12358 8091 15692 15574 25835 41195 32739 50094
135E0094k2607L1409j9118J5402K5173P1080K43208k30019j13476L121j4759K8298
$$ 50094 27487 58896 39778 55180 80353 151433 394641 164622 51146 54267 39508 67806
123F7806K1714J2445j4655N587M1590l3997n100K2718M6117n2439m0881P878M0238
$$ 67806 89520 101965 87310 92897 134487 100490 95390 118108 164225 111786 70905 78783 119021
110A19021J33915J0246n1412K34722Q6141N8266J5731J525932K646861N888259
$$ 119021 252936 263182 211770 446492 532633 590899 606630 2132562 4779423 10667682
100A0667682M8033028q307245m6601803k955087J8664k99961j00245j16456m8813
$$ 10667682 58700710 50393465 3791662 836575 855239 555278 455033 338577 289764
91B89764M3512p1490n7416n6862m1215l0371l6666j1014j0115L809k690J0492
$$ 289764 333276 261786 204370 147508 106293 75922 39256 28242 18127 21936 19246 29738
79B9738N633N5P583q623N734p285p417O344m943r028p607J709r40O022m794O210
$$ 29738 35371 35426 43009 34386 40120 32835 25418 31762 26819 17791 10184 11893 10953 16975 12181 18391
63A8391K357L010O038n355l192J406l440r292j954j335J213L343M244j234o1M453
$$ 18391 20748 23758 29796 24441 21249 22655 19215 9923 7969 6634 7847 11190 15434 14200 14139 18592
47A8592m612J969L54j588l631m075j371k226K12K871L194k62j21L364k549J872
$$ 18592 13980 15949 16303 14715 11084 7009 5638 3412 3624 6495 9689 9427 9306 12670 10121 11993
31A1993k934J218m016R34j971k637j45K2J509L361l31l98J409O30O30j842O99
$$ 11993 9059 10277 6261 7195 5224 2587 2442 2464 3973 7334 7003 6605 8014 8644 9274 7432 8131
14H131P10j006l3R96Q11J47J120K413K358l066K623J981k611J97
$$ 8131 8841 7835 7802 8798 9609 9756 10876 13289 15647 12581 15204 17185 14574 14771
0A4771
$$ 14771
##PAGE= F1=325.224303975
##FIRST=     6340.21289960861, 6666.66666666669, 23811
##DATA TABLE= (F2++(Y..Y)), PROFILE
1023B3811K414m878r14r51l220J144l497J666k264l69j94l450l83k558k356j129
$$ 23811 26225 21347 20433 19482 16262 17406 13909 15575 13311 12942 12748 9298 8915 6357 4001 2872
1007B872q55j295N58M4R40l71L0M0K00j34N58r28P58j098O24j54L34j81n73L05
$$ 2872 2017 722 1280 1324 2264 1893 1923 1963 2163 2029 2587 1659 2417 1319 1943 1789 2123 1942 1369 1674
987A674k00J36K3K16k94n83J816j459N38l31k65L7n5L10o43J283j377L49P05o43
$$ 1674 1474 1610 1633 1849 1555 972 2788 1329 1867 1536 1271 1308 1253 1563 920 2203 826 1175 1880 1237
967A237L91r4k02k12K98n01J017k51j346P30L91J90q9m82j2L38J59o68N96j03
$$ 1237 1628 1534 1332 1120 1418 917 1934 1683 337 1067 1458 1648 1559 1077 1065 1403 1562 894 1490 1387
947A387m77j90P36p61R40r84R53p04N56l53j43L15j47M2k25L2K62p02M54l13J91
$$ 1387 910 720 1456 695 1635 651 1604 900 1456 1103 960 1275 1128 1170 945 977 1239 537 991 678 869
926H69M54k74o56J030j0n92m16J031n71P52r73q2M10j62J00N80q58N68m37Q52
$$ 869 1323 1049 393 1423 1413 821 405 1436 865 1617 644 562 972 810 910 1490 632 1200 763 1615
906A615p00o53M31J043q76m16L05m7P36o93k00J23J035j198O16k31L02N6p52P05
$$ 1615 915 262 693 1736 860 444 749 702 1438 745 545 668 1703 505 1121 890 1192 1248 496 1201
886A201j022O75o3K00o58N37J1j8K42n77K97n43J11O25o6m06K02m4R2K66l94l3
$$ 1201 179 854 791 991 333 870 881 863 1105 528 825 282 393 1018 952 546 748 704 796 1062 668 635
864F35L55q9l81Q6L41k08p9l42P75M2j91p18Q89k07K29k13o64L2Q48j43m41L43
$$ 635 990 901 520 606 947 739 660 318 1093 1135 944 226 1115 908 1137 924 260 292 1140 997 556 899
842H99l47K42j73n11J160o26L16k64J56j17l52j71Q34n37LM6m0L36n69O06l91
$$ 899 552 794 621 110 1270 644 960 696 852 735 383 212 1046 509 512 558 518 854 285 891 500
821E00L14n73R89r83P06p18M70J3k66K22J47l59K2N90l22j03k35K63P2k98M67
$$ 500 814 241 1230 247 953 235 705 718 452 674 821 462 484 1074 752 649 414 677 749 451 918
800I18o89R86r11L9L40j77P06o94J04M03j93p67Q40n88M00m36J30M24k93M9r2
$$ 918 229 1215 304 343 683 506 1212 518 622 1025 832 65 905 317 717 281 411 835 542 591 499
779D99J89l3J46r3l08M1J63j5m33K38L33l32N64n04J0L14O3q7k29N5o3K67o87
$$ 499 688 655 801 708 400 441 604 589 156 394 727 395 959 455 465 779 842 755 526 581 518 785 98
756I8K82M67m45j07j95P50K64n81k01K15L27n45P94q04J75Q2l01K14J46o1j46
$$ 98 380 847 402 295 100 850 1114 533 332 547 874 329 1123 319 494 576 275 489 635 574 428
735D28L79Jk73K35K53n01m01P90q18J4M97O6j21m4K44k37R2M48q43L99k23L10
$$ 428 807 808 535 770 1023 522 121 911 93 107 604 670 549 505 749 512 604 1052 209 608 385 695
713F95l35qO77o28J026p61j69p1M50M2o56Q89p26l56M52L25p84M44J75K08m65
$$ 695 360 352 1029 401 1427 666 497 426 876 918 262 1151 425 69 521 846 62 506 681 889 424
692D24M08K6n74N63o02P33n90j95N36n71O97p62P30l42N79l91m24K44J71q3J02
$$ 424 832 858 284 847 245 978 388 193 729 158 855 93 823 481 1060 669 245 489 660 577 679
671F79j90j65N0M10l61q2M63l12J49r1L12o95Q11p02L8K66k52M62n03J23J71K08
$$ 679 489 324 374 784 423 341 804 492 641 550 862 167 978 276 314 580 328 790 287 410 581 789
649G89m35M51l90K61j03L35o83n9M96l18k25L76p1M36o29P19o68L35L14j69j76
$$ 789 354 805 415 676 573 908 225 166 662 344 119 495 424 860 231 950 282 617 931 762 586
628E86J30j91k02K1O6M37k22k93M37l37J68j27M89m79J88k20l89P6L73O67q63
$$ 586 716 525 323 344 410 847 625 332 769 432 600 473 962 483 671 451 62 138 511 1178 315
607C15J05O6K03N92j105O91M2o80O22m27L12m20L8N30q58N61J50M04o54L91n09
$$ 315 420 486 689 1281 176 867 909 229 851 424 736 316 354 884 26 587 737 1141 487 878 369
586C69P63r48K49n7r7J00M3q8j01N07J08m03M66l84L88L6p53L15j72l01N08m18
$$ 369 1132 184 433 376 279 379 422 334 233 740 848 445 911 527 915 951 198 513 341 40 548 130
564A30P20o56Q59l37M50r50O21m31j8Q40j213L07K79l74L45J0N39p37M5M28J33
$$ 130 850 194 1053 716 1166 216 837 406 388 1228 15 322 601 227 572 582 1121 384 429 857 990
543I90j9n04L06o51K45k22N49l05J63J76j41J25p0L97j46o36O86n05j15l6L07
$$ 990 971 467 773 122 367 145 694 389 552 728 587 712 642 1039 893 257 943 438 323 287 594
522E94R5k28q8M31r6k75N35L0o54M54m40Q7M41l17K80p31J56N41j56n52J071k81
$$ 594 689 461 373 804 708 433 968 998 344 798 358 445 886 569 849 118 274 815 659 107 1178 897
500H97o10J097o80j01j99j48O1Q1j04M24k85L16L27m94N63o58j71P36l60m32N65
$$ 897 287 1384 704 603 404 256 317 398 294 718 433 749 1076 582 1145 487 316 1052 692 260 825
479H25l62k88M20j4j76Q35o62M74m9l09q7m32K17M02N78J207M517J421m420j082
$$ 825 463 175 595 581 405 1240 578 1052 1003 694 607 175 392 794 1372 2579 7096 8517 4097 3015
459C015o93k090P95l43M84r10L36o8J26m64L17K0J75l04M76m4L10k62K27k58k64
$$ 3015 2322 232 1027 684 1168 258 594 526 652 188 505 525 700 396 872 828 1138 876 1103 845 581
438E81L4j89J80K14m02j74K66P75p89P21n45O46j80p74L71k69l29M41j67n1O54
$$ 581 615 426 606 820 418 244 510 1285 496 1217 672 1318 1138 364 735 466 137 578 411 360 1014
417A014q2m8m8J32N45p91M60n27k23K50k22k14J76r9N29M9K19r6q6K86n34M44
$$ 1014 932 884 836 968 1513 722 1182 655 432 682 460 246 422 323 852 901 1120 1024 938 1224 690 1134
395A134l31K27m87j82k31K54L12L0P45n20M11o45L22J19m21j2n76K27J71p8L83
$$ 1134 803 1030 543 361 130 384 696 726 1471 951 1362 717 1039 1158 737 725 149 376 547 469 852
374H52Q1p8K85k35J79Q34p71J43p21K25l1o01N7M06p8M10J58P13o83j1L20k0m68
$$ 852 933 855 1140 905 1084 1918 1147 1290 569 794 763 162 219 625 547 957 1115 1828 1145 1134 1454 1434 966
351I66q2l2k87m90P88k73J82M45M24j30l00M77p22M37j55m84k67k30K56O07o82
$$ 966 884 852 565 75 863 590 772 1217 1641 1511 1211 1688 966 1403 1248 764 497 267 523 1130 448
330D48Q38K08O5k83O67O04R99J82J429J663m586M14k320P18k73O87k72N13R24
$$ 448 1286 1494 1559 1276 1943 2547 3546 3728 5157 6820 2234 2648 328 1046 773 1460 1188 1701 2625
311B625j132j5O94j284M69p14O04m23j81O32j51O31j0O45m24l1M57j100J77m92
$$ 2625 1493 1478 2172 888 1357 643 1247 824 643 1275 1124 1755 1745 2390 1966 1935 2392 1292 1469 977
291I77n06M48k15L40rN07M07O33l26N03k92m82p8r49N57r61j30l4R69m9P41K48
$$ 977 471 919 704 1044 1035 1542 1949 2582 2256 2759 2467 1985 1907 958 1515 554 424 390 1359 1310 2051 2299
269B299P95rj182Q15j1j9j508K38o29J53J76J83O43K608k265m24K010j50m4P93
$$ 2299 3094 3085 1903 2718 2707 2688 1180 1418 789 942 1118 1301 1944 4552 2287 1863 3873 3723 3679 4472
249D472J1228J61840K39607K56823k81968j64003j47817o3555j0745j317o69O75
$$ 4472 15700 177540 417147 673970 392002 227999 80182 16627 5882 4565 3896 4571
237D571n26k012J795k07j890j22j16J316j680K992J2365r342k649J587M394o617
$$ 4571 4045 2033 3828 3621 1731 1609 1493 2809 1129 4121 16486 7144 4495 6082 10476 3859
221C859J1249p472K473n92Q191r457J03528J9570j18959O587n338L6756j2104
$$ 3859 15108 7636 10109 9517 17708 8251 111779 131349 12390 18977 13639 50395 38291
208C8291j3498k1413L947k105j476J950k760q57L66J374P70K931J391p206J3738
$$ 38291 24793 3380 7327 5222 3746 5696 2936 2079 2445 3819 4589 7520 8911 1705 15443
193A5443n078m886M444k728l508k022P59J46K590J295q10K04J0872j1992r1J6324
$$ 15443 10365 5479 9923 7195 3687 1665 2424 2570 5160 6455 5645 5849 16721 4729 4638 20962
177B0962j0390m473J337N882r199n35O62n42J3182L168j5158R333L2328J38293
$$ 20962 10572 6099 7436 13318 4119 3584 4246 3704 16886 20054 4896 14229 46557 184850
163A84850J3701Q2062k1966n1652r2010r6109j1302J3M229O763N91Q523m324L568
$$ 184850 198551 280613 258647 206995 114985 18876 7574 7587 11816 18579 19170 27693 23369 26937
149B6937l212r41O400p903k950J888n617r373J4630N203Q367J2388L067o195J5281
$$ 26937 23725 22784 29184 21281 18331 20219 14602 5229 19859 25062 33429 45817 48884 42689 57970
134E7970J298q618l50Q312P2125P50447k1537p88063k3727J8656J1021K5641L1769
$$ 57970 59268 50650 50300 58612 130737 881184 859647 71584 47857 66513 77534 103175 134944
121A34944J4528J7698J4571j2538K8433L381o624k2109j6941L5122M4223K23899
$$ 134944 149472 167170 181741 169203 197636 201017 194393 172284 155343 190465 234688 458587
109D58587K78213J04039O45005N94343O32226Q42363L149410O982876J9846385
$$ 458587 736800 840839 1485844 2080187 2712413 3554776 6704186 13687062 33533447
100C3533447K20752869k4537559k10757049j3291714j907914j010643n91806n02392
$$ 33533447 254286316 229748757 18991708 5699994 3792080 2781437 2189631 1687239
92A687239m20835k03887k36642k88083q9918j32090q2538j08785n4678Q003K8461
$$ 1687239 1266404 1062517 825875 537792 447874 315784 233246 124461 69783 77786 106247
81A06247J1242K5837J3605N681k80k2992j890k4624k8183j8768k6366j2073m193
$$ 106247 117489 143326 156931 162612 162332 139340 137450 112826 84643 65875 39509 27436 23243
68B3243N988N272J2312K464Q883M263m303r20j2274o209J32j1018j2589m088j837
$$ 23243 29231 34503 46815 49279 58162 62425 58122 57202 44928 38719 38851 27833 15244 11156 9319
53I319L538L177N049L697J486L197K140k465j666m656p592n452k675k295J033
$$ 9319 12857 16034 21083 24780 26266 29463 31603 29138 27472 22816 15224 9772 7097 4802 5835
38E835M010M495O17Q07N111l961K444l526Q20n675j583k328l498l8K86K029M468
$$ 5835 9845 14340 14957 15764 20875 16914 19358 15832 16652 10977 9394 7066 3568 3530 3816 5845 10313
21A0313k2Q44K272O30J060j962J433j127j263n48J257K128J030J968M211N309
$$ 10313 10291 11135 13407 14037 15097 13135 14568 13441 12178 11630 12887 15015 16045 18013 22224 27533
5B7533l077L289M347o050J904
$$ 27533 24456 27745 32092 26042 27946
0B7946
$$ 27946
##PAGE= F1=318.7075232646
##FIRST=     6340.21289960861, 6666.66666666669, 34697
##DATA TABLE= (F2++(Y..Y)), PROFILE
1023C4697K362p691k048k142l756O11k905Q08k121j639K42m858o97l694k720j238
$$ 34697 37059 29368 27320 25178 21422 22033 19128 19936 17815 16176 16418 11560 10863 7169 4449 3211
1007C211j013j448P05J78R50n15J59J05J78l45Q56j028P80j319P34J22J54m88
$$ 3211 2198 750 1455 1633 2583 2068 2227 2332 2510 2165 3021 1993 2773 1454 2188 2310 2464 1976
989A976k59L11k91Q0l8K10P5q60J811j412N00n40L9J7l03N67o64R75j153L92O81
$$ 1976 1717 2028 1737 1817 1779 1989 2064 1204 3015 1603 2103 1563 1602 1619 1316 1883 1219 2194 1041 1433 2114
968B114n79J60K4k52k72L48m58J149m80j276Q06M38K90j88q24N26j43M05p91P43
$$ 2114 1535 1695 1719 1467 1195 1543 1085 2234 1754 478 1284 1722 2012 1824 1000 1526 1383 1788 997 1740
948A740k30n05r4O30p50J049r21P86o14P13o47l2M39l71K8k8n9M9m29K71r0K1
$$ 1740 1510 1005 911 1541 791 1840 919 1705 1091 1804 1157 1125 1564 1193 1221 1193 1134 1183 754 1025 935 956
926I56O37m04o88J130j56o33l36J027m08P53j143j36L64M5J19L61o65L95k09Q37
$$ 956 1593 1189 501 1631 1475 842 506 1533 1125 1878 735 599 963 1008 1127 1488 823 1218 1009 1846
906A846q29q50P33J005j008l02K47P4N93o76o0J24O95p66J90K03l4K34p63O65
$$ 1846 1017 167 900 1905 897 595 842 916 1509 833 773 897 1592 826 1016 1219 1185 1419 656 1321
886A321j010P11o4J48o78N75J9j3J03m48L01n83K51L44K48q13M08J20L3L0j15
$$ 1321 311 1022 958 1106 428 1003 1022 1009 1112 664 965 382 633 977 1225 412 820 940 973 1003 888
865H88k08M99k24m32L35L07k82k92l09R60p4k59n60Q76p4J50m95m96Q0R07k44
$$ 888 680 1179 955 523 858 1165 883 591 282 1242 1168 909 349 1225 1151 1301 806 310 390 1297 1053
844A053m65L78j92J3n2n27J300q72M77l51J87n5m22k72Q98l78j37K40l38N15o09
$$ 1053 588 966 774 787 735 208 1508 636 1113 762 949 894 472 200 1098 720 583 823 485 1000 391
823C91N36k68K41n71R63r11P17p98L44J00j49Q3L03m74N1O80l21m9m75L39J59
$$ 391 927 659 900 329 1292 381 1098 300 644 744 595 678 981 507 558 1238 917 868 393 732 891
802H91l68K84p79J234r19P1K99K8N30o30Q9L07k0r01P96n71L28k70J8N95n36K91
$$ 891 523 807 28 1262 343 414 713 741 1271 641 730 1037 1017 116 912 341 669 399 417 1012 476 767
780G67k73M08j25o3K15l98j45L48M7n08J39M42k19M30o35L42L8K52k71q6L9p6
$$ 767 494 902 777 714 929 531 386 734 781 273 412 854 635 1065 430 772 810 1062 791 705 744 668
758F68P2o17M58K79l79j60p6O63K28n09j90J62N24q61J013r65J52N9j63K27J49
$$ 668 740 123 581 860 481 321 245 908 1136 627 437 599 1123 262 1275 310 462 521 358 585 734
737G34j18o2L27Jk38K18K00n34k77O57n47l24N77J21n7J2m6n8J52M51q73L52k21
$$ 734 616 554 881 882 644 862 1062 528 251 908 361 37 614 735 678 690 644 586 738 1189 316 668 447
714D47J85n2k79P08n58R48p44L2o9L19L7n53Q25r93o7L41L98q68M43J69M41q23
$$ 447 632 580 301 1009 451 1399 655 687 618 937 974 421 1246 253 186 527 925 57 500 669 1110 287
692B87O19R7p63P06n53N81o37j23M08l30O32o62M04J1M38l38m16K78J35k18J97
$$ 287 906 1003 240 946 393 974 337 214 622 292 924 262 666 677 1115 777 361 639 774 556 753
671G53l22J1j23M53k98j72O15n26N55m17L96m92L97k09l86M60m62O26n80J62K24
$$ 753 431 442 319 772 474 302 917 391 946 529 925 433 830 621 235 695 233 859 279 441 665
650F65K53l72J35p3Q8Q4K98q06K8K83j81k07L32Q2J90n72Q45o83L52J26kk69K62
$$ 665 918 546 681 608 696 780 1078 272 300 583 402 195 527 609 799 227 1072 389 741 867 865 596 858
627H58k76j92j08J35O12k26m16M36m14K59J17O9j93J07k30m19K64K6O40p39J82
$$ 858 582 390 282 417 1029 803 387 823 409 668 785 854 661 768 538 119 383 409 1049 310 492
606D92L4L39L36j059P22P0o55O18n71L93l84J93N93j087O40J49M97q59M61k40
$$ 492 526 865 1201 142 864 934 279 897 326 719 335 528 1121 34 674 823 1320 461 922 682
586F82L34n39L8r9j24J15J09j02j02M52J61k80K95k95M15q7o63K34k55j91N67
$$ 682 1016 477 515 416 292 407 516 414 312 764 925 645 940 645 1060 973 310 544 289 98 665
565F65m54P50o19P53k33M91j108O93m71qP43j098J68L66m21M82p5O30p88N4M51
$$ 665 211 961 342 1095 862 1353 245 938 467 459 1202 104 272 638 217 699 624 1254 466 520 971
544I71J33rn56K74p06K43j48M39k48K67J70j17J06Q6J05L6o83O20n50l5k05N19
$$ 971 1104 1095 539 813 107 350 202 641 393 660 830 713 819 905 1010 1046 363 983 433 398 193 712
522G12jj64o1M57k45j59P35j01r99P36m78O7K75k65M66q10J78L92nm84J198n83
$$ 712 711 547 486 943 698 539 1274 1173 174 910 432 499 774 509 975 165 343 735 730 246 1444 861
500H61m56J114p86j36r2k58O0K25j70M81l23L21K97m06O57r39N8N63l04l73N15
$$ 861 405 1519 733 597 505 247 307 532 362 843 520 841 1138 732 1389 450 508 1071 767 394 909
479I09m40k21L41K00l23P93l99K26K03n78l6m04K06K79R63Q67L942Q7k951l99
$$ 909 469 248 589 789 466 1259 860 1086 1289 711 675 271 477 756 1719 2586 6528 6615 3664 3265
459C265q30k063O72j13L20r97L67O4On70N54p2K73l98M67P7M03n73M37k43m60
$$ 3265 2435 372 1044 931 1251 254 621 685 691 121 675 603 876 478 945 1022 1425 852 1289 1046 586
438E86Q1k25J88K76m40m6K93N61m55L50k45M65j05r03M77l53k42K77j33m8P85
$$ 586 667 442 630 906 466 420 713 1274 819 1169 924 1389 1284 381 858 505 263 540 407 359 1144
417A144Qr2k19K14O99p78K52n42j18J63l32k06L54r0O02r1L09j13RJ57n55N26
$$ 1144 1152 1060 841 1055 1754 976 1228 686 568 731 399 193 547 457 1059 968 1277 1164 1173 1330 775 1301
395A301m47J40n21j47j88L95M16k19R07m32K17m94L26K9m08k21l56O4J14K22K58
$$ 1301 854 994 473 326 138 533 949 730 1637 1205 1422 928 1254 1283 875 654 298 362 476 698 956
374I56J95j08J25qJ76N15n62J81q93K78jn00l4L88p5O00j16J101r01p5M69j74
$$ 956 1151 1043 1168 1160 1336 1851 1289 1470 577 855 854 354 320 708 633 1233 1117 2218 1317 1242 1711 1537
352A537n26P0k74j06n51R73o02M69M09L44l5k87N00q69P80n23n16k67k19J21O61
$$ 1537 1011 1081 807 701 150 1123 521 990 1399 1743 1708 1421 1921 1052 1832 1309 793 526 307 428 1089
331A089l70N97M50l0n1O14K11J508O91K93K770n077N31k963Q37J71J90N7N05Q69
$$ 1089 719 1316 1766 1736 1685 2299 2510 4018 4709 5002 7772 2695 3226 263 1100 1271 1461 1518 2023 2892
311B892j279K03M78j305N71q58M63l22mM63J13N80J17M23k79lJ59q99K3k51q61
$$ 2892 1613 1816 2294 989 1560 702 1165 843 839 1302 1415 1995 2112 2535 2256 2253 2412 1513 1536 1285 424
290D24M73r7L98J8N17M41O70r1J17o1m91l08q43L71q10m66M2J174J79O72K47O88
$$ 424 897 800 1198 1216 1733 2174 2844 2753 2870 2809 2318 2010 1167 1538 728 262 304 1478 1657 2329 2576 3264
268C264J65j072O19Nm4j682K86o64J32J74K70R10K493k734K91K124m39K16P04
$$ 3264 3429 2357 2976 2981 2937 1255 1541 877 1009 1183 1453 2363 4856 2122 2413 4537 4098 4314 5018
249E018J5083K09603L16504K30139k98296k01544j82613p5706j1751j344l04N67
$$ 5018 20101 229704 546208 776347 478051 276507 93894 18188 6437 5093 4789 5356
237E356r49k389K521p25k010j99j29K303p9K962J5476j3257n433K809M034o437
$$ 5356 4407 2018 4539 3814 1804 1605 1476 3779 3700 6662 22138 8881 3448 6257 10291 3854
221C854R318n962L37k432J3891o037P8625K4991j04499O270o737M4517q301k1401
$$ 3854 13172 7210 7547 5115 19006 12969 91594 116585 12086 18356 11619 56136 47835 26434
207B6434k3553L744j813Q85N22k503j548L65J837N27K541m95Q37N756p556NL511
$$ 26434 2881 6625 4812 5697 6219 3716 2168 2533 4370 4897 7438 6943 7780 13536 5980 5985 9496
190I496l359k884j715P15J29K512L183j225K92R098m957q84O368p964L297n891
$$ 9496 6137 3253 1538 2253 2382 4894 8077 6852 7144 16242 11285 10401 16769 8805 12102 6211
174F211P787r103K050q09k769J4748Q481k1864J6782J9832J47785Q092R2960j1358
$$ 6211 13998 4895 6945 6136 3367 18115 26596 4732 21514 41346 189131 197223 290183 278825
160B78825o6945q2591j09411j2935J096M598P102P06R199m722L669j382l688R789
$$ 278825 211880 129289 19878 6943 8039 12637 19739 20445 29644 24922 28591 27209 23521 33310
146C3310j6921R027o328o992p784J7477R875M806R114J0691k0094L1444j9358
$$ 33310 16389 25416 19088 12096 4312 21789 31664 36470 45584 56275 36181 67625 48267
133D8267M407n770N59M9956N73708q2261n59334l672M4598Q584L1842L8407L7531
$$ 48267 52674 46904 47463 97419 671127 588866 29532 25860 70458 79042 110884 149291 186822
120A86822K7348j0510J1150M3436l5248n6209J1761K4116O1588J21902K51559
$$ 186822 214170 203660 214810 258246 222998 166789 178550 202666 264254 386156 637715
109F37715N40185L59375Q21217J055797J182946J557697L935870R729763L1288093
$$ 637715 1177900 1537275 2358492 3414289 4597235 6154932 10090802 19820565 51108658
100E1108658L81921781l3692535l65311522k2937083m353346j754919j131602
$$ 51108658 433030439 399337904 34026382 11089299 6735953 4981034 3849432
93C849432q62326p65365n30992l62357m25451k10598k11961j37543j53364o7649
$$ 3849432 2987106 2221741 1690749 1328392 902941 692343 480382 342839 189475 121826
83A21826L0955M8999L4045K6111J3893O360j5311l3931j6990l9125m5417m2510
$$ 121826 152781 201780 235825 261936 275829 282189 266878 232947 215957 176832 131415 88905
71H8905m3919j2792L80J0486J5374J4820J2512P465L844j3689r121j5238r360
$$ 88905 44986 32194 32574 43060 58434 73254 85766 93231 97075 83386 74265 59027 49667
58D9667m816j4883j1779n761j500N705K673K383P847N369r7J0744r375l529p105
$$ 49667 44851 29968 18189 12428 10928 16633 19306 21689 29536 34905 34808 45552 36177 32648 25543
43B5543q421n780l617k192J686M196M613J847K207N103m004J904k780n20n509
$$ 25543 17122 11342 7725 5533 7219 11415 16028 17875 20082 25185 21181 23085 20305 19785 14276
28A4276m261k156l804M8N37K348M572O69J868L072J30J120j243J230k482j013
$$ 14276 10015 7859 4055 4103 4640 6988 11560 12229 14097 17169 17299 18419 17176 18406 15924 14911
12A4911q94J101L307K256K790N220P460L49J635N210n788K769
$$ 14911 14017 15118 18425 20681 23471 28691 36151 36500 38135 43345 37557 40326
0D0326
$$ 40326
##PAGE= F1=312.1907425543
##FIRST=     6340.21289960861, 6666.66666666669, 38368
##DATA TABLE= (F2++(Y..Y)), PROFILE
1023C8368q13n908l042l290l342j9q80j320j104k646M25m773j277l652k561j110
$$ 38368 37555 31647 28605 25315 21973 21954 21074 19754 18650 16004 16429 11656 10379 6727 4166 3056
1007C056q65j516P90K16Q12m68K15J05J14m40R49r55P35j447Q95K13L2o69M9K77
$$ 3056 2191 675 1465 1681 2493 2025 2240 2345 2459 2019 2968 2013 2748 1301 2196 2409 2441 1772 1821 2098
987B098l68O2j13J78L68r37J420j074M38o95L31pm72O82n49N18p60L69N46m17
$$ 2098 1730 1792 1679 1857 2225 1288 2708 1634 2072 1377 1708 1701 1229 1911 1362 1880 1120 1489 2035 1618
967A618j24J82k44l24L19l01J113p07r78P98L70M30l26j056R49m87N11p88Q06
$$ 1618 1494 1676 1432 1108 1427 1126 2239 1532 554 1352 1722 2152 1826 770 1719 1232 1743 955 1761
948A761l34m66K9M43o54J056q10M97l99P38p34J4N47o30P1J42j83j02j33L6J74
$$ 1761 1427 961 990 1433 779 1835 1025 1522 1123 1861 1127 1141 1688 1058 1129 1271 1088 986 853 889 1063
927A063j00O62m39o48J085k24o97j26Q50j71O46j188p3J69L17MJ59l49J88o2P58
$$ 1063 963 1625 1186 538 1623 1399 702 576 1426 1255 1901 713 640 809 1126 1130 1289 940 1128 1066 1824
906A824q35q10R03O99r74j25R5L07L32o15O2J47K65k02l10O60l92L83o84N23q64
$$ 1824 989 179 1082 1781 807 682 777 1084 1416 801 863 1010 1275 1073 763 1423 1031 1414 730 1253 389
885C89O66o7R7o25N49j7O2o0k77K40n68M41j5N04j084N72K34p1j25J18l44N98
$$ 389 1055 988 1085 460 1009 992 1054 994 717 957 389 830 815 1319 235 807 1041 970 845 963 619 1217
863A217l22l46L77L25l24m74j47R59j81l16l55P75R7p4n54k71J33P44k54m28L42
$$ 1217 895 549 926 1251 927 453 306 1265 1084 768 413 1188 1285 1211 657 386 519 1263 1009 581 923
842I23l8k01J40n33J184q82N47m01J54P8m88k71Q07k02k01M01o11N87n11L88j37
$$ 923 885 684 824 291 1475 593 1140 739 893 971 483 212 1019 817 616 1017 406 993 482 870 733
821G33J20m59P40o53O10p51K12J15J1m2K72l73J3O87k69M1o96M61J68m21O0l65
$$ 733 853 394 1134 481 1091 340 552 667 678 636 908 535 548 1235 966 1007 311 772 940 519 579 214
799B14R60q23J02J80K58K25l99Q0J20J47q66O16l50J04j05m5O52p04M69m03N36
$$ 214 1174 351 453 633 891 1116 717 797 917 1064 198 814 464 568 463 418 1070 366 835 432 968
778I68j24l16N19m69k81N14N8m89O9L89k8J87o25O09k69M40l46J7j4r3j6n48N53
$$ 968 844 528 1047 578 297 811 869 380 449 838 810 997 372 981 712 1152 806 823 809 716 700 152 705
755G05L8k18k57J01N55J01m04j41J05O49j040J067r84J61K7j29L35Q1j64j6K71
$$ 705 743 525 268 369 924 1025 621 480 585 1234 194 1261 277 438 465 336 671 752 588 572 843
734H43%j49J16J69m87p1L58k00n21N01J26J7Q3k78Q9J55M62q70L08j68MK50l65
$$ 843 843 694 810 979 492 421 779 579 58 559 685 702 785 507 596 751 1213 343 651 483 487 737 372
711C72M84l37O98o04K07j19J66Q6l99O28j160L55J19M10p90L64N0P18j154P51
$$ 372 856 519 1217 613 820 701 867 953 554 1182 22 377 496 906 116 480 530 1248 94 845
691H45K06q64P41m64M30o63J60P4p6M86m18N1L68J05k29l63L82J4l21K20k90J33
$$ 845 1051 187 928 464 894 231 391 465 389 875 457 508 876 981 752 389 771 785 464 684 394 527
669E27l05M17j65j87N84o00Q36o62M58k71p5L18p56N95o26P77o36K16K13K52k34
$$ 527 222 639 474 287 871 271 1107 445 903 632 557 875 119 714 88 865 229 445 658 910 676
648F76j76K45j01K34J81o90N7o0Q2j93K87J89j61k77P71n96K83o4J88l40L35k98
$$ 676 500 745 644 878 1059 369 426 366 448 255 542 731 570 293 1064 468 751 687 875 535 870 572
626E72j47k05J79O65j99m45L00l25K41L58l33L8P8k09l74N14N84m11o27L12m3
$$ 572 425 220 399 1064 865 420 720 395 636 994 661 699 777 568 194 708 1292 881 254 566 523
605E23L60Q6n55L23J18n52N09n94M18l41L26O01j151O60M2N85r49M04J24j37n6
$$ 523 883 969 414 737 855 303 812 218 636 295 621 1222 71 731 773 1358 409 813 937 800 744
584G44j76j35k20J90J82j42q9L77Q6pL5j69M40k56m71R0j78j66N70m48P21n50
$$ 744 568 433 213 403 585 443 354 731 817 810 845 676 1116 860 389 479 301 135 705 257 978 428
562D28N91j01M24j053O48m51k2N82q32m3N03n10N49j00N64o69QM94R9j6n36K17
$$ 428 1019 918 1342 289 937 486 464 1046 214 171 674 164 713 613 1177 508 516 1010 1109 1093 557 774
540G74o95L18q8K56j62J78K89j18J3K94k27K30o91N95o03M5k93O35j15m0m5M36
$$ 774 79 397 309 565 403 581 870 752 765 1059 832 1062 371 966 363 408 115 750 635 595 550 986
518I86l60J7P63j79r55P04n36J05L5k06N95p62J69K12J24l05J064p69j81R30p37
$$ 986 626 643 1406 1227 272 976 440 545 580 374 969 207 376 588 712 407 1471 702 521 1451 714
497G14j93K3l19N6L39k23M69l28L08J68k37O79j084K52L30j44l22M23n10m9K64
$$ 714 521 544 225 281 620 397 866 538 846 1014 777 1456 372 624 954 810 488 911 401 352 616
476F16K72l80N56k8k3M28p68nl09J72O6J238M46K046q77j515R36p40j619M65K4
$$ 616 888 508 1064 1036 1013 1441 673 668 359 531 597 1835 2281 4327 3450 1935 2871 2131 512 977 1001
455A001K01r69L83J43j14m38N44j35L30m86M34J67M25p52N53j81n58R1k58K47
$$ 1001 1202 233 616 759 645 207 751 616 946 460 894 1061 1486 734 1287 1106 548 639 381 628
435F28K90n06J93K01L03j21K3M1K20qr04M31k63k18J63j39m5R09k8n2m35L87O75
$$ 628 918 412 605 806 1109 988 1011 1052 1272 1264 360 791 528 310 473 334 289 1198 1170 1118 683 1070 1745
412A745p38J24m60n8P4l58j99M62MM73j09K71r5J01M7n99O70n57M8m41j27j74
$$ 1745 1007 1131 671 613 687 329 130 592 596 1069 960 1231 1136 1237 1284 685 1355 798 846 405 278 104
390A04M91N04m38R19k81Lk76K95r0l35l25k26k4R3M26J55K20j29n1K16J99Q5k15
$$ 104 595 1099 661 1580 1299 1302 1026 1321 1231 896 571 345 321 414 840 995 1215 1086 1035 1251 1450 1535 1320
367A320J01q83L18K8l40j28L04p4O93l60J317r77j26N47k92n17J73l69O6n86J018
$$ 1320 1421 538 856 884 544 416 720 646 1339 979 2296 1319 1193 1740 1448 931 1104 735 801 215 1233
346A233q43O90K45L15P7k94M57q70J031q17n79p5k20n0O30l6K87O21j54K12M28
$$ 1233 390 1080 1325 1640 1717 1423 1880 1010 2041 1224 645 570 350 300 930 894 1181 1802 1648 1860 2288
325B288m6J832O87q2K871m907N51k797O74M88k16K94M02O90j169L33K14j148N88
$$ 2288 2242 4074 4761 4679 7550 2643 3194 397 1071 1559 1343 1637 2039 2729 1560 1893 2107 959 1547
306A547r03L39k00J20K02M27M32K60P6q6O2j24o74k6j8j113M57k1M52L1M29M44
$$ 1547 644 983 783 903 1105 1532 1964 2224 2300 2214 2276 2152 1478 1452 1434 321 778 757 1209 1240 1669 2113
284B113N33K48l21J82m35m70n82Q3n83n19Q7J072L81M31K67N99J86q10L97N5j73
$$ 2113 2646 2894 2573 2755 2320 1850 1268 1351 768 249 336 1408 1789 2220 2487 3086 3272 2462 2859 2914 2741
263B741j531K06m85J1R0L93J010K076k766Q79K014o10M22O07J6668J97095L03475
$$ 2741 1210 1416 931 942 1032 1425 2435 4511 1745 2624 4638 4028 4450 5057 21725 218820 522295
246E22295J43635k05475j97186j73754p1970j1266j284J03L37j149k540K963j096
$$ 522295 665930 460455 263269 89515 17545 6279 4995 5098 5435 4286 1746 4709 3613
233C613j932j63m5K420J194M499J4737j5786n753L808J943m218P269l747k061
$$ 3613 1681 1518 1473 3893 5087 9586 24323 8537 2784 6592 8535 4317 11586 7839 5778
218E778l351J4402M7P6456M1272j13667n825m901N1433j3860k2748k3625L762
$$ 5778 2427 16829 16876 93332 134604 20937 15112 10211 61644 47784 25036 1411 5173
205E173M4J043k212j605l42J54K024M35K157o92L430L569o419k483L290k388j997
$$ 5173 5217 6260 4048 2443 2101 2255 4279 4714 6871 6179 9609 13178 6759 4276 7566 5178 3181
188C181j379N07p3K810L608k261Q41Q099j501j963J107o805Q762j0063R216j0146
$$ 3181 1802 2309 2236 5046 8654 6393 7234 15333 13832 11869 12976 6171 14933 4870 14086 3940
172C940K971k273K011J0848R636j9151K1708N480J38478J5347Q7962j0058p3461
$$ 3940 6911 4638 6649 17497 27133 7982 29690 35170 173648 188995 276957 266899 193438
159A93438p0967j03263j3247J472M441O528P98Q736m237M952k291J103L096j5204
$$ 193438 122471 19208 5961 7433 11874 18402 19200 27936 23699 28651 26360 27463 30559 15355
145A5355J0447r758r971K624J1747J2863N76J3798O29l432J6599j5705j054n653
$$ 15355 25802 16044 6073 8697 20444 33307 33883 47681 48310 44878 61477 45772 44718 39065
131C9065j0031j6567O80693p023o07327l8613L4808P591K6735L1241M2112K8059
$$ 39065 29034 12467 693160 686137 78810 40197 75005 82596 109331 140572 182684 210743
119B10743j8994K3279J8350o4960n6158J6998N0896P1621J84418K00227N47830
$$ 210743 191749 215028 233378 168418 112260 129258 180154 251775 436193 636420 1184250
108A184250N05433O04567J078536J247529J564540L102001Q516528L0473552L94378195
$$ 1184250 1689683 2294250 3372786 4620315 6184855 9286856 17803384 48276936 442655131
99D42655131k7904881l78455304k3814419n378410j845567j259970q73056p96176
$$ 442655131 414750250 36294946 12480527 7102117 5256550 3996580 3123524 2327348
91B327348o53480l63149l25088l13163k19025j45560j32161m1666M0984N0160
$$ 2327348 1673868 1310719 985631 672468 453443 307883 175722 134056 175040 225200
81B25200M7365J1297N738K840k6269l0671k8419l7440m3427m3201m2292j1050
$$ 225200 272565 283862 289600 292440 266171 235500 207081 169641 126214 83013 40721 29671
69B9671K318J1115K1441R298J8149K515J050j6578j0068j2721r262j0467j1870
$$ 29671 31989 43104 64545 73843 91992 94507 95557 78979 68911 56190 46928 36461 24591
56B4591p059o308p53O462r14J5534o274R560l104J3092j2446m065o421n843m873
$$ 24591 17532 11224 10471 16933 16019 31553 25279 34839 31735 44827 32381 28316 21895 16052 11179
41A1179l860j914J786L583L280K636L227K819k348L38j109j895l593n168j634
$$ 11179 7319 5405 7191 10774 14054 16690 19917 22736 20388 20726 19617 17722 14129 8961 7327
26G327l416O7P32K307L396J542K089K912o29Q36n6L7k069m09p14O49L423L305
$$ 7327 3911 3978 4710 7017 10413 11955 14044 16956 16327 17163 17107 17144 15075 14666 13952 14601 18024 21329
8B1329L197M232P034M967j024K807j127J520
$$ 21329 24526 28758 35792 40759 39735 42542 41415 42935
0D2935
$$ 42935
##PAGE= F1=305.673961844
##FIRST=     6340.21289960861, 6666.66666666669, 30689
##DATA TABLE= (F2++(Y..Y)), PROFILE
1023C0689l952j235k478l606k151n33J403l324J56k817L92l088j713k503j939
$$ 30689 26737 25502 23024 19418 17267 16734 18137 14813 14969 12152 12544 9456 7743 5240 3301
1008C301q55m76j441P82J49N57k30J81M7L6m26Q44p37O13j433J057R7j7o77L21
$$ 3301 2446 1970 529 1311 1460 2017 1787 1968 2015 2051 1625 2469 1732 2345 912 1969 2066 2049 1372 1693
988A693J57m19J01j68J38M80p83P89n71L76p67N47p2m86O12l07K7l16K95L48j94
$$ 1693 1850 1431 1532 1364 1502 1982 1199 1988 1417 1793 1026 1573 1501 1015 1627 1320 1347 1031 1326 1674 1480
967A480m11L65j95l85K53q8R25q56n58P40J95N56m71j078J100n95M50o29P56l92
$$ 1480 1069 1434 1239 854 1107 1019 1944 1088 530 1270 1465 2021 1550 472 1572 977 1427 798 1554 1162
947A162l80J64K16m88R09o06J07r5O23o04oO09q57J68K56l30j56J39j88L83j44
$$ 1162 782 946 1162 674 1583 977 1084 989 1612 1008 1002 1611 754 922 1178 848 692 831 643 1026 882
926H82N41l71o01R56k06p54J46N46P3M69j068P2j40N89k32O1j9ol1O62p15n63
$$ 882 1423 1052 451 1407 1201 447 593 1139 1212 1681 613 685 545 1134 902 963 944 938 907 1569 854 291
904B91Q85K20p97R2j02N35O0n21J47J52j22L40p10R20o21M84n56K96n83N17m6
$$ 291 1176 1396 599 691 589 1124 1184 663 810 962 840 1180 470 1390 769 1253 697 993 410 927 881
883H81N6n26M66p4J99k11j50J74n16O13l22O20j064N64K79j90j86K67l82N91l41
$$ 881 937 411 877 803 1002 791 641 815 299 912 590 1210 146 710 989 799 613 880 498 1089 748
862G48j57J95L90l18n21J2P95k75l05j64O16K46l37m03q8J91M97l10k77K61O6
$$ 748 591 786 1176 858 337 349 1144 869 564 400 1016 1262 925 522 434 625 1122 812 535 796 862
841H62l32L19n05Q50o92N43m10M9K65m97j76N53n4k04N07p69N36l21K15m4lk50
$$ 862 530 849 344 1194 502 1045 635 684 949 452 276 829 775 571 1078 309 845 524 739 695 692 442
819D42L45k59L97n73P4J03J44j05M3n9r5O10j85K07p48M18Q8l96j63J42N43o76
$$ 442 787 528 925 352 426 529 673 568 611 552 457 1067 882 1089 341 759 847 451 288 430 973 297
797B97J84j7M32j15l8N7q0K11o53L68p5j14nn2O11p72N21l90N04m1m78O48m43
$$ 297 481 464 896 781 743 800 720 931 278 646 571 457 452 400 1011 239 760 370 874 833 355 1003 560
774E60l75O61j4l84K0K46J72j17m76P34n01N55k91R0j34o2K0n41N63k18%l56K81
$$ 560 185 846 832 448 468 714 886 769 293 1027 526 1081 790 880 746 684 704 163 726 508 508 152 433
751D33M34n8k95k4rO60r80R02q27J49L8j95M51j1j56k8K20J5j00JJ73l71O5P4
$$ 433 867 809 514 490 481 1141 161 1063 236 385 423 228 679 668 512 484 704 719 619 620 793 422 487 561
727E61J22n59L32Q8O9J64m15J82J21M30q15K39j4k16M66k38R9j40M59m02L13k00
$$ 561 683 124 456 544 613 777 362 544 665 1095 280 519 505 289 755 517 616 476 935 533 846 646
705F46M0J62k46L70p14K64j30M04n84K80j89R87j103M69L36q35O40l52K99o17
$$ 646 686 848 602 972 258 522 392 796 212 492 303 1290 187 656 992 157 797 445 744 127
685A27L87j90J17K65r0r1M86l03p4l30N62j76l80J94j26J74l60K24qj17L94n00
$$ 127 514 324 441 706 616 525 1011 708 634 304 866 690 310 504 378 552 192 416 408 291 685 185
663A85R00p70M91r8m76P52r62O05m74O55o51K77J10K35o5l19L90k57L19%l67L3
$$ 185 1085 315 806 708 232 984 22 627 153 808 157 434 544 779 714 395 785 528 847 847 480 513
641E13m42M17k22K38K82n44J33N65m50J15j42L40l62K98k93j1k54J70N74j14m04
$$ 513 71 488 266 504 786 242 375 940 490 605 463 803 441 739 446 435 181 351 925 811 407
620D07P5q5J22N33o47J97Q9j96k78P29R02j098n48M06q8K44j28j4q0J37l82L24
$$ 407 482 397 519 1052 405 602 691 495 217 946 1848 750 202 608 520 764 636 622 542 679 297 621
598F21m31L17k71L76N69j068O35j15N97q82K32M55m24L08l43j34l28K73K30k10
$$ 621 190 507 236 612 1181 113 748 633 1230 348 580 1035 611 919 576 442 114 387 617 407
578D07m4K60q2L78k91K8M03l80k69o2n6j46N23m36O54m54L97K9K83q15M89l27
$$ 407 363 623 541 919 628 656 1059 679 410 348 292 146 669 233 887 433 830 859 1142 327 816 489
556D89j00M20m89j96O15o53N36n8L54m26p8N62L8m9m53J44m89K85p9J08l6j20
$$ 489 389 809 320 124 739 86 622 564 918 492 414 976 1014 965 512 656 167 452 373 481 445 325
534C25M92j02j50N21n35L74o31O04o37R1k86O58j79O1q5M01m18J91O57k16o39
$$ 325 817 715 565 1086 551 925 294 898 261 352 66 724 545 606 521 922 504 695 1352 1136 497
513D97M62n92J77j95j41O44o36J40O4J91j52Q15q03J46N82n61k30Q7l03O4L71
$$ 497 959 367 544 349 208 852 216 356 420 611 459 1274 471 617 1199 638 408 495 192 256 627
492F27k24L83k92K88l4n0O31j017L19P6Q2l07L28n31J73J77K20l40K14L74k65
$$ 627 403 786 494 782 748 698 1329 312 631 707 789 482 810 279 452 629 849 509 723 1097 832
471H32N78q35J0k09J03j59J780P70J400q16j739P4k40r94K31Q3J56q44L88J83
$$ 832 1410 575 585 376 479 320 2100 2870 4270 3454 1715 1789 1549 555 786 869 1025 181 569 752
451G52k35j74L82j51K94m84L59J97L78p65N35q4n15N6l09L60K48n60M55JR6J19
$$ 752 517 343 725 574 868 384 743 940 1318 553 1088 1004 489 545 236 596 844 284 739 740 836 955
429I55j66K22l2J41q21K60rk85J79k11n8R73j68P4o51N80N09o53P2l16n1J5k42
$$ 955 789 1011 979 1120 299 559 550 265 444 233 175 1148 980 1054 403 983 1492 839 911 595 544 559 317
406C17k48M86J40J81OJ11l3J57l2o41Q25n97n8k38j03k39N18N50n81P97j14j56
$$ 317 69 555 695 876 882 993 960 1117 1085 444 1269 672 614 376 273 34 552 1102 521 1318 1204 1048
384A048q4K69k23k18k82k38l0J49M74J03J25j12j90L13K71k85J24l7p14L09Q7
$$ 1048 964 1233 1010 792 510 272 242 391 865 968 1093 981 791 1104 1375 1090 1214 1177 463 772 859
363H59j66j88J34k3O33m88J312r09j78N35k92m74J91k80J62n49Q91r03P67kL23
$$ 859 693 505 639 616 1249 761 2073 1164 986 1521 1229 755 946 666 828 279 1170 267 1034 1032 1355
342A355J63k89L44p35J150r79o17K29k35k19N02K71m0O78k48M32K77l02J836L70
$$ 1355 1518 1229 1573 838 1988 1009 392 621 386 167 669 940 900 1578 1330 1762 2039 1737 3573 3943
322C943K51K128m750R07k149O08O55m78L95K53M22q39L57o0q24N20q54K33o6J74
$$ 3943 4194 6322 1572 2479 330 938 1593 1115 1510 1763 2185 1346 1703 1643 819 1339 485 718 652 826
302H26p2O84K43L84l20J19J29k86n17L5J80j192L78jM92K8K81L89K85N67o73L69
$$ 826 754 1438 1681 2065 1745 1864 1993 1707 1190 1225 1405 213 591 590 1082 1110 1391 1780 2065 2632 1959 2328
280B328l15n43k23k55l16l86P8Q11M96R6L01N32P0m77J81J47l64j111M3j86j50
$$ 2328 2013 1470 1247 992 676 290 368 1179 1675 1771 2072 2604 2674 2197 2378 2525 2161 1050 1093 907 757
259G57l0N33Q77J478k359J179J706n95M77M80J5357J34137K13786N7133p2685
$$ 757 727 1260 2137 3615 1256 2435 4141 3546 4023 4503 19860 153997 367783 424916 352231
244C52231j53004j28825n5600r355j147M72J8j050k405K951j256j646P7n1J489
$$ 352231 199227 70402 14802 5447 4300 4772 4790 3740 1335 4286 3030 1384 1461 1410 2899
229B899J625N335J2303j4567l001J732p10N31M384k290l441j701P902M778P8705
$$ 2899 4524 9859 22162 7595 4594 6326 5616 6147 10531 8241 4800 3099 11001 15779 94484
214I4484N5765j20893j5183m937M5171j5211j4004k3861O72M140j96l761m12L23
$$ 94484 150249 29356 14173 9236 54407 39196 25192 1331 2003 6143 5947 2186 1774 2097
200B097k79J967M21J590J737L41k58k060m65Q46j550j100j377M49J50K679K665
$$ 2097 1818 3785 4206 5796 7533 7874 7616 5556 5091 5937 4387 3287 1910 2359 2509 5188 7853
183G853k326N26Q244l302j373J624q311J0918q656P729j1421O204n397L611J2649
$$ 7853 5527 6053 14297 10995 9622 11246 2935 13853 5197 12926 1505 7709 2312 5923 18572
168A8572M454q325J8439k731J06538K7383O9943j0869o7420n7650q1871j1633
$$ 18572 23026 14701 33140 30409 136947 164330 234273 223404 155984 98334 16463 4830
156D830J272L819N231P31P251l186O136m728N138k726j1336R712j0438r563J0794
$$ 4830 6102 9921 15152 15883 23134 19948 26084 21356 26494 23768 12432 22144 11706 2143 12937
141A2937L064J4306l683K2729k2381K8174j8381J3415j3521J07j5888j641O84796
$$ 12937 16001 30307 26624 49353 26972 55146 36765 50180 36659 36766 20878 19237 704033
128G04033m2855n87761k8917J8724J1609J9550K0425K8206K0811j5197K0195k2421
$$ 704033 661178 73417 44500 63224 74833 94383 114808 143014 163825 148628 168823 146402
116A46402n3431j9931l088M5475O0722J65159J08969K91371M15425J78828O44167
$$ 146402 92971 73040 69952 115427 176149 341308 450277 741648 1157073 1335901 1980068
105A980068P84885R10984J286059M389185J8151722K46659144j2640641k37701405
$$ 1980068 2764953 3675937 4961996 9351181 27502903 274162047 261521406 23820001
97B3820001j5136836m186347j158730q61060n07948m84900m70328k52675p4395
$$ 23820001 8683165 4496818 3338088 2477028 1969080 1484180 1013852 761177 686782
88F86782k80292j49530r7664o3239k599L0239L0460M0597o218l942q70k4442j4397
$$ 686782 406490 256960 159296 96057 93458 123697 154157 194754 188536 184594 183724 159282 144885
75A44885k7194k0457k2869k1768k2690q586J342P088J7959m85J5488k199j765
$$ 144885 117691 97234 74365 52597 29907 21321 22663 29751 47710 47225 62713 60514 58749
62E8749r823l319p125n526j1838n515j887n488L02O550pR388L54K256l710O037
$$ 58749 48926 45607 38482 32956 21118 15603 13716 8228 8530 15080 15073 24461 24815 27071 23361 29398
46B9398p982l285l156k497l120l329j553J361K671J447K242L386l99M5j429N40
$$ 29398 21416 18131 14975 12478 9358 6029 4476 5837 8508 9955 12197 15583 15184 15229 13800 14340
30A4340k400j341l842j052k500K4Q27J914J424K191J505J578j015N39P11j066
$$ 14340 11940 10599 6757 5705 3205 3229 4056 5970 7394 9585 11090 12668 11653 12192 12903 11837
14A1837m65J62j76K24K266L414K954J690M154O917k313j326L951r82
$$ 11837 11372 11534 11358 11582 13848 17262 20216 21906 26060 32977 30664 29338 33289 32307
0C2307
$$ 32307
##PAGE= F1=299.1571811336
##FIRST=     6340.21289960861, 6666.66666666669, 16149
##DATA TABLE= (F2++(Y..Y)), PROFILE
1023A6149m171K162o99k821p08r36K508l675R59k205K52p68j734j034j101o11
$$ 16149 11978 14140 13441 10620 9912 8976 11484 7809 8768 6563 6815 6047 4313 3279 2178 1567
1007A567j0j174O68KK76J13N3l0L5m20O48m65M31j264J143j31l0n40N36k8m42
$$ 1567 1557 383 1051 1053 1329 1442 1495 1465 1500 1080 1728 1263 1694 430 1573 1442 1412 872 1408 1380 938
986I38J73j97J27L92m64J44q0L26p45O31j60l52L92jl67M4J83J67L8o60N50j33
$$ 938 1111 914 1041 1433 969 1113 1033 1359 614 1245 1085 733 1125 1124 757 801 984 1151 1189 529 1079 946
964I46m26J53J21O36q70j45O72kN57n48q73R41m83K52l34N96m00k78K83J4l02
$$ 946 520 673 794 1430 560 415 1087 1085 1642 1094 221 1162 679 931 597 1193 793 515 798 812 510
943E10O27k87l24K04M22l38o0O06r98K94L13m74j05L29l07M31j03L56k62n67P78
$$ 510 1137 850 526 730 1152 814 754 1360 362 656 969 495 390 719 412 843 740 1096 834 267 1045
922A045j06o95L05K12K47K68p69K29m19P14n26J15K35j64j15O02n07k30P05k81
$$ 1045 939 244 549 761 1008 1276 507 736 317 1031 505 620 855 691 576 1178 671 441 1146 865
902H65n45L11k58O53j58l93J86J07l41O89q35Q41o39N25m39L4k25K90QK8l89L23
$$ 865 320 631 373 1026 868 475 661 768 427 1116 281 1122 483 1008 569 603 378 668 676 704 315 638
880F38j24L82l48r8J72m86P09m69N62o37K53K67l00j58L02k51M15k56O3j42M87
$$ 638 514 896 548 450 622 136 845 376 938 301 554 821 521 363 665 414 829 573 636 494 981
859I81k67l63K8N37l50k13k9M38L35n33j16j3K34L46n35j7J70J14l34L73m19L87
$$ 981 714 351 379 916 566 353 324 762 1097 564 448 435 669 1015 480 463 633 747 413 786 367 754
837G54l84M86l58j24M65l44j10K32Mj77N41p61M15j38J04m1j01M2j56J80J10k97
$$ 754 370 856 498 374 839 495 385 617 621 444 985 224 639 501 605 564 463 505 349 529 639 342
815C42r3J45K04r5l02L64k53M77r9M58o18J45m9k78l14N24J49m13K21k58N06l94
$$ 342 249 394 598 503 201 565 312 789 690 1148 530 675 626 348 34 558 707 294 515 257 763 369
793C69L60Rk19J22k85J63R6k21k3qN00p26M38k15L04R8l94M29k80m44P64j51k28
$$ 369 729 738 519 641 356 519 615 394 371 363 863 137 575 360 664 762 368 797 517 73 837 686 458
770D58k0J18L01l53k85O68n56N44j38J40l08M3R8n70N10m35K42l41L05L10j95
$$ 458 438 556 857 504 219 887 331 875 737 877 569 612 710 140 650 215 457 116 421 731 536
749E36j58J36k10N65p35N85n14Q3J14l23N20j03p8r1J74N8j45p7K14k21R2r9L36
$$ 536 378 514 304 869 134 719 205 288 402 79 599 496 418 327 501 559 414 337 551 330 422 323 659
726F59m90J65M7O0K50m68K38Q5L17o92J45K16m47N52l4k32r2L38j96L34k46o4
$$ 659 169 334 381 441 691 223 461 546 863 171 316 532 85 637 603 371 279 617 421 755 509 445
704D45K26j13J31j79R8l90L99k93K24m97J190q63J1M73p05M30k30J95l85L96k65
$$ 445 671 558 689 510 608 218 617 324 548 51 1241 378 389 862 157 587 357 552 167 563 298
683B98J55kK48o4L96n45nl55P80l76l77J49O6J43k48r9J15L1J06k46P36p25M77
$$ 298 453 451 699 635 1031 486 481 126 906 530 153 302 368 511 263 164 279 310 416 170 906 181 658
660F58on90Q77q09L49j56L71n80K97n6K17Q2j97K58l22L17k17O5k5k43K32l06
$$ 658 652 62 939 130 479 323 694 114 411 355 572 654 457 715 393 710 493 558 533 290 522 216
638B16J81L97o29K73L05k90j07M5L06l30J46k93K05k39J13L78kl33j46K13n2O13
$$ 216 397 794 165 438 743 453 346 391 697 367 513 220 425 186 299 677 675 342 196 409 357 970
616I70q21L13N3j88j09Q08R45j530k86M41k6lk67M13l03M2j79J30j85J33j31K87
$$ 970 149 462 515 327 218 1026 1971 441 155 596 570 567 300 713 410 452 273 403 218 351 220 507
594E07N20q53N52k36M66o66rO83l98L95m27p3j73J01K23l05M5Q4k44P72o32K94
$$ 507 1027 174 726 490 956 290 281 964 566 961 534 461 288 389 612 307 352 436 192 964 332 626
572F26K64l62j54j75M0o3M22m54N73l61K09J28J43n06K70q8k45L11j78j71N74
$$ 626 890 528 374 199 239 176 598 144 717 356 565 693 836 330 600 512 267 578 400 229 803
551H03p62M45J0Q1j59j80O37k3q8l30M7j68J57j02L8J11m84O37m9l29P08p47M07
$$ 803 41 486 496 577 418 238 875 852 764 434 481 313 470 368 406 517 33 670 621 292 1000 253 660
528F60m85O12n89M8k00O16j27M6j69L62m15L11N14k69k71K15o37K58l31K1N08
$$ 660 175 787 198 246 46 662 535 581 412 774 359 670 1184 915 644 859 222 480 149 170 678
507F78m83R1j3J88p7N49o06L48J59l26k03P2k07R1L08j95L05k96L15k58Q2N32
$$ 678 195 286 273 461 384 933 327 675 834 508 305 377 170 261 569 374 679 383 698 440 522 1054
485A054p58K37j36L13k83J93m42L39O5J18k24JN61m27O65q07kj57O4k3K112J277
$$ 1054 296 533 397 710 427 620 178 517 582 700 476 477 1038 611 1276 469 467 310 374 351 2463 3740
463C740K423p35m424l03J28k77j6P4J94o52L52K02l72R9J59q8J48l16K26J63K54
$$ 3740 6163 5428 1004 701 829 552 536 610 804 152 504 706 334 433 592 504 652 336 562 725 979
442I79o20L84M8l47M9m66N15J61n18O04k61LK05j80K76k53L61p27O0K88m02L43
$$ 979 359 743 791 444 493 27 542 703 185 789 528 531 736 556 832 579 940 213 273 561 159 502
420E02k62p6Q42l67K57p66O71K81n22O9j59p8j3rl21M18K38j42K00j23M9J80r3
$$ 502 240 164 1006 639 896 130 801 1082 560 629 470 392 379 370 49 467 705 563 763 640 689 869 776
397G76o48R21m77k02J4o8k18L24N37o25O05Mj92%L02l81p7j13l65J9K73L63J23
$$ 776 128 1049 572 370 384 316 98 422 959 334 939 943 751 751 1053 672 595 482 117 136 409 772 895
374H95q1m2k71K86L46m61L41j82m53K31J74%k11j05J35L94m09J050p30k42M38
$$ 895 814 772 501 787 1133 672 1013 831 378 609 783 783 572 467 602 996 587 1637 907 665 1103
353A103j06m63J23o9J68m02O23p34O45k65L60J71k46J70m85J087r54m16L37k37
$$ 1103 997 534 657 588 756 354 977 243 888 623 983 1154 908 1078 593 1680 726 310 647 410
333D10l54K99N26l45O21k37N14K11j73J462j85p1J861l962J300j669N29N79m88
$$ 410 56 355 881 536 1157 920 1434 1645 1472 2934 2749 2678 4539 577 1877 208 737 1316 828
314H28L77R2J32m04K97l13l84L95p13J13N8J67k68P84P5M47o63L21J39k83m62
$$ 828 1205 1297 1429 1025 1322 1009 625 1020 307 420 478 645 377 1161 1236 1683 1020 1341 1480 1197 735
293G35J62L31j045K09k8M91K5J14K69K3P74q52M43j33n34J42n77m0k31N1N27M96
$$ 735 897 1228 183 392 364 855 880 994 1263 1286 2060 1208 1651 1518 984 1126 549 509 278 329 856 1352
271A352k20L29M81r7k00J1K61n42n69j12Q4k71j24O50N31Q66j663J164J251l88
$$ 1352 1132 1461 1942 1845 1645 1656 1917 1375 806 694 778 507 383 1033 1564 2430 767 1931 3182 2794
251B794L35L61J1965O3982J10302J8362J0836r5780p5976l6333o593j039P13l40
$$ 2794 3129 3490 15455 79437 189739 208101 218937 123157 47181 10848 4255 3216 3929 3589
237C589o65j962K402j171j244L52J19M75N58O526R870j2640K070j746m207N604
$$ 3589 2924 962 3364 2193 949 1301 1420 1895 2453 8979 18849 6209 8279 6533 2326 7930
221G930J50J40l304R97J287P420L9893M3277p6559r769n564L7796m937j5064k1163
$$ 7930 8080 8220 4916 5913 7200 14620 54513 97790 21231 11462 5898 43694 38757 23693 2530
206B530j176N119j344k180L66q40j112J768K27R39J919J288k75n520J484K637
$$ 2530 1354 6473 5129 2949 3315 2475 1363 3131 3358 4297 6216 7504 7229 1709 3193 5830
190E830k292m91j563P73K20J108J454J397j71L774J458n300L712q679Q940m392
$$ 5830 3538 3047 1484 2257 2477 3585 5039 6436 6265 10039 11497 6197 9909 1230 10170 5778
174E778N071q789P499o774P52J1333l357P467O923Q404P7904M067O0548j2863
$$ 5778 10849 2060 9559 2785 3537 14870 11513 18980 25903 34307 112211 116278 176826 163963
160A63963n3433m1585n6793q793R73K880L588M29N079k028N819o219O930p220
$$ 163963 110530 68945 12152 3359 4332 7212 10800 11229 16308 14280 20099 13880 20810 13590
146A3590o071R231j0465j016O308j120J0606l960K2898k6778L6353l5752L0779
$$ 13590 7519 16750 6285 5269 11577 10457 21063 17103 40001 13223 49576 13824 44603
133D4603j7764J2024j387J8015K26948P4293k98060k7071O519K5175Q899Q279
$$ 44603 26839 38863 37476 55491 282439 356732 58672 31601 38120 63295 72194 80473
121H0473J0910R529j1558J1515l7994o979r234j1197K1669M0217Q2270M3182K5497
$$ 80473 91383 100912 89354 100869 62875 55896 46662 35465 57134 97351 179621 222803 248300
108B48300J42498r4944J28134K13556K02999j12793O43605M692236O6494854n26143
$$ 248300 390798 295854 423988 637544 840543 727750 1371355 6063591 72558445 72032302
98G2032302o4539351m389285j907746l04840k84891p7288j05492j59110r1692
$$ 72032302 7492951 3103666 1195920 891080 606189 528901 423409 264299 172607
89A72607P5806j31070n6554l7542j312J3447Q695O311K1614j3252p592j267j3303
$$ 172607 248413 117343 60789 23247 21935 35382 44077 50388 72002 58750 51158 49891 36588
76C6588K234j5935k521o1n81j686o802K00K044Q019o392P677l543k363R75K583
$$ 36588 38822 22887 20366 20305 19724 18038 11236 11436 13480 21499 15107 22784 19241 16878 17853 20436
60B0436j864j596p465j742Q38l617R12N604J333k543J0678n283j105m106L86k154
$$ 20436 18572 16976 9511 7769 8607 4990 5902 11506 12839 10296 20974 15691 14586 10480 10866 8712
44H712l59n66j298k228j192P23J775J76Q66L030k685J820k433J485k054lj581
$$ 8712 8353 7787 6489 4261 3069 3792 5567 5743 6609 9639 6954 8774 6341 7826 5772 5769 4188
27D188o27j372o5Q03J347m75K325O34m1p44N06O21j132O51M23J95N2N84K406K211
$$ 4188 3561 2189 2124 2927 4274 3799 6124 6758 6717 5973 6479 7100 5968 6619 7042 7237 7289 7873 10279 12490
7A2490n68Q29N165j648l841N459k655
$$ 12490 11922 12751 17916 16268 12427 17886 15231
0A5231
$$ 15231
##PAGE= F1=292.6404004233
##FIRST=     6340.21289960861, 6666.66666666669, 3905
##DATA TABLE= (F2++(Y..Y)), PROFILE
1023C905j914K425M69j608K79j044K228k555J079j379K41P47j296j16k74n12L54
$$ 3905 1991 4416 4885 3277 3556 2512 4740 2185 3264 1885 2126 2873 1577 1461 1187 675 1029
1006A029p15M73j73J09L61j07j08K52o07M85k07K05r58J069k98m9l79O86j82m23
$$ 1029 314 787 614 723 1084 977 869 1121 514 999 792 997 39 1108 810 761 382 1068 886 463
986D63J94k15J65J87j26k78K36K68o24N40j86j81J89K27n50J91N6O9K39q34O85
$$ 463 657 442 607 794 668 390 626 894 270 810 624 443 632 859 309 500 556 625 864 30 715
965G15p4l46l7K89K84o38N7O33q4L05m36n25N40k75PK0L61l72j88L55r2j61K97
$$ 715 641 295 258 547 831 193 250 883 799 1104 668 143 683 408 415 435 796 424 236 591 499 338 635
942F35R9m71J63K28q1r0N20r87L85L22n67J24K87k43K81k7K58k29n51N76N9l20
$$ 635 734 263 426 654 573 483 1003 16 401 723 156 280 567 324 605 578 836 607 56 632 691 371
920C71Q3k2K68Q2l35L68m64M93o40J72L44k77k26N76k81P0M18o59k67M58k69N84
$$ 371 454 432 700 782 447 815 351 844 204 376 720 443 217 793 512 582 1000 341 74 532 263 847
898H47l11k19J86qk42O44o48M49m32M97l75j89J07N6P4J6k22J39j39N73n08k1
$$ 847 536 317 503 495 253 897 249 698 266 763 388 199 306 362 436 452 230 369 230 803 295 274
876B74K52m34N51l91L32j15r5K29l80J2J43N8P6p5K34m27N35k10j32l3K69m16
$$ 274 526 92 643 252 584 469 374 603 223 235 378 436 512 437 671 244 779 569 437 404 673 257
854B57p3N1K66L69o01J80l5K20L61q55K46J04J57k19K09k85p6n6L96k22l23N98
$$ 257 184 235 501 870 269 449 414 634 995 140 386 490 647 428 637 352 276 220 616 394 71 669
832F69k8j36Lq4j56M95n85L13p9J37j40j79L59m83M05k13J3k82K86K07m9j16K22
$$ 669 641 505 508 424 268 763 178 491 412 549 409 230 589 106 511 298 311 29 315 522 473 357 579
809E79m10L13l6P42m78j68k05r3l2L54j41QR7m55N03m41N55o2k68m1J05J29M3
$$ 579 169 482 446 1188 710 542 337 244 212 566 425 433 530 75 578 137 692 630 362 321 426 555 598
786E98j98j41O0L38n57K99j6M1K84j90j7j5m30P19k77q6m5P7K99l11k53M10l66
$$ 598 400 259 319 657 100 399 383 424 708 518 501 486 56 775 498 412 367 444 743 432 179 589 223
763B23L76N0J59m69J88J24n83M45m34L62j77Q6J87k74J06K26m49L98m30J98j19
$$ 223 599 649 808 339 527 651 68 513 79 441 264 350 537 263 369 595 146 544 114 312 193
742A93L0J99l57M01j78L8j67J31J24k65p8K63r8J1j08M20l63K6Q5o6L33m46K68
$$ 193 223 422 65 466 288 326 159 290 414 149 71 334 236 247 139 559 196 222 307 241 574 128 396
719C96P3J31m26P8L22m92L73J10l70j66K92k6K81j97j72K54oj5K63p5n81L67K3
$$ 396 469 600 174 252 574 82 455 565 195 29 321 295 576 379 207 461 455 440 703 628 47 414 437
696D37J76m61R61o23l25N64n73J91j00J13r9L02j96O6k24M81l1K69l54k29k50
$$ 437 613 152 1113 490 165 729 156 347 247 360 261 563 367 433 209 690 659 928 574 345 95
675I5P88n07j81K2J33O8j05k54O1K25k05L9M65n15L54K1k53N21n57J63N2J03l74
$$ 95 883 376 195 217 350 418 313 59 120 345 140 179 644 129 483 504 251 772 215 378 430 533 159
652A59K16j65J33J78L1J0k32K09m48M80r0P3Jm17J03N30l27M0N4j68j57L44Q2
$$ 159 375 210 343 521 552 562 330 539 91 571 481 554 555 138 241 771 444 484 538 370 213 557 639
629F39k95n9k43L55j61L6K19L3k76k2J77j76N70o26K62j51j75P3Q39Q19j638q1
$$ 639 344 285 42 397 236 272 491 524 248 226 403 227 797 171 433 282 107 180 1019 1838 200 119
607A19M19J14k96j45M68k24j91l3L2l5m2J01P7M49n77M31k40J78l78j59P07j72
$$ 119 538 652 356 211 679 455 264 231 263 228 186 287 364 813 236 667 427 605 227 68 775 603
585F03K62m25N8K8j15J59l99J69j17KP23q66N13L7j74j51k02Q2P8K97n39N19l24
$$ 603 865 440 498 526 411 570 171 340 223 225 948 82 595 632 458 307 105 187 265 562 23 542 218
562B18P6J64R2k65N1K22l28K19j3j08M80p13K97K0j16Rk56O65n1p2k29o9J48J
$$ 218 294 458 550 285 336 558 230 449 436 328 808 95 392 412 296 305 49 714 663 591 362 293 441 442
538D42j36L0K54k24R8K8l32O82o95J83k57N62m07j14n1N27lo5k52L23l51L33M40
$$ 442 306 336 590 366 464 492 160 842 147 330 73 635 228 114 63 590 587 522 270 593 242 575 1015
515A015m03N5M6o77L50j70J06J98l27j0j0J30r4L71j54K50k15j13r2rq9J68K01
$$ 1015 612 667 713 36 386 216 322 520 193 183 173 303 209 580 426 676 461 348 256 247 158 326 527
492E27k18L02k83L63m37M1M41m48Q7k09L84k22R4k06L12n6M7r6J65K75m34P35
$$ 527 309 611 328 691 254 295 736 288 375 166 550 328 422 216 528 472 519 423 588 863 429 1164
470A164p94l7j28MM33K178K037L065R68n376k947m57M49k85M8L24m67K58K29n27
$$ 1164 370 333 205 209 642 2820 4857 7922 8890 3514 567 110 559 274 322 646 179 437 666 139
450A39L11m6J9p0JO6J18K0l60J68K29j55J49l73K72M9k78M97n05K2J60p7K34l69
$$ 139 450 404 423 353 354 420 538 558 198 366 595 440 589 216 488 537 259 756 251 273 433 356 590 221
426B21N87o71Q4L20m06M73k36o8N10n65M51l99K80P4l55J03p2r2m1K40l36K68
$$ 221 808 137 221 541 135 608 372 304 814 249 700 301 581 655 300 403 331 239 198 438 102 370
404C70K37l19L43l01P2J93j66k60N69j68l06J32l1j56P7M24n67M32K9j02n5M31
$$ 370 607 288 631 330 402 595 429 169 738 570 264 396 365 209 286 710 143 575 604 502 447 878
382H78n62N8R6l35LL06J35K22l48J01l41J76M47m38M02k97j91R2K73J34k16l66
$$ 878 316 374 470 135 138 444 579 801 453 554 213 389 836 398 800 503 312 404 677 811 595 229
360B29L71O1r4N53m96k70K40K62n31qJ48J30j50L32m99M22m14L74N8j47m9j02
$$ 229 600 661 567 1120 624 354 594 856 325 317 465 595 445 777 278 700 286 660 718 571 522 420
338D20P76p61J02P1j99l60M0O98o16M83j4K69J66L3J010J6o90J976k763N07q21
$$ 420 1196 435 537 608 409 49 89 787 171 654 640 909 1075 1108 2118 2134 1444 3420 657 1164 343
317C43J96L07k55K66q4m0o1K22n40R1K79m60p3J04J54k93O27j9M13q62N54J2j45
$$ 343 539 846 591 857 773 733 672 894 354 445 724 264 191 295 449 156 783 764 1177 315 869 881 736
294G36m68K66M39p47M4r2M12O9o5J03j52Q23q43L80J28m67L99q20K29j66QL12
$$ 736 268 534 973 226 270 178 590 659 594 697 545 1368 525 905 1033 566 965 145 374 208 216 528
272E28L93m34L39M39k49n2p8L62o12j09r2J15k76n2O03P2M04r19Q79P96q6J07
$$ 528 921 487 826 1265 1016 964 886 1248 636 527 435 550 274 222 825 897 1301 382 1261 2057 1971 2078
250B078J15Q213K3098M5601K0648J8603n0491l9414k1802l557j052P65o67n6j324
$$ 2078 2193 10406 33504 79105 99753 118356 67865 28451 6649 3092 2040 2805 2138 2082 758
235G58J434r41q42N35M14J522k441P798P462j0058L693l479k489M010k157J999
$$ 758 2192 1251 409 944 1358 2880 439 8237 15699 5641 9334 5855 3366 7376 5219 7218
219G218l345K320N03O890L5319M4953p1425j1832q295L1643n151j1867j2753j053
$$ 7218 3873 6193 6696 13586 48905 93858 22433 10601 2306 33949 28798 16931 4178 3125
205C125L007k350m55R83j661j665J282r5O28k1J325J573m442O16L274k870J06
$$ 3125 6132 3782 3327 4310 2649 984 2266 2171 2799 2778 4103 5676 1234 1850 5124 2254 2360
188B360j585Q79R2n40L59O083l505K801L232p050N308m785K781o92L465m891M804
$$ 2360 775 1654 1746 1206 1565 7648 4143 6944 10176 3126 8434 3649 6430 5738 9203 4312 9116
171I116o555j233P826o090J5343k225K4235N5522j7122M7976j3522m2773k5818
$$ 9116 2561 1328 9154 3064 18407 16182 40417 95939 78817 126793 113271 70498 44680
158D4680l7048o082Q27J806K065l5K706j070L961m635O127q286Q53K815m557J512
$$ 44680 7632 1550 2377 4183 6248 6213 8919 7849 11810 7175 13302 5016 5869 8684 4127 5639
142E639L360l629N695k730J6799j2267J6832j5637J7359j4909Q860P884j4930
$$ 5639 8999 5370 11065 8335 25134 12867 29699 14062 31421 16512 25372 33256 18326
129A8326L57064L4692l54706j6089j3556K3755o176K269q47J62o136L221k0977
$$ 18326 375390 410082 55376 39287 25731 49486 43310 45579 44732 44894 38758 41979 21002
116B1002J1163q521r125N773K1954J5254K5188m3147K4786J19559Q0309O5445
$$ 21002 32165 23644 14519 20292 42246 57500 82688 39541 64327 183886 264195 329640
104C29640J08514M64792N79546J486039K2973869k739782k1497751j409153L65668
$$ 329640 438154 902946 1482492 2968531 25942400 23202618 1704867 295714 661382
95F61382k93502n9551j19015o5328K8627r2230l5187J9391N91j4510j2363r873
$$ 661382 367880 308329 189314 123986 152613 60383 25196 44587 45178 30668 18305 8432
83H432l992N933K494N2M599j14K969p599M407m238o236m965O844n394L99j83J00
$$ 8432 4440 10373 12867 12919 17518 17404 20373 12774 17181 12943 6707 1742 8586 3192 3591 3408 3508
66C508N66l601K021J679J500q25J544n72j997r77J208j786N67L363k312P953n78
$$ 3508 4074 473 2494 4173 5673 4848 6392 5820 3823 2846 4054 2268 2835 6198 3886 11839 11261
49A1261n902K597n084J435j334M19J53Oj062q98K53R42k52n46K696l310K183k176
$$ 11261 5359 7956 2872 4307 2973 3392 3545 3551 2489 1591 1844 2786 2534 1988 4684 1374 3557 1381
31A381J597j471L75J21m83k71k17O43R07j500J796n3q58k03O63K88o56O19L23
$$ 1381 2978 1507 1882 2003 1520 1249 1032 1675 2582 1082 2878 2825 1967 1764 2427 2715 2059 2678 3001
12C001K63J4o51J099J406j412r94K629q24l354L896k096
$$ 3001 3264 3278 2627 3726 5132 3720 2726 5355 4531 1177 5073 2977
0B977
$$ 2977
##PAGE= F1=286.123619713
##FIRST=     6340.21289960861, 6666.66666666669, 2643
##DATA TABLE= (F2++(Y..Y)), PROFILE
1023B643j47L17k88q96o92P52Q16j358l71k19R31m26j86o74N35n53L65j92K65
$$ 2643 2496 2813 2525 1629 937 1689 2505 1147 776 557 1488 1062 876 202 737 184 549 357 622
1004F22k76K38J99j53k41O40r37L84Q0j09k45M67j76l6l57O66j95j51q7k52K37
$$ 622 346 584 783 630 389 1029 92 476 556 447 202 669 493 457 100 766 571 420 333 81 318
983C18P6Mj08J29P7l22J92J5j95L63Q9l95j5j4K6L61k06L6j8p5j06K08j43N3k43
$$ 318 394 398 290 419 496 174 366 381 186 549 638 243 228 214 240 601 395 431 413 338 232 440 297 350 107
958A07O16Mj89Rm02K69j84n3J65J44l33o2L02l0j41LM33p4l84J41j7mK99l29o1
$$ 107 723 727 538 547 145 414 230 177 342 486 153 91 393 363 222 225 658 584 200 341 324 320 619 290 229
933B29K82l66K78Lj11J57k9L34l16l10J31K34M8k18l9O9o4J13N04m41J38j18k22
$$ 229 511 145 423 426 315 472 443 777 461 151 282 516 564 346 307 376 312 425 929 488 626 508 286
910B86K95l42J06K15j15K29J02n81K7K19j87M28m36MJ61j48O3K60l74L2r2M11
$$ 286 581 239 345 560 445 674 776 195 222 441 254 682 246 250 411 263 326 586 212 244 152 563
888E63l35mj0p1Q8L0o5P2j23O08o90L50J77l32J03q3k7L14l51J88k92K02k22M09
$$ 563 228 224 214 143 231 261 196 268 145 753 63 413 590 258 361 278 251 565 214 402 110 312 90 499
864D99k53J36K99k92L01k03Km6R3l63q4J22R0L95n20L07o0J02M46o29j3Q1K73
$$ 499 246 382 681 389 690 487 489 443 536 173 89 211 301 696 176 483 423 525 971 342 329 410 683
841F83j33r4j69j59m3K88k4r0K24K93j77q0k46j58L67k96K64j84K90j98k75N74
$$ 683 550 456 287 128 85 373 349 259 483 776 599 519 273 115 482 186 450 266 556 358 83 657
819F57k62J11m35J73n1J12J96k1K48j31m27N0rR67l86l87l60J28J28J66k96M08
$$ 657 395 506 71 244 193 305 501 480 728 597 170 220 211 1178 792 405 45 173 301 467 171 579
797E79r3l61L61j61L18j40k57J20J09K04j32j19k42J07J42k90K79l4j54N26r2
$$ 579 486 125 486 325 643 503 246 366 475 679 547 428 186 293 435 145 424 390 236 762 670
776F70l51J55l48N39k67p4LO9J80m1l45K2K2Q7K19J36m76K20P5m48L14j10K25
$$ 670 319 474 126 665 398 324 327 396 576 535 190 212 234 321 540 676 200 420 495 47 361 251 476
753D76p8j21L8k23L98K33m95J94k40q8J11J08J76l19J88k46J23j95J10J62j06
$$ 476 398 277 315 92 490 723 228 422 182 94 205 313 489 170 358 112 235 40 150 312 206
732B06P1l3m5j75L8M33k72q6K12k82L93k99K11O8nj35J18K04m32J21R4k73K16
$$ 206 277 244 199 24 62 495 223 137 349 67 460 161 372 440 435 300 418 622 190 311 405 132 348
709C48k20N9J72o7k56K50P0n7N11k31m09J28K36J14l87O58m23k54M00n04mJ5N3
$$ 348 128 187 359 292 36 286 356 299 810 579 170 298 534 648 261 919 496 242 642 138 134 149 202
686B02J04K65j29m6j43L43n5K00J9n06L7N06n10L9r3R5l1pj02l8K45l08P1K31
$$ 202 306 571 442 396 253 596 541 741 760 254 291 797 287 326 233 328 297 290 188 150 395 87 158 389
662C89k09J33K4k5K34k86J49L1j01r6Q7m8j43K26K10j82rM8j68K44j32L25j15
$$ 389 180 313 337 312 546 260 409 440 339 243 330 282 139 365 575 393 384 432 264 508 376 701 586
639E86m28m4O03r6j07j09j44J56L22p0l22j78R6Q4n0m7K52q6k34K39p2j36L75
$$ 586 158 114 717 621 514 405 261 417 739 669 347 169 265 349 299 252 504 418 184 423 351 215 590
616E90k90K19m41M5j1P08L80j098l2L84K49n10J60J96J0l23p1O3K2j48K99p8K73
$$ 590 300 519 78 123 112 820 1200 102 70 454 703 193 353 549 559 236 165 228 250 102 401 323 596
593E96l29L03j44j14j57J14K80M9Q5l72K30J61k80Q3m02K30q0J97M35o13K62k06
$$ 596 267 570 426 312 155 269 549 598 683 311 541 702 422 505 103 333 253 450 885 272 534 328
571C28P9j46j14M2J82K20m87L56m01P5Q2J81j95j25N15k60R8j0o8L66n79K26n5
$$ 328 407 261 147 189 371 591 104 460 59 134 216 397 202 77 592 332 430 420 352 718 139 365 310
548C10q0k0l1L25k0P2k42j37L38j37j26ML81o0k78N5l4L41l74j94n1M08j65k41
$$ 310 230 210 179 504 484 556 314 177 515 378 252 256 637 577 299 354 320 661 287 93 42 450 285 44
524D4P2L97J00j76k88K95k09K04M63o13K89jm29K01R7L5n0j60k00P2L0j32L35
$$ 44 116 513 613 437 149 444 235 439 902 289 578 577 148 349 446 481 431 271 71 143 173 41 376
501C76K02M1m44K4N6q3m5L12J47l66L37k20M44m40k37M10k58j3m2J25o1O9k0J72
$$ 376 578 619 175 199 255 172 127 439 586 220 557 337 781 341 104 514 256 243 201 326 265 334 314 486
477D86j51J05n8L54j10k66P61q09q8j24n7Q67K202K160L714k51l922l182q47k65
$$ 486 335 440 382 736 626 360 1121 312 224 100 43 910 3112 5272 8986 8735 4813 1631 784 519
457E19k56j71N38m04J42K47n42L52k15J22k56K94l4J35l29j6J59K96j04K61l15
$$ 519 263 92 630 226 368 615 73 425 210 332 76 370 336 471 142 126 285 581 477 738 423
436D23K7m9l8K98m76n6J75q9J40n5M43o05K09J33k36M49j93p7K06n04M08k3q4
$$ 423 450 401 363 661 185 129 304 215 355 300 743 138 347 480 244 693 500 423 629 125 533 510 426
413D26n8j59J77j69oq7L56l07J31J35j84K38j60j49K22k53K19L4K01k53L8%r8
$$ 426 368 209 386 217 211 124 480 173 304 439 255 493 333 184 406 153 372 406 607 354 392 392 294
390B94j1J29m01L71l8qj12N40n96O8K23j49k4J79j39L68n73L21m31J20M24k43
$$ 294 283 412 11 382 344 336 224 764 168 236 459 310 286 465 326 694 121 442 11 131 555 312
368C12L69l54o3m6L71J91k20m96M84j60K46L5k92j0k24O47o24r6K10J21J34J87
$$ 312 681 327 264 218 589 780 560 64 548 388 634 669 377 367 143 790 166 70 280 401 535 722
346G22m44K53j86J46j66N4l11M00K05m79N29k32j28k21J30M64n73M2M07j44Q4
$$ 722 278 531 345 491 325 379 68 468 673 194 723 491 363 142 272 736 163 205 612 468 552
325E52K55Q65Q80l65J388j998q69j24k41LQ6K21l36J74j13K11l08O6K36k49j03
$$ 552 807 1672 2552 2187 3575 1577 708 584 343 346 432 653 317 491 378 589 281 347 583 334 231
304B31r5K41k09K43MK52m26M37l03M6k04J9M70m61J3j19K11K21k69l7mN19n86
$$ 231 136 377 168 411 415 667 241 678 375 421 217 236 706 245 258 139 350 571 302 265 261 780 194
281A94Q5M93l48M15o44J63k05j6J57K64n23K93M32l46J3k09M77k99j30K38k38
$$ 194 279 772 424 839 195 358 153 137 294 558 35 328 760 414 427 218 695 396 266 504 266
260B66p2J37L60k74K42m76M08O57l5J00n12N458J2033K2701J4324P776k3891k2619
$$ 266 194 331 691 417 659 183 591 1248 1213 1313 801 6259 18292 40993 55317 63093 39202 16583
242A6583j3644p27j216O86q77O99q54N62p62k64L45N41L206j526M105P607p826
$$ 16583 2939 2212 996 1682 805 1504 650 1212 450 186 531 1072 4278 2752 6857 14464 6638
225F638J679n058K251K87j634J80j807M239K345L652L9569L4852o9042m908j2648
$$ 6638 8317 3259 5510 5797 4163 4343 2536 6775 9120 12772 52341 87193 18151 13243 595
210E95K3291j1219K81n839k587J796k459j412O68l75j881M29m36K50r30K884n80
$$ 595 23886 12667 12948 7109 4522 6318 3859 2447 3115 2740 859 1288 852 1102 172 3056 2476
193B476j15K81J241l337P90l63k44O93k29O1O345n005K207L547o591O183l291
$$ 2476 2361 2642 3883 546 1336 973 729 1422 1193 1254 7599 2594 4801 8348 1757 7940 4649
176D649J677k957L820j995O055n012j434M97O693K704q140K4828L2636q568K8114
$$ 4649 6326 3369 7189 5194 11249 6237 4803 5300 11993 14697 6557 31385 64021 55453 83567
161H3567o748l5142j4903k1831m544K60P09J040n02R33m59R13J889j977K637l546
$$ 83567 76819 41677 26774 4943 399 659 1368 2408 1906 2839 2380 3293 5182 3205 5842 2296
145B296L274k413N30J881k363K104j594P479N09j387P573l476l616L211o627M3724
$$ 2296 5570 3157 3687 5568 3205 5309 3715 11194 11703 10316 17889 14413 10797 14008 7381 51105
129E1105K66818l5274k60516M038l210p43q437M917o754J932n056K590q817N776
$$ 51105 317923 282649 22133 26171 22961 22218 13781 18698 11944 13876 8820 11410 2593 8369
115H369k36m356P06J938j746J2709j253Q1403k283N0038M1104M0664J60394J34312
$$ 8369 8133 3777 4483 6421 4675 17384 16131 97534 95251 145289 186393 227057 387451 521763
101E21763P96360J5815988k33250j5306901j185877Q1374j96897q6082p6790m0019
$$ 521763 1318123 17134111 16900861 1593960 408083 489457 292560 206478 129688 89669
91H9669J8787k9338M055n7408l442j1409m409j413L081N075J800j910J118j618
$$ 89669 108456 79118 83173 25765 22323 10914 6505 5092 8173 13248 15048 13138 14256 12638
77A2638P08n712J054j785n553K169n86j696o63M41J748Q93l31N30m24j674K62
$$ 12638 13346 7634 8688 6903 1350 3519 2933 1237 574 1015 2763 3656 3325 3855 3431 1757 2019
60B019r91L77m66p59J299q45L85J042L12J1885o837l813L80J418m012q72j68O73
$$ 2019 1028 1405 939 180 1479 634 1019 2061 2373 14258 7421 3608 3988 5406 1394 522 354 1027
42A027R80p15r19O07k13q9R55L19m32q13J9q6o9K99N6o31N87m25J88R50l51k01
$$ 1027 2007 1292 373 980 767 678 1633 1952 1520 707 726 640 571 870 926 295 882 457 645 1595 1244 1043
20A043k22k17N5j53J193j245P04n36R85m56l35J073O63j817J334J393p91j16O90
$$ 1043 821 604 659 506 1699 454 1158 622 1607 1151 816 1889 2552 735 2069 3462 2671 2555 3245
1C245L78
$$ 3245 3623
0C623
$$ 3623
##PAGE= F1=279.6068390026
##FIRST=     6340.21289960861, 6666.66666666669, 2901
##DATA TABLE= (F2++(Y..Y)), PROFILE
1023B901l40L63K70r78l98K99Q57j394m65N4O75o68o6o54L22k75l3J3O6k20L87
$$ 2901 2561 2924 3194 2216 1818 2117 2974 1580 1115 1169 1844 1176 1110 456 778 503 470 483 549 329 716
1002G16j23j7l95P60o33o9L32l60k8J50J73N4k62K52k0R3l47rK9J65j86J55O8
$$ 716 593 576 181 941 308 239 571 211 183 333 506 560 298 550 530 623 276 267 296 461 275 430 498
979D98l00Q7k11L47l06O23k11k43j52K01j88K67K04l38J5R0L6R9k97K28l31N09
$$ 498 198 285 74 421 115 738 527 284 132 333 145 412 616 278 293 383 419 518 221 449 118 627
957F27R6n68M64n24L39k58J41l8M9k09P0Q9J24k15j51N45J96n59R3k02K13l9J36
$$ 627 723 155 619 95 434 176 317 279 328 119 189 278 402 187 36 581 777 218 311 109 322 283 419
934D19k05J71j45L14k18p5K59j65M46l63j65o0J89K68l84K3j23L6K06O21m67j38
$$ 419 214 385 240 554 336 261 520 355 801 438 273 213 402 670 286 309 186 222 428 1049 582 444
912D44L30n20J98l75N41j26lK07j74j22n4M2j92L88n39J72J55j24R4n8j81J02
$$ 444 774 254 452 77 618 492 489 696 522 400 346 388 196 584 45 217 372 248 342 284 103 205
890B05j57L53k00K29k87oQN5K1K15j93M77m90M55ml14k55K94j96L51l91J06j3
$$ 205 48 401 201 430 143 137 145 200 221 436 243 720 230 685 681 367 112 406 210 561 170 276 263
867B63J12k25L74l37J96K71p3J10k33J7K2K4j78k62J82q6M48m27L05l4r6M79k61
$$ 263 375 150 524 187 383 654 581 691 458 475 497 521 343 81 263 177 625 198 503 469 373 852 591
844E91k87R9M21j21l28k01K07l27J34J27J26j06M74j69j15l12j06J63l6J90l32
$$ 591 304 403 824 703 375 174 381 54 188 315 441 335 809 640 525 213 107 270 234 424 92
823I2M48r7l21N43j11l3k22j67K30k5J55kM54l31l32k30k0J069l33m57r8n4J04
$$ 92 540 443 122 665 554 521 299 132 362 337 492 490 944 613 281 51 31 1100 767 310 212 158 262
800B62O9k44N44k71j12K75j35J96j96k11M33j16K56k54o3k56J23j1k5L16k08k59
$$ 262 331 87 631 360 248 523 388 584 388 177 610 494 750 496 433 177 300 289 264 580 372 113
778A13P88j17l42L0k90L56n9k58J70l4K7J77l23n0J08k00L33O9k23Jpp9M2P5J86
$$ 113 901 784 442 472 182 538 479 221 391 357 384 561 238 188 296 96 429 498 275 276 269 190 232 307 493
753D93k6j68k19J24L78K62m87J96k62O1j18K05J26l43J20k96Q8q7J32O1J67N8
$$ 493 467 299 80 204 582 844 357 553 291 352 234 439 565 222 342 46 134 47 179 240 407 465
731D65k02j1q5j23M77k65j67K99l38L12j32J37M0Nj0J56R6m05k0m7K3L74l99l4
$$ 465 263 252 167 44 521 256 89 388 50 362 230 367 407 412 402 558 654 249 229 182 205 579 180 146
707A46J4L1q7J60M3q5O05l53k28J20K36L8l73M16k76l6K09m71p2L2J17J18L34
$$ 146 160 191 104 264 307 222 827 474 246 366 602 640 267 683 407 371 580 109 37 69 186 304 638
684F38j20j67N9M3j35K25K68o01K06K56m25J40k04J37j40L7J2Q6J29k33j03J04
$$ 638 518 351 410 453 318 543 811 210 416 672 247 387 183 320 180 217 229 315 444 211 108 212
662B12nM0j7M4N0n5K20j39k15J88l5J05l08J54K86k27J58l3P2j07j29M71j27l45
$$ 212 207 247 230 274 324 269 489 350 135 323 288 393 85 239 525 298 456 423 495 388 259 730 603 258
638B58p4M33M2j58r6k34L90K66q8l96j57K05j05N2j33L63k10j60L00k39lJ13n8
$$ 258 184 617 659 501 405 171 561 827 739 343 186 391 286 338 205 568 358 198 498 259 256 369 311
615C11K66l31N6k46N28R2l53l21L47L34n20K43k9K24l00k22J20J41j27L07p9r
$$ 311 577 246 302 56 584 676 323 2 349 683 163 406 377 601 301 79 199 340 213 520 441 432
593D32j87J89k4j27k12L22k8J48kl00L61J96l75O7k64J42J41N4K63l68rl83K84
$$ 432 245 434 410 283 71 393 365 513 511 211 572 768 393 460 196 338 479 533 796 428 419 36 320
570C20k9o5j5K31J82m32K88l28M7j75L11k26L2M38j51ro2p1K54l77J71r5O5j01
$$ 320 291 226 211 442 624 192 480 152 199 24 335 109 141 579 428 419 357 286 540 163 334 239 304 203
546B03J17m8O3K87l44p2L16k26J3j19M67k6k98j03K08N6j16j19j57J45O8j79M6
$$ 203 320 272 335 622 278 206 522 296 309 190 657 631 333 230 438 494 378 259 102 247 315 136 182
523A82K44J49k40k34K61m4k6N03p93M26N8j91J16K57p3j75j6l54J24q6J43J33
$$ 182 426 575 335 101 362 318 292 795 2 428 486 295 411 668 595 420 404 50 174 88 231 364
501C64K99j50m52Q9J01j03p5M83J54n76L39r0M91m10l37L43k56K2J3j03J66J3
$$ 364 663 513 61 150 251 148 73 556 710 134 473 383 874 464 127 470 214 236 249 146 312 325
479C25O0K7k01L01j34L34l52JP08p77m7l2l4Q86K021J821L153J306l159m186p19
$$ 325 385 412 211 512 378 712 360 361 1069 292 245 213 179 1065 3086 4907 8060 9366 6207 2021 1302
458A302q52K0k50M68m29N8J92k59J35l02J41l9J43o2J81k43lL37J55j60K76k57
$$ 1302 450 470 220 688 259 317 509 250 385 83 224 185 328 266 447 204 201 538 693 533 809 552
436E52j24r7O3J48j98k09L31l26J5L03K48m83J48K7q0L98j50j06L2j68J15J71
$$ 552 428 331 394 542 344 135 466 140 155 458 706 223 371 398 318 716 566 460 492 324 439 610
414F10j91j36j3K25l45J08r3L09k31M2O6o0M4J18l05J97j50K51k81M21j56n6K8
$$ 610 419 283 270 495 150 258 165 474 243 285 351 291 335 453 148 345 195 446 165 586 430 374 402
391D02p2N4k53l9L00n0j47J48L30l38o5J70Nk1K5l58M76l52K33l11J65N4j16M56
$$ 402 330 384 131 92 392 342 195 343 673 335 270 440 445 424 449 91 567 215 448 137 302 356 240 696
367F96l45j47p7M22J44k25j70J04j1K88k57j94L71l22M23o42J70j65K33K90K04
$$ 696 351 204 127 549 693 468 298 402 391 679 422 228 599 277 700 58 228 63 296 586 790
346G90n63J79R2q0k73K52r8K92l64j77O99m42l7j2K22K67l85k57N34q7m08P93
$$ 790 227 406 498 418 145 397 299 591 227 50 749 307 270 258 480 747 362 105 639 552 144 937
324I37R26J091K73O79k491n91j74m53J15KL70o05N20l49K34J75k82K19k38m6k75
$$ 937 1863 2954 3227 3906 1415 824 650 197 312 314 684 79 599 250 484 659 377 596 358 312 37
303C7M02l05P5J14o6K45J93m58J16M3j93K67k61L6j12P5L98l95Q0J86k7j38p9
$$ 37 439 134 209 323 257 502 695 237 353 396 203 470 209 245 133 208 606 211 291 477 450 312 233
280B33M93k44L01m58O3j65L8j6K52k11j71M62l13K10k32J42K11n26N60o15K28
$$ 233 726 482 783 325 388 223 261 245 497 286 115 577 264 474 242 384 595 69 629 14 242
259B42J40K41j23K19n83O0J006n43N21p35L360J0314J6412L343O458j2434j6802
$$ 242 382 623 500 719 136 196 1202 659 1180 445 3805 14119 30531 33874 40332 27898 11096
242A1096r826M18j355O31o92J033q57N56r37L77j93L88M216m53J588Q989p689
$$ 11096 1270 1688 333 964 272 1305 448 1004 67 444 251 639 4855 4402 5990 14979 7290
225G290M37o093N015l304J009k209j779L870P588K136K1820J9597m6293N123j1740
$$ 7290 7727 1634 6649 3345 4354 2145 366 4236 11824 13960 35780 55377 9084 14207 2467
210B467J8126r728L036n566l295K517k370k160n14J55j639k2o25m6K982J601k939
$$ 2467 20593 10865 13901 8335 5040 7557 5187 3027 2513 2668 1029 1007 382 336 3318 4919 1980
193A980J220O28m73k618l81J261j250J376J453J02L777n955M461M900q668M583
$$ 1980 3200 3828 3355 737 356 1617 367 1743 3196 3298 7075 1120 5581 10481 1813 6396
177F396j595K550o733O097j657O989m122k501Q87J2073q822N132Q98J6423O78
$$ 6396 4801 7351 618 6715 5058 12047 7925 5424 6311 18384 9562 14694 15592 32015 32693
162C2693J7806l017k2932j0872r248k795n75j51J75j79J921l47J079K312k638
$$ 32693 50499 47482 24550 13678 4430 1635 1060 909 1084 905 2826 2479 3558 5870 3232
147C232M393m452M270n055j375O770m041J260j249L513Q31M180l121l671Q80N2
$$ 3232 7625 3173 7443 2388 1013 7783 3742 5002 3753 7266 8097 12277 9156 5485 6365 6417
131F417R334J7496L90851j9543l82214K2016k3718j9891Q009P7N982N146q551
$$ 6417 15751 33247 424098 404555 22341 44357 20639 748 8757 8834 14816 19962 11411
118A1411N081p661l776j699J275Q670O92J2658l803K3020Q016P118K6167L6719
$$ 11411 16492 8831 5055 3356 4631 13301 13993 26651 22848 45868 53884 61002 87169 123888
104A23888M8423L4322L05119Q29288J0379359j248861r712247m15407k49724l456
$$ 123888 172311 206633 511752 1341040 11720399 10471538 759291 343884 94160 90704
94I0704N7644n3566j6413n8398P0034M4338j14282p046m323k828r57R53j231L955
$$ 90704 148348 94782 78369 19971 90005 134343 20061 13015 8692 5864 4907 5860 4629 8584
80H584n27k158L236l046J357k157o71J051j744r30n89j92Q06P81j909K143q3p46
$$ 8584 8057 5899 9135 6089 7446 5289 4618 5669 3925 2995 2406 2214 3020 3801 1892 4035 3952 3206
62C206j142K074k818K025k183j83O02j285J335J61L332q62J995n38l321K717k956
$$ 3206 2064 4138 1320 3345 1162 979 1581 296 1631 1792 5124 4262 6257 5719 2398 5115 2159
45B159p82j04n2J054j235o76Q98o08l55K453j417Q02k13j051K18n0M73n03j68
$$ 2159 1377 1273 1221 2275 1040 364 1262 654 299 2752 1335 2137 1924 873 1091 1041 1514 1011 843
26H43J57l86k90J106J30m57L46l90R5p11J432j086P02n45J064m58Q8J015O19j696
$$ 843 1000 614 324 1430 1560 1103 1449 1059 1154 443 1875 789 1491 946 2010 1552 1640 2655 3274 1578
6A578R50J119j80j263J001k61
$$ 1578 2528 3647 3467 2204 3205 2944
0B944
$$ 2944
##PAGE= F1=273.0900582923
##FIRST=     6340.21289960861, 6666.66666666669, 1885
##DATA TABLE= (F2++(Y..Y)), PROFILE
1023A885m45K60O50q52K26m91J048j328o9K1M26o6m19k86K15j46O1p0j53j57M42
$$ 1885 1440 1700 2350 1498 1724 1233 2281 953 884 905 1331 1265 846 560 775 629 690 620 467 310 752
1002G52k30M9l43M52k30k56L80l49k07K17K25J27j85K2K61J4m05J54j0J06k45
$$ 752 522 571 228 680 450 194 574 225 18 235 460 587 402 424 685 699 294 448 438 544 299
981B99J52J37m04K22j16J28j18M93l13k06q1L16l30O3M35m26m6J15J59J28j92
$$ 299 451 588 184 406 290 418 300 793 480 274 193 509 179 242 677 251 205 320 479 607 415
960D15k5k10M09Q1l51K74m69K84k36J40n8nr5P7K5J90k80m9L63K95m78k0j61K14
$$ 415 390 180 589 670 319 593 124 408 172 312 254 249 154 231 256 446 166 117 480 775 297 277 116 330
936C30j97K75j31P3j41L94k84j29M03k92M57k88j48J5l4L77l86m8N0K00j3O40
$$ 330 133 408 277 350 209 603 319 190 593 301 758 470 322 337 303 680 294 246 296 496 483 1123
914A123m46l30N02o29J11k49O72k99J31N9l70J81r9J4l12M43l89K6J80K6o7j09
$$ 1123 677 347 849 220 331 82 754 455 586 645 275 456 357 371 59 502 113 139 319 345 278 169
892A69r1L98l72J89k1K24l33KJ1L7R9L09l01L33k23M69j98l07j84L44j44M3k06
$$ 169 78 476 104 293 272 496 163 165 176 213 312 621 320 653 430 899 701 394 210 554 410 453 247
869B47K3R8l5l4J88k48J50J94O2J9k35k9J46k9m6l52J92k01M84l81K81Rk88M24
$$ 247 270 368 333 299 487 239 389 583 645 664 429 400 546 517 471 119 311 110 594 213 494 503 215 639
845F39N5l87J29N11q9l92l92L85l42N9O7K83k43M30r0j66k73n2J68j6P7k48L39
$$ 639 694 307 436 947 858 466 74 459 117 176 243 526 283 713 623 457 184 132 300 284 361 113 452
822D52Q3l87M44nm7r2l48L32n1L9M7N16l70k34l23L3Q94k88m21J44k21p6J82p6
$$ 452 535 148 592 587 540 448 100 432 381 420 467 983 613 379 56 89 983 695 274 418 197 121 303 227
798B27L40m02J85K12k54K05k13q7N16k53K35k60n6k36J81J6O2K75l44l14R86j82
$$ 227 567 165 350 562 308 513 300 213 729 476 711 451 395 159 340 356 418 693 349 35 1021 839
776H39k62j06k37K09J78m89L66k03r3K33j43J70p3k49J96l3L8k43QK21j78J05
$$ 839 577 471 234 443 621 132 498 295 202 435 292 462 389 140 336 303 341 98 106 327 149 254
754B54J81M6o6k40J39K61L23m94K51k88J14k15K20J08l66J44l38j0N4J78q1L22
$$ 254 435 481 415 175 314 575 898 404 655 367 481 266 486 594 228 372 34 24 78 256 175 497
732D97M9k84N8n7j79M64k68j89K71k58J64qJ10k3L6N7J55N0l53j80o1L16K97m11
$$ 497 546 262 320 263 84 548 280 91 362 104 268 260 370 347 383 440 595 645 292 112 51 367 664 253
708B53p9j33M1R9J82p8j42O31m13j50K55J64k8l76K28k02J67Q0m26L9n1K86k5
$$ 253 174 41 82 181 363 285 143 774 361 211 466 630 602 226 454 252 419 499 73 112 61 347 322
685C22M29j52k98J81j72j88K78K86m83K65P1l38J52k68K52k42O7M6K32L3k26j65
$$ 322 751 599 301 482 310 122 400 686 203 468 539 201 353 85 337 95 162 208 440 473 247 82
663H2N0M1K00j59Ml9Q1K74l46r1K88j32J68k27mK62j75J88l3J55l25p9N00r9k61
$$ 82 132 173 373 214 218 179 260 534 188 97 385 253 421 194 190 452 277 465 432 587 262 183 683 584 323
638C23l7J77J06j47O8l00L48K77j7m74q7J63j77J08j80L91k48o4K05k37Q2j48
$$ 323 286 463 569 422 490 190 538 815 798 324 237 400 223 331 151 542 294 230 435 198 280 132
616A32Q8L27j24k3k74K45L8r7k75K03L44l37R3r7L16k26k72J10K83j32K95m4k05
$$ 132 220 547 423 400 126 371 409 312 37 240 584 247 340 243 559 333 61 171 454 322 617 573 368
593C68k00R5R2Jl31L72j12R0N4j85L34J45l92J51k04R0K79j49K03k26k10m2L5
$$ 368 168 263 355 356 25 397 285 375 429 244 578 723 331 482 278 368 647 498 701 475 265 223 258
570B58J31q4r4K38J43l59K86k07m1j94J66j68K25K10m7j05j02j09J77j40R4K6
$$ 258 389 305 211 449 592 233 519 312 271 77 243 75 300 510 463 358 256 147 324 184 278 304
548C04J10j81J59k63R6M37m15QK09k45K32k29M50p0j31l25L34j13M2n5j35j67
$$ 304 414 233 392 129 225 662 247 255 464 219 451 222 672 602 471 146 480 367 409 354 219 52
526E2K59j31N9Q8J58k55j30K19Q1k44M70m11P7J32l5R6L24j72j77Q6m09P9j50
$$ 52 311 180 239 327 485 230 100 319 400 156 626 215 292 424 389 485 809 637 460 546 137 216 66
503F6L08nL17l05l17J36J9j11%N21J85o89K34N9M46l24l55L05k90R1o2J6J30p4
$$ 66 374 369 686 381 64 200 219 108 108 629 814 125 359 418 864 540 185 490 200 291 229 245 375 301
479C01J18q7k07M92k30J28m21K27N95o52R2j1m9P31J859J218L124L882k602o440
$$ 301 419 332 125 617 387 515 94 321 916 264 356 345 296 1027 2886 4104 7228 11110 8508 2068
459B068m25j245K52k88L44m65N0N8M1j8k26m3J94o3k3J41J06j17M02K2k00J88
$$ 2068 1643 398 650 362 706 241 291 349 390 372 146 103 297 234 211 352 458 341 743 765 565 753
437G53j74j73r2L5P6Jj68L45m97q4M41J96l22J3j5k9L57j04j57Lk7K4K16j31k60
$$ 753 579 406 314 349 425 426 258 603 106 22 463 659 337 350 335 306 663 559 402 405 378 402 618 487 227
412B27J24K23m52J34r7K50j05j2J72k40m0K68k51J25k2J05k10K70n1n8M9r2J33
$$ 227 351 574 122 256 159 409 304 292 464 224 184 452 201 326 304 409 199 469 418 360 409 317 450
389D50l50jL22j2l37M21M4q7j04O2J28m4j07j85K21l5O8k65K01j30j03O14l26
$$ 450 100 99 421 409 72 493 537 450 346 408 536 492 385 200 421 386 454 189 390 260 157 771 445
366D45l38K3L87L2k16J55k64L12J46l02j06M87k99Q2n15K86j29J37K30K50o39
$$ 445 107 130 517 549 333 488 224 536 682 380 274 761 462 544 29 315 186 323 553 803 164
345A64J56K11k17j20K44j6K13m84j02N59n01P3J92K46J47l09k07L20K08n88R61
$$ 164 320 531 314 194 438 422 635 151 49 608 107 180 372 618 765 456 249 569 777 189 1150
324A150Q65Q19pP34k549J11m46n13N26m36N20o27M19k53J26M03l50J61l07o3j96
$$ 1150 2015 2834 2827 3561 1012 1123 677 164 690 254 774 147 566 313 439 842 492 653 346 283 87
303H7M08k58Q1J8k88M65J51l22J06m5j07k1j41K6o6J16M23m03J71J35k44J7R2
$$ 87 495 237 318 336 48 513 664 342 448 403 296 275 134 160 94 210 633 230 401 536 292 309 401
280D01K59j61K54m26N3l4N1j02L25k57k22M39l28L96k19j84M00n79N81m12J8O3
$$ 401 660 499 753 327 380 346 397 295 620 363 141 580 252 648 429 245 645 66 647 235 253 316
258C16K56J05Q9o82L29R57r66Q38r5J638O964J4349J309Q878j1152j3327p440
$$ 316 572 677 766 84 413 1370 404 1242 1147 2785 9749 24098 25407 34285 23133 9806 2366
241B366j006j096O51k78N88j094J030r92L18l49N43M126J46O54Q800q308o18l055
$$ 2366 1360 264 915 637 1225 131 1161 169 487 138 681 4807 4953 5607 14407 6099 5481 2426
223B426L626m950K932k17m86j76J0580j033N9867K4849q3362L214j2962J8346
$$ 2426 6052 1102 4034 3817 3331 3155 13735 12702 72569 97418 14056 17270 4308 22654
209B2654l083o543l056n063L723k982l856o2L84r74L82l64l81L155o28k28M735
$$ 22654 19571 13028 9972 4909 8632 5650 1794 1732 2116 1142 1524 1160 779 3934 3306 3078 7813
192G813k232k131k163j031J506q95J399J225J08J600l287M179K095o296K791K04
$$ 7813 5581 3450 1287 256 1762 867 2266 3491 3599 5199 1912 6091 8186 1890 4681 4885
176D885J409j907N138m571O524k577m022M472Q124p447P429j3192K1301p945J8012
$$ 4885 6294 4387 9525 4954 11478 8901 4879 9351 17475 10028 17457 4265 25566 17621 35633
161C5633p523j1022r465l919j708m57L32O2j44K450n85K553j379O67l79j154K796
$$ 35633 28110 17088 7623 3704 1996 1539 1871 1933 1789 4239 3654 6207 4828 5495 5116 3962 6758
144F758k729L12L618l973n55n01P957p811J4689j6937R026m038N579J3701N226
$$ 6758 4029 4341 7959 3986 3431 2930 10887 3076 17765 828 9854 5816 11395 25096 30322
129C0322R1356Q7971j80079O106j9768k911M765n374N661K378r387M305p936K892
$$ 30322 121678 209649 29570 35676 15908 12997 17762 12388 18049 20427 11040 15345 7409 10301
115A0301j825l016O927L914J1186k605k281L2289j3640J5849K6288K4133m8642
$$ 10301 8476 5460 12387 16301 27487 24882 22601 54890 41250 57099 83387 107520 58878
102E8878J21022M14999Q815321l9417q530096m47080k39132n3622M2831n1404
$$ 58878 179900 594899 9410220 9370803 840707 393627 154495 100873 143704 92300
92I2300n73K1431J00296j19566o3098j2433j3251J121J919M5j124M143k079k923
$$ 92300 91727 113158 213454 93888 30790 18357 5106 6227 8146 8191 7067 11210 9131 6208
78F208K232m350K280l382l05J681k580J957k105M58Q22K77j642K010o00q35o50
$$ 6208 8440 4090 6370 2988 2683 4364 1784 3741 1636 2094 2916 3193 1551 3561 2961 2126 1476
61A476J686j760K059k856Q06O4q57J414J301Q194K621l582m490l843J622j556
$$ 1476 3162 1402 3461 605 1411 1475 618 2032 3333 11527 14148 10566 6076 2233 3855 2299
45B299j218M06k80J181j390l79O86l28p21K352j546Q46N36k358J007m83P66m08
$$ 2299 1081 1487 1207 2388 998 619 1305 977 256 2608 1062 1908 2444 86 1093 610 1376 968
27I68j9O8l86j02P56o0k14N21q97K18n51J119q05O23k56P07j66k91P75O51j660
$$ 968 949 1017 631 529 1285 1225 1011 1532 635 853 302 1421 616 1239 983 1690 1524 1233 2008 2659 999
6I99M56J016j31j502J051n21
$$ 999 1455 2471 2340 838 1889 1368
0A368
$$ 1368
##PAGE= F1=266.573277582
##FIRST=     6340.21289960861, 6666.66666666669, 688
##DATA TABLE= (F2++(Y..Y)), PROFILE
1023F88n47L94M56j13J82p44J057j256K81pN26Rm96n4K55k8K04j17l42j31M87
$$ 688 141 535 991 878 1060 316 1373 117 398 391 917 926 430 376 631 603 807 690 348 217 704
1002G04k20m9j92J28P7k49K91k68P0P6o0J48m9m4N33k53l64K94J1k1k31J68Q6
$$ 704 484 435 243 371 448 199 490 222 292 368 308 456 407 363 896 643 279 573 584 563 332 500 586
979E86j66R3j03j08J53K09k24o4j42L15l65r2N43l25k34J39K06J90j57j45r7L94
$$ 586 420 513 410 302 455 664 440 376 234 549 184 92 635 310 76 215 421 611 454 309 212 606
957F06J4k14K5k03K3j03J2J67j85j7P6M5J81l11K1K60K48l06j87R5J3j5O8kL7
$$ 606 620 406 431 228 251 148 160 327 142 125 201 246 427 116 137 397 645 339 152 247 260 245 313 311 348
932C48k42M75k29j31L66l37L99j71j60R3j59L65l02j92L19K41j01N45l24m88M28
$$ 348 106 581 352 221 587 250 649 478 318 411 252 617 315 123 442 683 582 1127 803 315 743
911G43n21J2L0M85l51K61j31m57L02j02R1k18K22j82j13J61J71j92L5n1M46l70
$$ 743 222 234 264 749 398 659 528 71 373 271 362 144 366 184 71 232 403 211 246 195 641 271
889B71L4RJ24j88L5r4L4K08L03l35J27J3M57l62k72o0L49r7k89L9L8Q5k31J52
$$ 271 305 314 438 250 285 191 225 433 736 401 528 541 998 636 364 304 653 556 267 306 344 429 198 350
865C50N5j67J37J00J13k1j88r4K92j12O8l72J51j71M10k93K02K9m00L18K54l39
$$ 350 405 238 375 475 588 567 379 285 577 465 533 161 312 141 551 258 460 489 89 407 661 322
843C22J36N20J0m03m07K10k36J23j38M15k39K06N0k21k02k6K96j14Rl7L6K46l95
$$ 322 458 978 988 585 178 388 152 275 137 552 313 519 569 348 146 120 416 302 311 274 310 556 161
820A61K88R1Lm9k17J17J3j43J37M81k96j27l94J09P17k32l77K92l15j87L46r5
$$ 161 449 540 543 494 277 394 407 264 401 882 586 459 65 174 891 659 282 574 259 72 418 323
798C23R9l68L62J09k71J88k12N8L95k63J54j79q1k26L12J07M3J63l77j71Q87k39
$$ 323 422 54 416 525 254 442 230 288 683 420 574 395 314 88 400 507 550 713 336 165 1052 813
776H13k29j14j69J00L17o16M63l26r3N6J15K92j15k04k3j43J91k21J35J92k59
$$ 813 584 470 301 401 718 102 565 239 146 202 317 609 494 290 267 124 315 94 229 421 162
755A62K8J25J78N5j20n1R5L77m91K88k70R3j78J22J32l34J58k87L5J8J72k01L60
$$ 162 190 315 493 548 428 377 472 849 358 646 376 469 291 413 545 211 369 82 117 135 307 106 466
732D66O5l24J33j06p8L37k13j33J34j61N0J01J38j25oJ47J21L7k47k09L5L73R2
$$ 466 531 207 340 234 156 493 280 147 281 120 170 271 409 284 278 425 546 583 336 127 162 535 627
709F27l66m7j31J64J1J97k16j25N64l66j94L67J36o1l35R6k49L34rl64J58m8L87
$$ 627 261 214 83 247 258 455 239 114 678 312 118 485 621 560 225 321 72 406 397 33 191 143 530
686E30j08M31k01l99K04k38K1J17R3k11K63p6k73R5k1J48l16J13J7L09l4k43r1
$$ 530 422 853 652 253 457 219 240 357 450 239 502 426 153 248 227 375 59 172 189 498 464 221 130
663A30k1k3M59k81l3j7M3K77m57J98J52k09J46r8k9J71j79J60J2J84l74l1M32
$$ 130 109 86 545 264 231 214 257 534 77 275 427 218 364 266 237 408 229 389 401 585 211 180 612
640F12r3k03Rm9J23o2K46l04J03L87O9n37L4j4j16P9r0K35k30K7N0rN9j77L7K60
$$ 612 519 316 325 276 399 337 583 279 382 769 838 301 335 321 205 284 194 429 199 226 276 267 326 149 186 446
614D46P2r2j88j02J15j1k04J21K79j02j34J9K42j42j75P5L08j47K95k9k54l31
$$ 446 518 426 238 136 251 240 36 157 436 334 200 219 461 319 144 219 527 380 675 646 392 61
592F1K0K06N2k03J60J8p3J56o8K32M8l43K81k50J22K73k69J86j67l20K73q9K09
$$ 61 81 287 339 136 296 314 241 397 329 561 609 266 547 297 419 692 423 609 442 122 395 306 515
569E15j32j81J92P6k34L03r9j39k06J4J1K85j1P5k17j24q2J35L5O6J61J03l30
$$ 515 383 202 394 470 236 539 440 301 95 109 120 405 394 469 252 128 46 181 216 282 443 546 216
546B16J86j59r5M63l79K6R6j27L71k65L66o4o6m49L70j70Q8q7L2k27J58j37J22
$$ 216 402 243 148 611 232 258 354 227 598 333 699 635 569 120 490 320 408 321 353 126 284 147 269
523B69m0J53k09q3J88J73l91L33l8j16J22P7O0L09k15p7J56m66L5j57L59r2L40
$$ 269 229 382 173 90 278 451 60 393 355 239 361 438 498 807 592 515 671 205 240 83 442 350 690
500F90m41j42J34p9n6J24L99K42o73J9J58L39j32m10L02k56J11p6J42n5nR0j40
$$ 690 249 107 241 162 106 230 629 871 198 217 375 714 582 172 474 218 329 253 395 340 335 425 285
477B85j85N70k82j44j30J33L84l91K11k1p3N46J573K18M020L463j879o513r5j376
$$ 285 100 670 388 244 114 247 631 240 451 430 357 903 2476 2694 6714 10177 8298 1785 1690 314
457C14M01k48J45m13P3r2K94p1k03j13K20j53P9m6M32j35L68j20k01O2q0j47n6
$$ 314 715 467 612 199 272 180 474 403 200 87 307 154 233 187 619 484 852 732 531 593 513 366 310
434C10l0M6J45k7K04n68Q9J86K43j56j1j12j08L43n7k23N9k6O2K23m3m42L21J56
$$ 310 280 326 471 444 648 80 169 355 598 442 431 319 211 554 497 274 333 307 369 592 549 107 428 584
410E84m78Q5r6J93O4n8L09m80P5J28r2N6M5j0n8J4N1L1O3j58J65k08j73L45j8
$$ 584 106 191 95 288 352 294 603 123 198 326 234 290 335 325 267 281 332 363 426 268 433 225 52 397 379
385C79j84L26j75J31q8k9K36j33j77M1m6K08r3k21K43k21nO32k82n17J13K88p6
$$ 379 195 521 346 477 389 360 596 463 286 327 281 489 396 175 418 197 192 824 542 25 138 426 350
362C50j65M03k84L18M0l15N8M00k79j74k39J79O0k4P9K45n17J42J87l04K8K42
$$ 350 185 588 304 622 662 347 405 805 526 352 113 292 352 328 407 652 135 277 464 160 188 430
340D30m7J91k60k16K54j71O1K12K26O1k46k38J51L88n13N53O95P73n15Q93k555
$$ 430 383 574 314 98 352 181 242 454 680 741 495 257 408 796 283 836 1531 2304 1789 2682 127
319A27P39j82m88O96n97N16o76K45M7p2M90k31Q3k72k63l0L45J5k3j87j61K48
$$ 127 866 684 196 892 295 811 135 380 427 355 845 614 697 425 162 132 477 492 469 282 121 369
297C69J64j30J31k37J7j92o3m5J55J02L16l56J56R7k57l0J92Q0j4K34l85O6Q2
$$ 369 533 403 534 297 314 122 59 14 169 271 587 231 387 484 227 197 389 469 455 689 304 370 452
274D52Lj15L28l01k22L89l79M80j97l45M62m47M64j96j56j2L04J89j05m60M38
$$ 452 455 340 668 367 145 534 155 635 438 93 555 108 572 376 220 208 512 701 596 136 574
253E74O88q79P32L06P41L495J2468M795Q663j2010j0061o555j957p73P41l62M38
$$ 574 1262 383 1115 1421 2162 5657 18125 22920 31583 19573 9512 2957 1000 227 968 606 1044
236A044p77Q43r99J42o9J148L409K12n23P174o817p19q31J537k464J455K048m68
$$ 1044 267 1110 111 253 184 1332 4741 4953 4430 11604 4787 4068 3237 4774 2310 3765 5813 5345
218E345N24R646l441N9640J6351p9334J0782j4172J5001k041q024J174o251L275
$$ 5345 5869 15515 12074 71714 88065 8731 19513 5341 20342 18301 10277 11451 5200 8475
204H475l400l619k53N01o90P02l69o93J728m81N293L484l889l038k639o38Q69
$$ 8475 5075 1456 1203 1704 1014 1716 1347 654 2382 1901 7194 10678 6789 3751 1112 474 1343
187A343k69P98P93K52j37k37J193j782j27j66M335k728N427M255q361P961k550
$$ 1343 1074 1872 2665 2917 2780 2543 3736 1954 1827 1661 5996 3268 8695 12950 4589 12550 10000
170A0000m642N491L277l911O251o381K8071j9010J2788n078j0825o826p033p36
$$ 10000 5358 10849 14126 10215 16466 10085 38156 19146 31934 26856 16031 9205 2172 1436
156A436k45N64Rn73K410p30K533l068L270l528J241q03J622J544K166m177k796
$$ 1436 1191 1755 1764 1191 3601 2871 5404 2336 5606 2078 3319 2516 4138 5682 7848 3671 875
139H75O48Q134j139K280J495m051j432K446J793P143J86422J13527k77675n977
$$ 875 1523 9657 8518 10798 12293 8242 6810 9256 11049 18192 204614 318141 40466 34489
125C4489j7695L114m235m246J545r05n505J170k385M227j112m170L437L363K590
$$ 34489 16794 19908 15673 11427 12972 12067 6562 7732 5347 9574 8462 4292 7729 11092 13682
110A3682j899L334j0397K9415J9292J6175K6947J28148J19616N85080M355389
$$ 13682 11783 15117 4720 34135 53427 69602 96549 224697 344313 929393 5284782
99E284782j374645l562915l24214O1017k3784l9340J9383L6771K34957J40227
$$ 5284782 3910137 347222 23008 84025 60241 20901 40284 77055 312012 452239
89D52239J13190n07510k9895j5333m502q79k879k529O10m65K214k970L456k026
$$ 452239 565429 57919 28024 12691 8189 7310 4431 1902 2512 2047 4261 1291 4747 2721
75B721J096j266N08k037K173k762J116L23o52m53j48m27J008r44J313j079K013
$$ 2721 3817 2551 3059 1022 3195 433 1549 1872 1220 767 619 192 1200 256 1569 490 2503
58B503k396J472n22j69L83J252N316k220J764l547j850M06o32j333O74m18J313
$$ 2503 107 1579 1057 888 1271 2523 7839 5619 7383 3836 1986 2392 1760 427 1101 683 1996
41A996j338q4M14k21m61J433j146J195M08j407j41m01O33k22M9J54m32J42K87
$$ 1996 658 574 988 767 306 1739 593 1788 2196 789 648 247 880 658 707 861 429 571 858
22H58J6l07N49q45R3j53N01l81L60p1K40J43n50N48L66j168N19K07Jk32j73j62
$$ 858 874 567 1116 271 364 211 712 331 691 620 860 1003 453 1001 1367 199 718 925 926 694 521 359
0C59
##PAGE= F1=260.0564968717
##FIRST=     6340.21289960861, 6666.66666666669, 425
##DATA TABLE= (F2++(Y..Y)), PROFILE
1023D25M04O1l40N48p03M23K95m86n12PR14m95j82k19L02J05K06j14l28j12M43
$$ 425 829 890 550 1098 395 818 1113 627 115 122 1036 541 359 140 442 547 753 639 311 199 642
1002F42k58k06L4K25q9j12J80k00L01k7j69p6J25l3O83m94k06L40J6n1k73K23
$$ 642 384 178 212 437 348 236 416 216 517 490 321 245 370 337 1020 526 320 660 676 625 352 575
980E75o0J09o7j62k42L74j01NJ24k91K05k67p2M25j59l01P0J28K31j59K7j58M28
$$ 575 515 624 557 395 153 527 426 431 555 264 469 202 130 555 396 95 165 293 524 365 392 234 662
957F62k3l17j13P0j70j9k7L71m27P1O8N5J44k42K5K49J13j14k68K46k26J98j05
$$ 662 639 322 209 279 109 90 63 434 7 78 146 201 345 103 128 377 490 376 108 354 128 326 221
934B21O4L6k93M86j34r1K19l27M07j42j64J53j20K11k05j69L89K17r2M10j66o30
$$ 221 285 321 28 514 380 289 508 181 588 446 282 435 315 526 321 152 541 758 666 1076 910 280
912B80K42k75l7K38K01l07L19k95j89L3p3K01m2j29N9l3n4K80k16O0jM57l24l2
$$ 280 522 247 210 448 649 342 661 366 177 210 137 338 296 167 226 193 139 419 203 263 262 719 395 363
888C63o6KM7J59l62R6K73K43k80j18J85M20m45j83p7L87k7n54K24J38K8m21K72
$$ 363 297 299 346 505 143 239 512 755 475 357 542 962 517 334 257 644 617 63 287 425 453 32 304
865C04Nq4J16QJ02j5j25j43M16k01J48l46P3k1L04k05P8M1m13K31K83k28R8M75
$$ 304 309 225 341 349 451 436 311 168 584 383 531 185 258 237 541 336 414 455 42 273 556 328 426 901
841I01J52m16l36o8p4K01k79M92k15m9K06k09j87N3L06k11O4O3k17L00k33L0J81
$$ 901 1053 637 301 233 159 360 81 573 358 309 515 306 119 172 478 267 331 394 177 477 244 274 455
818D55P1o0qj51P9k97K23L83j62J0n10K09O19j80l78L58l48o1K89j79r5k9J83
$$ 455 526 466 458 307 386 89 312 695 533 543 33 242 861 681 303 661 313 252 541 362 267 238 421
795D21jl0J3k43J45K05j77O0q0j14j78M31J52OM1l36k5O83k76k29kq2J9L37n94
$$ 421 420 390 403 160 305 510 333 393 313 199 21 452 604 610 651 315 290 973 697 468 466 384 403 740 146
770A46M17l30Nq6J42L54p1j80j81j89J98N1J7J54j93Km0L33J09jk52p4L62m43
$$ 146 563 233 238 152 294 648 577 397 216 27 225 276 293 447 254 256 216 549 658 657 405 331 693 250
746B50L11k43K4k6o4J75k34J18r6L2m9J36k89L14J01l40J75j98Q8J68j05j6l3
$$ 250 561 318 342 316 252 427 193 311 215 247 198 334 45 359 460 120 295 97 185 353 248 232 199
723A99o7n4K46J73k42L7J00P5J4j11Ok00M64p5l37K2j46L58j34J70l42k2M34k31
$$ 199 132 78 324 497 255 292 392 467 481 370 376 176 640 565 228 250 104 462 328 498 156 134 568 337
699C37j33J97J82m9k73N7k13K66m9k20K19j23M62r4L19k54m04J37j68J62O7j36
$$ 337 204 401 583 534 261 318 105 371 322 102 321 198 660 566 885 631 227 364 196 358 425 289
677B89N1K26k37j83KK73ol38J15L0K66p7k39J2o0o1O02k88q9O2o7K22k64J90K4
$$ 289 340 566 329 146 148 421 415 77 192 222 488 411 172 184 124 63 665 377 288 350 283 505 241 431 455
652D55k76R5J2O7L8k84J40R0K36l17m4L24j05j90N5j41J01J83K10l08n6N02Q1
$$ 455 179 274 286 353 391 107 247 337 573 256 212 536 431 241 296 155 256 439 649 341 285 787 868
629H68n90J81k43L6j6Q0k7j84P8q3K83M9o4p4K6K02j20p3k92R9K85l83J30J23
$$ 868 278 459 216 252 236 316 289 105 183 100 383 432 368 294 320 522 402 329 37 136 421 38 168 291
605B91R0l28J89J04o2q6R2K37j43L01k5k23l68N2J10M4k1j06K26j71J25L3J72
$$ 291 381 53 242 346 284 198 290 527 384 685 660 437 69 121 231 275 254 148 374 203 328 361 533
582E33m8k63L67l40K05J47k43J60j30k79L75j12K69j90k33J01l6m6L12k3k26j74
$$ 533 485 222 589 249 454 601 358 518 388 109 484 372 641 451 218 319 283 237 549 526 300 126
560A26n7R1L03k03K45l67r8J57L5K4J32J55R6n05K35lk85L87k37lj8J22L76k65
$$ 126 69 160 463 260 505 138 40 197 232 256 388 543 639 134 369 366 81 468 231 228 210 332 708 443
536D43K73K2j50m54L57j20K2j90K49j99qj98K14j09J67r9j50J71K33l51L7K62
$$ 443 716 738 588 134 491 371 393 203 452 253 245 47 261 152 319 220 70 241 474 123 160 422
514D22j78N2J62k7K07j79Q5K22n18j2j55L94q0K96n53O7M7j54J04J42K05L48o09
$$ 422 244 296 458 431 638 459 544 766 248 236 81 475 395 691 138 205 252 98 202 344 549 897 288
491B88k08K02J62J35m49K89j85J24j7J00k04J96j5j19r2M50k64k88J14k3O7n0
$$ 288 80 282 444 579 130 419 234 358 341 441 237 433 418 299 207 657 393 105 219 196 263 213
469B13K59kj20L42J153l86L579L028j568n290K32j200M49j73j10k28Q4j19L40
$$ 213 472 470 350 692 1845 1459 5038 8066 6498 1208 1440 240 689 516 406 178 262 143 483
450D83n4k09k4O0r4J35j19N08r1K78k56k02j4lr4%l3pL12N6J1n76J94K8K48k4
$$ 483 429 220 196 256 162 297 178 686 595 873 617 415 401 398 304 304 271 264 576 632 643 67 261 289 537 513
424E13N1k27k69L64k3k52R5m2J03K68J9n05L65P4m64M6N2l3K57j23L70m57J43
$$ 513 564 337 68 432 409 157 252 210 313 581 600 95 460 534 70 116 168 135 392 269 639 182 325
401C25j78R1J0O8l9k9j42J27J41Q2k55J34q7j92K84p7N2J13k43K65m4j09L22k84
$$ 325 147 238 248 316 277 248 106 233 374 456 201 335 248 56 340 263 315 428 185 450 406 297 619 335
377C35j21J23j62L82k76j31L17l36J44N36j99m51RR9j62j1M91n3Q4j1l69K45K61
$$ 335 214 337 175 557 281 150 467 131 275 811 612 161 170 269 107 96 587 534 618 607 238 483 744
354G44j90l74PJ0K23j74r0J73k02J73O4k98J61K13j66J71n6k36p1K69M4Q7J80
$$ 744 554 180 187 197 420 246 156 329 127 300 364 66 227 440 274 445 389 153 82 351 395 482 662
331F62Jj06l76K3M67l97M36L11R05j293J033m98n98m5l27P51n65M22p14J34K83
$$ 662 663 557 181 204 671 274 710 1021 1926 633 1666 1168 570 525 198 949 384 806 92 226 509
310E09k03M23n1L4j11m52NK37L18j25m15m9J41J02J40N4l22L5k23pJ28J14N8J41
$$ 509 306 729 678 712 601 149 154 391 709 584 169 120 261 363 503 557 235 270 47 40 168 282 340 481
286D81k73J27J36k2l59J77p2J98J72k26R6R2j03n8K23j72k34K08k02L13r5k61
$$ 481 208 335 471 449 90 267 195 393 565 339 435 527 424 366 589 417 183 391 189 502 407 146
264A46L08l37L51k8k32M0K05J67k69p3L31K74m17L94M17K93K697J2485M351P343
$$ 146 454 117 468 440 208 248 453 620 351 278 609 883 466 860 1277 1570 4267 16752 21103 28446
244B8446j1054q758n967k086n52P56l38L56k61M49o27j97M75J189K775N4k67N364
$$ 28446 17392 8634 2667 581 29 785 447 803 542 991 364 167 642 1831 4606 4660 4393 9757
226I757n353P32k536J100j32k35K746P39J209P164l573N4849J5993p6763J2503
$$ 9757 4404 5136 2600 3700 3568 3333 6079 6818 8027 15191 11618 66467 82460 5697 18200
211A8200j1216L517j958J392Q90n880K068k312k712M93q31q54N21k65p24J010
$$ 18200 6984 10501 8543 9935 10825 4945 7013 4701 1989 2482 1651 797 1318 1053 329 1339
195A339K609M573N424n353m277l688k96L72J21J55M90Q18p86K780j900j265M36
$$ 1339 3948 8521 13945 8592 4315 627 331 703 824 979 1469 2287 1501 4281 2381 1116 1552
178A552J028M449m923Q500L858j0233P489m590L21L982j854r65r9L295K1204n568
$$ 1552 2580 7029 2106 10606 14464 4231 11720 7130 7451 11433 9579 8614 8515 11810 33014 27446
162B7446j642M641j3701o644q283j329k24N88Rj36J228q95J652k282J367N45J042
$$ 27446 25804 30445 16744 10100 1817 488 264 852 861 725 1953 1058 2710 428 1795 2340 3382
145C382j339K960N55L20k686j297J250L053J174p97J0433j0685K038L567Q690
$$ 3382 2043 5003 5558 5878 3192 1895 3145 6198 7372 6575 17008 6323 8361 11928 20618
130B0618M3121K86206o8701k46462j2885n228n860n623K826m133r61J750l465
$$ 20618 63739 349945 281244 34782 21897 16669 10809 5186 8012 3879 2918 4668 1203
117A203J661J351J800m711L078k75J290l511L706J3484N520J5268J4974J5474
$$ 1203 2864 4215 6015 1304 4382 4107 5397 1886 5592 19076 24596 39864 54838 70312
103G0312O9564M6878M99399M051754j161044l237682l05032L9994j7959k0337
$$ 70312 139876 186754 686153 4737907 3576863 339181 34149 74143 56184 35847
93C5847J9247M1639L97893J055576k22249j209003q7519j8308n602p31k388p90
$$ 35847 55094 96733 494626 1550202 1327953 118950 31431 13123 7521 6790 4402 3612
81C612j999K026J617k794K151j676K46j171K29k14J91j376R10p99j27p8l86K89
$$ 3612 1613 3639 5256 2462 4613 2937 3183 2012 2241 2027 2218 842 1752 953 826 748 362 651
63F51P84q38M18m66Q59o64O67j98q4n20N71L046J0790n345q305P2N12j012m27
$$ 651 1435 597 1015 549 1408 744 1411 1213 1129 609 1180 4226 15016 9671 1366 1438 1950 938 511
44E11R8m88J507j436K93P1k42J48K94k55J292j54l97q94J97K0k32K84Q3m60L30
$$ 511 609 121 1628 192 485 556 314 462 756 501 1793 1639 1242 348 545 565 333 617 700 240 570
23E70k62N10l97K97p5j56r6MJ2J88k21R2J48r2K83n9j32M77p05P69Q6m90K50
$$ 570 308 818 421 718 643 487 391 395 407 595 374 466 614 522 805 746 614 1091 386 1155 1241 751 1001
0A001
$$ 1001
##PAGE= F1=253.5397161613
##FIRST=     6340.21289960861, 6666.66666666669, 542
##DATA TABLE= (F2++(Y..Y)), PROFILE
1023E42L58Q6k11K84r03Q20Oj55p62L02O67n03j27k92K06J69Q3j00l5j09K26l37
$$ 542 900 986 775 1059 156 976 982 827 65 367 1034 531 404 112 318 487 570 470 435 326 552 215
1001B15r4O7M71m58J27J16k35L97o1K3n08K82k6O55n52QK59J0J4l25J99j59K93
$$ 215 121 188 659 201 328 444 209 606 545 568 60 342 316 971 419 427 686 696 710 385 584 425 718
978G18k21k20k12M28l06K95K04m08L9j10oK71qj91j30OK27j60L22k70M51m3n45
$$ 718 497 277 65 493 187 482 686 278 317 207 201 472 464 273 143 149 376 216 538 268 719 676 131
955A31j00K07j1k00K16K49l60j2K8k2J04o4p0K88K7jj88K18m17L38j52mM6j93
$$ 131 31 238 227 27 243 492 132 120 148 126 230 166 96 384 411 410 222 440 23 361 209 205 251 58
931E8L66n6p1J05l07N77k70j75K14l1N8j31o1L01J54m5L15p2p14Q2o4PL50p0k32
$$ 58 424 368 297 402 95 672 402 227 441 410 468 337 276 577 731 686 1001 929 215 297 233 240 590 520 288
906B88K95l98J64k99M6J96P6l08K06N4k54L51k05nP6M48k87r4j21j18L20K73o61
$$ 288 583 185 349 50 96 292 368 60 266 320 66 417 212 207 283 731 444 350 229 111 431 704 43
883D3K18K41J77j82l10K72L40m09m5k22L83Q3m34L5K82l8k91L5P4K4K6p2M3O1
$$ 43 261 502 679 497 187 459 799 390 345 123 506 589 155 190 472 434 143 178 252 276 302 230 273 334
859C34j12p0M22k62J52k89j2J59K73j88k9R9l51J27K18j54L8L92K75m12k44k07
$$ 334 222 152 574 312 464 175 163 322 595 407 378 477 126 253 471 317 355 747 1022 610 366 159
837A59qK57k29M34k15j70K57j23k68J83J92k97K08P4l20J68O9k29K11J49r8J78
$$ 159 151 408 179 613 398 228 485 362 94 277 469 172 380 454 134 302 371 142 353 502 404 582
815E82k79%j13N1K28kJ65n46J96N61j42l91L43l25N2K25k49j74J57Po8K61j08
$$ 582 303 303 190 241 469 467 632 86 282 843 701 310 653 328 380 605 356 182 339 346 278 539 431
792D31k69O8M9n0Kj2j47N8L25J41l0j1k85O9M60k88k18J65Qk5K55m86K95k50M3
$$ 431 162 230 279 229 231 219 72 130 455 596 566 555 270 339 799 511 293 458 466 441 696 210 505 255 298
767B98O8j18M03l1j83k60p1N7K61k17J93n9J9j41L99J08J00m19j41K03l22L12
$$ 298 366 248 651 620 437 177 106 163 424 207 400 341 360 219 618 726 826 407 266 469 147 459
745D59k44p9K26j36Q8j28L6J30Pj33J11l03K09J33k97J15r7M2N7lJ25j30j8j18
$$ 459 215 136 362 226 314 186 222 352 359 226 337 34 243 376 79 194 97 139 196 193 318 188 170 52
721E2L73J73l09K59j76L9l7lK08m74N43r3l52P7j80N13k63J34m21K8L69j09K0
$$ 52 425 598 289 548 372 411 374 371 579 105 648 555 203 280 100 613 350 484 63 91 460 351 371
698C71j36K92jk59N5p1P7k5p2K44k88N13j3J35l04k75nm6J74J91j68R0J48m04
$$ 371 235 527 526 267 322 251 328 303 231 475 187 700 687 822 518 243 238 192 366 557 389 479 627 223
674B23o3J7L71j09l09Q0P7J41j04j91P1l4jN29j61j59J11j59J23n3J40n9l36Q8
$$ 223 160 177 548 439 130 210 287 428 324 133 204 170 169 698 537 378 489 330 453 400 540 481 145 233
650B33L0K30j25k94P2J28L14k80o6J91o0k44Q3K2O4L89jl41Q1M58qo26K95l88
$$ 233 263 493 368 74 146 274 588 308 242 433 373 129 212 234 298 687 686 345 426 884 876 250 545 157
626A57J58o9J87k40q0K3l0L56Q4n6j36j33K36r0K1k82M91J10n21N4l8J72l07J54
$$ 157 315 246 433 193 113 136 106 462 546 490 354 221 457 367 388 106 597 707 186 240 202 374 67 221
602B21K5Ln3J18J46j07K98oj82l27J05o3J25N5j89K29j18n2Q1J97j19k11L90m16
$$ 221 246 249 196 314 460 353 651 645 463 136 241 178 303 358 169 398 280 228 309 506 387 176 566 150
578A50K84l0j40J65p3j76L26j40L80k38k54L0j65J44K91J7k80n5j11N8K95l40
$$ 150 434 404 264 429 356 180 506 366 746 508 254 284 119 263 554 571 291 236 125 183 478 138
556A38M32m93J16J15Mk6K15M5R1n55K39J15m09K47m9k8j25L64L22k43J64R8k46
$$ 138 570 77 193 308 312 286 501 546 637 82 321 436 27 274 225 197 72 436 758 515 679 777 531
533E31l83L12Kq7k64L69j45j33p5Q5r9K31l9k42J56K71k49j72L56j87J3K01j49
$$ 531 148 460 462 375 111 480 335 202 127 212 113 344 305 63 219 490 241 69 425 238 251 452 303
510C03M6q7K57L00n51o2j56M84k4J56o11K27k7j88K27J17KM94n18l75J21oL81
$$ 303 349 262 519 819 268 206 50 534 510 666 55 282 255 67 294 411 413 907 389 14 135 129 510
487E10l59K07j24J63Qk4k68L69q5l8K5K00j35k37J5k1j19J05K37K8r8J05P78K74
$$ 510 151 358 234 397 405 381 113 482 397 359 384 584 449 212 227 206 87 192 429 457 359 464 1242 1516
463A516J328L809j943l681R4q94M00j30l55L7Q6m5J76Lk03Q2r0%J39J8L12j0J72
$$ 1516 2844 6653 4710 1029 1123 229 629 499 144 181 267 222 398 401 198 280 190 190 329 347 659 649 821
440H21l41k43L3M9p5N2J6n8M47N6j31n17J69R7J29L0Q3k64k70K74k6j34l2M9J7
$$ 821 480 237 270 319 244 296 312 254 701 757 626 109 278 375 504 534 617 353 83 357 331 197 165 214 231
415B31L56P2m19J72K3l67N9K32k61L36k24L34k84J27k76Q4K6O5kj09j3M8J58J20
$$ 231 587 659 240 412 435 68 127 359 98 434 210 544 260 387 111 195 221 286 284 175 162 210 368 488
391D88l68O2pn3J59j51J96n4p9K13Pj90L54m22R0j3q6M61m51J9L54m18J77M27
$$ 488 120 182 175 122 281 130 326 272 193 406 413 223 577 155 245 232 146 607 156 175 529 111 288 715
367G15q8l65j9k1p0K5L18K06j53o7m03L77J65qn32J59j49K89j65m1o8kK48p0j23
$$ 715 627 262 243 222 152 177 495 701 548 481 78 455 620 612 80 239 90 379 214 173 105 103 351 281 158
342A58K28J29k94R0R6k13J8K41O8p1J11j6J16n89l3N59l60J74J90J199p57M26
$$ 158 386 515 221 311 407 194 212 453 521 450 561 545 661 72 39 598 238 412 602 1801 1044 1470
320A470J60j095j41k38P44m19L25o61J18K61j61K04Q4L3O6m12j59J06N17j55n14
$$ 1470 1630 535 394 156 900 481 806 145 263 524 363 567 651 684 750 338 179 285 802 647 133
299A33m2K34j02M16j17k31q5j43oK57J0J00p8j75J69K03J71o44N8m9K29Q3k5J85
$$ 133 91 325 223 639 522 291 206 63 57 314 324 424 346 171 340 543 714 70 128 79 308 391 366 551
275E51K1k34J8M9P7k92LP0J30M9r9O0k53K28Q1k21J48L0J01k31R6K10j91J21J68
$$ 551 572 338 356 405 482 190 193 263 393 442 343 403 150 378 459 238 386 416 517 286 382 592 401 522 690
250F90K61L77M563J0375L717N140q556r459n277j342k92K69P4J29k7M09m52j46
$$ 690 951 1328 5891 16266 19983 25123 16567 7108 1831 489 197 466 540 669 642 1051 599 453
232D53O90Q43K238P9K016K919m695O86k592L70M15j444L767O52J07N133k937N8777
$$ 453 1143 1986 4224 4303 6319 9238 4543 5229 2637 3007 3422 1978 5745 6397 6504 11637 8700 67477
214F7477J9634q0931J1922j0317k784M155k908M597p258J515k6q60k09k118j037
$$ 67477 87111 6180 18102 7785 5001 9156 6248 10845 3587 5102 5076 4216 4007 1889 852
199H52k55j24O71J888L630L826O65n323k274k440q25L49n1m40K03J246j100L877
$$ 852 597 473 1144 3032 6662 10488 11153 5830 3556 1116 291 640 589 149 352 1598 498 4375
181D375j73L831o637L896N42j017O061L948j0406M775m246L806r53l615K73k622
$$ 4375 4202 8033 1396 5292 5834 4817 10878 14826 4420 9195 4949 8755 7802 4187 4460 1838
165A838K289J5500M351o317O012q960p630m395j787o7n69n4J569k12q73J475j21
$$ 1838 4127 19627 23978 17661 23673 14713 7083 2688 901 834 265 211 1780 1568 695 2170 2049
148B049r72L147j575K693j989N01K611l807J270J015K75L055Q323j371q30p819
$$ 2049 1077 4224 2649 5342 3353 3854 6465 2658 3928 4943 5218 8273 16596 15225 14395 6576
132F576M469j296L6960K51983o1570k00107k8450M919j1489K425L031j861O27
$$ 6576 11045 9749 46709 298692 237122 37015 8565 13484 1995 4420 7451 5590 6217
119F217j594J996n098R33J547k425N321k92O349o36N935R50K348Q977P604M675
$$ 6217 4623 6619 1521 2454 4001 1576 6897 6605 12954 12318 18253 19203 21551 30528 38132 42807
103D2807L663N1519M054M183154N30650m228709l44109j61341k5634j8506j3680
$$ 42807 46470 97989 102043 4285197 4815847 587138 243029 81688 56054 37548 23868
$$ [...]
0I56
##END NTUPLES=nD NMR SPECTRUM
##END=
