##TITLE=$$ Begin of the link block
##JCAMP-DX=5.00 $$ ACD/Spectrus 2012 v 14.01
##ORIGIN=
##OWNER=
##DATA TYPE=LINK
##BLOCKS=3
##TITLE=$$ Begin of the structure block
##JCAMP-CS=3.7 $$ ACD/Spectrus 2012 v 14.01
##ORIGIN=
##OWNER=
##BLOCK_ID=1
##ATOMLIST=
$$        AN        AS        NH
          1         C 
          2         C 
          3         C 
          4         C 
          5         C 
          6         C 
          7         N 
          8         H 
          9         H 
          10        H 
          11        H 
          12        H 
          13        C 
          14        O 
          15        C 
          16        O 
          17        H 
          18        H 
          19        H 
          20        H 
##BONDLIST=
$$        AN1       AN2       BT
          1         2         S
          1         3         D
          1         7         S
          2         4         D
          2         8         S
          3         5         S
          3         9         S
          4         6         S
          4         10        S
          5         6         D
          5         11        S
          6         16        S
          7         12        S
          7         13        S
          13        14        D
          13        15        S
          15        17        S
          15        18        S
          15        19        S
          16        20        S
##XY_RASTER=
$$        AN        X         Y         Z
          1         128       55
          2         128       92
          3         96        37
          4         96        110
          5         64        55
          6         64        92
          7         159       37
          8         159       110
          9         96        0
          10        96        147
          11        32        37
          12        159       0
          13        191       55
          14        191       92
          15        223       37
          16        32        110
          17        242       69
          18        205       5
          19        255       18
          20        0         92
##$MOLFILE=  $$ Empty String
  ACD/Labs03071414592D
  $$ Empty String
 20 20  0  0  0  0  0  0  0  0 21 V2000
  127.5000  -55.2091    0.0000 C   0  0  0  0  0  0  0  0  0  0  0  0
  127.5000  -92.0152    0.0000 C   0  0  0  0  0  0  0  0  0  0  0  0
   95.6250  -36.8061    0.0000 C   0  0  0  0  0  0  0  0  0  0  0  0
   95.6250 -110.4182    0.0000 C   0  0  0  0  0  0  0  0  0  0  0  0
   63.7500  -55.2091    0.0000 C   0  0  0  0  0  0  0  0  0  0  0  0
   63.7500  -92.0152    0.0000 C   0  0  0  0  0  0  0  0  0  0  0  0
  159.3750  -36.8061    0.0000 N   0  0  0  0  0  0  0  0  0  0  0  0
  159.3750 -110.4182    0.0000 H   0  0  0  0  0  0  0  0  0  0  0  0
   95.6250    0.0000    0.0000 H   0  0  0  0  0  0  0  0  0  0  0  0
   95.6250 -147.2243    0.0000 H   0  0  0  0  0  0  0  0  0  0  0  0
   31.8750  -36.8061    0.0000 H   0  0  0  0  0  0  0  0  0  0  0  0
  159.3750    0.0000    0.0000 H   0  0  0  0  0  0  0  0  0  0  0  0
  191.2500  -55.2091    0.0000 C   0  0  0  0  0  0  0  0  0  0  0  0
  191.2500  -92.0152    0.0000 O   0  0  0  0  0  0  0  0  0  0  0  0
  223.1250  -36.8061    0.0000 C   0  0  0  0  0  0  0  0  0  0  0  0
   31.8750 -110.4182    0.0000 O   0  0  0  0  0  0  0  0  0  0  0  0
  241.5280  -68.6811    0.0000 H   0  0  0  0  0  0  0  0  0  0  0  0
  204.7220   -4.9311    0.0000 H   0  0  0  0  0  0  0  0  0  0  0  0
  255.0000  -18.4031    0.0000 H   0  0  0  0  0  0  0  0  0  0  0  0
    0.0000  -92.0152    0.0000 H   0  0  0  0  0  0  0  0  0  0  0  0
  1  2  1  0  0  0  0
  1  3  2  0  0  0  0
  1  7  1  0  0  0  0
  2  4  2  0  0  0  0
  2  8  1  0  0  0  0
  3  5  1  0  0  0  0
  3  9  1  0  0  0  0
  4  6  1  0  0  0  0
  4 10  1  0  0  0  0
  5  6  2  0  0  0  0
  5 11  1  0  0  0  0
  6 16  1  0  0  0  0
  7 12  1  0  0  0  0
  7 13  1  0  0  0  0
 13 14  2  0  0  0  0
 13 15  1  0  0  0  0
 15 17  1  0  0  0  0
 15 18  1  0  0  0  0
 15 19  1  0  0  0  0
 16 20  1  0  0  0  0
M  ZZC   1 4
M  ZZC   2 3
M  ZZC   3 5
M  ZZC   4 2
M  ZZC   5 6
M  ZZC   6 1
M  ZZC   7 8
M  ZZC   8 3a
M  ZZC   9 5a
M  ZZC  10 2a
M  ZZC  11 6a
M  ZZC  12 8a
M  ZZC  13 9
M  ZZC  14 10
M  ZZC  15 11
M  ZZC  16 7
M  ZZC  17 11a
M  ZZC  18 11b
M  ZZC  19 11c
M  ZZC  20 7a
M  END
$$$$

##END=$$ End of the structure block
##TITLE=$$ Begin of the peaks block
##JCAMP-DX=5.00 $$ ACD/Spectrus 2012 v 14.01
##ORIGIN=
##OWNER=
##BLOCK_ID=2
##DATA TYPE=INFRARED SPECTRUM
##DATA CLASS=PEAK TABLE
##NPOINTS=26
##FIRSTX=683.00000000
##LASTX=3323.00000000
##MAXX=95.47423553
##MINX=61.61500931
##MAXY=0.00000000
##MINY=0.00000000
##XFACTOR=1.0000000000
##YFACTOR=1.000000000000000
##FIRSTY=64.73728180
##XUNITS=1/CM
##YUNITS=TRANSMITTANCE
##PEAK TABLE=(XY..XY)
683, 64.7373
712, 70.4992
796, 72.038
807, 66.4031
836, 67.4913
857, 90.1178
969, 85.4588
1015, 86.6017
1108, 84.2957
1172, 80.2554
1225, 62.1295
1235, 71.2451
1242, 69.4749
1259, 68.0299
1327, 76.8
1370, 75.1658
1435, 65.3709
1505, 61.615
1563, 66.3615
1609, 70.328
1651, 67.0745
2881, 95.4742
2931, 94.8295
3109, 84.957
3161, 84.406
3323, 87.0765
##END=$$ End of the peaks block
##TITLE=$$ Begin of the data block
##JCAMP-DX=5.00 $$ ACD/Spectrus 2012 v 14.01
##BLOCK_ID=3
##SPECTROMETER/DATA SYSTEM=PERKIN-ELMER Spectrum One IR
##DATE=14 May 2012 16:55:40
##DATA TYPE=INFRARED SPECTRUM
##DATA CLASS=XYDATA
##ORIGIN=Exported PE Spectrum Data File
##OWNER=Admin
##NPOINTS=3351
##FIRSTX=650.00000000
##LASTX=4000.00000000
##MAXX=4000.00000000
##MINX=650.00000000
##MAXY=101.22921753
##MINY=61.61500931
##XFACTOR=1.0000000000
##YFACTOR=0.000001000000000
##FIRSTY=75.19227600
##DELTAX=1.00000000
##XUNITS=1/CM
##YUNITS=TRANSMITTANCE
##XYDATA=(X++(Y..Y))
$$ plain form
650 75192276 75526230 75922928 76225830 76296104 76142647 75828094 75395325 74987808 74403831 73920990
660 73920990 73537155 73062843 72593849 72125664 71683540 71204582 70612961 69902878 69284798 68857224
670 68857224 68486382 68082207 67635239 67167511 66712639 66294205 65920074 65591270 65307938 65069000
680 65069000 64877068 64752922 64737282 64860054 65111382 65462311 65910629 66479813 67172073 67956894
690 67956894 68801666 69678627 70556931 71418671 72269135 73109093 73908379 74627716 75250229 75771194
700 75771194 76180283 76473244 76660316 76735687 76635338 76239716 75438354 74235710 72834579 71587669
710 71587669 70792633 70499237 70541100 70761292 71149811 71744911 72493462 73275696 74005043 74634621
720 74634621 75113815 75415230 75576035 75657120 75686699 75674797 75655945 75678764 75763626 75901764 76084045
$$ packed form
650G5192276L33954L96698L02902P0274j53457l14553m32769m07517n83977m82841
660G3920990l83835m74312m68994m68185m42124m78958n91621p10083o18080m27574
670F8857224l70842m04175m46968m67728m54872m18434l74131l28804k83332k38938
680F5069000j91932j24146j5640J22772K51328L50929M48318N69184O92260P84821
690F7956894Q44772Q76961Q78304Q61740Q50464Q39958P99286P19337O22513N20965
700G5771194M09089K92961J87072P5371j00349l95622q01362j202644j401131j246910
710G1587669p95036k93396M1863K20192L88519N95100P48551P82234P29347O29578
720G4634621M79194L01415J60805Q1085K9579j1902j8852K2819Q4862J38138J82281
$$ plain form
731 76084045 76305168 76555748 76839104 77181282 77595108 78050842 78511772 78981689 79486603 80025368
741 80025368 80571465 81111969 81652565 82191666 82718620 83231392 83731613 84209496 84655228 85075630
751 85075630 85478302 85849274 86167992 86438591 86687157 86932327 87175087 87412148 87641838 87858253
761 87858253 88053879 88228188 88384850 88523354 88640793 88739609 88828041 88914398 89001732 89083694 89147316
772 89147316 89187279 89215118 89243469 89262680 89246078 89178413 89065369 88914818 88723907 88486832 88199089
783 88199089 87847549 87406982 86849525 86143471 85237160 84058296 82545502 80688431 78551758 76293991
793 76293991 74195396 72649139 72037987 72528038 73935852 75763290 77382927 78269867 78097252
802 78097252 76681625 74061455 70785599 67891327 66403145 66902428 69363174 73165749 77366959
$$ packed form
731G6084045K21123K50580K83356L42178M13826M55734M60930M69917N04914N38765
741H0025368N46097N40504N40596N39101N26954N12772N00221M77883M45732M20402
751H5075630M02672L70972L18718K70599K48566K45170K42760K37061K29690K16415
761H7858253J95626J74309J56662J38504J17439R8816Q8432Q6357Q7334Q1962O3622
772H9147316L9963K7839K8351J9211j6602o7665j13044j50551j90911k37075k87743
783H8199089l51540m40567n57457p06054r06311j178864j512794j857071k136673k257767
793G6293991k098595j546257o11152M90051J407814J827438J619637Q86940j72615
802G8097252j415627k620170l275856k894272j488182M99283K460746L802575M201210
$$ plain form
811 77366959 81132111 84034668 86065361 87437561 88375648 89024841 89476143 89796013 90009010 90090622
821 90090622 90011971 89780418 89421387 88946220 88348038 87584244 86553375 85131477 83227509 80782982
831 80782982 77785637 74396942 71090706 68578239 67491302 68092819 70268105 73690315 77896690
840 77896690 82287613 86245827 89363617 91561066 92994064 93876877 94379486 94618050 94665115 94550621
850 94550621 94272064 93813126 93158188 92318489 91384583 90561539 90117783 90251129 90964928 92052322
860 92052322 93211029 94204903 94948067 95473038 95849136 96128731 96341347 96508301 96650169 96781410
870 96781410 96903122 97006744 97087708 97151237 97201233 97231819 97240021 97240829 97256195 97289734 97323891 97342552
882 97342552 97346428 97345879 97348099 97353737 97358749 97356247 97341248 97315994 97287834 97261185 97234520 97205566 97176788 97155426
$$ packed form
811G7366959L765152K902557K030693J372200R38087O49193M51302L19870K12997Q1612
821I0090622p8651k31553l59031m75167n98182p63794j030869j421898j903968k444527
831H0782982k997345l388695l306236k512467j086937O01517K175286L422210M206375
840G7896690M390923L958214L117790K197449J432998Q82813N02609K38564M7065j14494
850I4550621k78557m58938o54938q39699r33906q23044m43756J33346P13799J087394
860I2052322J158707R93874P43164N24971L76098K79595K12616J66954J41868J31241
870I6781410J21712J03622Q0964O3529M9996L0586Q202Q08J5366L3539L4157J8661
882I7342552L876n49K220N638N012k502j4999k5254k8160k6649k6665k8954k8778k1362
$$ plain form
896 97155426 97148186 97153114 97155685 97138611 97099228 97051773 97008209 96964272 96911385 96854652 96808418 96778511 96759621
909 96759621 96746681 96736786 96721924 96693398 96655144 96621681 96600105 96581779 96551811 96496758 96401909 96255188
921 96255188 96064796 95870003 95727020 95680893 95747032 95908791 96123817 96338318 96507973 96613853 96663124
932 96663124 96676498 96672226 96657784 96633987 96604080 96575737 96554001 96535477 96510536 96469765 96409584 96335289
944 96335289 96257393 96180763 96098663 96001396 95884850 95742218 95557701 95330200 95102692 94940483 94864273
955 94864273 94818115 94717445 94516518 94214569 93810570 93273712 92552864 91599998 90397346 88996284
965 88996284 87550171 86304619 85534889 85458839 86160446 87537109 89299057 91071793 92563324
974 92563324 93659714 94389977 94838890 95093201 95225655 95286926 95302940 95285454 95242508 95175964 95080650
$$ packed form
896I7155426p240M928K571j7074l9383m7455m3564m3937n2887n6733m6234k9907j8890
909I6759621j2940r895j4862k8526l8254l3463k1576j8326k9968n5053r4849j46721
921I6255188j90392j94793j42983m6127O6139J61759K15026K14501J69655J05880M9271
932I6663124J3374m272j4442k3797k9907k8343k1736j8524k4941m0771o0181p4295
944I6335289p7896p6630q2100r7267j16546j42632j84517k27501k27508j62209p6210
955I4864273m6158j00670k00927l01949m03999n36858p20848r52866j202652j401062
965H8996284j446113j245552p69730p6050P01607J376663J761948J772736J491531
974I2563324J096390P30263M48913K54311J32454O1271J6014j7486m2946o6544r5314
$$ plain form
985 95080650 94956787 94818237 94680351 94544289 94400398 94242104 94068924 93881050 93679672 93469742
995 93469742 93253517 93023300 92768471 92488487 92191299 91879585 91546127 91183205 90791344 90382370
1005 90382370 89983696 89634712 89356964 89115227 88821976 88401497 87859848 87294495 86839584 86601738
1015 86601738 86629440 86915634 87413628 88050835 88742554 89413643 90014900 90517815 90902847 91162239
1025 91162239 91304886 91346375 91300507 91190117 91058197 90955406 90917671 90962982 91102379 91338676 91656013
1036 91656013 92026276 92426201 92835175 93222733 93560982 93850410 94114326 94365425 94593430 94786346
1046 94786346 94946571 95081024 95190536 95276703 95346397 95402512 95443604 95475822 95511169 95552834 95592392
1057 95592392 95620285 95631203 95621666 95592148 95552811 95518799 95497879 95487480 95482422 95478035 95467842 95448090 95424843
$$ packed form
985I5080650j23863j38550j37886j36062j43891j58294j73180j87874k01378k09930
995I3469742k16225k30217k54829k79984k97188l11714l33458l62922l91861m08974
1005I0382370l98674l48984k77748k41737k93251m20479n41649n65353m54911k37846
1015H6601738K7702K86194M97994O37207O91719O71089O01257N02915L85032K59392
1025I1162239J42647M1489m5868j10390j31920j02791l7735M5311J39397K36297L17337
1036I1656013L70263L99925M08974L87558L38249K89428K63916K51099K28005J92916
1046I4786346J60225J34453J09512Q6167O9694N6115M1092L2218L5347M1665L9558
1057I5592392K7893J0918r537k9518l9337l4012k0920j0399n058m387j0193j9752k3247
$$ plain form
1070 95424843 95407585 95394661 95373405 95336128 95289162 95244606 95208473 95176811 95138885 95086105 95022850 94964836
1082 94964836 94920517 94877686 94816841 94735512 94651222 94581841 94529144 94477867 94403328 94286324 94131393 93964294
1094 93964294 93799332 93614075 93367340 93035843 92616791 92097252 91438225 90592308 89530647 88263947
1104 88263947 86874298 85554787 84599861 84295715 84766113 85906197 87439323 89029030 90400833
1113 90400833 91424881 92105507 92508598 92703674 92745880 92675941 92528389 92350784 92212898 92178894
1123 92178894 92263573 92429359 92632141 92853729 93085075 93301941 93474411 93590515 93659378 93697723 93719070
1134 93719070 93728371 93719566 93682617 93616623 93530426 93430191 93316681 93197754 93090645 93003136 92922478 92833405
1146 92833405 92737671 92643898 92546242 92427513 92279793 92109772 91928223 91746925 91581818 91442764 91319901
$$ packed form
1070I5424843j7258j2924k1256l7277m6966m4556l6133l1662l7926n2780o3255n8014
1082I4964836m4319m2831o0845q1329q4290o9381n2697n1277p4539j17004j54931j67099
1094I3964294j64962j85257k46735l31497m19052n19539o59027q45917j061661j266700
1104H8263947j389649j319511r54926l04146M70398J140084J533126J589707J371803
1113I0400833J024048O80626M03091J95076M2206o9939j47552j77605j37886l4004
1123I2178894Q4679J65786K02782K21588K31346K16866J72470J16104O8863L8345K1347
1134I3719070R301q805l6949o5994q6197j00235j13510j18927j07109q7509q0658q9073
1146I2833405r5734r3773r7656j18729j47720j70021j81549j81298j65107j39054j22863
$$ plain form
1157 91319901 91192001 91044899 90869553 90650612 90375359 90047020 89666809 89204964 88602997 87781662
1167 87781662 86619225 84991379 82983307 81122253 80255356 80980812 83122574 85799431 88047295
1176 88047295 89409485 89993599 90119759 90031754 89854332 89647964 89431267 89194336 88932785 88661438
1186 88661438 88390915 88114014 87824608 87530800 87239182 86941475 86625496 86287193 85923836 85525711
1196 85525711 85082901 84593246 84058418 83479317 82859543 82206108 81520470 80793549 80015869 79191032
1206 79191032 78334915 77463005 76582680 75696571 74804726 73900101 72973907 72034950 71112160 70223358
1216 70223358 69348579 68446785 67488510 66461411 65368622 64257622 63247311 62495308 62129452
1225 62129452 62217030 62767910 63722157 64954163 66330223 67746277 69089973 70206940 70947594
$$ packed form
1157I1319901j27900j47102j75346k18941k75253l28339l80211m61845o01967q21335
1167H7781662j162437j627846k008072j861054q66897P25456K141762K676857K247864
1176H8047295J362190N84114J26160q8005j77422k06368k16697k36931k61551k71347
1186H8661438k70523k76901k89406k93808k91618k97707l15979l38303l63357l98125
1196H5525711m42810m89655n34828n79101o19774o53435o85638p26921p77680q24837
1206G9191032q56117q71910q80325q86109q91845r04625r26194r38957r22790q88802
1216G0223358q74779r01794r58275j027099j092789j111000j010311p52003l65856
1225F2129452Q7578N50880R54247J232006J376060J416054J343696J116967P40654
$$ plain form
1234 70947594 71245094 71149048 70803467 70386604 70031555 69771675 69578026 69474869 69592865 70069626
1244 70069626 70906876 71952858 73001419 73879326 74478851 74760590 74729767 74395889 73755135 72814705
1254 72814705 71631737 70332024 69110313 68233826 68029861 68798485 70670784 73539444 77099213
1263 77099213 80918320 84535118 87594940 89940704 91595146 92684486 93364258 93766205 93978050
1272 93978050 94059006 94058777 94009048 93905319 93717751 93432327 93085152 92761108 92556786 92529305 92662506
1283 92662506 92875443 93072632 93195198 93231346 93194984 93106773 92984573 92834801 92650772 92423943 92153992
1294 92153992 91846008 91506371 91148781 90799210 90486221 90227692 90030624 89898079 89827759 89803780
1304 89803780 89798157 89780640 89722496 89596794 89389130 89106110 88761848 88358955 87888107 87345177 86737518
$$ packed form
1234G0947594K97500r6046l45581m16863l55049k59880j93649j03157J17996M76761
1244G0069626Q37250J045982J048561Q77907N99525K81739l0823l33878o40754r40430
1254G2814705j182968j299713j221711q76487k03965P68624J872299K868660L559769
1263G7099213L819107L616798L059822K345764J654442J089340O79772M01947K11845
1272I3978050Q0956k29m9729j03729j87568k85424l47175l24044k04322k7481J33201
1283I2662506K12937J97189J22566L6148l6362q8211j22200j49772j84029k26829k69951
1294I2153992l07984l39637l57590l49571l12989k58529j97068j32545p0320k3979
1304H9803780n623j7517n8144j25702k07664k83020l44262m02893m70848n42930o07659
$$ plain form
1315 86737518 86070793 85341843 84553551 83729309 82897743 82060760 81189331 80251778 79245529 78227463
1325 78227463 77340050 76799988 76819801 77506660 78816353 80567482 82489151 84312965 85873993
1334 85873993 87128883 88100449 88833076 89382484 89798401 90091293 90246750 90275337 90204880 90048164
1344 90048164 89808044 89494522 89125328 88711807 88254494 87754333 87219734 86656219 86057884 85415787
1354 85415787 84728989 84006592 83253532 82473602 81680313 80889702 80107796 79337868 78594177 77893394
1364 77893394 77238060 76625252 76070549 75615089 75305725 75165756 75186340 75351685 75681396 76219719
1374 76219719 76925919 77675873 78437698 79299660 80315849 81416862 82492020 83495079 84402855
1383 84402855 85168961 85788719 86337189 86876183 87340935 87643005 87811356 87906143 87940521 87919937 87876556
$$ packed form
1315H6737518o66725p28950p88292q24242q31566q36983q71429r37553j006249j018066
1325G8227463q87413n40062J9813O86859J309693J751129J921669J823814J561028
1334H5873993J254890R71566P32627N49408M15917K92892J55457K8587p0457j56716
1344I0048164k40120l13522l69194m13521m57313n00161n34599n63515n98335o42097
1354H5415787o86798p22397p53060p79930p93289p90611p81906p69928p43691p00783
1364G7893394o55334o12808n54703m55460l09364j39969K0584J65345L29711N38323
1374G6219719P06200P49954P61825Q61962J016189J101013J075158J003059R07776
1383H4402855P66106O19758N48470N38994M64752L02070J68351R4787L4378k0584m3381
$$ plain form
1394 87876556 87827141 87730919 87571640 87398079 87226654 87016022 86758224 86493675 86229111 85927856
1404 85927856 85571106 85189392 84812805 84423973 83995613 83518143 82984535 82395744 81766792 81106659
1414 81106659 80408653 79675354 78916710 78083992 77062920 75910126 74848061 73903839 72953323 71945724
1424 71945724 70943497 70022430 69189201 68432098 67752213 67131302 66563560 66109314 65789925 65546715
1434 65546715 65370934 65404953 65705093 65994690 66128677 66300415 66675491 67251595 67980247 68869682
1444 68869682 69927612 71139214 72600006 74452606 76515701 78375999 79935638 81375656 82706673
1453 82706673 83785156 84648811 85637238 87032379 88306099 88903114 89135231 89270798 89347092 89420708
1463 89420708 89557716 89741951 89837883 89822411 89772903 89705490 89597420 89467674 89394463 89376831 89289299
$$ packed form
1394H7876556m9415r6222j59279j73561j71425k10632k57798k64549k64564l01255
1404H5927856l56750l81714l76587l88832m28360m77470n33608n88791o28952o60133
1414H1106659o98006p33299p58644q32718j021072j152794j062065r44222r50516j007599
1424G1945724j002227r21067q33229p57103o79885o20911n67742m54246l19389k43210
1434F5546715j75781L4019L00140K89597J33987J71738L75076N76104P28652Q89435
1444F8869682J057930J211602J460792J852600K063095J860298J559639J440018J331017
1453H2706673J078483Q63655R88427J395141J273720N97015K32117J35567P6294P3616
1463H9420708J37008J84235R5932j5472m9508o7413j08070j29746p3211j7632q7532
$$ plain form
1474 89289299 89134987 88994514 88837593 88614304 88346275 88071609 87766167 87381577 86932938 86468910
1484 86468910 85974838 85394653 84727570 84030296 83310898 82459549 81461571 80486259 79587311 78644150
1494 78644150 77507660 76040253 74197388 72146744 70121796 68253197 66572563 65055878 63674469
1503 63674469 62463364 61615009 61715363 63985062 67668800 70300705 71888573 73062820 73886719
1512 73886719 74361183 74569908 74856079 75811020 77872696 80386353 82439049 84162262 86204079
1521 86204079 88429337 89864944 90427910 90681030 90862709 90986732 91032112 90984863 90838860 90632210
1531 90632210 90423378 90209152 89899582 89517593 89201645 88954247 88682251 88285210 87713806 86998810
1541 86998810 86243263 85552193 84866585 84054245 83145447 82291130 81491196 80567863 79397308 78141098
$$ packed form
1474H9289299j54312j40473j56921k23289k68029k74666l05442l84590m48639m64028
1484H6468910m94072n80185o67083o97274p19398q51349r97978r75312q98948r43161
1494G8644150j136490j467407j842865k050644k024948j868599j680634j516685j381409
1503F3674469j211105q48355J00354K269699L683738K631905J587868J174247Q23899
1512G3886719M74464K08725K86171R54941K061676K513657K052696J723213K041817
1521H6204079K225258J435607N62966K53120J81679J24023M5380m7249j46003k06650
1531I0632210k08832k14226l09570l81989l15948k47398k71996l97041n71404p14996
1541H6998810p55547o91070o85608q12340r08798q54317p99934r23333j170555j256210
$$ plain form
1551 78141098 77026833 75970490 74727554 73326897 72085136 71136780 70228027 68996613 67722969
1560 67722969 66919121 66476944 66361481 66748680 67631348 68727089 69867493 71299660 73517570
1569 73517570 76543030 79405594 81421730 82884590 84258835 85904800 88036865 90208336 91622734
1578 91622734 92270630 92606461 92912132 93221527 93437218 93519798 93519325 93458389 93302910 93050438 92751221
1589 92751221 92418831 92016335 91535187 90999550 90390358 89645035 88743370 87721123 86601723 85387001
1599 85387001 84087379 82696152 81172905 79504280 77738525 75921249 74088554 72378342 71047455
1608 71047455 70328011 70349274 71131744 72499687 74118866 75789139 77628006 79950806 82605873
1617 82605873 84621925 85531120 85778236 85794762 85734879 85623428 85499237 85434250 85450821 85514061 85556702
$$ packed form
1551G8141098j114265j056343j242936j400657j241761r48356r08753j231414j273644
1560F7722969q03848m42177j15463L87199Q82668J095741J140404J432167K217910
1569G3517570L025460K862564K016136J462860J374245J645965K132065K171471J414398
1578I1622734O47896L35831L05671L09395K15691Q2580m73o0936j55479k52472k99217
1589I2751221l32390m02496m81148n35637o09192p45323r01665j022247j119400j214722
1599H5387001j299622j391227j523247j668625j765755j817276j832695j710212j330887
1608G1047455p19444K1263P82470J367943J619179J670273J838867K322800K655067
1617H2605873K016052R09195K47116J6526n9883j11451j24191o4987J6571O3240M2641
$$ plain form
1628 85556702 85472740 85191071 84739609 84196663 83626961 83044952 82400307 81634018 80805008 80038567
1638 80038567 79342903 78639465 77860367 76980904 76050018 75125816 74165985 72976891 71388000 69712685
1648 69712685 68437820 67580261 67074547 67084770 68295448 70573059 72052612 72830025 73662842 74757675
1658 74757675 76133194 77716049 79531837 81735008 84308929 86721931 88517746 89802979 90879204
1667 90879204 91993500 93270386 94567223 95547684 96149994 96572372 96960526 97361198 97734024 98014168
1677 98014168 98213478 98363342 98490128 98612160 98741318 98903511 99149963 99413864 99550804 99601776
1687 99601776 99608856 99619637 99655533 99694954 99738403 99811729 99922356 100031555 100090874 100107918 100126167 100155472
1699 100155472 100184807 100175926 100139618 100142624 100156212 100165344 100165802 100154938 100172188 100216202 100241119 100234459 100223465
$$ packed form
1628H5556702q3962k81669m51462n42946n69702n82009o44645p66289q29010p66441
1638H0038567o95664p03438p79098q79463r30886r24202r59831j189094j588891j675315
1648F9712685j274865q57559n05714J0223J210678K277611J479553P77413Q32817J094833
1658G4757675J375519J582855J815788K203171K573921K413002J795815J285233J076225
1667I0879204J114296J276886J296837R80461O02310M22378L88154M00672L72826K80144
1677I8014168J99310J49864J26786J22032J29158J62193K46452K63901J36940N0972
1687I9601776P080J0781L5896L9421M3449P3326J10627J09199N9319J7044J8249K9305
1699A00155472K9335q881l6308L006J3588R132M58j0864J7250M4014K4917o660j0994
$$ plain form
1712 100223465 100229362 100245926 100265549 100310287 100393906 100437256 100369095 100279778 100242569 100230309 100215416 100199516
1724 100199516 100193527 100191315 100177223 100151360 100118568 100086014 100075325 100122711 100246773 100392128 100426674 100365379
1736 100365379 100328011 100316162 100308853 100294350 100266556 100237373 100206711 100179398 100167633 100166969 100158180 100136200 100118034
1749 100118034 100123878 100144073 100151794 100145889 100130783 100100807 100052528 99993500 99944382 99933495 99962860 100008278
1761 100008278 100040466 100042274 100044937 100073555 100110428 100130348 100132126 100139046 100177361 100248283 100330719 100383636 100387672
1774 100387672 100373337 100354118 100333672 100324562 100327522 100328102 100316734 100298904 100289162 100292198 100291237 100278229 100260933
1787 100260933 100254440 100263062 100280312 100305641 100340958 100366310 100365257 100357880 100364998 100386406 100408798 100416344 100407166
1800 100407166 100384811 100347122 100309380 100304031 100333359 100369675 100386452 100384384 100376915 100363869 100342041 100325508
$$ packed form
1712A00223465N897J6564J9623M4738Q3619M3350o8161q9317l7209j2260j4893j5900
1724A00199516n989k212j4092k5863l2792l2554j0689M7386J24062J45355L4546o1295
1736A00365379l7368j1849p309j4503k7794k9183l0662k7313j1765o64q789k1980j8166
1749A00118034N844K0195P721n905j5106k9976m8279n9028m9118j0887K9365M5418
1761A00008278L2188J808K663K8618L6873J9920J778O920L8315P0922Q2436N2917M036
1774A00387672j4335j9219k0446r110K960N80j1368j7830r742L036r61j3008j7296
1787A00260933o493Q622J7250K5329L5317K5352j053p377P118K1408K2392P546r178
1800A00407166k2355l7689l7742n349K9328L6316J6777k068p469j3046k1828j6533
$$ plain form
1812 100325508 100328125 100338745 100342514 100343979 100349113 100349884 100333496 100304245 100276062 100250229 100220551 100182877 100138031
1825 100138031 100095177 100075226 100088028 100112900 100120918 100105545 100100998 100126381 100153290 100162735 100166733 100181213 100194450
1838 100194450 100179955 100137711 100093445 100063187 100049286 100046616 100035156 99994095 99928101 99854683 99792999 99754501
1850 99754501 99739388 99746529 99773781 99811920 99853653 99900345 99958504 100019348 100067032 100103264 100137550 100161781
1862 100161781 100159103 100132080 100099068 100068108 100032188 99987045 99934677 99873032 99809357 99753151 99691757 99608406
1874 99608406 99510536 99429543 99390144 99387299 99405640 99448067 99523361 99618935 99707634 99777710 99840950 99906670
1886 99906670 99965736 100004730 100017120 100006050 99991768 100002609 100037048 100058105 100034981 99976059 99910820 99848610
1898 99848610 99779137 99701065 99625412 99560822 99518463 99515823 99562393 99643631 99734879 99829697 99930336 100016197
$$ packed form
1812A00325508K617J0620L769J465N134P71j6388k9251k8183k5833k9678l7674m4846
1825A00138031m2854j9951J2802K4872Q018j5373m547K5383K6909R445L998J4480J3237
1838A00194450j4495m2244m4266l0258j3901k670j1460m1061o5994p3418o1684l8498
1850I9754501j5113P141K7252L8139M1733M6692N8159O0844M7684L6232L4286K4231
1862A00161781k678k7023l3012l0960l5920m5143n2368o1645o3675n6206o1394q3351
1874I9608406r7870q0993l9399k845J8341M2427P5294R5574Q8699P0076O3240O5720
1886I9906670N9066L8994J2390j1070j4282J0841L4439K1057k3124n8922o5239o2210
1898I9848610o9473p8072p5653o4590m2359k640M6570Q1238R1248R4818J00639Q5861
$$ plain form
1910 100016197 100063362 100077026 100079979 100083817 100089699 100101494 100115959 100114578 100089996 100070175 100077774 100096146 100108078
1923 100108078 100128296 100175224 100228432 100248878 100231384 100204605 100180428 100144218 100089035 100038849 100026726 100062981
1935 100062981 100127495 100173630 100156601 100076141 99980331 99918167 99901321 99914673 99952133 100018707 100097282 100151421
1947 100151421 100162254 100140022 100105110 100075241 100060936 100052444 100021469 99959656 99902191 99885208 99900833 99918968
1959 99918968 99933380 99953125 99962143 99929298 99856964 99786247 99756241 99776184 99825294 99863861 99857651 99809052
1971 99809052 99759369 99745110 99756081 99755783 99731010 99694298 99654640 99620110 99612366 99640579 99673012 99671066 99643082
1984 99643082 99636482 99676102 99740158 99793999 99820969 99823059 99817360 99834015 99887222 99943932 99952255 99898056 99820236
1997 99820236 99779114 99806419 99877541 99931877 99925133 99868362 99809013 99777817 99767128 99764343 99775986 99799416
$$ packed form
1910A00016197M7165J3664K953L838N882J1795J4465j381k4582j9821P599J8372J1932
1923A00108078K0218M6928N3208K0446j7494k6779k4177l6210n5183n0186j2123L6255
1935A00062981O4514M6135j7029q0460r5810o2164j6846J3352L7460O6574P8575N4139
1947A00151421J0833k2232l4912k9869j4305q492l0975o1813n7465j6983J5625J8135
1959I9918968J4412J9745R018l2845p2334p0717l0006J9943M9110L8567o210m8599
1971I9809052m9683j4259J0971k98k4773l6712l9658l4530p744K8213L2433j946k7984
1984I9643082o600L9620O4056N3841K6970K090n699J6655N3207N6710Q323n4199p7820
1997I9820236m1122K7305P1122N4336o744n6771n9349l1196j0689k785J1643K3430
$$ plain form
2009 99799416 99806023 99779938 99746910 99736130 99738358 99729233 99712456 99708977 99718338 99722084 99711937 99683510 99624405
2022 99624405 99539383 99465553 99431412 99417702 99388245 99344475 99320236 99338867 99398735 99484444 99564575 99600807
2034 99600807 99592896 99591812 99635368 99696373 99727364 99727936 99726891 99721481 99684517 99623474 99583534 99591331 99629494
2047 99629494 99668259 99695419 99713646 99730469 99752136 99773331 99779907 99773331 99778175 99807480 99835922 99829918 99792038
2060 99792038 99751915 99726456 99718063 99740463 99809113 99903625 99975021 99999512 99996582 99993080 99993767 99987747 99964905
2073 99964905 99923515 99876640 99849594 99855118 99874123 99876038 99857086 99841347 99846924 99870651 99903610 99940399 99971558
2086 99971558 99987686 99996727 100019623 100062813 100108711 100138252 100148026 100140594 100116020 100081795 100056709 100052238 100057442
2099 100057442 100051369 100025826 99990059 99958405 99939148 99934021 99942909 99964622 99991318 100004951 99988045 99942764
$$ packed form
2009I9799416O607k6085l3028j0780K228r125j6777l479R361L746j0147k8427n9105
2022I9624405q5022p3830l4141j3710k9457m3770k4239J8631N9868Q5709Q0131L6232
2034I9600807p911j084M3556O1005L0991N72j045n410l6964o1043l9940P797L8163
2047I9629494L8765K7160J8227J6823K1667K1195O576o576M844K9305K8442o004l7880
2060I9792038m0123k5459q393K2400O8650R4512P1396K4491k930l502O87o020k2842
2073I9964905m1390m6875k7046N524J9005J915j8952j5739N577K3727L2959L6789L1159
2086I9971558J6128R041K2896M3190M5898K9541R774p432k4574l4225k5086m471N204
2099A00057442o073k5543l5767l1654j9257n127Q888K1713K6696J3633j6906m5281
$$ plain form
2111 99942764 99892876 99861099 99849762 99848274 99851723 99862564 99878929 99892799 99900513 99908180 99926270 99961708 100011551
2124 100011551 100059464 100083588 100075775 100051483 100035667 100041199 100063141 100088097 100103851 100104416 100090736 100063904 100020576
2137 100020576 99966141 99928192 99934036 99968849 99979507 99936188 99871597 99840164 99855156 99885742 99900070 99885056
2149 99885056 99835266 99755203 99672752 99624809 99623817 99651878 99685349 99707253 99697884 99639938 99543442 99448029 99391533
2162 99391533 99385025 99416321 99466690 99526878 99604568 99710098 99827660 99910889 99921501 99869713 99806984 99780975
2174 99780975 99798508 99825912 99823883 99787659 99752075 99748955 99765022 99757149 99707199 99641510 99595245 99583237 99608353
2187 99608353 99667709 99736320 99770782 99750679 99701889 99664909 99657166 99675720 99713333 99753532 99769829 99753151
2199 99753151 99726425 99711258 99694626 99652054 99592606 99555298 99565521 99614487 99677155 99730011 99753693 99741531
$$ packed form
2111I9942764m9888l1777j1337j488L449J0841J6365J3870P714P667J8090L5438M9843
2124A00011551M7913K4124p813k4292j5816N532K1942K4956J5754N65j3680k6832m3328
2137A00020576n4435l7949N844L4813J0658m3319o4591l1433J4992L0586J4328j5014
2149I9885056m9790q0063q2451m7943r92K8061L3471K1904r369n7946r6496r5413n6496
2162I9391533o508L1296N0369O0188P7690J05530J17562Q3229J0612n1788o2729k6009
2174I9780975J7533K7404k029l6224l5584l120J6067p873m9950o5689m6265j2008K5116
2187I9608353N9356O8611L4462k0103m8790l6980p743J8554L7613M0199J6297j6678
2199I9753151k6726j5167j6632m2572n9448l7308J0223M8966O2668N2856K3682j2162
$$ plain form
2211 99741531 99711067 99693108 99704498 99737610 99773773 99797791 99803658 99798698 99801559 99824715 99856514 99867599 99838020
2224 99838020 99776260 99714050 99683685 99694138 99724525 99743607 99738663 99723648 99721153 99743263 99787231 99836594
2236 99836594 99863152 99841698 99773354 99689232 99626953 99607574 99631699 99684219 99739845 99776245 99789474 99790146
2248 99790146 99784927 99773987 99766891 99781784 99819916 99853401 99849617 99802490 99735283 99684044 99679520 99730156 99811211
2261 99811211 99880341 99911476 99908516 99888046 99863197 99847160 99849396 99860138 99856979 99837280 99826675 99841370 99859436
2274 99859436 99847778 99806747 99769997 99766159 99793076 99825493 99834991 99810181 99767288 99739288 99746590 99780899 99820030
2287 99820030 99849396 99864235 99861259 99843842 99827087 99827446 99844604 99864868 99874695 99868401 99846504 99818878 99803627
2300 99803627 99809868 99828072 99837975 99833008 99820175 99813461 99821022 99843124 99862823 99855995 99816246 99772949 99760826
$$ packed form
2211I9741531l0464j7959J1390L3112L6163K4018N867m960K861K3156L1799J1085k9579
2224I9838020o1760o2210l0365J0453L0387J9082m944j5015k495K2110M3968M9363
2236I9836594K6558k1454o8344q4122o2279j9379K4125N2520N5626L6400J3229O72
2248I9790146n219j0940p096J4893L8132L3485l784m7127o7207n1239m524N0636Q1055
2261I9811211O9130L1135k960k0470k4849j6037K236J0742l159j9699j0605J4695J8066
2274I9859436j1658m1031l6750l838K6917L2417R498k4810m2893k8000P302L4309L9131
2287I9820030K9366J4839k976j7417j6755L59J7158K0264R827o294k1897k7626j5251
2300I9803627O241J8204R903m967j2833o714P561K2102J9699o828l9749m3297j2123
$$ plain form
2313 99760826 99788696 99832260 99870476 99889381 99891487 99881371 99875328 99868996 99853584 99835655 99858017 99936546 100017914
2326 100017914 100035217 99977509 99911346 99887611 99901855 99924667 99934227 99928619 99890106 99833481 99794441 99803391
2338 99803391 99843094 99871620 99858368 99824303 99820442 99876274 99938408 99937294 99890953 99856918 99855705 99857590 99852585
2351 99852585 99848892 99835884 99788643 99719360 99720886 99860519 100070755 100205467 100179626 100024200 99814621
2362 99814621 99633423 99546982 99556801 99601784 99628441 99654678 99726860 99836639 99929054 99966476 99948685 99889923
2374 99889923 99809189 99735001 99695297 99698471 99732857 99781212 99830009 99867355 99883850 99879845 99866241 99854797
2386 99854797 99848244 99841698 99832573 99826218 99829567 99839767 99842590 99826096 99795052 99767174 99754356 99751709 99746338 99732109
2400 99732109 99712898 99695930 99685989 99682899 99680710 99671707 99654160 99633423 99614594 99599014 99589989 99593254 99605179
$$ packed form
2313I9760826K7870M3564L8216J8905K106j0116o043o332j5412j7929K2362P8529Q1368
2326A00017914J7303n7708o6163k3735J4244K2812R560n608l8513n6625l9040Q950
2338I9803391L9703K8526j3252l4065l861N5832O2134j114m6341l4035j213J885n005
2351I9852585l693j3008m7241o9283J526J39633K10236J34712k5841j55426k09579
2362I9814621j81198q6441R819M4983K6657K6237P2182J09779R2415L7422j7791n8762
2374I9889923q0734p4188l9704L174L4386M8355M8797L7346J6495m005j3604j1444
2386I9854797o553o546r125o355L349J0200K823j6494l1044k7878j2818k647n371j4229
2400I9732109j9211j6968r941l090k189r003j7547k0737j8829j5580r025L265J1925
$$ plain form
2413 99605179 99606987 99581032 99531723 99482758 99454185 99448563 99458504 99479050 99507782 99537758 99557388 99560272 99553719
2426 99553719 99553452 99566315 99580658 99578712 99557655 99531746 99513275 99499466 99481079 99455971 99429314 99406532 99391144
2439 99391144 99383743 99377327 99358376 99318649 99263596 99206070 99156334 99120621 99101387 99092567 99081223 99060852 99038406
2452 99038406 99021835 99007286 98985916 98956665 98922707 98881767 98832901 98789948 98773636 98787010 98809006 98816971
2464 98816971 98808838 98799248 98799782 98807747 98811684 98804558 98791061 98781555 98778770 98774307 98760704 98741837 98726036 98713303
2478 98713303 98696831 98674919 98653572 98637787 98627441 98621727 98620979 98623711 98628311 98637459 98653633 98669548 98672295
2491 98672295 98660355 98648544 98649597 98656708 98652687 98635368 98625885 98648201 98703186 98766312 98810974 98832748 98849876
2504 98849876 98881462 98927132 98967567 98983620 98975525 98965607 98980637 99026772 99081169 99112450 99111313 99096992 99093407
$$ packed form
2413I9605179J808k5955m9309m8965k8573n622R941K0546K8732K9976J9630K884o553
2426I9553719k67J2863J4343j946k1057k5909j8471j3809j8387k5108k6657k2782j5388
2439I9391144p401o416j8951l9727n5053n7526m9736l5713j9234q820j1344k0371k2446
2452I9038406j6571j4549k1370k9251l3958m0940m8866m2953j6312J3374K1996P965
2464I8816971q133r590N34P965L937p126j3497r506k785m463j3603j8867j5801j2733
2478I8713303j6472k1912k1347j5785j0346n714p48K732M600R148J6174J5915K747
2491I8672295j1940j1811J053P111m021j7319r483K2316N4985O3126M4662K1774J7128
2504I8849876L1586M5670M0435J6053q095r918J5030M6135N4397L1281j137j4321l585
$$ plain form
2517 99093407 99105530 99122871 99138557 99156166 99179565 99203880 99218628 99216095 99195862 99164680 99133720 99113548
2529 99113548 99107872 99109161 99100998 99070129 99021469 98978966 98964729 98976929 98993752 98998619 98993492 98986183 98975784
2542 98975784 98957375 98933121 98909103 98884499 98852272 98809273 98759659 98709320 98662079 98620193 98584114 98552109
2554 98552109 98522614 98495056 98466347 98430939 98388397 98346527 98311790 98280525 98245895 98209839 98180046 98156425
2566 98156425 98128899 98089607 98040802 97989685 97941566 97899734 97866119 97838638 97811699 97782761 97755768 97735397
2578 97735397 97719131 97697456 97662140 97614555 97566742 97533165 97519066 97516701 97514420 97508865 97506386 97514305 97533867
2591 97533867 97560852 97588821 97611343 97625832 97637863 97658302 97693222 97738007 97783867 97828079 97874077 97922119
2603 97922119 97965309 97997849 98024399 98056915 98102089 98154846 98203911 98240112 98259209 98262680 98259613 98263855 98283440
$$ packed form
2517I9093407J2123J7341J5686J7609K3399K4315J4748k533k0233l1182l0960k0172
2529I9113548n676J289q163l0869m8660m2503j4237J2200J6823M867n127p309j0399
2542I8975784j8409k4254k4018k4604l2227m2999m9614n0339m7241m1886l6079l2005
2554I8552109k9495k7558k8709l5408m2542m1870l4737l1265l4630l6056k9793k3621
2566I8156425k7526l9292m8805n1117m8119m1832l3615k7481k6939k8938k6993k0371
2578I7735397j6266k1675l5316m7585m7813l3577j4099k365k281n555k479P919J9562
2591I7533867K6985K7969K2522J4489J2031K0439L4920M4785M5860M4212M5998M8042
2603I7922119M3190L2540K6550L2516M5174N2757M9065L6201J9097L471l067M242J9585
$$ plain form
2616 98283440 98314148 98347107 98380394 98417473 98455887 98485680 98502113 98514389 98536972 98573639 98612869 98638527
2628 98638527 98644630 98640396 98640732 98651398 98665192 98673035 98674110 98670738 98658066 98628075 98583923 98541641 98513771
2641 98513771 98496483 98476135 98444138 98402786 98360840 98326881 98303604 98284561 98258087 98217293 98165642 98112007
2653 98112007 98062340 98016968 97972969 97927513 97880745 97836197 97796288 97757553 97713844 97665176 97620064 97587914
2665 97587914 97571632 97567917 97570541 97572853 97572060 97573830 97588188 97617683 97652794 97682022 97703857 97725899 97754768
2678 97754768 97789574 97823280 97848831 97865440 97878883 97892700 97900383 97892578 97872910 97858551 97861366 97874619 97882706
2691 97882706 97877815 97861725 97837456 97807312 97776047 97748917 97727722 97712807 97705322 97702415 97694572 97675201 97650635
2704 97650635 97633888 97629601 97630821 97628174 97615868 97591431 97558044 97526749 97508354 97501976 97498207 97493904 97496185
$$ packed form
2616I8283440L0708L2959L3287L7079L8414K9793J6433J2276K2583L6667L9230K5658
2628I8638527O103m234L36J0666J3794P843J075l372j2672k9991m4152m2282k7870
2641I8513771j7288k0348l1997m1352m1946l3959k3277j9043k6474m0794n1651n3635
2653I8112007m9667m5372m3999m5456m6768m4548l9909l8735m3709m8668m5112l2150
2665I7587914j6282l715K624K312p93J770J4358K9495L5111K9228K1835K2042K8869
2678I7754768L4806L3706K5551J6609J3443J3817P683p805j9668j4359K815J3253Q087
2691I7882706m891j6090k4269l0144l1265k7130k1195j4915p485k907p843j9371k4566
2704I7650635j6747m287J220k647j2306k4437l3387l1295j8395o378l769m303K281
$$ plain form
2717 97496185 97510513 97532684 97556496 97582794 97616287 97657654 97702850 97746513 97782684 97806168 97817963 97827187
2729 97827187 97843307 97867561 97894493 97920067 97944344 97967430 97987732 98005455 98024620 98048515 98074135 98093987
2741 98093987 98104210 98108833 98114296 98121574 98127129 98130623 98136574 98146172 98152664 98149498 98140282 98134407 98132996 98124794 98098167
2756 98098167 98053856 98004440 97963226 97934311 97910103 97876671 97824844 97759224 97695328 97645454 97607651 97569885
2768 97569885 97523163 97467651 97407127 97342590 97274117 97205475 97141747 97082123 97019905 96951813 96883759 96823219
2780 96823219 96767265 96702805 96620415 96525818 96436279 96366653 96318489 96280067 96235855 96177490 96108292 96039047
2792 96039047 95981270 95943909 95932541 95947678 95984436 96036407 96098549 96164619 96225845 96278313 96330116 96393478
2804 96393478 96468689 96543449 96610863 96680771 96767418 96870567 96974838 97064713 97134705 97186592 97223007 97245209
$$ packed form
2717I7496185J4328K2171K3812K6298L3493M1367M5196M3663L6171K3484J1795R224
2729I7827187J6120K4254K6932K5574K4277K3086K0302J7723J9165K3895K5620J9852
2741I8093987J0223M623N463P278N555L494N951R598O492l166r216n875j411q202k6627
2756I8098167m4311m9416m1214k8915k4208l3432n1827o5620o3896m9874l7803l7766
2768I7569885m6722n5512o0524o4537o8473o8642o3728n9624o2218o8092o8054o0540
2780I6823219n5954o4460q2390r4597q9539o9626m8164l8422m4212n8365o9198o9245
2792I6039047n7777l7361j1368J5137L6758N1971O2142O6070O1226N2468N1803O3362
2804I6393478P5211P4760O7414O9908Q6647J03149J04271Q9875O9992N1887L6415K2202
$$ plain form
2816 97245209 97255219 97259888 97271767 97300858 97342583 97378197 97392426 97388977 97384605 97389885 97399895 97402061 97388824
2829 97388824 97363159 97335457 97314819 97301064 97285797 97263184 97237740 97219070 97211662 97212997 97219131 97227592 97236237
2842 97236237 97244270 97254036 97267952 97283356 97293503 97292931 97279343 97251595 97210678 97163277 97120209 97089394 97071037
2855 97071037 97058968 97044022 97017326 96974251 96917213 96853516 96789711 96727409 96662384 96586830 96495415 96391548
2867 96391548 96286064 96188370 96100937 96022194 95950134 95881134 95810181 95736755 95667084 95607010 95556175 95513603
2879 95513603 95484383 95474236 95480255 95494598 95516045 95549904 95596107 95645775 95692162 95738533 95791374 95850609
2891 95850609 95910202 95964760 96012398 96053604 96090179 96123352 96151466 96171890 96186089 96198845 96210342 96212723
2903 96212723 96198349 96169876 96137817 96108864 96079529 96041412 95991463 95935547 95881874 95831299 95775818 95707832
$$ packed form
2816I7245209J0010M669J1879K9091M1725L5614J4229l449m372N280J0010K166j3237
2829I7388824k5665k7702k0638j3755j5267k2613k5444j8670p408J335O134Q461Q645
2842I7236237Q033R766J3916J5404J0147n72j3588k7748m0917m7401m3068l0815j8357
2855I7071037j2069j4946k6696m3075n7038o3697o3805o2302o5025p5554r1415j03867
2867I6391548j05484r7694q7433p8743p2060o9000p0953p3426o9671o0074n0835m2572
2879I5513603k9220j0147O019J4343K1447L3859M6203M9668M6387M6371N2841N9235
2891I5850609N9593N4558M7638M1206L6575L3173K8114K0424J4199J2756J1497K381
2903I6212723j4374k8473l2059k8953k9335l8117m9949n5916n3673n0575n5481o7986
$$ plain form
2915 95707832 95629349 95549423 95472679 95393990 95306290 95211716 95123161 95055702 95016487 94999725 94989174 94967552
2927 94967552 94928474 94881454 94844429 94829544 94834335 94846214 94855888 94866806 94890289 94931030 94978882 95016106
2939 95016106 95032379 95032440 95030853 95039993 95061081 95084892 95101395 95108391 95109673 95106300 95094673 95074387 95052536 95035408
2953 95035408 95018898 94992371 94951088 94900345 94847801 94796242 94744949 94693871 94643555 94592331 94535721 94469215
2965 94469215 94391754 94306351 94217224 94126862 94037010 93951454 93874214 93804794 93738861 93675400 93619110 93573036
2977 93573036 93532646 93491608 93450287 93413742 93383408 93355919 93328499 93299828 93266754 93226799 93184853 93150360
2989 93150360 93125015 93098335 93058754 93006126 92950096 92899048 92854065 92812027 92771393 92734413 92704796 92682503
3001 92682503 92661224 92633064 92595840 92553520 92509781 92465698 92425293 92397346 92386070 92382309 92369576 92339241
$$ packed form
2915I5707832p8483p9926p6744p8689q7700r4574q8555o7459l9215j6762j0551k1622
2927I4967552l9078m7020l7025j4885M791J1879R674J0918K3483M0741M7852L7224
2939I5016106J6273O1j587R140K1088K3811J6503O996J282l373j1627k0286k1851j7128
2953I5035408j6510k6527m1283n0743n2544n1559n1293n1078n0316n1224n6610o6506
2965I4469215p7461q5403q9127r0362q9852q5556p7240o9420o5933o3461n6290m6074
2977I3573036m0390m1038m1321l6545l0334k7489k7420k8671l3074l9955m1946l4493
2989I3150360k5345k6680l9581n2628n6030n1048m4983m2038m0634l6980k9617k2293
3001I2682503k1279k8160l7224m2320m3739m4083m0405k7947j1276l761j2733l0335
$$ plain form
3013 92339241 92295769 92246620 92192398 92129768 92060394 91991928 91928963 91865433 91788208 91689491 91575691 91462418
3025 91462418 91359467 91261581 91155930 91037964 90917015 90805161 90702827 90600258 90494850 90402458
3035 90402458 90347496 90343300 90384491 90455727 90542000 90630821 90711983 90780350 90835937 90875786 90887245 90854675
3047 90854675 90775299 90666214 90553940 90456749 90376907 90307152 90241570 90179497 90120369 90056503 89973183 89858765
3059 89858765 89715866 89563194 89426605 89326393 89268646 89245026 89239685 89237740 89229324 89209030 89175575 89132362
3071 89132362 89084213 89030899 88966194 88885483 88791412 88689598 88582214 88470230 88359108 88255486 88158142
3082 88158142 88057877 87947906 87830643 87712952 87598213 87484688 87369255 87250023 87126495 86999138
3092 86999138 86869598 86741585 86621140 86513405 86417175 86323959 86224220 86112610 85985992 85840759 85677177
$$ packed form
3013I2339241m3472m9149n4222o2630o9374o8466o2965o3530p7225r8717j13800j13273
3025I1462418j02951r7886j05651j17966j20949j11854j02334j02569j05408r2392
3035I0402458n4962m196M1191P1236Q6273Q8821Q1162O8367N5587L9849J1459l2570
3047I0854675p9376j09085j12274r7191p9842o9755o5582o2073n9128o3866q3320j14418
3059H9858765j42899j52672j36589j00212n7747k3620n341j945q416k0294l3455m3213
3071H9132362m8149n3314o4705q0711r4071j01814j07384j11984j11122j03622r7344
3082H8158142j00265j09971j17263j17691j14739j13525j15433j19232j23528j27357
3092H6999138j29540j28013j20445j07735r6230r3216r9739j11610j26618j45233j63582
$$ plain form
3103 85677177 85504379 85336510 85185989 85064354 84985268 84956993 84970558 85005264 85050331 85113800 85205261
3114 85205261 85316208 85424324 85513908 85585381 85647049 85705070 85761292 85812813 85850403 85864204 85857071 85848434
3126 85848434 85856949 85878822 85889252 85868271 85821030 85769470 85728294 85694954 85661194 85625427 85589935 85553215
3138 85553215 85511063 85462341 85409668 85356712 85307770 85266731 85232117 85195312 85148087 85090714 85029366 84967834
3150 84967834 84906906 84849739 84800385 84756279 84708542 84652069 84590370 84529526 84473389 84428131 84406029 84418701
3162 84418701 84467651 84545334 84645294 84768761 84920258 85096428 85279160 85442978 85573891 85680710 85784958
3173 85784958 85900490 86025658 86152367 86275192 86390259 86492744 86581337 86662781 86748085 86844955 86953743
3184 86953743 87066872 87171387 87257256 87326508 87391411 87461510 87534698 87601982 87657295 87699997 87731232 87753311
$$ packed form
3103H5677177j72798j67869j50521j21635p9086k8275J3565L4706M5067O3469R1461
3114H5205261J10947J08116Q9584P1473O1668N8021N6222N1521L7590J3801p133q637
3126H5848434Q515K1873J0430k0981m7241n1560m1176l3340l3760l5767l5492l6720
3138H5553215m2152m8722n2673n2956m8942m1039l4614l6805m7225n7373o1348o1532
3150H4967834o0928n7167m9354m4106m7737n6473o1699o0844n6137m5258k2102J2672
3162H4418701M8950P7683R9960J23467J51497J76170J82732J63818J30913J06819J04248
3173H5784958J15532J25168J26709J22825J15067J02485Q8593Q1444Q5304R6870J08788
3184H6953743J13129J04515Q5869O9252O4903P0099P3188O7284N5313M2702L1235K2079
$$ plain form
3196 87753311 87772087 87795708 87830109 87877190 87936073 88003120 88071815 88137283 88202255 88276382 88367859 88476494
3208 88476494 88595245 88717445 88842155 88972954 89111755 89254654 89396011 89537331 89688248 89854202
3218 89854202 90024452 90176918 90297600 90393364 90483559 90581841 90688484 90796860 90902145 91003189 91099556
3229 91099556 91189293 91269875 91340935 91405548 91467644 91527878 91584267 91638588 91699455 91774078 91856552 91928841
3241 91928841 91975822 91997215 92003609 92004814 92005005 92005348 92005302 92001595 91990852 91973923 91955292 91938843 91927063 91923790
3255 91923790 91932892 91953278 91979156 92007233 92040215 92081566 92129845 92180634 92231415 92281868 92332809 92387878
3267 92387878 92453125 92530411 92612602 92689346 92757973 92824867 92894348 92959000 93003136 93014992 92995346 92956009
3279 92956009 92910835 92866295 92819138 92762749 92694534 92615837 92527367 92429306 92327293 92234436 92164375 92122833
$$ packed form
3196H7753311J8776K3621L4401M7081N8883O7047O8695O5468O4972P4127R1477J08635
3208H8476494J18751J22200J24710J30799J38801J42899J41357J41320J50917J65954
3218H9854202J70250J52466J20682R5764R0195R8282J06643J08376J05285J01044R6367
3229I1099556Q9737Q0582P1060O4613O2096O0234N6389N4321O0867P4623Q2474P2289
3241I1928841M6981K1393O394J205J91L43m6l707j0743j6929j8631j6449j1780l273
3255I1923790R102K0386K5878K8077L2982M1351M8279N0789N0781N0453N0941N5069
3267I2387878O5247P7286Q2191P6744O8627O6894O9481O4652M4136J1856j9646l9337
3279I2956009m5174m4540m7157n6389o8215p8697q8470r8061j02013r2857p0061m1542
$$ plain form
3291 92122833 92106819 92110153 92127075 92151665 92176720 92195129 92202599 92198608 92183647 92155327 92108238 92038368 91946136
3304 91946136 91833153 91696434 91528145 91321533 91075302 90792381 90476982 90135147 89776688 89413139
3314 89413139 89052971 88700157 88358566 88036179 87743950 87491867 87288300 87144112 87076469 87107613
3324 87107613 87257431 87533493 87926346 88415833 88983597 89617653 90303146 91013481 91717224 92394104
3334 92394104 93038559 93645935 94202469 94695564 95129257 95520096 95879066 96205521 96498322 96763496
3344 96763496 97007637 97230957 97432022 97613670 97778969 97925545 98050529 98158859 98261307 98365013
3354 98365013 98469208 98568176 98654144 98720306 98766357 98800575 98833389 98870453 98915047 98973137 99048065 99130646
3366 99130646 99202408 99252129 99284546 99311440 99339554 99369499 99401085 99435799 99475616 99520958 99567947 99608253
$$ packed form
3291I2122833j6014L334J6922K4590K5055J8409P470l991j4961k8320m7089o9870r2232
3304I1946136j12983j36719j68289k06612k46231k82921l15399l41835l58459l63549
3314H9413139l60168l52814l41591l22387k92229k52083k03567j44188o7643L1144
3324H7107613J49818K76062L92853M89487N67764O34056O85493P10335P03743O76880
3334I2394104O44455O07376N56534M93095M33693L90839L58970L26455K92801K65174
3344I6763496K44141K23320K01065J81648J65299J46576J24984J08330J02448J03706
3354I8365013J04195R8968Q5968O6162M6051L4218L2814L7064M4594N8090P4928Q2581
3366I9130646P1762M9721L2417K6894K8114K9945L1586L4714L9817M5342M6989M0306
$$ plain form
3378 99608253 99635674 99654305 99675514 99704681 99735252 99758888 99777214 99797798 99821243 99839722 99848953 99855598
3390 99855598 99870399 99896942 99928726 99955864 99974167 99988716 100009018 100039406 100073822 100102791 100125305 100150467
3402 100150467 100185997 100228210 100266579 100296082 100320541 100344162 100364670 100377335 100383392 100391068 100407471 100430817
3414 100430817 100451904 100462540 100461212 100452309 100443871 100446266 100466919 100501884 100536148 100557426 100568764 100585037 100617310
3427 100617310 100660950 100698891 100716660 100715004 100708969 100714516 100734901 100759201 100773056 100769997 100754074 100735855 100726410
3440 100726410 100731689 100750183 100775948 100803391 100827370 100840729 100837334 100820114 100802841 100798546 100807190 100819038 100826469
3453 100826469 100829582 100833755 100844391 100862885 100885056 100903839 100914619 100917839 100917000 100915588 100916306 100921532 100932724 100948402
3467 100948402 100964005 100975136 100980705 100981430 100977173 100969154 100964043 100969727 100983665 100991379 100982841 100965645 100955956 100958725
$$ packed form
3378I9608253K7421J8631K1209K9167L0571K3636J8326K0584K3445J8479R231O645
3390I9855598J4801K6543L1784K7138J8303J4549K0302L0388L4416K8969K2514K5162
3402A00150467L5530M2213L8369K9503K4459K3621K0508J2665O057P676J6403K3346
3414A00430817K1087J0636j328q903q438K395K0653L4965L4264K1278J1338J6273L2273
3427A00617310M3640L7941J7769j656o035N547K0385K4300J3855l059j5923j8219r445
3440A00726410N279J8494K5765K7443K3979J3359l395j7220j7273m295Q644J1848P431
3453A00826469L113M173J0636J8494K2171J8783J0780L220q39j412P18N226J1192J5678
3467A00948402J5603J1131N569P25m257q019n111N684J3938P714q538j7196r689K769
$$ plain form
3481 100958725 100963112 100960350 100958153 100969086 100990982 101008881 101012047 101002556 100987320 100967705 100942116 100915642 100901161
3494 100901161 100908966 100935051 100960861 100968155 100955681 100939766 100939316 100960419 100989830 101004959 100997108 100980042 100970856
3507 100970856 100972504 100977409 100978645 100976608 100976395 100978760 100978416 100973801 100972916 100985046 101008789 101031555 101038673 101021172
3521 101021172 100979187 100924393 100878548 100861053 100873810 100899788 100918991 100923981 100920685 100918159 100921288 100931213 100945869
3534 100945869 100960373 100970238 100975769 100981216 100989464 100997818 100998711 100985039 100955246 100918762 100895416 100903168 100940773
3547 100940773 100989723 101033005 101060173 101062683 101039726 101006142 100983307 100979408 100984200 100986244 100988503 101002121 101029724
3560 101029724 101060226 101079155 101080101 101064087 101031059 100978676 100914108 100861687 100854034 100899734 100963226 101004074
3572 101004074 101018623 101030769 101056923 101088547 101103996 101092125 101062523 101033508 101014938 101003471 100992355 100979927
$$ packed form
3481A00958725M387k762k197J0933K1896J7899L166r491j5236j9615k5589k6474j4481
3494A00901161P805K6085K5810P294j2474j5915m50K1103K9411J5129p851j7066r186
3507A00970856J648M905J236k037k13K365l44m615q85J2130K3743K2766P118j7501
3521A01021172m1985n4794m5845j7495J2757K5978J9203M990l296k526L129R925J4656
3534A00945869J4504R865N531N447Q248Q354Q93j3672k9793l6484k3346P752L7605
3547A00940773M8950M3282K7168K510k2957l3584k2835l899M792K044K259J3618K7603
3560A01029724L0502J8929R46j6014l3028n2383o4568n2421p653M5700O3492M0848
3572A01004074J4549J2146K6154L1624J5449j1871k9602k9015j8570j1467j1116j2428
$$ plain form
3584 100979927 100970901 100971832 100985817 101003838 101014511 101033424 101071976 101106293 101109772 101077362 101023689 100974823 100953804
3597 100953804 100963188 100991081 101024757 101051208 101058029 101041084 101009018 100979927 100973801 100993149 101014481 101007942 100981560
3610 100981560 100970612 100980492 100985413 100973145 100963356 100979042 101011292 101030815 101027618 101017593 101020470 101038193 101042427
3623 101042427 101005882 100942513 100894241 100880379 100881477 100872902 100859749 100893120 100984566 101043365 101018791 100960373
3635 100960373 100936539 100957832 100984520 100993576 100997963 101009148 101016632 101010109 100993263 100962654 100902313 100816933 100762535
3648 100762535 100803467 100888496 100894211 100856033 100882996 100969269 101044914 101067482 101046219 101023209 101027504 101038147
3660 101038147 101026970 101001038 100978668 100959335 100928650 100885559 100843216 100809547 100775330 100724693 100664612 100660423
3672 100660423 100753220 100868408 100932198 100959869 100998489 101077515 101144455 101114471 101016624 100938889 100914299 100917351
$$ packed form
3584A00979927r026R31J3985J8021J0673J8913L8552L4317L479l2410n3673m8866k1019
3597A00953804R384K7893L3676K6451O821j6945l2066k9091o126J9348K1332o539k6382
3610A00981560j0948R880M921j2268r789J5686L2250J9523l197j0025K877J7723M234
3623A01042427l6545o3369m8272j3862J098q575j3153L3371R1446N8799k4574n8418
3635A00960373k3834K1293K6688R056M387J1185P484o523j6846l0609o0341q5380n4398
3648A00762535M0932Q5029N715l8178K6963Q6273P5645K2568k1263k3010M295J0643
3660A01038147j1177k5932k2370j9333l0685m3091m2343l3669l4217n0637o0081m189
3672A00660423R2797J15188O3790K7671L8620P9026O6940k9984r7847p7735k4590L052
$$ plain form
3684 100917351 100930710 100955719 100974380 100959663 100922653 100917412 100972641 101060883 101142563 101201073 101229218 101211884
3696 101211884 101149124 101080551 101054916 101071671 101084190 101053391 100985886 100926582 100906769 100914490 100921074 100912621
3708 100912621 100893440 100876198 100873009 100881424 100886261 100897163 100930099 100964203 100969086 100943214 100912796 100896965 100886787
3721 100886787 100867867 100846764 100847160 100881783 100929398 100953331 100946144 100931847 100908157 100846626 100755775 100697487
3733 100697487 100724342 100804039 100843956 100816673 100791496 100805229 100823891 100840668 100896492 100990494 101045486 100990608
3745 100990608 100899437 100914894 100993584 101011978 100983986 100992088 101019714 100988892 100920067 100873367 100863022 100877922
3757 100877922 100913567 100956215 100966042 100927345 100889763 100896187 100921303 100920197 100900772 100916832 100987862 101062363
3769 101062363 101075165 101026001 100982796 100992477 101024384 101035042 101033531 101055130 101103333 101140366 101128578 101080208
$$ packed form
3684A00917351J3359K5009J8661j4717l7010n241N5229Q8242Q1680N8510K8145j7334
3696A01211884o2760o8573k5635J6755J2519l0799o7505n9304j9813P721O584q453
3708A00912621j9181j7242l189Q415M837J0902L2936L4104M883k5872l0418j5831j0178
3721A00886787j8920k1103L96L4623M7615K3933p187j4297k3690o1531r0851n8288
3733A00697487K6855P9697L9917k7283k5177J3733J8662J6777N5824R4002N4992n4878
3745A00990608r1171J5457P8690J8394k7992Q102K7626l0822o8825m6700j0345J4900
3757A00877922L5645M2648R827l8697l7582O424K5116j106j9425J6060P1030P4501
3769A01062363J2802m9164m3205R681L1907J0658j511K1599M8203L7033j1788m8370
$$ plain form
3781 101080208 101046227 101043083 101040085 101015312 100985992 100987366 101026749 101073769 101089905 101059219 100999329 100950882
3793 100950882 100942917 100962303 100965118 100934692 100918251 100968864 101054955 101078285 100983047 100858009 100867172 101004875
3805 101004875 101122894 101135841 101076828 101039368 101053711 101054718 101002945 100940742 100912094 100893982 100829590 100732613
3817 100732613 100711784 100818024 100957359 101017410 100964729 100877724 100867218 100901718 100898712 100862679 100852348 100893456
3829 100893456 100945587 100953560 100908821 100853806 100838745 100878304 100943077 100990021 100986015 100926682 100856567 100833664
3841 100833664 100861031 100891876 100898598 100897484 100908844 100923042 100913216 100868004 100804703 100759354 100751328 100778824 100825134
3854 100825134 100875427 100979614 101117409 101184090 101158859 101084106 101002251 100942383 100916306 100903687 100861664
3865 100861664 100797050 100783905 100846428 100919518 100945160 100955269 101021881 101132248 101179031 101108665 100991585
$$ packed form
3781A01080208l3981l144k998k4773k9320J374L9383M7020J6136l0686n9890m8447
3793A00950882p965J9386K815l0426j6441N0613Q6091K3330r5238j25038R163J37703
3805A01004875J18019J2947n9013l7460J4343J007n1773o2203k8648j8112o4392r6977
3817A00732613k0829J06240J39335O0051n2681q7005j0506L4500l006l6033j0331M1108
3829A00893456N2131P973m4739n5015j5061L9559O4773M6944m006n9333p0115k2903
3841A00833664K7367L0845O722j114J1360J4198r826m5212o3301m5349q026K7496M6310
3854A00825134N0293J04187J37795O6681k5231p4753q1855n9868k6077j2619m2023
3865A00861664o4614j3145O2523P3090K5642J0109O6612J10367M6783p0366j17080
$$ plain form
3876 100991585 100928589 100932159 100941902 100914253 100857445 100825027 100874687 100991676 101092804 101106621 101044296 100993973
3888 100993973 100997833 101008736 100995483 100984283 101001411 101035927 101058754 101055496 101035530 101007622 100968315 100918907
3900 100918907 100888481 100908264 100969032 101023956 101040039 101029686 101027626 101044685 101065781 101074562 101060333 101022202
3912 101022202 100974739 100941269 100928558 100917152 100885300 100837120 100802261 100802750 100839371 100900627 100964638 100997452
3924 100997452 100978020 100929436 100902145 100917030 100951378 100980057 100999283 101010292 101005936 100984665 100962662 100956238
3936 100956238 100965637 100978493 100981613 100967949 100936363 100894974 100861145 100850601 100865036 100891403 100912804 100921669
3948 100921669 100922508 100921761 100921448 100921219 100919342 100912827 100900780 100887154 100879486 100885063 100906982 100942116 100980522 101010941
3962 101010941 101028137 101035408 101040451 101049026 101062538 101078720 101094810 101109901 101122498 101126465 101112823 101079247 101035873
$$ packed form
3876A00991585o2996L570R743k7649n6808l2418M9660J16989J01128J3817o2325n0323
3888A00993973L860J0903j3253j1200J7128L4516K2827l258j9966k7908l9307m9408
3900A00918907l0426J9783O0768N4924J6083j0353k060J7059K1096Q781j4229l8131
3912A01022202m7463l3470j2711j1406l1852m8180l4859M89L6621O1256O4011L2814
3924A00997452j9432m8584k7291J4885L4348K8679J9226J1009m356k1271k2003o424
3936A00956238R399J2856L120j3664l1586m1389l3829j0544J4435K6367K1401Q865
3948A00921669Q39p47l13k29j877o515j2047j3626p668N577K1919L5134L8406L0419
3962A01010941J7196P271N043Q575J3512J6182J6090J5091J2597L967j3642l3576m3374
$$ plain form
3975 101035873 100998116 100973534 100958076 100945030 100934166 100932030 100944794 100971565 101004189 101033310 101053856 101065445
3987 101065445 101069504 101067688 101062874 101058876 101056946 101052711 101039459 101016556 100993629 100984436 100995842 101022171 101049660
4000 101049660
$$ packed form
3975A01035873l7757k4582j5458j3046j0864k136J2764K6771L2624K9121K0546J1589
3987A01065445M059j816m814l998j930m235j3252k2903k2927r193J1406K6329K7489
4000A01049660
$$ =====================================================
$$ Start of Advanced Chemistry Development specific data
$$ =====================================================
##$UVIR_ASSIGNMENT=ACDTABLE(X,Y,A,VT)
(3109,84.957,'2,8',undefined)
(3109,84.957,'3,9',undefined)
(3109,84.957,'4,10',undefined)
(3109,84.957,'5,11',undefined)
(1225,62.1295,'6,16',undefined)
(1563,66.3615,'7,12',undefined)
(3323,87.0765,'7,12',undefined)
(1651,67.0745,'13,14',undefined)
(1259,68.0299,'16,20',undefined)
(1327,76.8,'16,20',undefined)
(3161,84.406,'16,20',undefined)
(1370,75.1658,'15,17,18,19',undefined)
(1435,65.3709,'15,17,18,19',undefined)
(2881,95.4742,'15,17,18,19',undefined)
(2931,94.8295,'15,17,18,19',undefined)
(1505,61.615,'1,2,3,4,5,6',undefined)
(1609,70.328,'1,2,3,4,5,6',undefined)

$$ =====================================================
$$ End of Advanced Chemistry Development specific data
$$ =====================================================
##END=$$ End of the data block
##END=$$ End of the link block
