##TITLE=PARACETAMOL (4-ACETAMIDO PHENOL) 13C{1H} /300K DMSO $$ Begin of the link block
##JCAMP-DX=5.00 $$ ACD/Spectrus 2012 v 14.01
##ORIGIN= 
##OWNER= 
##DATA TYPE=LINK
##BLOCKS=4
##TITLE=PARACETAMOL (4-ACETAMIDO PHENOL) 13C{1H} /300K DMSO $$ Begin of the structure block
##JCAMP-CS=3.7 $$ ACD/Spectrus 2012 v 14.01
##ORIGIN= 
##OWNER= 
##BLOCK_ID=1
##ATOMLIST=
$$        AN        AS        NH
          1         C 
          2         C         1
          3         C         1
          4         C         1
          5         C         1
          6         C 
          7         N         1
          8         C 
          9         C         3
          10        O 
          11        O         1
##BONDLIST=
$$        AN1       AN2       BT
          1         2         S
          1         3         D
          1         7         S
          2         4         D
          3         5         S
          4         6         S
          5         6         D
          6         11        S
          7         8         S
          8         9         S
          8         10        D
##XY_RASTER=
$$        AN        X         Y         Z
          1         128       25
          2         128       74
          3         85        0
          4         85        98
          5         42        25
          6         42        74
          7         170       0
          8         213       25
          9         255       0
          10        213       74
          11        0         98
##$MOLFILE=  $$ Empty String
  ACD/Labs03071414572D
  $$ Empty String
 11 11  0  0  0  0  0  0  0  0 12 V2000
  127.5014  -24.5388    0.0000 C   0  0  0  0  0  0  0  0  0  0  0  0
  127.5014  -73.6131    0.0000 C   0  0  0  0  0  0  0  0  0  0  0  0
   84.9983   -0.0016    0.0000 C   0  0  0  0  0  0  0  0  0  0  0  0
   84.9983  -98.1503    0.0000 C   0  0  0  0  0  0  0  0  0  0  0  0
   42.4999  -24.5388    0.0000 C   0  0  0  0  0  0  0  0  0  0  0  0
   42.4999  -73.6131    0.0000 C   0  0  0  0  0  0  0  0  0  0  0  0
  170.0006   -0.0009    0.0000 N   0  0  0  0  0  0  0  0  0  0  0  0
  212.5006  -24.5376    0.0000 C   0  0  0  0  0  0  0  0  0  0  0  0
  255.0000    0.0000    0.0000 C   0  0  0  0  0  0  0  0  0  0  0  0
  212.5011  -73.6119    0.0000 O   0  0  0  0  0  0  0  0  0  0  0  0
    0.0000  -98.1499    0.0000 O   0  0  0  0  0  0  0  0  0  0  0  0
  1  2  1  0  0  0  0
  1  3  2  0  0  0  0
  1  7  1  0  0  0  0
  2  4  2  0  0  0  0
  3  5  1  0  0  0  0
  4  6  1  0  0  0  0
  5  6  2  0  0  0  0
  6 11  1  0  0  0  0
  7  8  1  0  0  0  0
  8  9  1  0  0  0  0
  8 10  2  0  0  0  0
M  ZZC   1 4
M  ZZC   2 3
M  ZZC   3 5
M  ZZC   4 2
M  ZZC   5 6
M  ZZC   6 1
M  ZZC   7 8
M  ZZC   8 9
M  ZZC   9 11
M  ZZC  10 10
M  ZZC  11 7
M  END
$$$$

##CROSS REFERENCE=NMR PEAK ASSIGNMENTS: BLOCK_ID = 2
##END=$$ End of the structure block
##TITLE=PARACETAMOL (4-ACETAMIDO PHENOL) 13C{1H} /300K DMSO $$ Begin of the assignment block
##JCAMP-DX=5.00 $$ ACD/Spectrus 2012 v 14.01
##ORIGIN= 
##OWNER= 
##CROSS REFERENCE=STRUCTURE: BLOCK_ID = 1
##BLOCK_ID=2
##.OBSERVE FREQUENCY=75.45090
##.OBSERVE NUCLEUS=^13C
##DATA TYPE=NMR PEAK ASSIGNMENTS
##DATA CLASS=ASSIGNMENTS
##NPOINTS=8
##XUNITS=PPM
##YUNITS=ARBITRARY UNITS
##PEAK ASSIGNMENTS=(XYMA)
(23.68198,0.43, ,<9>)
(114.98574,1.00, ,<4>)
(114.98574,1.00, ,<5>)
(120.88551,1.00, ,<2>)
(120.88551,1.00, ,<3>)
(130.95636,0.31, ,<1>)
(153.11223,0.35, ,<6>)
(167.56035,0.32, ,<8>)
##END=$$ End of the assignment block
##TITLE=PARACETAMOL (4-ACETAMIDO PHENOL) 13C{1H} /300K DMSO $$ Begin of the peaks block
##JCAMP-DX=5.00 $$ ACD/Spectrus 2012 v 14.01
##ORIGIN= 
##OWNER= 
##BLOCK_ID=3
##DATA TYPE=NMR SPECTRUM
##DATA CLASS=PEAK TABLE
##.OBSERVE FREQUENCY=75.45090
##.OBSERVE NUCLEUS=^13C
##NPOINTS=6
##FIRSTX=23.68197823
##LASTX=167.56034851
##MAXX=36339628.00000000
##MINX=11362028.00000000
##MAXY=0.00000000
##MINY=0.00000000
##XFACTOR=1.0000000000
##YFACTOR=36339628.000000000000000
##FIRSTY=15599821.00000000
##XUNITS=PPM
##YUNITS=ARBITRARY UNITS
##PEAK TABLE=(XY..XY)
23.68198, 0.4293
114.98574, 1
120.88551, 0.9971
130.95636, 0.3127
153.11223, 0.3516
167.56035, 0.3216
##END=$$ End of the peaks block
##TITLE=PARACETAMOL (4-ACETAMIDO PHENOL) 13C{1H} /300K DMSO $$ Begin of the data block
##JCAMP-DX=5.00 $$ ACD/Spectrus 2012 v 14.01
##BLOCK_ID=4
##DATE=03 Jul 2008 17:10:27 
##DATA TYPE=NMR SPECTRUM
##DATA CLASS=XYDATA
##ORIGIN=Bruker BioSpin GmbH
##OWNER=ochem
##.OBSERVE FREQUENCY=75.45090
##.ACQUISITION TIME=0.83569
##.ZERO FILL=0
##.SHIFT REFERENCE=INTERNAL,  ,16384, -20.3919
##.OBSERVE NUCLEUS=^13C
##.ACQUISITION MODE=SIMULTANEOUS
##SPECTROMETER/DATA SYSTEM=??
##.SOLVENT NAME=DMSO-d6
##SWCYCLICAL=19605.44922
##NPOINTS=16384
##FIRSTX=18065.66601563
##LASTX=-1538.58496094
##MAXX=18065.66601563
##MINX=-1538.58496094
##MAXY=36339628.00000000
##MINY=-359090.34375000
##XFACTOR=1.0000000000
##YFACTOR=0.100000000000000
##FIRSTY=36730.19921875
##DELTAX=-1.19662154
##XUNITS=HZ
##YUNITS=ARBITRARY UNITS
##XYDATA=(X++(Y..Y))
18065.7 367302 590579 847041 458278 186710 -963039 -801258 -948839 -276947 337806 31904
18053.7 31904 -1358874 -1195606 -698953 -35409 954176 1128552 1604884 1348619 1482652 757671
18041.7 757671 130380 151293 -67910 -433605 -85765 -211854 -322166 -1018134 -833924 303257
18029.8 303257 -218642 -640839 -488068 -449784 -566813 -40808 -57003 -485216 -708255 109025
18017.8 109025 853331 1140844 846626 1213256 346051 -537494 -605683 -247011 113277 -607255
18005.8 -607255 -483128 -139009 -430541 -563953 -117707 449389 193416 -329934 146063 334570
17993.9 334570 208759 -351058 -57154 105913 -242832 -616363 -17616 484797 14407 474341
17981.9 474341 187459 872818 434124 -585786 -264367 -288094 -452763 85770 -235343 -837734
17969.9 -837734 -146677 -625249 -862304 69078 455959 1273456 1533040 1080769 845622 1473500
17958 1473500 886790 -77341 -377709 27728 361912 515867 449607 -89320 -272604 -211802
17946 -211802 -747857 -1067634 -922890 -350581 505381 787618 519196 10627 446750 -49028
17934 -49028 -550839 -6843 82116 -578829 -1284133 -464450 726668 666740 191900 -168345 -791083
17920.9 -791083 -943831 -785186 -767713 -840166 -465413 151032 845266 395847 -189084 -75133
17908.9 -75133 525337 366740 413986 239328 1059918 1418613 -493138 -1459386 -1892382 -584855
17896.9 -584855 661830 956821 682483 -240466 -954340 -717334 -203166 -282013 -385705 -227297
17885 -227297 -765392 -139701 358880 1115359 87659 -283831 440237 238382 -1445843 -470458
17873 -470458 975336 702266 561275 311186 302159 844936 367470 521853 195256 -113380
17861 -113380 1150122 1256914 278608 893873 594319 -725674 -792946 -54359 706898 162100
17849.1 162100 -597174 -340596 -592554 -392213 -104773 -1371564 -1592188 -702868 -129410 -1379042
17837.1 -1379042 -1310711 44731 -985251 -712387 -1045992 -1035426 -724476 -1080421 -100972 1376158
17825.1 1376158 1267945 731991 1263160 700482 367588 282355 589118 592628 968366 1338162
17813.2 1338162 331934 374676 932142 940853 993630 116959 -11899 -1020901 -271745 300090
17801.2 300090 931226 1434661 969300 -100 -439937 -118817 -666739 -458146 39342 169084
17789.2 169084 -448754 -751137 -1521285 -248290 783831 -339759 -1062465 -949690 -839073
17778.5 -839073 -350895 -692208 -1621103 -798328 498324 884511 379150 192921 -64931 178713
17766.5 178713 554714 707282 229029 -244142 363596 308090 606576 1104396 562796 368636
17754.5 368636 14425 -47528 452699 516015 788864 912945 1487360 964890 -878477 -1347483
17742.6 -1347483 -697791 197561 727567 547241 -281427 -118392 -202407 -365283 -771781 -925131
17730.6 -925131 319457 298662 -254994 -725073 -935419 -783185 -1852931 -3058169 -1445155
17719.8 -1445155 -238273 -101335 -807787 -1202823 -1483138 -609288 26123 853760 555269 240192
17707.9 240192 966205 754978 155469 -430558 -687814 493243 1718018 1874333 676881
17697.1 676881 1137903 1283630 903768 630173 689675 911603 916890 18186 -27282 -1124777
17685.1 -1124777 -762423 -682263 332954 1110415 195265 -703415 -1297205 -960590 168053 -27594
17673.2 -27594 -267161 -417543 -937620 -821884 -1402224 -840069 -229678 -37408 597591 1584479
17661.2 1584479 1526101 1063625 902917 160676 -330410 881533 585797 372393 -340317 -210554
17649.2 -210554 -909193 380573 433737 -400523 -5366 549438 81043 -999382 -653883 -675735
17637.3 -675735 -415087 446626 979317 504758 593564 421860 456401 494021 353484 -804576
17625.3 -804576 -1998021 -1940963 547910 1391236 414350 -581606 -243296 397292 701125 612321
17613.3 612321 445926 294050 541683 340482 -19501 -128528 -657728 -1677657 -392783 314008
17601.4 314008 -474308 -919998 -1898310 -1584560 -1429398 -998323 -850932 -563831 -198083 636919
17589.4 636919 1068558 946361 354033 695180 120964 110119 -313378 504032 985579 898032
17577.4 898032 889469 1208058 220958 288298 452889 -556873 -604903 -389356 671407 835133
17565.5 835133 418194 -36551 -553672 -1018612 -1529825 -1500628 -464249 446068 304249 308406
17553.5 308406 988538 811914 -423112 -789633 -279363 709341 563230 -92983 -696560 445880
17541.5 445880 1626630 1643552 1367663 376545 1403474 1396318 -128001 -1213594 -926819 -1377860
17529.6 -1377860 -1417859 -852941 399497 1206528 170029 -441187 -549499 -1469745 -675192 984888
17517.6 984888 475297 -379955 197616 -368202 259647 613156 -307788 747306 1329882 668835
17505.6 668835 -550817 -316136 -652811 257534 -304138 -240268 -310773 -308432 -846226 -686920
17493.7 -686920 -939887 -1265678 -982749 -1750315 -841357 -490142 -63932 28668 -17847 810329
17481.7 810329 -177752 -976952 -428908 510658 890124 1625740 1232725 121864 -404106 -612433
17469.8 -612433 213045 132295 353859 -128774 -813379 -744493 450700 -83539 -563687 -661631
17457.8 -661631 403182 591889 483292 46939 26264 -306457 -41652 597793 1406626 1058342
17445.8 1058342 1361002 780026 170966 177578 -126746 -131127 74048 705515 617796 699934 747463
17432.7 747463 224580 488220 762943 -190788 -537087 -156971 -1211435 -1721097 -1722044 -972462
17420.7 -972462 387413 580512 577702 1231994 2134122 2998822 2439608 328269 -31818 183822
17408.7 183822 558633 387866 289288 488423 -374949 -105362 269298 -379055 -1344819 -1030452
17396.8 -1030452 -1136020 -1000792 -622520 -995761 -555664 -414835 -993503 -895108 551306 118164
17384.8 118164 -151860 -703223 -1298338 -1063858 -1448413 -1589485 -1014140 -800718 -886242 -378580
17372.8 -378580 -568870 -172946 55398 -326869 -813474 -45209 -378615 60236 746074 1601220
17360.9 1601220 2049214 350734 -63951 -217056 -3123 509149 96868 185606 518431 48958
17348.9 48958 688495 1438811 1956275 1918361 1065617 636255 315921 218163 83035 149500 788024
17335.7 788024 1037450 1024396 1057509 1915580 585481 66870 -335022 -1163229 -2111263 -1819973
17323.8 -1819973 -1951064 -2676935 -2900585 -930982 211405 -95420 -682210 -292671 -558033
17313 -558033 -469204 1083912 867396 229043 -1122417 -1115305 -472043 -717801 -449235 250308
17301 250308 -146776 -137201 -73249 -59842 140837 408983 133975 -842746 130725 1034096 988815
17287.9 988815 271969 64256 281284 310404 371410 874398 499541 175556 107237 690094
17275.9 690094 816718 1109249 710465 636005 631700 543408 -207715 -1225900 -228030 -36784
17263.9 -36784 -261517 -981110 -71288 -925965 -983251 -1525703 -894298 -381080 100693 315351
17252 315351 275415 1173987 1544045 477345 -656533 -609405 -151545 289956 -8956 -580469
17240 -580469 48798 -365217 1586770 2034623 699852 803903 1122500 142794 -716149 125343
17228 125343 -148782 -37361 66256 -432894 -124370 -1698497 -1168176 -793494 535176 915532
17216.1 915532 639653 306810 -35191 -194869 -443063 67686 -89956 -1317531 -1324394 -1330752
17204.1 -1330752 -518657 391467 1099011 584160 783519 883888 251358 -535424 -640998 137512
17192.1 137512 292942 -119683 -218963 -469497 -1096490 -272061 309198 875514 863860 1188604
17180.2 1188604 912284 -109080 82660 -8264 -281332 -232761 958149 1613745 1159294 -357944
17168.2 -357944 -285614 -931534 -1256445 -486280 -1435319 -2812079 -1059035 1216711 1381912 6700
17156.2 6700 306963 1738857 1455146 384965 -238489 -339802 -431481 -616128 -384880 347078
17144.3 347078 928648 690119 267328 -608770 -1082952 -334029 422801 -63647 208396 -186612
17132.3 -186612 293167 -103760 -232405 840051 1964271 1332307 -276626 -1427558 -2102600
17121.5 -2102600 -1645871 -960424 9875 935096 1061402 224813 -945829 -133827 1334500
17110.8 1334500 263862 -897069 -865006 1127344 262421 -115080 46237 -585870 -452241
17100 -452241 -150995 236758 -339402 -684412 -1073037 -176085 90457 -1208429 -1736026 -2581402
17088 -2581402 -2745966 -982549 28814 482088 587690 501859 885259 712488 1990352 2513432
17076.1 2513432 2008738 1539162 856226 1151762 564684 -221126 473313 -303093 -393767 -799850
17064.1 -799850 -544345 -113808 -348217 -587485 -975385 -1228237 -1821582 -1340302 -188463 924257
17052.1 924257 492625 510009 482348 -221193 -192204 -44565 238303 20636 82734 1162953
17040.2 1162953 1432268 1322490 565505 531598 545255 16192 -204763 -407471 -54643 235701
17028.2 235701 550065 -12042 -323183 -213632 25690 -97367 -162232 810614 1535316 1000266
17016.2 1000266 552050 673487 587890 327549 -496862 -1927105 -1853550 -1850469 -789318 -943540
17004.3 -943540 -1476186 -2362340 -1883307 -1217901 -1137403 471822 1385753 333585 260179 656544
16992.3 656544 978737 1326090 555400 674327 712631 675295 463056 476004 341583 389107 -18517
16979.1 -18517 -326759 -129579 -474691 -255885 1022015 1270017 -12223 -955466 745593 1811257
16967.2 1811257 1145008 79704 529729 -480115 -395884 -333078 -619781 -555371 -1572324 -1547711
16955.2 -1547711 -1162834 -959889 -407092 -805913 -630168 -1014399 -309753 854018 -70748 234935
16943.2 234935 741945 715495 261838 617493 1370981 1062626 571514 -686905 -1273854 -117752
16931.3 -117752 809218 591174 756204 747699 88776 873018 752813 643008 1776002 468148
16919.3 468148 -238855 280386 -367646 -1378065 -820060 -873677 -1071958 -1189198 -1326137 -1293221
16907.3 -1293221 -1047964 133720 1153400 1082835 679584 67556 -314391 140305 533425 645792
16895.4 645792 -682906 -1059499 -838723 -1203659 -1381210 -955207 309335 512772 953697 245358
16883.4 245358 -420176 -39789 724742 366054 862942 966766 353659 -14709 1368476 594852
16871.4 594852 94231 339767 512000 634136 1309088 52280 -1729235 -1810302 -138974 659596
16859.5 659596 -52138 -405453 -514013 -457449 650633 1007807 564456 428717 172139 -522603
16847.5 -522603 -950409 -442199 -1122858 -894445 -447395 -201937 -94759 387120 -209508 -283474
16835.5 -283474 -1006660 588256 2160607 827540 35243 -216946 -54566 554408 64789
16824.8 64789 -722846 -1372002 -589824 -245047 -802870 -390235 477712 1308911 1722965 739048
16812.8 739048 873229 376735 474709 652919 -100637 162171 -710176 -1507621 -312221 938225
16800.8 938225 155681 -405394 188057 302362 240459 53819 -280440 -324207 -335076 35941
16788.9 35941 64056 -517053 -622843 55525 -126682 -984988 -1329087 -849620 46164 31820
16776.9 31820 745314 1003229 1349761 153257 -706108 -1365479 -790839 -404436 86589 692100
16764.9 692100 1618615 922816 160584 -556838 -64302 740654 563068 -328695 -307125 -524357
16753 -524357 -276167 -348872 -48151 54771 809971 855401 -103893 -595741 -256339 -1112842 -868807
16739.8 -868807 -738656 -653432 -1844557 -1884784 -2228527 -1181382 -468829 1551001 1542018 640961
16727.8 640961 -521780 -896541 -434151 437934 608363 668913 506819 -11001 116313 216287
16715.9 216287 519789 467781 -347578 -217618 668989 1379403 694602 -313182 13550 1060458
16703.9 1060458 624047 256983 742923 694680 746685 -280172 701783 607550 717832 509903
16691.9 509903 -349785 74441 416231 723004 1064219 346191 -374869 171426 30220 286424
16680 286424 -901526 -539283 825521 1856876 1272465 285314 922676 -607117 -1477975 -1654194
16668 -1654194 -1532281 -1297969 -1432513 -734607 100080 -159163 -1082448 -632801 -374612 -608862
16656 -608862 -1112965 -1365028 -1275359 -1195944 400184 1303931 1501066 1627522 1095737 619164
16644.1 619164 -277552 -1081355 -549193 61916 -455346 1236774 2110274 1336718 1061653 1196176
16632.1 1196176 384294 -2807 -116923 20578 125345 -960636 -822587 -626752 -967818 -964570
16620.1 -964570 61395 994922 192751 -446424 -630223 -244224 -215254 -275892 -158880 498818
16608.2 498818 -199464 -1203580 -1817097 -651285 130066 496321 725373 525798 341671 -754045
16596.2 -754045 -381768 441412 211158 410574 231279 368488 -605815 -595189 294399 1359978
16584.3 1359978 -253049 -1458520 -199706 138355 -237961 -334047 -1163327 -1161457 -644857 -220913
16572.3 -220913 738037 933240 293626 118914 837110 698928 220616 -52014 1017967 1751236
16560.3 1751236 760034 -815362 -1966042 -1341253 -449148 729464 1039570 164474 -73321
16549.5 -73321 -33379 -736471 -596878 200693 1498824 2034027 861426 1109199 1125016 1155759
16537.6 1155759 662175 -114195 -340988 175581 -569152 -1115434 -364511 374454 -723605 -1386737
16525.6 -1386737 -1638149 -1318497 -192140 827537 387991 309711 583011 189204 26897 -1111923
16513.6 -1111923 -1023860 -738572 245094 724195 591706 1014253 1341685 1518282 824820 468315
16501.7 468315 584774 391563 -240394 -144751 -279099 228067 90122 12556 -78441 -693678
16489.7 -693678 -1396643 -1281258 -1651704 -136649 104520 -1416774 -327046 1059143 623367
16478.9 623367 120008 -530569 -473330 -649036 246913 624157 994123 715010 -40599 -433165
16467 -433165 -799142 222948 1366558 -172316 -1467100 -263639 179879 635825 503708
16456.2 503708 206822 -856439 -223312 1060108 936590 -736124 -501821 -596497 -1130615 -1288009
16444.2 -1288009 -468589 -165411 -434468 -882996 -1414904 -578021 -338751 -407648 -118083 31107
16432.3 31107 -199965 -435030 27897 281735 656598 410969 199062 -310281 -728769 1094714
16420.3 1094714 1717405 1642817 2044635 2476121 1301952 495756 352127 296189 682656 796570
16408.3 796570 -141651 -139538 -209853 -609561 -1709164 -2168538 -1230328 -973139 278592 415108
16396.4 415108 1035522 712868 -557353 -637945 -74453 -218053 -118142 -1044641 -1627089 -160554
16384.4 -160554 504642 445192 77929 21085 1532317 2420399 2471455 2096927 629630 208711
16372.4 208711 -694280 -335563 760398 -154411 -524215 -736154 -477737 -405327 -534001 -882081
16360.5 -882081 -232673 153195 498492 -183267 -724224 -1105136 -1682986 -2316595 -1843570 -2403493
16348.5 -2403493 -1961851 -737520 -350771 -262293 590760 798414 947895 1155277 1666731 1507822
16336.5 1507822 1291364 1273866 1286719 1355033 153870 -1580990 -2532769 -1946138 -1843731 -1839107
16324.6 -1839107 -471116 62165 -93121 38765 144113 1482482 1585577 960964 -28784
16313.8 -28784 -687465 -483336 131718 798798 1358556 1320030 1430897 1900242 1504632 1078452
16301.8 1078452 186421 476174 818166 1165615 1239686 -480892 -1628294 -1071694 -703768 -536538
16289.9 -536538 -383901 15268 -887362 -686944 -451246 188404 -374613 -609326 576296 279376
16277.9 279376 -195985 581272 105354 972549 1665484 1361737 327717 -898941 108263
16267.1 108263 1314488 190518 -1406830 -1893620 -1810687 -650080 69450 241719 320356 241923
16255.2 241923 451335 166634 -178492 -539003 -236409 -117761 -149433 -450990 -495512 298821
16243.2 298821 697865 -311972 -892250 -257679 -839957 -1250292 -830835 -553864 -1117464 -1275289
16231.2 -1275289 -1322153 351892 1449723 1332825 573303 543271 716402 310752 -630218 -732238
16219.3 -732238 -1032934 -543159 881469 1595620 656740 -141539 -133926 -122881 -316130 -120199
16207.3 -120199 -315741 142947 632390 55223 308855 420590 232460 -269127 274295 -215274
16195.3 -215274 -644293 -605124 -556876 383638 44315 -873234 -1040805 -432664 189063 1378886
16183.4 1378886 2245616 1575055 858622 4698 37773 1507443 603800 -521208 191518 519501
16171.4 519501 -298967 -1356580 -1551506 -805971 -701534 -1372333 -1394878 -549065 107524 18059
16159.4 18059 343942 439189 -3714 151515 1063761 1496755 1614165 712140 187491 -12530
16147.5 -12530 -454625 -523014 -989113 -144 160868 1190110 764274 1042093 936580 963186
16135.5 963186 1308531 56961 -693298 -401131 -784417 -1147552 -2000239 -1609019 -873831 121611
16123.5 121611 263551 877697 1049123 617031 -536822 -187686 346344 621992 1283289 172255
16111.6 172255 -555083 -916415 -838888 -1246784 -1345596 -494957 -455873 -872838 -1164039 -495699
16099.6 -495699 -150784 -14482 283680 1354774 1634318 1011008 1213045 810909 881199 173713
16087.7 173713 -468611 -742144 -514108 -8165 251548 -28273 -703848 -840823 -380003 -242566
16075.7 -242566 793417 282760 197591 510045 129126 -781162 -326968 998638 1017421 882485
16063.7 882485 744197 1048612 1266658 902802 -7004 -420726 -1541672 -496707 34984 58679
16051.8 58679 505775 483811 240680 -373321 -860698 -822085 -889676 544153 1089244 392737
16039.8 392737 127840 -416885 4127 311002 -321285 -1019810 -644665 -756095 -1048684 -131105
16027.8 -131105 -210990 -92377 -975310 -1869956 -2145284 -1497876 -1126893 -34323 481533 637589
16015.9 637589 -69785 421993 701167 504748 1495473 1778540 884624 -15506 -630282 -53854
16003.9 -53854 663875 626531 39519 125076 -65644 -671686 406050 1023505 1155631 761451
15991.9 761451 1440433 2323741 1528420 660395 497048 -928510 -1723675 -1519479 -2211545 -2075563
15980 -2075563 -1625755 -846409 -1063278 -745398 -410697 -1021986 -351191 268097 747922 1134521
15968 1134521 893416 113565 -874970 -833447 -679153 1233341 437709 -828184 10205 2119139
15956 2119139 1924749 795612 255486 -186016 -488168 243930 228150 -574203 -1377115 -1508124
15944.1 -1508124 448702 524592 -435937 -520378 275856 -93502 -489704 -822950 -523970 -740519
15932.1 -740519 -77301 529675 -278223 228042 437451 393878 1251807 489875 -805224 -1028382
15920.1 -1028382 -654683 55870 -140934 268004 155622 32871 57644 1115804 1561538 1152063
15908.2 1152063 859894 279125 472552 702469 111925 -39879 469496 1033491 1326418 965784
15896.2 965784 185629 347238 169900 645512 79734 -909680 -597198 232776 -364025 -630637
15884.2 -630637 -376013 -948512 -853682 -1142003 -808447 -1195959 -1414288 -693981 372081 490158
15872.3 490158 -475607 -791297 -728251 536898 1945469 1619393 732988 -103961 -136297 503887
15860.3 503887 1434415 117346 -36156 1050140 270870 723113 825966 2190789 1025803
15849.5 1025803 750691 -276663 -63317 -32412 -453417 130235 -241241 -346783 -1132497 -1747707
15837.6 -1747707 -630294 82224 -113678 -328550 -1473282 -2695863 -2923628 -1889159 -806947
15826.8 -806947 -509543 -685296 146232 414879 -42723 -1042721 -1626014 -83675 1659877 856790
15814.8 856790 -143485 -529511 -914907 -140655 917949 1159936 32809 -202781 -287035 -182290
15802.9 -182290 776167 1139276 -231599 -476386 916482 1215816 150459 -1266730 42538
15792.1 42538 1928082 1417390 1198076 291732 401317 1051081 1419105 371479 -859721 -273250
15780.1 -273250 343095 -324648 -367220 1101351 726348 -964300 -1619315 -1080376 -845810 -628808
15768.2 -628808 46414 -329905 -342273 686909 -260465 -597769 -1032708 -65829 413548 360274
15756.2 360274 798468 517281 -105472 265695 -323385 -1116846 -534566 73123 258556 494933
15744.2 494933 174613 23841 581618 1000926 887011 -240418 -402704 448893 272925 -472013
15732.3 -472013 200364 1003496 442083 -337451 -233476 727067 23902 -398816 -1659842 -760824
15720.3 -760824 -1093812 -286571 44473 -426587 -392719 -281019 306618 1265790 1230146 840439
15708.3 840439 -800481 -818188 -727102 16887 272432 -686898 -96202 -222664 -672169 91013
15696.4 91013 1361036 1225499 958843 885555 68635 -759212 -169922 514 -122074 -1116448
15684.4 -1116448 -2794982 -2257510 -1017353 -707238 -1711415 -1600789 -722953 7431 -191384
15673.6 -191384 558070 1332995 1920290 1545832 887836 1538530 798688 479469 -224254 671278
15661.7 671278 1507099 1715120 -125822 -147411 -96159 1015376 1692671 1246264 1094954 562540
15649.7 562540 -692478 -908694 -759250 -1065679 -758283 -466788 248004 -297226 -980186 -712839
15637.7 -712839 85473 247816 -639338 -831871 98224 386507 324004 702119 1588707 2702481
15625.8 2702481 1823010 685856 752988 -65911 -1304619 -872810 -121707 650088 764092 548043
15613.8 548043 280187 693949 -400114 -1858380 -1523971 -1415295 -1336239 -1433063 -982946 -45961
15601.8 -45961 464230 -192178 -451826 21556 -470807 -1242885 -1350420 286957 -112106 -1071377
15589.9 -1071377 -989297 -1119397 -1869755 -1722108 -62031 990202 1868415 2230298 1454218 1643108
15577.9 1643108 1634360 1447183 1050975 235169 -539241 -2006496 -2492705 -955388 24899 -449347
15565.9 -449347 551716 589047 -40686 642864 1518675 1915684 1101043 552198 60600 257223
15554 257223 412997 480190 94351 -122816 -534446 255030 411000 -766448 -1799625 -981211
15542 -981211 -1225700 -2039320 -2268947 -1351240 -659793 227327 1412521 1088760 719152 1037273
15530 1037273 162736 302218 73157 -549413 -562920 -440074 515286 1082890 905920 1120123
15518.1 1120123 1348639 703463 907652 433133 154920 -1041782 -815768 -1528190 -2062646 -1210821
15506.1 -1210821 -411117 -950013 -912020 -1171745 88404 139048 -688972 -802048 -789321 -602300
15494.1 -602300 172811 637756 1284238 1826048 829295 1416233 535452 -43811 1454891 1803257
15482.2 1803257 1391208 874038 857317 1915923 1409119 835568 310288 474870 607023 -656002
15470.2 -656002 -1546737 -1301876 -1536777 -1097133 392612 886928 -288197 -790307 -330172 -668021
15458.2 -668021 -1370353 -1620083 -688247 -1479124 -713187 623670 867066 662305 698435 -228202
15446.3 -228202 -998170 -465344 96197 -451731 291470 883045 652357 420954 905525 912010
15434.3 912010 -138140 -226120 40648 1020419 439613 454387 1191177 682129 305422 -149935
15422.3 -149935 -943448 -1120089 -756600 -334100 -458710 -1014811 388033 533105 1404931 901060
15410.4 901060 381350 -764696 -884619 -750408 -461605 -1021377 -1285609 -1054889 -1134256 -1099262
15398.4 -1099262 7094 -151767 -183182 726638 163020 429949 -21076 -755029 -16984 -94565
15386.4 -94565 486050 1146478 977710 1047455 816239 488527 179831 -241978 -386634 -781673
15374.5 -781673 183380 314255 657200 949714 1364454 426885 -250499 -747067 -61611 -70720
15362.5 -70720 -109662 -527632 -1375717 -980188 -408903 285582 -144879 178277 1030496 -271524
15350.5 -271524 -308243 183190 468183 82992 -860576 -1698986 -931590 -335462 -1024437 -485551
15338.6 -485551 -211998 772229 1045681 1529858 838238 452558 418295 -159651 -1069421 -1203253
15326.6 -1203253 -246767 691271 1665465 1456385 1039704 1383422 1285081 372325 -237902 -403653
15314.6 -403653 -817993 -884892 3637 191221 124950 -180100 -736369 -1616377 -1206972 -1380735
15302.7 -1380735 -915858 673479 371802 286493 1315887 638223 31459 591045 313612 -704997
15290.7 -704997 -1134319 349377 -442795 -1442030 -957957 242872 12106 -478188 -1177195 -1539518
15278.7 -1539518 -1099530 146177 -347875 -187378 309637 837252 1282210 1135610 1594174 1099678
15266.8 1099678 1617397 1053395 -181715 -656770 -35660 1051915 1031582 629980 963865 877436
15254.8 877436 958088 417445 -301255 936469 468860 -1113963 -1918171 -1838745 -1127999 -1147324
15242.8 -1147324 -720250 -751315 -688015 -935746 -1240322 -52642 513491 238223 -626957 -134892
15230.9 -134892 492855 1751582 556574 -124000 -540448 -1143290 -348473 -230383 -261855 -390565
15218.9 -390565 1046707 935593 179931 -685780 155161 297482 1904062 1754553 354108
15208.1 354108 94671 1296239 1404438 455903 -356076 566056 278777 -489196 -741512 -956431
15196.2 -956431 -318792 -230625 -727980 -99405 188894 377603 220633 228476 -108405 -622718
15184.2 -622718 -939059 -1357825 -589566 -496763 -988035 -850045 -266223 168398 -293964 -310846
15172.2 -310846 -239239 -431390 -319500 353074 644888 948856 540972 331333 364014 -188569
15160.3 -188569 -247898 979453 1117640 733651 125466 238709 -487446 -607937 -207097 -369235
15148.3 -369235 -662593 -194324 329234 -528087 77945 -57653 -388875 -139773 186112 -75675
15136.3 -75675 -448977 -346907 -836149 -565907 931378 1089317 -147242 -322905 191316 630313
15124.4 630313 630541 1258312 587795 -281372 -237108 639515 870719 1015592 913700 1013925 1350050
15111.2 1350050 -79232 216449 228118 -410727 286143 281071 -246377 -1395774 -1670985 -571966
15099.2 -571966 -507543 -267433 227090 539921 -239684 -1039288 -668210 -417155 -635610 155697
15087.3 155697 457449 -90259 -1046491 -848485 -256095 -151465 -721017 -589833 -639222 -1393270
15075.3 -1393270 -1079579 -1060171 -503046 -554824 37566 1396186 2340129 1732653 1569883 1257254
15063.3 1257254 1467448 1935996 1354173 -212591 -388250 -31193 -508211 -340291 -1288580 -1297680
15051.4 -1297680 -293771 -15225 -639027 170447 -608274 -884619 -304267 -204567 337643 996461
15039.4 996461 1375537 593775 -42949 -665576 -1212525 173553 2098995 1523613 370519
15028.6 370519 720228 1261919 237575 388237 222469 -1117904 -482575 -410221 -1389908 -1052647
15016.7 -1052647 -714908 -1253992 -1187562 -1987119 -542777 188518 315278 -376310 -1883697 -1478591
15004.7 -1478591 -802469 98474 -790817 1554 -50476 -64098 327764 970549 1162228 1470812
14992.7 1470812 730199 1281455 1543046 2247000 1936621 1054480 -77020 331168 -18564 120217
14980.8 120217 741067 633024 555104 286234 720170 571337 -707326 -907395 -1049045 -946164
14968.8 -946164 -729261 770484 532366 176218 210982 -233289 -250768 -944202 -931349 -1472162
14956.8 -1472162 -1198322 -1225596 -1857632 -1072602 -503260 -1714510 -720423 -117862 185639 758748
14944.9 758748 462615 703050 491905 -220752 797794 233621 -878724 -183235 16346 -955921
14932.9 -955921 -1101256 -653768 1177245 2040279 1735683 1524216 1533419 936069 243507 -19225
14920.9 -19225 -504312 -1050666 -822610 713875 1307619 499968 -67237 318753 9050 -597677
14909 -597677 -11158 575118 1208100 897319 603071 365164 88379 -1061619 -1774923 -1542937
14897 -1542937 -1035399 -1561874 -1253078 -481931 590429 678811 379339 -725075 -52511 740778
14885 740778 672722 739719 2049436 1102499 255099 -502683 -1086414 -765905 -199570 354492
14873.1 354492 879223 860343 558619 13997 -384613 243462 -70408 700719 603233 -895164
14861.1 -895164 -1574252 -1345139 -1011861 254697 -410320 -421234 -1032968 -690733 867300 1107821
14849.1 1107821 14412 -788817 -1747978 -1718552 -689183 -318502 606439 140343 -119043 244396
14837.2 244396 -314216 -117031 607249 158061 808085 1238126 1179692 493634 327597 -383656
14825.2 -383656 -933955 -80671 1259755 1157410 804206 1093051 1110062 1696775 2267425 1767078
14813.2 1767078 315948 -568576 140332 -159605 -221041 -447745 -168175 -189754 -1007853 -505408
14801.3 -505408 118153 -145360 -1233677 -1885400 -1809238 -1136972 -1316799 39379 711439 633632
14789.3 633632 209305 -295072 -812344 -493844 209983 211990 -610347 -1804615 -1490432 -559797
14777.3 -559797 -772215 -946024 -665376 -403878 -866452 -675349 -525107 100583 1249807 2005930
14765.4 2005930 2544808 1572663 616140 689094 547855 -113835 -1044692 -1445336 -443639 1489983
14753.4 1489983 1893562 1416575 909010 701678 -6727 162204 662726 998114 1642066 942031
14741.5 942031 836943 321099 553702 105906 535198 -179280 -643433 -1329056 -2256197 -2698588
14729.5 -2698588 -1496503 94668 -25020 -56570 -586797 -743475 -1877307 -1960018 -953614
14718.7 -953614 -414888 15267 -453144 -1224281 -640662 562524 113306 303899 1264411 2251855
14706.7 2251855 1195618 587192 1387108 1723189 1954863 942398 563245 -534421 -955746
14696 -955746 -1050506 -1269331 -851012 -627544 -1318486 -151231 -410325 -1013219 -193395 -98435
14684 -98435 -595423 -397292 -574021 1412 1122036 761649 1030921 1675657 1315219 1322207 1356143
14670.9 1356143 951357 243572 415433 1103226 168776 -1504351 -2108529 -737602 -330358
14660.1 -330358 -424537 -251844 -372275 237513 -807615 -1827044 -1100433 403667 443825 368993
14648.1 368993 670994 -536019 -1113380 -111136 816528 1247340 1452089 1896006 1589246 650970
14636.1 650970 274334 484039 -407938 -202041 -182208 106425 47977 -28871 287831 229737 -173068
14623 -173068 -176357 -627445 -362373 -694220 -876505 -827882 -683211 1174675 972433 570154 -44726
14609.8 -44726 -544732 181209 -839473 -577213 -949825 -999628 -221908 -818818 -586348 -122688
14597.9 -122688 94520 1158961 101693 7891 -213156 -509706 -627992 -585622 -265742 428937
14585.9 428937 171464 562128 -162884 -22505 -240669 -822521 -1550331 336876 964977 536318
14573.9 536318 372144 -733120 161082 442775 534159 145407 -418785 -60914 -351666 18572
14562 18572 730699 1506152 595904 -289953 235226 1442388 579876 976511 618672 -725596
14550 -725596 -774814 -590021 -711431 -246138 21922 -470751 361604 908400 -142695 80056
14538 80056 681595 810236 769131 865881 558494 496442 974970 848297 637059 826798 25651
14524.9 25651 106806 554731 -990698 -1170207 -1303590 -1363638 -940520 -512922 -767147 -1324774
14512.9 -1324774 -887645 -500767 -863488 -654773 -232037 -841980 -1442228 -608576 -1191466 -808912
14500.9 -808912 -1323984 -1326472 -637015 67531 896734 1341320 1089191 1369855 1386245 627273
14489 627273 677272 110015 -38897 482302 520203 128637 -319722 -302042 159584 385482 149567
14475.8 149567 331800 -92901 103763 526510 465646 253352 282047 -194220 362129 1184245
14463.8 1184245 432069 784248 119226 -931687 -529484 -304613 -247549 -892908 -719706 -352137
14451.9 -352137 -1126956 -1370764 -918459 -930928 -366615 396993 627916 637650 -623746 -1287898
14439.9 -1287898 -11394 698919 653211 1083439 401379 -665881 -324726 695084 631619 1118168
14427.9 1118168 253465 96243 -535019 -511630 -373402 24768 500996 374678 1217044 1765867
14416 1765867 910139 502466 -319322 -1220612 -2252054 -1752856 338515 615327 657790 153257
14404 153257 -9119 -248389 -390121 -54955 790237 641553 -61383 10585 23421 41095 -435003
14390.8 -435003 762967 481738 168578 -99016 -126004 -734755 -222685 190215 1138908 1879330
14378.9 1879330 1646893 526451 -651640 -427225 -524854 396284 423904 297025 218652 875709
14366.9 875709 30568 291890 970988 167401 -76432 -249282 -521435 -1418587 -1920251 -702891
14354.9 -702891 574829 557701 -167207 -385507 -289690 -379850 95009 -312096 -303312 -1469174
14343 -1469174 -2277433 -1248217 155780 1156180 1796507 1734008 994108 593751 -325823 94419
14331 94419 -765238 -2026600 -1123131 67100 193142 -1316382 -2099655 -1005397 -715371 -827858
14319 -827858 482895 853584 -363984 -214349 372336 781787 57731 322662 384813 787078
14307.1 787078 912827 1576303 -319913 -344081 809882 939856 67460 -70373 -989194 -476850
14295.1 -476850 -518558 -1299984 -1055689 167222 943745 409967 379557 1100279 1828511 1118391
14283.1 1118391 -277959 -630317 -1051095 -1236651 -407322 -119981 -182402 694733 343021 707433
14271.2 707433 960016 607257 -369046 -321481 505739 -259278 -133312 -180360 331318 905397
14259.2 905397 574217 -18659 387983 -99329 520524 1111219 1444939 308654 -613909 -905086
14247.2 -905086 -16363 725582 556273 -386729 -1044964 -402695 -15827 146419 149598 33571
14235.3 33571 199891 693822 389126 -685642 -2529577 -1405227 -69829 -670111 -360444
14224.5 -360444 -649055 -790690 -233049 93966 582661 1841208 1845676 1342085 354627 -800992
14212.5 -800992 -479185 -730007 -971032 -1588226 146830 358455 -62194 312178 322289 38765
14200.6 38765 -715231 -975512 -603410 -590564 -1071154 -390527 -534887 20553 513788 572053
14188.6 572053 449034 297782 -23227 -574050 -643270 -651816 -940326 -649075 73857 180621
14176.6 180621 1063200 2017608 1665483 898407 754409 910701 491295 -507353 -1211214 -525742
14164.7 -525742 -273995 -21371 -936775 -588837 -398345 -129456 -649934 1299060 1287047 712006
14152.7 712006 -157995 -300005 350687 -333452 -612958 -279091 572208 -172715 323200 355112
14140.7 355112 -1046761 -810408 -334089 -740012 -601813 790259 1475576 604875 -130686 163541
14128.8 163541 639788 699116 962197 1043223 150031 -1245647 -211922 209263 275031 -318361
14116.8 -318361 284023 -1029218 -161921 1539805 1625106 -664540 -1457152 -1242357 -827767 432165
14104.8 432165 689804 -738081 -451848 -626202 -480244 -104291 -234772 353247 1758066 974472
14092.9 974472 436436 -409770 -1431949 -1418043 -1118348 -1359875 -1306823 -579657 477859 698244
14080.9 698244 602978 328896 406860 440298 1225698 1223867 1123476 351625 157207 72373 386079
14067.8 386079 323206 -331835 -42360 501622 1268805 833296 187413 626520 811649 680741
14055.8 680741 -22976 -559232 -2085211 -2117063 -1139056 -103567 325388 961108 127365 -340591
14043.8 -340591 -658166 -527039 -1050389 -404818 105231 29528 29294 580542 -165288 -97036 -452462
14030.7 -452462 -320687 843207 587947 -772608 -688439 169983 -74722 -111300 -196095 -659692
14018.7 -659692 -700687 -165681 1051835 1671599 295900 -1023627 -924410 21925 647674 673619
14006.7 673619 181421 -114867 142280 307182 -488666 -668105 -833533 -663541 -115457 515745
13994.8 515745 966217 30478 -24811 -720966 -794194 -623018 -238174 617597 729924 627028
13982.8 627028 684974 647080 1082764 1860679 2197325 1202978 -227854 -403711 444298 678366
13970.8 678366 -692606 -913466 -561415 -165876 -367206 -208851 -854559 -261873 189552 -871764
13958.9 -871764 -1072229 -1077371 -1037757 -536808 -365803 497846 705203 300354 -29403 -429997
13946.9 -429997 -683305 -634692 -492045 -322161 -22474 957965 1379802 1861049 1394094 953343
13934.9 953343 746138 1159279 749551 -431756 269198 373669 252966 -129327 474231 -334043
13923 -334043 -977221 -1012894 -727438 -1065658 -959430 -960695 -1296218 -1387515 -766124 837404 1394282
13909.8 1394282 1542172 462028 1301768 1670888 802745 -971780 -1366323 -1181014 -405311
13899 -405311 -615130 -296216 278362 122861 202243 462301 402490 647019 390345 -421398 -662938
13885.9 -662938 -75458 597660 -47188 178356 -527428 -1241407 -399836 29782 748826 -180219
13873.9 -180219 -643568 -143601 -239448 156844 -74098 -46662 -365514 -372619 -297754 -857743 -501684
13860.7 -501684 53959 175900 -249399 -381965 -418345 -804970 -152300 419180 773565 793241
13848.8 793241 713976 -110526 182828 -168439 -514753 398739 813519 266544 -197454 -41185
13836.8 -41185 -221657 -1246164 -1637552 -517483 386597 727681 1027978 1474171 1340545 536084
13824.8 536084 759408 625512 299593 680678 484515 630737 918784 -226339 -640352 -480872
13812.9 -480872 -677237 316398 448244 179393 302844 328793 595803 -439505 -539338 -808369
13800.9 -808369 -1651763 -1714823 -1272701 -247289 68865 114404 170335 105417 30898 305672 2680
13787.7 2680 -173418 -290654 77952 159446 -1004234 -1127509 -562274 995348 1328784 462241
13775.8 462241 34725 -154940 -174543 725319 930275 361215 -379165 -911112 -459949 -488430
13763.8 -488430 -592152 -1401730 -1022345 -809313 -495356 462993 362496 475949 98094 622291
13751.8 622291 800023 1593560 1538688 784379 623120 454144 1075049 901313 43515 -532682
13739.9 -532682 -687130 -188243 232190 246050 997583 852743 -336458 -394274 -1070193 -1355877
13727.9 -1355877 -1468864 -566993 -312140 -999026 -21817 401679 -473786 -1074046 -495963 -668573
13715.9 -668573 141068 518116 1186603 402114 199232 -2511 113698 1072928 1765984 725691
13704 725691 -115704 345378 1609044 1029279 377569 26645 -90081 -711109 -1422272 -1499754
13692 -1499754 -1866619 -719040 -1406529 -713721 -301082 -367521 192833 -324861 -1145955 -578044
13680 -578044 887807 1085951 711022 219797 432573 534214 901408 922616 491072 1949638
13668.1 1949638 2103199 967309 -123212 -1556473 -568398 138340 41909 -380163 -1022555
13657.3 -1022555 -343701 1121662 653051 -112625 596468 125832 -847280 223261 1126910
13646.5 1126910 209984 -586571 -547130 -555378 -310152 -448915 -359744 -740346 -1080383 -1840365
13634.6 -1840365 -1413602 -557781 -990276 -1014363 -935976 -32939 -78928 468894 458164 748631
13622.6 748631 909236 759556 510313 -506217 -757390 205827 922984 773726 1026173 -314288
13610.6 -314288 -1200322 -981792 405990 904747 555829 385826 242139 317839 628154 90959
13598.7 90959 -324877 -1386925 -1007583 640584 1531425 18855 619218 1237841 704278 997613
13586.7 997613 368743 410532 142751 -181096 -152800 -325590 14431 449560 544873 903636
13574.7 903636 956376 769076 327685 -663799 -792903 -473577 495476 337959 336933 -859556
13562.8 -859556 -1040922 -1309490 -838856 -1630928 -1608740 -1041764 -137308 -185572 215131 -330593
13550.8 -330593 -936883 -1175002 546631 632964 -46284 -328011 -154532 404947 1017766 1315719
13538.8 1315719 183956 -462430 25248 -283202 -618177 -827619 -243103 113700 -1205350
13528.1 -1205350 -1607102 130530 1223755 1022625 1638171 595258 560173 -454781 -882050
13517.3 -882050 -1244930 -462453 732926 879215 606726 881293 1130605 1152963 2149485 1001971
13505.3 1001971 -444528 -1089573 -766060 92473 522197 1412979 2205994 1806770 168842
13494.6 168842 -1182254 -1631617 -1273099 -787756 -150114 -205201 315945 1368361 785534 243431
13482.6 243431 -268734 -478545 -923853 -653912 -569083 -715235 105828 192662 -179679 -207720
13470.6 -207720 20863 832134 -705627 -1166353 -572860 -602273 -1105155 -245961 -692783 -636595
13458.7 -636595 -7232 757578 237311 -804687 -502928 -958554 -861929 -269380 289045 711238
13446.7 711238 196989 142163 -43078 -744239 -722701 5855 -135713 214894 1149253 -367132
13434.7 -367132 -289618 979478 1294104 399645 280407 662413 1009110 899301 -292555 -536052
13422.8 -536052 -1514281 -1152599 -213849 591411 1510983 1441904 696509 888199 13747 -928135
13410.8 -928135 -1067732 -263542 -274711 -390175 829703 1182111 774962 -242405 -325811 -870499
13398.8 -870499 -1739602 -899395 -105190 -653495 323378 -57357 469440 822173 48853 -474852
13386.9 -474852 -468856 375446 743828 -59018 -1126979 -677743 -794279 -1137811 234905 1063850
13374.9 1063850 679262 966772 525107 635033 1124655 1167155 1535112 1801898 1651320 759052
13362.9 759052 -491440 -542504 -707946 -2133511 -3590903 -3181154 -1446332 -667268 753200
13352.2 753200 2119788 2216329 202837 -712075 510234 664968 -3895 -487013 -828897 -952101
13340.2 -952101 -524191 101892 -212690 -779948 -860529 -563355 197382 810880 650779 538347
13328.2 538347 493197 1052032 745380 1368083 856438 163538 -405602 -424673 -975194 -499472
13316.3 -499472 -153765 448678 301349 845702 1453370 1095825 138085 -91530 240809 -574080
13304.3 -574080 -1308769 -1168860 -291771 -461510 -628867 -493018 -502285 -757984 -155977 -393291
13292.3 -393291 -1165573 -877842 -429685 -88520 -51236 352613 -33517 -498090 60908 652776
13280.4 652776 622047 103965 623609 1144597 574130 200713 41101 -96576 450954 1044858
13268.4 1044858 1342433 199590 283619 627628 1167758 376207 -87465 -812891 -1433238 -477285
13256.4 -477285 -780644 -767815 -1198863 -1628179 -622722 752048 104353 -267518 -12154 508471
13244.5 508471 735350 1328706 1017868 346947 470947 427569 491355 -697081 -2008395 -1094352
13232.5 -1094352 -739843 -443631 -322630 -77241 394601 -177894 -1251624 -1408314 -206723
13221.7 -206723 512252 866881 -52311 -201772 -367947 35008 561038 1058597 1157578 519400
13209.8 519400 -107297 781545 469328 390754 15090 -345778 197666 -153618 542125 379103
13197.8 379103 -1002248 -1710340 -642564 70564 829518 1673682 1140294 399081 583612 545093
13185.8 545093 1176595 1772502 1772725 1044388 383435 -466740 -1016982 -896869 -1143059 -1739824
13173.9 -1739824 -1688841 -1363574 -885798 -360350 -905599 -780624 -137501 817264 902414 575402
13161.9 575402 183688 -361928 164901 1403214 1438277 826885 -1078461 -1811766 -2508349 -580025
13149.9 -580025 -241324 -208779 815371 1330509 1395048 1742797 802827 -55763 373911 153055
13138 153055 -882333 -940740 -832151 -1052068 -651001 11310 268716 192968 903721 691179
13126 691179 58902 -11549 692310 698066 -218812 -577140 -522512 -729229 -1013648 -1696544 -2035764
13112.8 -2035764 -1390755 -939371 278315 1591800 390791 56992 -1185277 -912394 -79823
13102.1 -79823 980841 1655418 1463994 -489935 -550021 -417781 693206 1243698 219299 -124462
13090.1 -124462 261725 160483 -211878 -685875 -640863 -389593 755686 1454057 1806731 1501187
13078.1 1501187 677173 -939205 -1456383 -930795 -36662 392614 -397416 133376 897308 743708
13066.2 743708 940632 1346834 496742 -1070016 -1012382 -696795 -625402 202210 781627 141962
13054.2 141962 -342635 -255084 -342026 614874 1121906 609149 1049556 1209383 1353734 204135
13042.2 204135 414030 1499635 726452 -100673 -14582 -948117 -1537226 -2176367 -1521545 -728942
13030.3 -728942 -466187 -121288 82974 477339 908 -589991 -440503 -418540 -1153557 -1478389
13018.3 -1478389 -1625506 -273239 488131 -350737 -352836 -444704 -375871 -684815 -358415 781476
13006.3 781476 216998 63040 704671 168349 1106194 1055296 831987 -982799 -1905259 -1540211
12994.4 -1540211 -1814534 -1132899 -14544 623369 444365 1001163 1639068 1722939 1821308 1335274
12982.4 1335274 483158 -847062 -1090988 -811546 622000 1548176 1441069 1445780 1311780 1923807
12970.5 1923807 1230349 -154229 -915874 -1296494 -439848 -737537 -428104 -253685 124581 -555657
12958.5 -555657 44212 -97129 -592846 -255930 136000 -755703 -762038 -270903 612941 515024
12946.5 515024 608259 160779 287569 658053 647835 16595 -871337 434569 1052435 995554
12934.6 995554 -382581 -1160021 -1472823 -1327867 109870 732848 1096003 1259580 822659 13551
12922.6 13551 50720 117374 274367 -842542 -670029 -514535 -227785 -1150740 -1070073 -1000408 -654264
12909.4 -654264 -782698 -828136 -419710 329523 -703182 -1012689 -1068594 -338568 -684306 -938678
12897.5 -938678 -1745040 -1037133 -631752 -476303 -58358 246197 -464217 1198818 1532994 504178
12885.5 504178 420914 650246 1893869 1353416 543591 -145927 -1116377 -932683 -54961 463514
12873.5 463514 555960 223435 110212 -506450 -595746 -395108 402250 -113669 -271653 174903
12861.6 174903 -980573 -1226930 -757452 424717 724632 207925 787798 762169 753508 1111190
12849.6 1111190 1228113 418250 -733781 -987341 -358903 296774 681273 826588 887744 1328920
12837.6 1328920 956046 1243681 39492 180663 160562 897320 1186874 861199 12313 165858
12825.7 165858 -449322 -676785 -526806 -535423 -848924 -299036 -286911 387540 1175392 922619
12813.7 922619 -272378 -1618405 -1854608 -1559439 -1288720 -372341 -317605 -545713 240419 360862
12801.7 360862 690335 1311855 1841938 790559 744481 1223682 1882806 964564 627572 1039270
12789.8 1039270 214348 -1132903 -1286680 -979482 -1005857 -143997 73593 -596300 -783149 434587
12777.8 434587 1244355 941353 -278176 -1017418 -697354 -515315 -682588 -1284933 -1662759 -1133866
12765.8 -1133866 268152 -184725 -434890 -384122 -1317573 -1394315 -151270 50166 114845 574371
12753.9 574371 1452050 697792 876488 592073 624710 291620 -64369 -1388496 -342426 1050111
12741.9 1050111 1126482 885137 -118844 -748761 -512263 134734 439361 311105 -217527 246373
12729.9 246373 110304 -221308 -598628 -133362 -70147 188914 7111 -79619 -143756 -911851
12718 -911851 -1295040 -601729 -475724 -257028 -406456 436160 562400 578467 383074 -1066278
12706 -1066278 -1048727 -676102 -543016 -953388 -566673 493976 1236548 517040 360216 624517
12694 624517 -353464 -720063 307304 789167 1938720 1217741 536648 -575666 -844952 -59321
12682.1 -59321 311526 908151 1308931 1331193 1329869 174732 -377816 -795250 -659638 503993
12670.1 503993 -142120 77505 520056 344909 -169583 806989 1008367 763939 1309867 2729148
12658.1 2729148 2932743 2087611 1876748 2066347 1447860 2594057 4577858 6679649 8876814
12647.4 8876814 12869730 21517963 47553030 116865880 79371195 27942908 11899423 5854941
12637.8 5854941 2535007 1349328 -74445 -995727 -250625 -258015 497349 1058157 1230345 116612
12625.8 116612 -19862 818875 1012030 826893 -217213 -792263 -1292087 -737195 -256407 722396
12613.9 722396 553491 73355 -770393 -1122832 605197 522243 -139396 -1133250 -1135899 -753118
12601.9 -753118 -88828 1255889 1745473 1471326 610055 -66292 602363 -626609 -1030258 -946697
12589.9 -946697 -1367268 -1624285 -1106395 -1071622 -410217 -760334 -728268 -967192 -481842 363860
12578 363860 -537659 -1349277 -1490333 -1626682 -259515 -17936 722144 1795850 1563276 1237384
12566 1237384 1625236 857650 560405 1234559 1337093 4513 77270 743984 572261 -226138
12554 -226138 713790 1394188 1097167 717356 813043 450606 1019292 1680660 1211696 133707
12542.1 133707 -1354239 -2008865 -1428182 -308240 168158 -8496 -1450401 388510 205005
12531.3 205005 -267625 -971234 -925066 310029 823422 -15419 -1197990 -1452728 -480728 -679015
12519.3 -679015 -1006870 -605379 -585172 -1505504 -1075812 -1460452 -1314418 -694388 -1426926 -488579
12507.4 -488579 -189181 -255841 -316583 612550 1169772 1068356 602061 -505108 1066737 1007290
12495.4 1007290 72555 171714 1121963 1585141 500790 180645 -1072581 -1353508 -174275
12484.6 -174275 103611 683558 -9106 -395874 776973 847608 410347 677218 -387310 452151
12472.7 452151 1867885 1172217 1905378 1496139 453942 671253 1027675 845607 357980 -288629
12460.7 -288629 -30428 297424 -74853 -1058745 -2567673 -1853094 -816213 -627300 -884006 -184193
12448.7 -184193 -137990 -1219322 -250172 291684 -178927 -385673 448209 -156670 -332115 565754
12436.8 565754 1386500 397763 423302 129625 884511 883741 136474 20763 -796680 -1596314 -751565
12423.6 -751565 315598 760547 -130904 -59450 -118001 246603 743014 869234 431522 1023029
12411.6 1023029 39451 -1116447 324075 509781 -93747 -356295 -472434 143327 207430 -199544
12399.7 -199544 735489 449605 -208426 -128482 301758 11118 -303763 104 -938533 -1358785
12387.7 -1358785 -948002 -29954 -949620 -1836374 -1311253 -1197903 -380206 232242 209015 -216858
12375.7 -216858 158559 -142313 -475532 -224867 -5097 -185358 -34483 66781 153492 -249293
12363.8 -249293 -188926 -549418 -1333714 -280402 -210122 -1296189 -502649 404515 -332446 54104
12351.8 54104 532572 81631 1736954 2001826 1714170 1807816 1864914 490094 618963 578389
12339.8 578389 623743 -669172 -1052103 -774127 21153 558260 974661 580860 351907 369299
12327.9 369299 -389875 -524924 -130384 -78896 424164 737169 893701 -24371 -336829 -164104
12315.9 -164104 -156396 333520 -636224 -1035849 24827 501326 965567 1136718 1962002 2148651
12303.9 2148651 787742 -783851 99186 1297202 460035 -1053820 -910875 -615235 -453134
12293.2 -453134 -213480 -167091 -659747 214947 -28240 14520 -2075 -1147652 -943445 -2190381
12281.2 -2190381 -1984114 -1162426 -657149 -671458 -896519 -1489222 -1278913 -370546 446715 -35619
12269.2 -35619 -466132 21409 648802 993669 592907 307562 642333 407528 602306 816223
12257.3 816223 154114 666630 476000 -359218 -252484 131843 351228 1494887 1274785 231538
12245.3 231538 -175353 -29323 -63281 -212264 871402 -132502 -399574 -297880 117177 217409
12233.3 217409 -324840 -422777 -1175003 -946664 -760670 -934207 -443959 14947 -432386 -230792
12221.4 -230792 623666 722585 -152395 38294 -452581 -787673 -1012905 -944529 -658977 568364
12209.4 568364 1325092 1016148 1702300 1573298 1190169 480330 -25005 32882 487779 488996
12197.4 488996 645161 443801 -390966 -1138576 -1325044 -1158119 -788987 -446134 -21684 -494617
12185.5 -494617 -48444 -122005 445526 699906 896882 730259 158510 64079 -3935 -46149 -438924
12172.3 -438924 -392649 -1543015 -2025256 -1000082 159388 111444 -993857 -685614 63812 430205
12160.3 430205 1221163 164694 -1238957 -861110 799883 1200898 1152122 602815 130803 -968010
12148.4 -968010 183834 705587 1315816 1008227 1088277 681643 324265 543817 759693 40496
12136.4 40496 13580 82204 421106 -43959 -361969 -310432 452233 934163 -573131 -1393687
12124.4 -1393687 -1513982 -2480144 -2003886 -1619967 -1401415 -1447324 -1016947 -1102050 -416811 -308244
12112.5 -308244 674245 1613625 1539159 947040 519820 1446223 1321549 1287525 1351272 1627229
12100.5 1627229 718050 20447 -540018 33122 1588347 1548849 -154701 -231791 -49651 549857
12088.5 549857 993864 704592 577113 -1038750 -425548 -421570 -667512 -1355027 -2046098 -2121253
12076.6 -2121253 -1677495 -200675 781625 231469 172680 -369549 -376574 -247102 392994 159110
12064.6 159110 322741 73045 148356 -14455 1055888 849042 95437 250079 -288337 53863
12052.6 53863 1349101 813402 -435099 -1377710 -669453 102139 852545 2702 189700 150068
12040.7 150068 -668371 -1622695 -1571645 -395921 -63496 -80722 -541786 -1293178 -876608 -704765
12028.7 -704765 95580 1786726 1568003 -470336 -691553 -382680 -889430 -315622 1186212
12017.9 1186212 515040 169798 -1143223 -65370 1213214 816657 1471187 2537801 1367334
12007.2 1367334 1149728 1268725 442175 491054 -167149 -492934 93666 -754235 -1348422 -1637707
11995.2 -1637707 -996297 -1396461 -1391457 -1003825 -417313 -322927 -666938 -443481 -538550 174209
11983.2 174209 769393 242792 -168252 -1393232 -730229 63387 350950 597720 -99722 -455538
11971.3 -455538 -597951 904293 1471588 713870 1223448 1247962 1100449 107023 556268 165704
11959.3 165704 411116 750393 367620 -773536 -953684 -378612 -419460 -1147342 113889 -79452
11947.3 -79452 14242 227306 299017 559817 -613670 -804397 -921784 -924621 -305197 148471 -164223
11934.2 -164223 612368 360378 -319485 -104507 626001 484813 1234343 1822066 2110843 1875475
11922.2 1875475 1674619 1752626 1349599 205520 -614571 -676182 -568892 -80010 -1094560 -899049
11910.2 -899049 -81111 365199 313519 -568419 -914873 -810672 -396560 -345184 39810 170336
11898.3 170336 -135329 -325284 -313864 -607892 -479245 -297408 414193 -281486 -1361706 -1300427
11886.3 -1300427 -305868 228822 1617649 1276885 352129 468998 742956 210669 -972275
11875.5 -972275 -1017557 -954763 -2117983 -1384059 -728824 -332098 -1425277 -1052533 137693 1384218
11863.6 1384218 949799 720939 296892 574985 804402 163562 -1101563 -1342465 -1223606 -1440604
11851.6 -1440604 -629784 1249514 1285632 1346120 1332342 1376220 2231235 677811 56918 -134171
11839.6 -134171 346344 -929402 -1272025 -1612419 -1391618 434450 753489 -115348 -788363 -480601
11827.7 -480601 -709159 -1566958 -1729873 -1307404 -914900 -795091 -409397 333963 1366584 799691
11815.7 799691 969054 879380 96803 885183 1294499 1583447 979620 769733 992001 652975
11803.7 652975 523186 845314 1768431 2554422 1427136 138922 681055 438805 714992 -904293
11791.8 -904293 -558946 364424 131283 129104 -32424 -955112 -1005976 -1121373 -1038328 -100677 521522
11778.6 521522 647346 -700584 -1280271 -1692388 -1520167 -949350 -802294 -1169477 -493481 -537919
11766.7 -537919 -1340626 -1619445 -1916597 -977781 -658199 -356895 -558440 -153644 137025 481143
11754.7 481143 1596332 1589223 1283344 935653 313430 775933 764241 260856 -1152792 -754145
11742.7 -754145 -5305 -272228 1281790 1914776 1497194 1465819 786237 991220 -478228 -607508
11730.8 -607508 -622480 -359413 330750 546940 -121579 267694 720861 -1064054 -517653 -226345
11718.8 -226345 -146639 413342 -632654 401949 -428770 -981435 -1105924 455267 1078195 156381
11706.8 156381 -103779 -484596 -974744 -1123565 -1174644 -911425 -993553 -6002 459589 175931
11694.9 175931 -441786 -252882 -205431 62938 -203748 -167086 -53010 611974 110817 -8011
11682.9 -8011 259825 115980 996840 538664 830654 1206827 955051 1137579 1362027 1904522
11670.9 1904522 1658916 1092869 665787 252982 -231011 22 184409 105410 -455921 -633720
11659 -633720 -139100 -784022 -229057 1086098 762150 269704 -488355 -752420 -981388 -1653136
11647 -1653136 -1388118 -2080569 -2232600 -1198756 -797152 -330335 121612 -196691 -1220201 -824996
11635 -824996 -724085 -851220 -583180 -849106 -52042 806801 1036917 549205 170156 116041
11623.1 116041 857784 -22720 -405827 -178183 -322637 107031 -12655 321858 -433221 262055
11611.1 262055 721383 1242516 1358743 434633 -840993 -1130940 -1486296 -1473233 -1035963 -307546
11599.1 -307546 470156 1005808 2345667 1631220 -86814 -696166 -138455 1399286 1498423 1496871
11587.2 1496871 2430169 2577519 1222692 385413 232278 93595 300388 1451837 1345521
11576.4 1345521 1282281 1571157 1018836 1039101 1410451 2723924 1632049 2152091 2625560 2044876
11564.4 2044876 1810240 1905473 3210097 4458020 7644441 12477851 19766559 39267773 104973870
11553.7 104973870 127774390 43607960 17644950 8609798 4538018 2763720 2426983 970937
11544.1 970937 803321 32529 192112 1639997 603412 -628446 -1564997 -1430876 -455889
11533.3 -455889 -464223 -598702 -218922 263817 418076 339235 -175897 -103711 803242 677896 1531640
11520.1 1531640 2406040 1792298 603806 57220 -504766 -783083 -341952 -877946 -1290664 -332117
11508.2 -332117 891551 621368 1079250 1019726 967044 1470914 923074 531005 -62210 -1731801
11496.2 -1731801 -1876619 -1524241 -2106318 -1823096 107231 798278 -1161403 -1627522 -1556734 -496942
11484.2 -496942 -628785 -914738 -1456604 -533483 -240778 -337777 264220 155041 547917 -171118
11472.3 -171118 91962 -345715 -372472 913908 2145182 2309586 982435 1281160 1878765 1492835
11460.3 1492835 1267249 1007194 65468 -1024476 146625 233397 -389470 -739764 -634382 -104686
11448.3 -104686 279898 -381766 376340 -18164 -720311 -713053 -975851 -383117 12936 -522836
11436.4 -522836 603978 422265 139753 365761 -1096692 -1779614 -1236227 -1658891 -1558049 -1129238
11424.4 -1129238 -1294278 -1124800 -36217 138131 1341644 1503033 1407426 199453 -660094
11413.6 -660094 503720 461352 -314508 228939 1378455 934744 484275 953936 445359 -93899
11401.7 -93899 282636 -12538 -112488 -482089 -148219 -185853 -740122 -857727 -334607 -307653 -654412
11388.5 -654412 -809789 78264 -723815 -535039 -379462 425881 1428955 1521364 1174467 1106976
11376.6 1106976 386678 -1045801 -1451140 122139 1549468 1260265 354896 416539 969465
11365.8 969465 703269 822873 590793 1089354 355814 95338 1488211 1116314 95422 -122576
11353.8 -122576 -52207 -1190305 -631218 -569852 -779731 -182956 -436367 -626804 -920730 -1274402
11341.8 -1274402 -1256872 -844090 113325 -331448 -1172118 -741892 -224953 60164 38667 22192
11329.9 22192 613832 529080 -1397495 -1465634 -1278322 -597875 -313062 49180 437911 275124
11317.9 275124 602968 516765 918291 980006 1549947 1374638 336963 252904 109840 -34703
11306 -34703 -231633 -456552 -753641 -353077 -168111 62116 1261582 742744 2059434 1586459
11294 1586459 -812741 -1861692 -1236330 -1142409 -471604 14443 -1341443 -971524 11208 121397
11282 121397 643799 1034600 1153980 290633 300295 743828 262422 775252 516329 107418 785301
11268.9 785301 631778 3541 -987677 -525114 -554358 -389442 -837831 -852914 -597225 -237089
11256.9 -237089 268351 487785 280912 -585967 -138197 9049 -624613 -451810 -149110 -171308
11244.9 -171308 -635983 292775 -486835 -1282291 -387864 -58481 -493177 809734 1536372 1024374
11233 1024374 -61632 -236478 28336 -425314 636434 1434978 849499 799446 1357375 427805
11221 427805 -440179 -37740 933927 1074829 57704 -382761 -1911796 -1319695 522800 823025
11209 823025 2040400 843301 406964 1012209 945749 -23058 -913956 -80382 -452490 -1157960
11197.1 -1157960 -923233 -1255409 -1204829 -490194 176892 -614496 -380136 -389835 -943065 -262980
11185.1 -262980 1674368 805516 -554649 -239693 103019 -364984 -462130 -847689 -1296531 -1014080
11173.1 -1014080 284063 400936 567725 602177 1102 -540037 936583 126472 -502318 -401137
11161.2 -401137 -243929 735911 -71595 -1209472 -1707857 -1000427 -1148192 -442866 16247 -141656
11149.2 -141656 -363059 664486 1173390 1462806 1589736 221773 -482922 -1303194 -1219471 -218470
11137.2 -218470 881908 1785338 1021284 2191673 2011525 1775844 719573 127492 47688 -324878
11125.3 -324878 -319070 221102 5377 88520 -164325 -515493 -817053 -299883 118588 93358 483666
11112.1 483666 84129 207853 -1040164 -368096 -474123 -1336518 -2339946 -1053146 -817751
11101.3 -817751 -1097344 -1588283 -1357992 -84422 -153765 516359 900042 939748 2022951 1289360
11089.4 1289360 -216873 -555434 -301321 487876 1189245 877857 -213977 485146 456119 -507701
11077.4 -507701 -504194 697414 1132038 1552794 853918 1588538 1080690 -72925 -161837 427404
11065.4 427404 1169426 -129225 -1681467 -2200798 -2771027 -1167039 394613 172248 785174
11054.7 785174 864612 198707 260447 -93378 -9026 246768 -112599 -838909 -492082 -1119294
11042.7 -1119294 -1502138 -735229 578921 1247237 1064947 677439 -713463 -1648457 -1337354
11031.9 -1337354 -587676 -582961 269872 886589 1166168 1432558 1789471 1200533 -222820 -390616
11020 -390616 -474983 -716992 95150 419771 -433566 -46959 -670910 258601 987516 622891
11008 622891 617157 270438 -565713 -652952 -528253 -135440 219320 289386 458169 1095955 774974
10994.8 774974 693593 -431112 -407731 -370986 -240363 -419706 -1313125 -843568 -756829 -512152
10982.9 -512152 -358433 -440692 255128 678903 1123706 843829 487315 920047 1275441 -68418
10970.9 -68418 -1596870 -946098 -614364 -721603 -347286 -1199886 -1056035 -621669 -718800 135808
10958.9 135808 1114746 1012078 797254 1063231 823900 488931 -294996 -1448395 -793238 443811
10947 443811 786340 38702 -1030884 -1235094 -119714 -812958 -856763 -1196485 -793227 592100
10935 592100 1553289 1390835 1031280 532640 554628 641621 17939 -449414 -11646 221403 -354704
10921.8 -354704 -645849 -587299 130348 70558 -401481 -794777 -212012 354325 468497 28889
10909.9 28889 503306 1427322 927841 -35310 -608434 46911 -175137 -543507 -563686 -113138
10897.9 -113138 125221 1024855 2414043 1164398 297346 -113154 473267 420197 275731 -655691
10885.9 -655691 -1621877 -1440010 -1498459 -2122515 -1820715 -1482670 407957 12242 207481 34573
10874 34573 -464161 -186436 -275096 -221866 643316 659369 372025 901450 1167405 522073 -215990
10860.8 -215990 59941 311654 1030874 1003655 811326 1815134 1587755 600298 -75406 -254679
10848.8 -254679 209469 647049 -165774 -624318 -720515 -774879 -741473 -941310 -696935 -769842 -657272
10835.7 -657272 -832182 -595781 -599359 -139109 -681572 -77190 -507097 -1369696 -1149057 -582550
10823.7 -582550 -335955 577848 1428589 1613834 713168 387451 816753 975404 -23861 -852466
10811.7 -852466 116206 842074 -270632 292413 786472 444101 -304686 -868426 -426948 86114
10799.8 86114 681158 282048 -116332 781802 328810 793631 820659 39636 -249117 1164098
10787.8 1164098 2298092 1545085 944192 29073 -327284 -448559 -1591437 -879230 -933740 -522285
10775.8 -522285 386767 1243742 267115 -432279 -1146613 -593136 -583049 -1435450 -2068305 -2402118
10763.9 -2402118 -1257142 654416 667953 73187 -865302 -1272041 -547631 -244022 -243056 5553
10751.9 5553 806701 1235659 -359626 -155427 478200 409679 -423416 -1264449 -1269075 -822092 1004651
10738.8 1004651 842547 373958 943200 1229778 1131547 1127975 1177994 588406 151375 424469
10726.8 424469 1146714 1072679 -43037 646792 92270 -241784 628641 900542 851199 -10134
10714.8 -10134 -188994 -645347 -351458 -488132 -947573 -262518 -438373 -752582 -1377936 -661166
10702.9 -661166 -1251598 -104026 -518678 -548325 -556989 274863 1098151 -311177 -721439 -924595
10690.9 -924595 -43277 274122 491106 421782 -334129 -1059275 -1107478 -289721 66028 -56253
10678.9 -56253 -259490 -477797 -406106 -575374 -403961 708018 909285 878609 781649 927365
10667 927365 666063 -76286 92249 1018586 877690 27502 -166124 -950898 -1236550 -353057
10655 -353057 -125057 -136273 -856768 -266648 -154235 650423 668160 1037844 -69586 -982746
10643 -982746 -780235 419057 406640 633305 -356091 -754073 -351655 -1256998 -1426630 -768060
10631.1 -768060 -972443 802691 755804 -37983 550741 1242255 1054646 1432821 1371625 872854
10619.1 872854 639087 863800 777407 1280948 1041720 -390308 129259 1552565 846822 286098
10607.1 286098 -960723 -418924 -40431 -391481 -1047661 -1362093 -773188 -886021 -743382 -1492715
10595.2 -1492715 -1198709 -566460 -1404492 -660649 -93128 -24336 -177374 -1331199 -922007 -973477
10583.2 -973477 -156891 1544267 1297096 610499 274382 1078875 900191 82389 1015091 1982359
10571.2 1982359 1456535 1472143 591792 652155 16662 -967642 -224948 -514198 408932 604323
10559.3 604323 -165375 -211983 -363293 -138197 -558297 -224129 -439684 -16712 445406 148329
10547.3 148329 1212729 1181664 1131128 429997 399192 62317 -900097 -1103828 -585214 381006
10535.3 381006 172949 -110207 -546144 -551025 -1088095 -1185361 285371 731816 762664 655291
10523.4 655291 219716 58556 -209024 -845610 -1313455 -1768365 -2020551 -1557543 -1117953 289791
10511.4 289791 879041 1545466 2229658 1194889 -899097 -1153721 -734423 -746948 -1225065 -921079
10499.4 -921079 -1074731 -845694 233193 71009 553710 1175621 1217282 764330 623712 452352
10487.5 452352 74241 -847848 -592206 347130 1255080 1656811 1155623 894332 -19041 -188209
10475.5 -188209 77444 -280435 573509 -938334 -894489 602597 812135 247888 10587 -880021
10463.5 -880021 -192293 365364 -272062 -593914 -365570 165517 931509 388307 583122 1219600
10451.6 1219600 1339661 2020269 626125 -1005400 -1779589 -1212157 -375674 -311891 -829478 -960200
10439.6 -960200 -1100483 -718661 -1140037 -740694 -978924 -880499 -968273 -1247568 -564305 -124818
10427.6 -124818 86344 161704 -143335 -1887869 -2067111 -645294 -147578 -898103 184510 435996
10415.7 435996 197313 885117 1386395 1857589 1595755 935163 1003178 965476 1381532 837138
10403.7 837138 -39184 -478148 655797 1886536 2167564 2614407 1516862 632072 271267
10392.9 271267 691167 572300 -483311 -1570557 -2298487 -619111 334994 1246669 1751279
10382.2 1751279 1197365 -336962 -927490 -1447728 -1079255 -987388 -939847 -993040 86414 178010
10370.2 178010 -158019 48770 -60012 323934 343212 -901624 96597 293722 -695299 -400598
10358.2 -400598 190141 -112349 -352999 248709 -64091 -1090953 -1539275 -869364 386793 51159
10346.3 51159 -396303 111129 478953 325071 -9868 -397409 -698777 -1182466 -1669173 -824911
10334.3 -824911 -774551 -132482 1010487 677265 550075 -150425 -528900 -490098 1015641 1481850
10322.3 1481850 1774502 1971336 1077260 -414847 536381 181551 505042 804310 441745 -813505
10310.4 -813505 -729774 -435365 -904585 -946856 -1287315 276820 261829 -188313 294680 -435407
10298.4 -435407 -911717 -870673 -1170470 -836377 -291265 -390411 649520 595141 1530690 979303
10286.4 979303 212664 41952 -363697 533817 1115639 1068001 434160 424565 229951 -828385
10274.5 -828385 -322720 -330905 -550536 292010 -161873 94477 -1038798 -902533 -845885 -628899
10262.5 -628899 -1009440 241466 346569 -491403 362203 628950 566492 900644 1077943 1443755
10250.5 1443755 857368 222645 417660 739651 789613 487620 -2173 -423766 -631618 434995
10238.6 434995 224833 -922904 -1238765 -765159 -1134059 -612943 -123432 -113746 70396 40765
10226.6 40765 -534750 -1170514 -917299 -1867493 -1356183 266857 350406 419937 86945 -560228
10214.6 -560228 -700620 -179386 923374 1330712 756645 1193883 883573 525777 1121038 846011
10202.7 846011 -376670 -1231464 -466670 676455 926838 79887 -381358 -138456 -554749 263908
10190.7 263908 1001536 1020050 690822 117754 -78048 603446 236745 103775 266160 562722
10178.7 562722 178545 -421969 918680 579683 783883 1077220 1241875 -388557 -595627 -1539159
10166.8 -1539159 -2432894 -1406696 -820838 -747719 -1244065 -909996 -824936 -588262 376736 182416
10154.8 182416 150211 619175 492625 846947 1590223 1633747 1234312 611513 -99329 -960830
10142.8 -960830 -1000521 -136410 233106 -1235784 -1195003 -482874 355828 361109 203283 -394519
10130.9 -394519 -299755 60566 674399 556022 969966 687786 -94314 -1218424 -1529653 -2067163
10118.9 -2067163 -2347313 -1975461 -1350795 524192 994803 248684 616630 1825944 1267930
10108.1 1267930 1070984 9707 160811 322925 -899927 -1309420 258223 826296 1309011
10097.4 1309011 903221 -109610 557438 1145722 1665369 517122 -612333 -303199 -274586
10086.6 -274586 -879892 -1094301 -1091385 -1450575 -2055901 -1314024 -1087650 -355776 24315 593721
10074.6 593721 341668 -39651 -26552 702588 960586 1738168 1690155 828511 159652 -1550484
10062.7 -1550484 -1774109 -1158145 -1171062 -613033 58167 1385590 707597 156827 -337684 -388448
10050.7 -388448 367461 1617178 2078833 2265183 2055563 1123765 378259 349349 124210 -399777
10038.7 -399777 71883 -1929 -788915 -61927 -83460 -231283 -216241 224422 119534 341924
10026.8 341924 174194 -829137 -1073532 -312914 -1650710 -1359947 -272733 1013291 1836340
10016 1836340 424145 -1707965 -1662952 -856833 449069 455177 915260 1322865 1251951 682819
10004 682819 -480976 -857052 -608278 -540030 -903903 -1260064 -546521 132186 -196978 -692825
9992.1 -692825 -1591387 -1085070 -897449 -634211 81311 989892 769815 -419523 -524366 -998797
9980.1 -998797 -1903348 -1424755 367167 1276011 1131069 915540 780773 794282 291069 -41789
9968.1 -41789 -44926 634657 889244 247283 732382 253654 -421990 619088 979791 987003 1355880
9955 1355880 1164351 706236 666240 804112 1720143 1968038 388702 964394 1406745 1421138
9943 1421138 947886 252318 -987020 -1973059 -1630958 -1349412 -2263831 -2629447 -1572156 -1892915
9931 -1892915 -886317 -661550 -1352947 -1388959 -1388528 -854338 -423417 -555741 407007 278716 -538815
9917.9 -538815 -73992 -420875 666837 735013 -372323 -1070761 -536322 485769 -900408 -926500
9905.9 -926500 344554 1422958 2382680 2112477 1700660 616962 756849 1299171 1284656 2107238
9893.9 2107238 2304541 2910902 3033384 2891127 4655353 7341628 9942498 15636326 30263108
9883.2 30263108 74375275 113620280 43662440 16499743 8212378 5446371 2805094 1667153
9873.6 1667153 1578908 1169985 -36448 -1385412 -950415 -1156779 -1662388 -2170289 -1019601 606362
9861.6 606362 282490 57624 -440675 208135 -298072 -306701 -674020 -465420 -1139 -185888
9849.7 -185888 343842 -328956 -1136567 -1116614 -1149719 -666408 167598 247570 -135752 -756770 -359608
9836.5 -359608 -817875 -1905940 -2513191 -201364 694585 512921 1435565 2008930 1725943 1002800
9824.5 1002800 308042 104653 237459 -416569 -202277 541759 919750 1134926 901571 -75317
9812.6 -75317 -823603 -1226105 -331286 7680 23167 241132 159165 231976 197130 -511953 -326046
9799.4 -326046 200674 -529943 573027 536170 806517 417686 -158670 -55108 -616438 -93565
9787.4 -93565 -443918 -511514 -640771 -995455 -763114 -674506 136955 800352 1247153 340297 -632483
9774.3 -632483 308711 767519 -21603 -860135 -812984 -1404985 96043 626479 499612 162577
9762.3 162577 -982612 -1589881 -574111 21631 -82660 439841 203322 1171036 2136902 1349795
9750.3 1349795 990457 812877 725085 -21144 -662680 325832 838406 87475 197239 -259889
9738.4 -259889 -18120 -580370 -1250253 -996242 -758593 -1150632 -750974 628616 682332 -137314
9726.4 -137314 -412697 -1676000 -1770521 -616589 355295 520825 1124618 735365 650119 908172
9714.4 908172 982448 -451907 -1015811 -71282 -57970 -758 -104270 152492 692263 1143881
9702.5 1143881 -290321 195141 775933 107178 -113327 -1009518 -643785 22040 -321147 -184528
9690.5 -184528 215526 749561 1170130 169573 635108 858216 63665 -368192 125083 193287
9678.5 193287 -572046 365734 1040500 54791 -152307 -143964 230579 230863 -579456 -814913 -740280
9665.4 -740280 322823 13250 -1293007 -1954023 -1403917 442985 480812 -963101 -1189618 270456
9653.4 270456 1229601 907624 -636806 -773935 -88878 -967554 -994669 -596538 -319273 1405590
9641.5 1405590 1005216 999764 1925831 1453598 142903 -365628 375926 82520 -220354 1131111
9629.5 1131111 1830056 682724 -748984 -1009439 27909 365862 55661 -543648 -956044
9618.7 -956044 -516597 375946 -662922 -369816 -657681 -823213 646500 1207720 -595022 -1257482
9606.7 -1257482 -602307 -1007052 -577922 -175550 -43447 -346473 421089 1366621 925818 -127993
9594.8 -127993 -1303712 -984376 415803 1127205 649253 757065 840490 -135616 -247604 543566
9582.8 543566 -552503 -54631 989834 1215892 1131230 1280658 1571250 897780 -20009 -492963
9570.8 -492963 -177505 -250309 -87887 -54187 -77993 -1276152 -1132681 -1292788 -1887768 -1328817
9558.9 -1328817 -614788 -292677 -332572 -1255761 -2331887 -1812086 -961474 -1445253 -1201379 -866403
9546.9 -866403 -501394 373638 552133 524405 1057256 852480 1049274 1113725 470851 899069
9535 899069 1325386 361934 228795 1165639 1031657 737735 553635 -361045 807045 731284
9523 731284 -314317 764905 969659 763928 -197459 -608879 -171030 -324237 -55471 -160798
9511 -160798 -311616 -60190 587543 735958 831157 1286357 954503 -101508 47768 -662836
9499.1 -662836 -1115714 -1515988 -752513 -1009803 -206937 267079 860016 390216 -190657 510397
9487.1 510397 455235 -214941 423533 449049 495816 -48644 -782853 -111350 -239664 -311730 -136130
9473.9 -136130 74191 -900626 -1193088 -538739 -232750 -729764 -1357293 -783511 -160737 317951
9462 317951 543508 -689895 -821212 -399670 220193 814743 530174 1329796 829396 1631084
9450 1631084 2067618 1781215 1677534 858776 34973 -695339 -1285726 -903127 -927813 -794784
9438 -794784 -735789 16804 200558 -115010 -52573 -1112501 -889750 -874288 -461661 -904701 -921305
9424.9 -921305 -275078 159152 -848175 -1168349 131063 649565 1086704 482503 199165 -358379
9412.9 -358379 -344010 -216084 -258578 305564 766434 24894 -308347 456502 -112221 397650
9400.9 397650 -233800 296363 1091377 1025711 422237 174523 -320966 -882983 -1154421 393677
9389 393677 29884 -603737 -572088 -46081 -81823 -838566 -335120 128023 403110 480926 682647
9375.8 682647 477231 653655 445629 791661 958475 1112613 575172 -83425 452864 1244328
9363.8 1244328 1282575 211362 -553064 -452961 -334657 6144 246675 221519 636435 -27108
9351.9 -27108 -353225 -273528 121110 136403 -108321 -373222 -880520 87087 -1051534 -669351
9339.9 -669351 218869 714302 1164382 265532 -281117 -150112 100369 1241701 665520 -467175
9327.9 -467175 -1390130 -1352054 -1359555 -1737804 -1089317 -1004271 -959784 583117 -417777 409505 256427
9314.8 256427 504125 558285 -423192 -59434 116634 -76114 523115 -1077027 -1242551 -1430795
9302.8 -1430795 -1571027 -340966 913206 -379778 -1131315 -693682 -592909 -644165 249193 385734
9290.8 385734 494170 303345 1080949 255833 530538 1026247 1012266 1030081 673651 935151
9278.9 935151 1484279 607527 984110 638967 -413678 1054771 728239 76920 -134575 -744339
9266.9 -744339 465851 817043 -182187 273156 748932 770301 -375455 -495262 40596 -678483
9254.9 -678483 -1097241 -1327370 -1737405 -1482323 -1727683 -1629544 -987518 -374834 268484 716403
9243 716403 1393019 1977219 2239938 1941268 873831 193806 -304869 -542694 -80205 626024
9231 626024 759190 506554 -437940 -288580 -862646 -799354 -30902 -11050 -350851 -636275 -1274627
9217.8 -1274627 -1346437 -486969 -1159863 -1380424 -1158872 -1046348 -465417 -297435 -524614 -1147642
9205.9 -1147642 -1125054 -264221 -18856 187800 -372981 -232518 306685 978440 398499 777090
9193.9 777090 878329 1044630 976136 1127695 1285628 266288 104890 -4777 -26674 -1089224
9181.9 -1089224 -176379 80849 376358 272599 530055 73027 298081 136072 -335635 -190042
9170 -190042 80702 892328 526683 802316 973664 135963 -409552 561735 -144468 -734936
9158 -734936 -93510 -207094 -1560574 -1130653 1097692 3052065 3290595 2446541 1928970 2699214
9146 2699214 2675882 2713772 1875583 1578645 2101987 3736858 4663558 4663417 4256193 4816499 6120643
9132.9 6120643 7672848 9225601 10913975 12784460 19678635 28906193 46383765 81587115
9123.3 81587115 172167520 362324480 266782300 105044430 47782045 25556963 14419586
9114.9 14419586 8359917 5601431 3812438 2154089 998620 300291 256280 -604941 343129
9104.2 343129 555750 -582523 -2049334 -1975072 -1273349 167984 116254 429772 958136 1684657
9092.2 1684657 1347859 800107 954466 1768995 2637067 701962 -783420 -1035578 149836
9081.4 149836 97057 -50208 -748229 -518072 353640 321787 420605 382782 12919 23269 580247
9068.3 580247 354378 982870 718809 -100644 -697177 -969536 -997294 -363436 -1224357 -1897449
9056.3 -1897449 -1636405 -392373 -465080 -826886 -592525 26590 -42558 203982 -169655 -196826
9044.3 -196826 -839016 -1194818 -1266461 -50420 -207981 901294 881195 1102695 1384693 2182578
9032.4 2182578 1474699 54335 105485 -179981 656610 1394795 1257850 505288 -108714 -443972
9020.4 -443972 -764816 -1214539 -910557 -325346 -74568 66753 -1105063 -1371230 21952 395882
9008.4 395882 -204196 -100682 -190178 512836 1088241 877198 244918 -1124815 -1960516 -1506224
8996.5 -1506224 -2185025 -1171939 131084 188465 825484 226051 -503292 -1217044 -956467 -753611
8984.5 -753611 -404664 -248928 -25590 1161622 1631391 129477 -547567 299044 584486 103042
8972.5 103042 26507 797323 1206532 666536 301647 559197 453329 -252585 -371443 -128336
8960.6 -128336 694079 1204960 881738 697503 532400 37396 -599787 -518388 14397 589692
8948.6 589692 1662713 1477965 -38975 -614618 -246062 104085 775518 1096467 -470698 -1875236
8936.6 -1875236 -1788280 -1295340 -1326650 -1468871 -633905 549496 917400 -260738 -989350 -1410184
8924.7 -1410184 -444397 36131 -563342 685385 1937955 1350319 895245 843197 304896 189957
8912.7 189957 -107883 476238 646015 1224570 740364 -656976 -306817 308148 -409157 -1792455
8900.7 -1792455 -1996902 -1986363 -529892 -311173 -105591 -89466 -336608 -526673 -342635 -136900
8888.8 -136900 -26107 -91091 -53872 -195178 398434 1058710 1664465 301570 -17844 -285651
8876.8 -285651 153895 -289002 -1567267 -1165980 162955 -1096749 -932676 985205 2054166
8866 2054166 2692717 2481016 2462527 1491133 1258548 179424 -680448 -1059361 -219486 -654954
8854.1 -654954 -757663 277842 -263618 -193962 -200258 659621 734430 590837 1343862 1262916 -441903
8840.9 -441903 -1658885 -1211841 -1862129 -1949093 -2000214 -1226855 -1309166 -304723 55491 209672
8828.9 209672 831126 332862 538003 963422 38463 -613248 -429092 -573076 -358528 -214510
8817 -214510 -92172 79849 -83568 -370095 -854257 -888301 -210503 -7573 -270692 235337 678794
8803.8 678794 926958 857949 552482 203327 652812 1572698 2422174 2172828 1177795 -34938
8791.8 -34938 125872 -820866 -1226489 -1374095 449586 1546818 620658 925968 -153812 -1297632
8779.9 -1297632 -1450985 -1272912 -1831513 -1232451 -1092754 -1945996 -1582414 353036 1413071 880151
8767.9 880151 11645 -536076 -1485023 -734673 608794 1081587 952922 602188 238473 1567665
8756 1567665 2353896 862538 80656 18764 -1107860 -31832 -60116 -184060 -329022 -807658
8744 -807658 -580668 -20427 502032 622191 -144717 -814016 -661453 -894461 -882620 -863696 -1018006
8730.8 -1018006 -1120971 -1493792 -885621 -586290 -1077208 -1218827 -1814794 -1185159 -1165304 -685334
8718.9 -685334 -123966 534866 1649274 1035012 1474938 1564733 987282 1637421 2844259 3851741
8706.9 3851741 3620225 2402390 2842191 2539935 1095968 674807 1402261 2066610 1809151 1851001
8694.9 1851001 2151629 3529192 4263667 5408768 6230244 7595293 8781310 10071312 11915096
8684.2 11915096 15303180 21006045 29604358 46779230 81526855 169881360 363396280 272478160
8674.6 272478160 105244920 47108510 23462610 13231399 9116953 6492725 5235494 4435033
8665 4435033 3767080 2547175 2466432 1474542 197007 597814 -215438 -149550 -664957 -878013
8653 -878013 8965 383773 1429860 780469 340907 -640720 -471430 353093 1084725 920029
8641.1 920029 -735881 -1066945 -744753 -235274 93668 99346 -159269 -224291 13965 674694
8629.1 674694 852506 -186986 -210617 -685670 -685005 85613 -556793 -1023922 -1094218 2757 1228004
8615.9 1228004 970455 1057788 43700 -648040 59130 -6504 344229 841292 553805 1023086
8604 1023086 714171 811255 502467 1152568 1041256 -144329 -302568 -417084 113441 -343151
8592 -343151 -597989 -1173923 -745084 -171876 -756001 -972155 -1510485 -1586297 -1109114 398209
8580 398209 474128 436500 122269 -644448 -1294594 -1330278 -1151659 -964593 -633808 1036128 1416952
8566.9 1416952 929116 685998 1372738 1847165 1309932 -204392 -1059287 -729642 -429636 -3446
8554.9 -3446 480863 1104606 237838 -1417752 -1788635 -1106657 -877572 -641530 -772564 -885319
8543 -885319 85928 28122 188436 591559 619538 -692019 -655520 -1061010 -93491 818387 1849336
8529.8 1849336 1127812 504807 524011 1908508 1021469 892850 1737118 1987502 1441790 371010
8517.8 371010 -91065 -134739 -62957 -253347 -275703 -423865 -429836 331102 1328230 1272243 811840
8504.7 811840 402606 -613790 -803527 -253570 -1525729 -1067378 -396287 -280283 -854433 -1725334
8492.7 -1725334 -1198385 -960890 -1465690 -507513 -773985 -1174294 -409242 197589 -43508 -794923
8480.7 -794923 650636 839690 918359 347558 -70508 -511994 -200656 652659 471495 -433692
8468.8 -433692 -916091 -2147559 -2127354 -628977 582907 1009105 468162 635526 438671 18217
8456.8 18217 -490315 -655837 438935 151184 -116697 -293431 913624 450526 1019239 2035325
8444.8 2035325 1794342 585506 408051 734681 -585290 32060 778723 -61658 1019119
8434.1 1019119 749607 988630 -786670 -1145364 -786437 -58110 864943 61959 -159646 320655
8422.1 320655 -383930 19450 358376 774742 1510325 823028 1010322 1367734 402421 -159530
8410.1 -159530 459414 1487980 938467 -1104814 -1061078 -2024072 -411556 -237198 -1411678 -870648
8398.2 -870648 -539672 -600239 -756589 -1617353 -1487134 -1367940 -936864 -936167 -15055 -426473 -546676
8385 -546676 190952 327307 225531 163602 116789 -315198 110680 1105282 880225 369936 748338
8371.8 748338 779242 -302180 -664903 -254340 -58126 -287493 -1066496 -35389 132913 -355250
8359.9 -355250 836466 1494708 615578 -326704 455382 1049129 1422424 211284 327347 695338
8347.9 695338 901624 1064429 1294365 802710 869864 915686 84007 -382996 607587 505887
8335.9 505887 -793892 -1436631 -1055025 -1956595 -1735635 -1379629 -926862 3224 -846299 -713959
8324 -713959 -808035 -1280584 -1225374 360403 1145215 1861169 1626342 771633 -551015 -984140
8312 -984140 -774040 -1155274 -1433134 -609903 47003 -69142 -375991 -1343177 -821 -215646
8300 -215646 98202 638551 1389907 1122640 548041 1089065 612487 -13390 174473 781627
8288.1 781627 -159383 -357530 -393221 459330 1617602 1386990 714407 1146482 1103451 1870048
8276.1 1870048 468481 -120260 -435341 -534080 -396449 -254028 -1147864 -1052620 -791015 -738239
8264.1 -738239 -744063 -142878 -301201 -662795 -1438548 -1934070 -830553 207226 -143212 163291
8252.2 163291 -123036 -721311 -1419210 -1317392 -750612 -761918 -656452 -732235 -906631 -969013 -164086
8239 -164086 38330 384552 1206841 245573 -635651 -84186 -167160 151219 -312681 312796 1109108
8225.8 1109108 1045418 995549 919384 792675 369706 229212 35991 385343 886431 1673292
8213.9 1673292 1803205 2230009 2181944 694238 1126486 1486088 1703027 999017 495474 -302673
8201.9 -302673 263196 309618 759476 -258919 -648169 -701667 -393817 -1045832 -1868575 -1487029
8189.9 -1487029 -2105130 -1690000 -1017238 -1326621 -931945 128910 338754 266510 46308 225285
8178 225285 -399421 -667510 -215298 -124415 -1454481 -1316828 -892658 -435282 684886 1495904
8166 1495904 1342845 1148205 1612573 1166394 -565740 -1052469 -1196623 -1178985 -1045319 -1057726
8154 -1057726 -41303 -567907 -166707 352672 -165610 -379871 -251824 -931547 -992790 43221
8142.1 43221 1364510 1556542 1202003 926119 402924 651986 751840 -93144 542308 386767
8130.1 386767 287324 -145169 -843886 -468392 -69914 -654685 -532661 180968 39900 -1159235
8118.2 -1159235 -843782 -406879 -540047 -441967 35071 1225781 1995357 1822668 701166 626645
8106.2 626645 1041049 352569 737894 1082253 1402340 1245287 298160 666687 1249818 625230
8094.2 625230 -369249 -922831 -209348 -57823 123648 375092 -337491 -1481366 -1380195 -1433374
8082.3 -1433374 -1332012 -1275249 -521179 20755 -496234 -613477 -1140355 -1143899 -1481640 -1532003 -1215088
8069.1 -1215088 -542050 -765733 150327 -389518 -156659 -247341 48457 368137 1787211 1596348
8057.1 1596348 685971 86466 -192494 478244 1154712 555706 1109193 2066091 2561509 1612112
8045.2 1612112 957052 1888627 2873969 2038503 905255 21789 -1073574 606401 651761 163083
8033.2 163083 -948142 -1681823 -1514557 -1187032 -1468560 -1517444 -1074918 -894192 -1331503 -905732
8021.2 -905732 -219789 144793 249714 473345 51883 -1463390 -1891681 -1421122 -4127 -831767
8009.3 -831767 -1180654 -1299371 -452719 -95084 -351775 -152558 713794 239492 -118013 1081714
7997.3 1081714 1482476 563607 343669 -4299 884719 426525 241859 800889 501010 -112916
7985.3 -112916 39300 -770135 -382132 117618 885447 900029 -10227 115615 808339 1022852
7973.4 1022852 503922 696248 334266 1498437 1478495 1096208 287385 -1010927 -477958 -15139
7961.4 -15139 215695 -527912 -1296705 -628013 184460 387521 295102 544657 463285 -1345148
7949.4 -1345148 -1613709 -814092 -429170 234243 -473893 -1011098 -986972 -1602558 -1405594 -611635
7937.5 -611635 -301039 -530173 -203610 -709626 -1153289 -612550 -1002300 -5242 -289309 -1094692
7925.5 -1094692 -1301130 -251777 18706 181716 -681685 -216603 368854 1345018 2014074 1799847
7913.5 1799847 2010961 1719285 1252387 338966 -284275 -69190 842922 -123228 -309744 -181454
7901.6 -181454 -242651 1078822 1490274 1401918 1370627 808840 387014 610242 567487 469715 991607
7888.4 991607 2319319 1534936 -459905 510489 205591 -1003594 -1232728 -756053 -1476980 -2046783
7876.4 -2046783 -1764534 -1891913 -1406983 -1633207 -1652360 -2350480 -1267677 -275086 74082 -309205
7864.5 -309205 -80658 301262 449192 -243973 -298700 214028 -696692 -93572 -617927 45230
7852.5 45230 663167 791186 474191 695123 1509871 1693452 892317 411477 222067 -1113583
7840.5 -1113583 -1127859 -3329 -331043 -454103 -1074599 -520031 -162713 -633128 558101 1728328
7828.6 1728328 1953469 1550422 1159636 275067 128734 -364064 101722 -195691 -509330 -274012
7816.6 -274012 -365915 -204332 334171 528086 493080 -553525 -1102744 -158315 933600 1555771
7804.6 1555771 746058 297734 1020713 279301 -868991 -286927 -1144842 -1245681 -813206 -1002313
7792.7 -1002313 -788876 -365326 -486651 -635868 -626708 -358869 -734538 -665821 -194360 444676
7780.7 444676 609814 -227399 -659267 629086 1435419 1659533 1555192 1623855 1472842 379925
7768.7 379925 -188759 -739069 -234163 729703 866011 153184 -610431 -633988 -787067 -768232
7756.8 -768232 -796595 218099 833406 448800 -147688 503029 201225 -286885 -140437 35320
7744.8 35320 -374724 -675901 -200607 -828527 -217199 -530861 -1249859 -926902 270854 1306856
7732.8 1306856 1851437 1065365 945219 707809 -204259 -484391 -289605 49884 -287740 -1164445
7720.9 -1164445 -997809 -766119 1138845 1443348 -570041 -1813023 -1098464 -471972 -547768 -928698
7708.9 -928698 -720581 193372 464631 218030 348367 1667262 1692598 1373827 517447 -672385
7696.9 -672385 566797 584408 -311763 -502171 -274624 -488089 53723 526941 490057 6722
7685 6722 532033 872864 18682 534633 450866 88734 1472829 1750667 -76926 -672403 -186512
7671.8 -186512 72181 -1067055 -1026805 -663643 -998087 -798211 -708980 -485796 362097 1355646
7659.8 1355646 308940 -360549 -285461 -384777 -32100 -346551 -885769 -858293 -693569 -1058778
7647.9 -1058778 -1512938 -1566188 -252488 -102521 774381 1799775 1239663 1755440 1337391 817665
7635.9 817665 47954 -195970 -106359 508424 474090 139954 321039 222110 -861942 -1396693
7623.9 -1396693 -1363009 -1131808 -585149 -659414 -385167 -449030 -180370 -408926 -816465 173489
7612 173489 1037701 980649 -834520 -1419989 -1027202 -558299 828902 2118597 1284110 952321
7600 952321 494362 848980 513720 -832395 -1904784 -1804891 -643659 89439 -205204 106642
7588 106642 813039 1336153 853962 1325780 520602 -1033069 -1361721 59674 1171083 1108091
7576.1 1108091 1882533 1607671 1017928 270824 948506 487000 1179353 1044162 356969 -7117
7564.1 -7117 713265 392141 378008 1183241 -185269 -350735 -425778 -813547 -1385470 -1201942 -1158924
7551 -1158924 -1562412 -1750480 -1381113 -1198336 -1748895 -1182110 -262651 -393543 -199096 -891454
7539 -891454 -1126269 1479966 1291334 -90239 -503803 159557 -326447 -649270 -247688 846508
7527 846508 1699930 2327167 2060621 1146846 -438242 -1268907 -1503394 -1225785 447047 1275403
7515.1 1275403 375962 -1314350 -1078049 -656267 -806831 -1215517 384224 531456 -716873
7504.3 -716873 -1085676 -1382219 276219 1056554 -209022 -450083 -30250 1319529 1678295 1174034
7492.3 1174034 495245 706244 822265 442026 221506 53543 -11073 -440529 -458205 -394316
7480.4 -394316 236167 562991 620327 547348 231590 379668 -1007667 -1174112 -1510318 -1220306
7468.4 -1220306 -975129 -782302 -1542099 -881965 157115 513164 -542136 -296501 397937 -262906
7456.4 -262906 -747872 58502 508755 555188 -74230 -594798 392010 1587549 1955279 1594235
7444.5 1594235 1195633 344772 713335 -229462 -427713 374659 861893 403158 343293 -450929
7432.5 -450929 -752380 -258681 317927 389622 -434423 -320453 635853 713348 758766 437049 545898
7419.3 545898 -201656 -222146 -413054 -247676 -505090 -463283 51517 -132816 113932 -1052493
7407.4 -1052493 -757696 -224968 -625123 -692236 463808 115020 17642 811148 2000763 824378
7395.4 824378 334071 767782 -681342 -203634 114109 -959762 -1463392 -235589 479638 -618697
7383.4 -618697 -556003 262997 673636 767148 -26404 -1116884 -846953 -354045 2377 790711
7371.5 790711 352296 -301582 -403548 -1018905 -762031 142173 480237 910219 215597 -199874
7359.5 -199874 232909 -306915 -852445 -470666 67481 400891 1208403 -1036099 -1695313 -190895
7347.5 -190895 1671230 853805 189550 20976 125218 609045 -446204 -385447 -218940 -2149
7335.6 -2149 -34817 423863 320822 -202203 179285 232929 192614 211846 477638 1280103 594930
7322.4 594930 -154895 -908118 -1094968 -1063859 -1850677 -1781929 -607796 494534 193765 -187845
7310.4 -187845 -781967 -22616 -24624 256461 1499946 1165788 561511 289160 75512 412800
7298.5 412800 152193 -509032 440651 482137 221749 1077843 1222087 -510209 718548 1489473
7286.5 1489473 1375626 -168532 -1462008 -995896 -1376273 -1030788 76216 890247 1868314
7275.7 1868314 840970 52516 579693 -66851 -313229 -89205 -336229 -555823 -766993 -700112
7263.8 -700112 -293449 -1146912 -1637898 -2448879 -1596582 -479258 -953648 -312220 1721095 1485360
7251.8 1485360 632812 1067112 793018 422905 -634578 -516683 -329934 -274375 208296 504749
7239.8 504749 358185 857911 400273 466084 642149 394525 224941 367838 997810 824413
7227.9 824413 538758 1429459 621785 -549444 -778165 33784 -309071 -891508 -369901 -136332
7215.9 -136332 88992 -65568 -1403 -503007 -323999 132454 -162369 -704139 -1471464 -2345803
7203.9 -2345803 -2482514 -1378637 -935589 -665404 -595215 -552216 -802631 -99576 648320 -327291
7192 -327291 -649319 -983474 -957877 -279203 -273377 428071 287485 -145305 -34829 81597 75459
7178.8 75459 271623 1057006 1983238 1689036 2420333 1784325 1991051 3014007 2005867 1905990
7166.8 1905990 1709331 312807 130650 426814 1680214 1616120 1022026 -201185 -324979 -890659
7154.9 -890659 -1610116 -847519 -314933 -830883 -844749 -978928 -682697 -1224229 -574094 -48324
7142.9 -48324 1208510 -70773 -745715 -1960057 -2653250 -1452759 -812145 160762 -1722230
7132.1 -1722230 -987060 -67405 -193118 381163 937522 1057526 109779 702293 342374 -276113
7120.2 -276113 -626966 -806472 -742506 -1125072 -2504333 -728868 -135144 37698 -376320 -269477
7108.2 -269477 789935 1286583 1586709 866797 21848 109713 61513 178583 703967 1359017
7096.2 1359017 1195888 2031721 1490640 44226 224217 762162 556182 293501 208355 -467727
7084.3 -467727 -684784 252720 480329 -507740 -317555 813304 1645033 584165 -77534 99394
7072.3 99394 70524 -99032 -887247 -538045 57973 -1274521 -2046016 -1632475 -1064759 -1707935
7060.3 -1707935 -94094 542486 158226 315783 634323 -253087 255885 360802 128191 -952298
7048.4 -952298 -1740141 -1147497 61081 -170917 159765 108032 -298573 795089 1247698 2098675
7036.4 2098675 2082775 1573659 364267 -281974 715102 669829 546716 -202488 -309308 440658
7024.4 440658 190499 -50231 -492602 -851786 -402530 -1009545 -1567006 -1618702 -1840144 -690987
7012.5 -690987 493761 372210 -249249 550610 387041 394027 1227512 1349206 1280938 1244967 2129136
6999.3 2129136 1991929 751858 -526861 -475906 221997 494374 432232 324137 -731468 -1895129
6987.3 -1895129 -1743550 -2507531 -3255561 -2215239 -993538 -338852 600534 291228 -520977 -862673
6975.4 -862673 -666503 -869832 -755852 782318 876784 207186 -514859 -1580681 -931386 -706927
6963.4 -706927 917668 1072865 552763 229488 768608 1178955 1754118 1772412 1146092 1244853
6951.4 1244853 652993 67498 -643081 -118125 488781 -111933 -237938 -35860 63312 -150878
6939.5 -150878 -381723 947680 705379 532010 -237893 -1427798 -1482635 -572014 -125984 -511861
6927.5 -511861 -1284965 -1303700 -155935 94303 -146513 -231545 -5761 1264010 716323 -821075
6915.5 -821075 -1002648 685953 262945 -43857 -443033 -875838 94559 593562 65634 -409476
6903.6 -409476 -139845 975266 873581 1050128 758328 628330 919846 845678 2311762 2072181
6891.6 2072181 922152 132537 -623082 -939423 -212896 -330550 79518 -10409 -573475 -315657
6879.6 -315657 -471956 -1664549 -2129697 -1972945 -1721053 -603619 244898 -119527 -620356 -835424
6867.7 -835424 296756 787035 1090503 582348 825451 746829 161422 -284007 -625771 -814096
6855.7 -814096 -1135919 -380666 -48255 -1147734 -1246613 -1089485 180112 853383 1612749 1264845
6843.7 1264845 1000525 712626 1171933 1676418 936737 608846 890082 915177 191424 -227248
6831.8 -227248 -567665 -560354 -1443160 -2040217 -727467 264438 673560 623136 -94881 677150
6819.8 677150 1366982 1342616 1219444 1079918 -277990 -150739 -137049 178552 -264252 133728
6807.9 133728 -617414 -284715 1112805 1615037 1718458 792021 194465 755343 -532746 -266846
6795.9 -266846 -64275 44940 -475845 -1128902 -2369323 -1828346 -185771 -333012 -1888180 -1451490
6783.9 -1451490 -586954 -196292 -636158 -425781 846027 698426 341430 -75764 667994 721126
6772 721126 -279805 396799 478690 -65089 -421384 -325051 -488047 -74543 -78534 232692 865299
6758.8 865299 613687 689941 227299 -117073 -336663 -524683 -446700 -826972 -954370 -1257724
6746.8 -1257724 -986502 -148841 -75020 -173603 -672060 -911954 -1041401 -754086 587387 -263693
6734.9 -263693 -465778 142973 362671 920883 897270 266508 259360 -55251 -290855 576761 246177
6721.7 246177 -157021 719837 484866 505962 1120384 166667 -1492240 -1291396 92592 802376
6709.7 802376 -737687 -258135 1496510 1835795 2040905 609798 -292753 -453619 -327238 -308965
6697.8 -308965 -536413 885923 1544438 647616 -1197645 -1109107 -731030 -999030 -535262 -284436
6685.8 -284436 1111106 1510687 693425 -600785 -1220926 -630495 -357203 -238080 -285013 763011
6673.8 763011 558818 -538891 -919928 -394954 649685 171407 -111810 -614542 -421615 130619
6661.9 130619 772728 605109 400166 950688 1107100 561146 268204 365617 756688 703204
6649.9 703204 336571 218861 388878 1351332 1933047 529693 -97979 -381240 -1820899 -2506868
6637.9 -2506868 -2404627 -1237164 -435217 -49162 -310068 -759348 268485 103390 661620 910277
6626 910277 -388645 -1512603 -1093039 -869582 -1178365 -1155466 -1301309 -1040743 307501 704322
6614 704322 -460995 -503380 255806 -404424 861706 1571783 1420210 1052821 -129839 154009
6602 154009 211118 -180409 -704075 -64341 779133 166940 -407682 -7871 516456 611653 1592658
6588.9 1592658 1138420 352485 -242682 -579606 141904 -232045 -1816981 -1701070 -1134866 52590
6576.9 52590 16714 440134 1126167 -218503 -156207 822623 -145129 33601 -596682 -438680
6564.9 -438680 -291740 -81741 -215845 -259170 -791874 -1024096 -1110011 -761740 336133 929456
6553 929456 860270 896878 1005132 737366 -306197 498611 1057452 250272 915675 1459240 1164645
6539.8 1164645 751154 -265952 -81816 -59848 -61501 39600 711964 1106939 1075643 596285
6527.8 596285 -767512 -1306939 -631897 -824067 -277365 470506 362956 477037 -117680 -277874
6515.9 -277874 26032 -180339 -569483 200908 -246054 -1054958 -1084477 -368773 392119 270933
6503.9 270933 526257 293864 533302 -177239 -461210 -315115 -112854 -1400554 -1592488 -1515133
6491.9 -1515133 -1401011 -819528 -531471 546349 936540 1186107 1364643 966422 1612649 1492150
6480 1492150 1155089 712457 -496816 -467159 477212 305072 1134231 1372925 785807 10975
6468 10975 -255882 -89795 -197136 -1087774 -1132873 -1235568 -307419 -30946 -377329 -1457975 -236234
6454.8 -236234 445301 -334661 -141664 1038649 784714 779889 -314772 -647616 341082 -138842
6442.9 -138842 -879287 -1014089 197901 -105404 278005 531295 -535883 -2158325 -1283608 -661290
6430.9 -661290 -736498 154977 -700405 -608421 -270535 402795 986874 569522 -360931 -215725
6418.9 -215725 -695231 -680263 508909 163076 -262550 312686 375703 183009 514724 -1057828
6407 -1057828 -947242 895534 2939785 2192027 659884 494023 639031 93816 243043 333516
6395 333516 395561 -14939 -123940 -377551 -1348582 -1691178 -615191 -68912 -56106 182655 -2586
6381.9 -2586 -1060475 -1350158 -326566 -488249 -146639 -473258 -194848 -574423 -526180 458441
6369.9 458441 834869 1368257 1773618 1395438 1810801 1955990 694150 370741 -823079 -713228
6357.9 -713228 -565783 -158802 95414 -438517 -1557898 -1186416 18089 157889 485635 1740277
6346 1740277 2280570 1544553 477718 -527461 -1043775 -884765 -1496017 -433814 266471 -513730
6334 -513730 -242826 -58323 161894 -275165 449768 -74821 -229621 355165 264175 -812026
6322 -812026 -1648361 -1918231 -1620134 -746196 -466729 326119 684412 846922 -144789 -818752
6310.1 -818752 -619653 -789062 -765135 -616935 9612 935978 1710545 799882 113350 -240358
6298.1 -240358 64065 325919 359597 67021 -142214 231140 235716 232488 11681 620073 290927
6284.9 290927 71471 -353390 -220318 -776317 -1383927 -1082866 276224 437748 1318366 1668056
6273 1668056 531251 434752 959547 172410 -282824 -87446 -420468 26944 495492 536480
6261 536480 707453 873941 1102014 734653 17213 13790 738602 933755 353500 -21092 647284
6247.8 647284 142557 -619604 253193 597164 -794428 428647 638735 5867 -1330400 -1372278
6235.9 -1372278 -475618 24040 91602 24315 1666 -213739 -928931 -2207491 -1489952 -349476
6223.9 -349476 491082 1188981 476574 -675296 -1257269 -167796 56918 -580570 -1189109 -985296
6211.9 -985296 -784772 -1241844 -1923095 -1542140 -873634 568947 1454942 889364 750035 581014
6200 581014 606344 1579117 980029 36196 24256 668316 968362 954699 1393722 1162963 1182251
6186.8 1182251 1228577 682400 487056 396214 -142901 -637569 -58055 -345178 -940138 -1007975
6174.8 -1007975 -938212 -1126416 -1689779 -1485096 -1706581 -653234 673399 329028 1237472 616124
6162.9 616124 313722 58717 350847 -715084 -1194654 -1302530 -1265922 -944333 -559537 608216
6150.9 608216 1334732 127637 -57444 370884 -350065 -1878691 -902351 -481868 685858 1753145
6138.9 1753145 1191665 914428 1246806 1101638 1090434 128583 -74567 -17148 50333 581062
6127 581062 370340 -604585 -556714 662973 -37052 -250200 -106568 -556672 507302 -101331
6115 -101331 -1257300 -797129 -943809 -885640 -480944 -602565 -640511 -571818 -621667 488506 2219864
6101.8 2219864 2327976 2204501 2173643 1255922 656664 953718 -496854 -689114 -475516 -1007730
6089.9 -1007730 -1621348 -743871 603779 715196 -1063823 -498077 1337354 1206267 1259816 1478225
6077.9 1478225 1721366 883543 317731 -130819 514815 77682 -553561 -637370 -638660 -309092
6065.9 -309092 -966352 -1790272 -2798938 -2684429 -1972930 -1537255 -1427710 -1086988 -1078107 -149693
6054 -149693 287157 522817 60461 311431 563152 -420926 -704727 227450 1195829 140255
6042 140255 273261 519175 576256 372022 122041 -523238 -52824 374537 662036 396284 700309
6028.9 700309 1082792 1212462 879951 514033 -117597 350870 802862 653211 612720 265553
6016.9 265553 233336 -477430 157315 596700 313680 -1205746 -2297011 -1829747 -1064377 -220857
6004.9 -220857 -811261 -873591 292865 539023 939982 717299 666967 1191949 920628 29425
5993 29425 -957215 -1119827 97200 -143649 -71613 745453 730795 76324 1143184 1416995 481344
5979.8 481344 642710 916019 890252 966199 -294633 48672 -340113 -947761 -1313382 -430402
5967.8 -430402 -29543 -1016 55651 338106 648787 221057 -977706 -1352998 -1040961 -955887
5955.9 -955887 -1510081 -1224454 -109010 107218 539372 615915 773635 119667 -889605 -782978
5943.9 -782978 224528 838239 436392 476964 32178 535995 595799 145477 -30126 498452
5931.9 498452 -49580 -15342 -308064 31543 386162 197535 -472592 -1036789 -1274405 -587152
5920 -587152 -282971 -1033397 -699779 -1051785 -1074327 -515983 9109 344528 1094216 982484 1962508
5906.8 1962508 1093919 9694 -1490657 -1743722 -288193 954859 935616 -138822 -795141
5896 -795141 -505555 -596526 -972676 -822146 26579 1053947 1215086 840332 567801 2765
5884.1 2765 4656 115077 -134668 668395 69514 -499342 695646 513698 34436 865901 566739
5870.9 566739 634997 810750 413977 -1336092 -593541 403945 655030 836895 134785 -228565
5858.9 -228565 -421701 -381355 75694 1584446 2423123 1185366 -230590 -565902 -358577 564253
5847 564253 -396471 -1319628 -1581760 -639945 -1290480 -1179670 -1532884 -1669917 -1282373 -500469
5835 -500469 -44573 1112589 764550 -97865 694293 957198 328386 -205549 -368185 -72044
5823 -72044 586324 1715409 744278 -430298 -508570 -700611 -505824 602412 112422 70272
5811.1 70272 -222715 -169601 -716579 -117727 369451 202153 -213009 -393518 -768302 -781088 -632358
5797.9 -632358 -838509 102783 97212 -1291277 -1063862 -246275 436529 1020218 1296774 1799572
5785.9 1799572 1809364 773074 540920 429378 -141622 -436656 190920 905926 1729656 2381985
5774 2381985 1834621 647844 338866 -190666 -541116 -1300974 -1848912 -1504408 -329464 -90500
5762 -90500 -286450 240961 303624 -211117 -510320 -578133 -1319807 -786125 -1090448 -2075916 -1961123
5748.8 -1961123 -562152 -307549 324353 1326054 2549990 1699507 336854 -326393 -184112
5738.1 -184112 789607 1575992 916195 543908 116961 410315 382645 287704 292423 585232 -185828
5724.9 -185828 -1811208 -1545430 258440 230414 391978 -454643 -929788 -712644 -151168 -72812
5712.9 -72812 -96733 -190691 72982 -925503 -1092283 -156484 64383 -561008 1100029 1449560
5701 1449560 505546 -33688 376646 471659 413212 310386 -1418635 -1255398 -253592 -235217
5689 -235217 -391336 -141006 -390767 -830734 -840792 -841146 -860660 -791659 -266418 -582435 -616304 -248929
5674.7 -248929 830427 1301370 1005849 -98753 277325 710158 1045371 41923 -8096 -849708
5662.7 -849708 -567680 -375160 -184121 -429461 -805161 -121353 -2858 374403 696910 1215179
5650.7 1215179 1405931 345638 1357801 1967910 1157222 124894 -25136 416364 710431
5639.9 710431 519847 -184363 -18120 722985 480287 444695 1182345 1724206 -107429 -1079510
5628 -1079510 -745136 -355540 -203055 -66555 -522838 -288522 -653030 -899887 -411365 130245
5616 130245 246113 444046 164169 -514630 694376 1217257 303239 -239458 -682250 -1085005
5604 -1085005 -1864569 -871828 214114 -125121 -126440 782842 730046 -597189 -192313 -269595 -3861
5590.9 -3861 684027 59223 -525880 -1096651 -1052015 -1678810 -1566495 -831632 -1513943 -1488175 -1878011
5577.7 -1878011 -1397426 -822779 626400 507431 161978 -576000 -97085 40457 -734025 338279
5565.8 338279 1727343 2393723 1640584 1124779 862443 758179 1503410 811246 709060 -140557
5553.8 -140557 -1060056 -703814 140872 901573 1769628 1737108 1808984 1019788 -520265 -684976
5541.8 -684976 672276 13877 -338891 -52848 -291025 -209563 -279967 -46323 -493195 -1953762
5529.9 -1953762 -2698436 -1619649 -1021849 175486 645820 -22739 -1657521 -355460 906104
5519.1 906104 909171 971738 1195700 9242 -303111 -261899 -771690 -1536947 -1566974 -1115706 -43078
5505.9 -43078 863538 919080 635570 783464 970602 826046 -508417 -329742 473912 82613
5494 82613 -105061 -672064 -403755 -335784 -52807 875693 1838903 2471773 2067104 73051 -529909
5480.8 -529909 -60425 1119530 462976 760965 403005 607063 496147 -85533 -311349 -1179192
5468.8 -1179192 -1138731 -1549870 -1015002 -918363 449648 622391 342326 43551 -14813 1003569
5456.9 1003569 862699 1305084 -44993 -1092047 -1512357 -577442 -415123 -446453 638071 1366742
5444.9 1366742 875563 334967 -986127 -820356 407363 187777 316482 -895884 -847205 -332509
5432.9 -332509 -14681 178929 678385 -533221 -885889 22328 257001 453221 -141545 -708610
5421 -708610 -954859 -448859 85862 70746 235370 636687 321229 30540 601188 638997 -145281
5407.8 -145281 -753899 -1064616 101105 -435062 -802818 -1187861 -826074 -429078 -650052 -210275
5395.8 -210275 435139 976384 1115574 87460 582647 -330699 -1514638 -1604695 -2076458 -1078707
5383.9 -1078707 -6802 435282 377540 82727 401800 759238 625510 999167 653832 725312
5371.9 725312 270631 -125576 28926 856763 427598 480803 114553 104307 10160 699370 477097
5358.7 477097 856055 681646 279630 -188360 -248564 453148 632420 498842 -124320 -816813
5346.8 -816813 -5525 704812 955837 311784 -345819 -1223322 -1102357 -824329 -213935 -1045518
5334.8 -1045518 -102182 381999 -262260 73032 19175 -799222 -1800429 -997582 -2262516 -1149642
5322.8 -1149642 -511397 -190357 679827 658106 294255 -294285 -213393 428319 834681 1160435
5310.9 1160435 803235 50815 760219 1924336 1283088 470662 -105952 -1313582 -554332 -511769
5298.9 -511769 -1343296 -1924552 -1519007 -124369 1405010 1543578 385810 435285 1077794 1095342
5286.9 1095342 256858 -654361 -148003 -92765 -822065 -313339 517294 650751 568034 906671
5275 906671 804699 791762 438495 858998 624770 783387 331215 244511 -328112 310214 584207
5261.8 584207 895216 432558 -159523 -1346839 -1451311 -681814 -560265 -405904 -335044 -866928
5249.8 -866928 -221736 570483 583290 841976 124776 -831522 -544590 410293 -296822 333188
5237.9 333188 848413 -649294 -1532534 -1510366 -1350476 -435432 618638 112823 237643 639043
5225.9 639043 44982 -267952 -299501 -949510 -1780039 -857071 529229 629197 417148 358392
5214 358392 500909 642891 431117 50996 879212 719122 -11010 356935 242946 289310 -52622
5200.8 -52622 -1216284 -713885 -107213 -261160 -926632 -908106 -41342 -345269 -1428172 -1403220
5188.8 -1403220 16069 741949 119157 -116009 -132627 243319 399045 -146400 400084 -204776
5176.9 -204776 -770075 -1408930 -2040774 -1489356 162852 1675917 2343186 1628889 1666948 1766088
5164.9 1766088 1102227 1318386 623170 360711 1955285 1282744 1198482 907636 1391708 156866
5152.9 156866 -441412 -774116 -490559 -96035 -379662 72696 83318 -125619 655365 622037
5141 622037 -328376 -35305 610391 -369931 -1110329 -1080297 303798 -187791 -1042465 -1374726
5129 -1374726 -1824204 -1943256 -1493801 -1024721 -4749 -174664 -811458 -275223 46866 -682168
5117 -682168 -487066 -607226 -271599 -778484 -627404 293553 -51077 1034734 2126915 1344088
5105.1 1344088 54622 -679520 -1632110 -715400 -200494 -107278 530332 981773 586958 1214299
5093.1 1214299 1714060 2033905 2180853 893807 762379 -868242 -1834197 -818998 -1469246
5082.3 -1469246 -306512 759431 906250 604810 256339 500362 195102 152069 744863 42673
5070.4 42673 314409 1066438 1200620 538436 -782950 -1315703 -204946 -991331 -954489 -300743
5058.4 -300743 79056 -884169 -1345563 -988833 -640211 -395053 -203781 -439891 -349727 -195815
5046.4 -195815 447640 560905 -394991 -1241630 -1742668 -1127643 -355524 557777 1062376 852057
5034.5 852057 802300 523726 72834 -185494 108586 561849 -48783 212801 376714 612759
5022.5 612759 436536 -291628 820944 301036 -320062 -235501 -471223 71022 520058 1109608
5010.5 1109608 1624410 590734 1106552 1074450 -206712 -1163435 -732169 434119 1186676 1632767
4998.6 1632767 294523 -615110 -533432 -325555 -776327 -967218 -244388 -926182 -693594 -214847
4986.6 -214847 -977151 -2026786 -1539627 -1811476 -1610419 -617123 -540929 -1149190 -1226332 265416
4974.6 265416 810190 307525 239185 -290321 462698 465793 531204 935708 985762 720304 -23685
4961.5 -23685 -305128 855059 1722497 1469876 1531105 1477706 1023666 -290624 54363 655195
4949.5 655195 493756 245416 -472938 -716378 -274398 -87541 -644733 -11649 414210 1161519
4937.5 1161519 809411 -615507 -368432 -559835 -352527 717408 300262 -277792 85985 -424953
4925.6 -424953 -930599 -1210891 -990518 -1469782 -1122229 6348 591858 2656 126466 104120
4913.6 104120 116288 129101 -249481 -159958 -72031 -387655 94264 553401 196628 148118 1131875
4900.4 1131875 120596 801811 1034746 1059078 71127 -30174 -255554 -18377 121920 301166
4888.5 301166 -268873 -28590 12342 -536515 -377642 -230336 -2504845 -1744077 -462502 -572326
4876.5 -572326 -1154561 -915404 -1405032 -638239 432638 341622 751656 1828660 795037 -617144
4864.5 -617144 333684 1255429 1564675 2740729 2300266 1321587 445543 934598 140605 -271060
4852.6 -271060 -266720 -720527 -233013 359974 262569 28622 109346 -75851 48503 -344367 -495820
4839.4 -495820 -857453 -1243918 -2050585 -1176018 -489028 -1196026 -1017818 -631562 -1510245 -1815792
4827.4 -1815792 -1998342 -1700620 -721887 557804 29866 605393 147964 -319022 1227676 2451913
4815.5 2451913 1895401 1580702 1134010 1037052 666476 150760 520435 953418 1368049 955912
4803.5 955912 157373 -696664 -279991 -550417 -8606 784519 1890070 723652 -735144 125757
4791.5 125757 -257674 -668745 -1105104 -926284 -629402 -401333 -1459608 -814781 -710064 -886492
4779.6 -886492 -184687 -508307 79689 860756 573704 854468 487433 739387 482214 581734
4767.6 581734 447451 1144809 709283 -31148 305120 -246116 -570198 -65441 274998 -333494
4755.6 -333494 -366746 -603486 -577176 -499174 -1037645 -536255 -273679 949156 713468 -601236
4743.7 -601236 92869 983779 681536 -623982 -879058 -1822507 -1070393 -288085 490149 629563
4731.7 629563 128353 -1183103 -1070046 -771488 -19456 -1126790 -606396 377793 -233511 465518
4719.7 465518 724703 1771301 1086976 498424 740036 -404683 -175327 15468 473924 690171
4707.8 690171 661274 582479 624929 889885 363992 316144 618828 -166049 -220959 -665871 -248394
4694.6 -248394 152192 265021 -323002 -229025 271940 259376 -164107 -511624 -1264496 -1190437 -1893786
4681.5 -1893786 -1369280 -715864 860946 344362 -26534 1380260 1817231 1552958 558471 76011
4669.5 76011 670953 1009392 528835 587385 -476557 -552889 320484 369596 533638 -76605 -1336328
4656.3 -1336328 -1536396 -561531 -409612 -826138 -694913 -587993 -404445 947649 861315 603031
4644.4 603031 186999 348612 -60402 -365749 21093 -282657 -1201337 -1338041 -1920416 -1421631
4632.4 -1421631 -1329622 -1127509 -328849 916915 1003408 223924 387461 787991 696019 12356
4620.4 12356 -584872 -305871 1479085 3408805 2045490 911529 376093 -810447 -981439
4609.7 -981439 114579 854745 867419 -358797 -253373 26000 -550788 -112882 457532 1517456
4597.7 1517456 1238199 73100 -884912 -707580 -995788 -1539125 -894510 -877684 -665990 219363
4585.7 219363 -486769 -1925479 -1747789 -1103141 -282408 -832393 1306 142370 415230 69970
4573.8 69970 -1560486 -869811 -994927 -644686 -447910 159635 705855 463735 614959 1580799
4561.8 1580799 2410730 2151848 2004494 2369818 1367704 869832 643747 356569 -716640 -1467837
4549.8 -1467837 -311444 357095 408059 19281 -145187 836676 1439774 595223 283815 -784492
4537.9 -784492 -72805 -482016 -801726 -551837 -1714711 -1667138 -864855 15923 -182334 970082
4525.9 970082 1869647 1180359 -258296 -509587 -194377 -1098736 -1977330 -1702073 -777842 60317
4513.9 60317 60558 -137 467899 -676874 -530990 338975 887014 -268586 323093 1235711 1475587
4500.8 1475587 605041 1781805 2448230 714185 684093 891099 -206216 516783 974530 1312216
4488.8 1312216 1795294 751618 577230 242363 -352359 -709654 -1220213 -1775928 -669577 -1183916
4476.8 -1183916 -651107 -1269369 -1550576 -728217 -270144 -639276 -1859057 -2374673 -2334974 -2324050
4464.9 -2324050 -1885039 -925976 86457 107226 470667 792829 1025256 1410669 1236258 1149008
4452.9 1149008 882846 1202200 1294343 1864191 1269829 931605 -142287 -1203747 -1972205 -1729378
4440.9 -1729378 -1034422 -1086046 -1079036 177213 98091 -477091 365315 973083 517014 95472
4429 95472 -299500 -91584 164793 -318690 287685 914277 1135787 525804 -184356 370700 481574
4415.8 481574 873966 1727841 1782947 773929 -570922 -1158188 -587748 -53988 255066 783452
4403.8 783452 1196876 412888 -157614 823824 336411 321321 211562 -957659 -676725 -639819
4391.9 -639819 -250598 -334280 -1154428 -1665114 -1481426 -962021 -259062 97371 -415021 656151
4379.9 656151 199079 -112279 219992 423504 -96061 -426813 -815079 -761736 619972 634617
4367.9 634617 137962 -82002 -1032460 -827194 -393623 -49092 -703146 -140791 -439277 -265477
4356 -265477 -393005 -793750 80067 742668 1637393 1676745 1397001 749963 313588 296868 187296
4342.8 187296 -793654 -820421 -535867 154252 -120741 419392 880091 1135071 2086893 1344354
4330.8 1344354 230397 1212606 760711 402415 -212833 63581 -456115 128634 -609534 -1680306
4318.9 -1680306 -945254 -837661 -1076029 -1724935 -2076261 -1479725 -591796 252105 -316101 250823
4306.9 250823 860950 33978 -457873 222174 -1250419 -744056 467453 -644998 -1795988
4296.1 -1795988 -141650 657994 549577 443713 559981 280032 -71080 385143 -833616 -988299
4284.2 -988299 556803 1568079 1273190 967927 -133870 4124 -743369 -14214 130299 -410499
4272.2 -410499 -1362669 -914027 64000 844286 1498483 2098173 771552 302603 813640 -305681
4260.2 -305681 -612338 153982 211628 -102045 -678107 348968 809687 160020 797545 699869
4248.3 699869 990849 456605 -305033 -316676 -1457160 -675646 -997398 -1692972 -1829450 -1295580
4236.3 -1295580 -185053 1061947 720932 838922 644946 510920 -626292 -907914 -664151
4225.5 -664151 -102806 972846 1299512 1740002 827720 383593 139375 64890 191718 -1227588
4213.6 -1227588 -1556029 -612856 -427585 -279474 -256371 -729778 -643815 -1069236 -145095 701610
4201.6 701610 1086090 1266666 710375 712166 1192586 993573 336902 536832 581470 -809331
4189.6 -809331 -790637 -1475745 -15169 -154548 -1122068 -1013819 220507 -398513 -1011160 -693829
4177.7 -693829 -2172978 -593817 -277207 -246577 895380 1450995 435862 147965 1083968 907424
4165.7 907424 1256543 526629 694053 123237 129959 445408 1295628 892251 336432 703163
4153.7 703163 701703 1193675 897963 -360685 -420386 -90621 643165 165451 141151 1173542
4141.8 1173542 1889433 1202776 -207124 -1074298 -345871 -35835 -389246 -1750788 -2367994 -1909826
4129.8 -1909826 -1525404 -1261148 320701 388696 369092 -390089 -766515 -591641 -990492 -977848
4117.8 -977848 -615793 -132195 215611 1329129 1276886 760321 -495567 -1546875 -1592681 -1178315
4105.9 -1178315 -851292 -156427 417562 472299 1018696 1044958 340466 698511 1243700 771788
4093.9 771788 1229752 1546159 753349 627059 450345 -851559 189742 211897 -844434 -712564
4081.9 -712564 -1050885 -1407162 -1909276 -1960511 -464943 923724 795966 677397 1160302 1237779
4070 1237779 1149541 1164696 602055 -189634 -361956 1086391 358669 -1591513 -1997389 -1635967
4058 -1635967 -1009044 -396470 441093 221696 1271421 688079 396090 364371 925593 519481
4046 519481 -607704 -659996 -713081 -746126 -527412 -1315087 -1403151 -586889 99194 498427 -56930
4032.9 -56930 503360 793104 948871 -267905 -1170833 -413815 1119114 1025810 507920 382801
4020.9 382801 -692789 230466 -401493 -1183717 -742428 -1153212 -45387 -841216 -617207 -574914
4009 -574914 -486616 255130 323816 -41462 -1141645 -856139 84781 -263994 -1491287 -1338354
3997 -1338354 -106799 502846 -147165 575999 1184239 1858537 1677428 798138 1256905 1181056
3985 1181056 -248860 -366881 1529449 1412314 1330168 1059072 334987 11360 287514 845144
3973.1 845144 158829 -1323407 -1212154 -454694 544712 770763 -148941 -515426 -645930 -334568
3961.1 -334568 -1302033 -220550 -564908 -1170229 -256293 -588477 -482403 19477 80644 1158427
3949.1 1158427 1914836 1155945 637450 299592 650808 31806 -81200 526735 -35269 -947342
3937.2 -947342 -1118076 -1019643 -403368 -112435 -574060 59736 918268 1020884 361975 -282267
3925.2 -282267 87873 520728 -286020 -698627 58508 273124 403023 426333 659647 260492
3913.2 260492 -572169 -1421411 -1023279 -842781 -209660 -519555 -391292 1159479 1110892 -102930
3901.3 -102930 -595737 443991 418833 43210 -454471 -476757 -1155182 -1073844 -522650 -362585
3889.3 -362585 146332 707641 1054046 236160 -331208 -1003035 -1209138 -723829 254210 496602
3877.3 496602 537400 263013 628963 258514 -759557 -1077826 -821588 -806073 -218793 -169563
3865.4 -169563 114897 518887 1787439 1842422 1552861 1177408 1184556 487566 -174454 210704
3853.4 210704 -1294884 -1473049 -1269301 -1395330 -1484781 -1437259 -252435 -308976 -152034 100109
3841.4 100109 615168 591605 371940 1137953 942517 780180 1626791 1579412 475940 -486966
3829.5 -486966 -1398047 -1578931 -684882 -22831 -122403 700097 636591 1125616 1645317 1004222
3817.5 1004222 1046789 797703 -11511 -251858 1054538 1809949 641027 -6111 -2732 -1044752
3805.5 -1044752 -1181754 -1523603 -871624 554289 -409730 -1604315 -1789015 -744576 -487676
3794.8 -487676 -1291726 -1163860 -968566 -1340570 -2016604 -1711983 -436966 766233 -109715 -333105
3782.8 -333105 -349689 158184 1013294 812376 742913 920078 1222131 1227972 1359303 387881 577628
3769.6 577628 1470238 388885 68433 343950 643516 1008269 1434533 1262627 22182 -560567
3757.7 -560567 -980916 -331993 418961 572588 1351799 1131133 939038 -405788 -950771 -2014035
3745.7 -2014035 -958577 -379045 -875383 -385018 -1073415 390748 341594 -39867 -232221 403758
3733.7 403758 119301 -654248 -967825 -297116 540280 70364 -367928 -52353 -888389 -1485567
3721.8 -1485567 -522788 273712 783969 1501159 2083191 247231 -158206 201301 577127 990510
3709.8 990510 1230949 -180149 -1809750 -2116913 -1434930 187845 403083 -49632 -412607 730545
3697.8 730545 730502 23342 547964 1529057 826569 133281 -626970 -1270788 -898081 -1764128 -3001859
3684.7 -3001859 -2581118 -1920617 -366043 212983 1233882 900718 627651 1310121 1375089 1221409
3672.7 1221409 531399 481508 565001 440944 891593 1354532 1015926 303010 -148715 367431
3660.7 367431 541872 -255280 190819 340506 -129703 -675749 -602 476526 -601452 -602435
3648.8 -602435 -493430 -340458 161888 -107108 -529921 -813851 -496898 -833062 -1235066 -1108801
3636.8 -1108801 -731741 4300 709157 52824 -257553 -1230099 -1112756 -831221 -63012 275345
3624.8 275345 977262 1867349 1899571 1243639 724079 1217966 1712058 149470 -1040290 374073
3612.9 374073 593787 562169 -379092 -409835 -297196 180889 -83957 -834189 -739927 525752
3600.9 525752 151719 76538 647069 -361918 -661105 -1051789 -999023 -47527 -343362 -1095538
3588.9 -1095538 -1043942 -1367032 -1032863 215954 1966920 2072207 1590340 2016912 841412 206468
3577 206468 -412433 21549 494290 -529013 -1468466 -40894 36833 -961682 -1030076 -160566
3565 -160566 -847713 -1146722 -623426 -297004 326180 638859 401225 -813087 -307950 818262
3553 818262 312367 170121 -355096 -205224 -415599 -547721 193869 -97172 -885507 -455150
3541.1 -455150 -161831 -26710 314285 -315095 118012 296354 57860 -1385595 -2187540 -389936
3529.1 -389936 940313 -134418 -254611 222317 1004912 832852 810989 317192 405314 1244411
3517.1 1244411 2888639 3249027 1402950 942386 603458 900510 817397 351098 317046 -337940
3505.2 -337940 -805729 -877520 -936814 -117120 -487914 -491347 -377139 465029 1056325 503519 -254356
3492 -254356 -747454 -865507 -503054 -1171224 -1322894 -1790816 -1733831 -1369345 -1056511 -1206023 201668
3478.8 201668 18023 -142603 60061 -403778 -1180789 -342384 606088 1776765 1846609 986775
3466.9 986775 -204999 -390526 -129737 -134160 360009 429239 1365349 460547 -344390 220676
3454.9 220676 -419241 -223633 467790 481243 274021 -21016 41840 36774 158776 -449296 -151687
3441.8 -151687 -181821 604847 2232557 2522766 1766167 283805 -604285 -85892 -224087 -1819760
3429.8 -1819760 -2362968 -2165245 -953914 -877261 -1242442 -486176 290490 340300 -33868 -641971
3417.8 -641971 -53628 -862766 -966857 106481 962339 737019 57818 210924 -385054 -1714146
3405.9 -1714146 -2230699 -1181763 1306040 2278554 1715672 1552718 1187685 70187 1160179
3395.1 1160179 1643943 391613 -603115 -1383744 -73840 960396 366697 -142113 -33660
3384.3 -33660 144062 1083293 271124 -624439 -1453477 -941617 659139 463050 442883 238348
3372.4 238348 428985 -220207 39654 -804949 -433251 113387 64798 -503369 -1136350 -529062
3360.4 -529062 -35046 812747 853367 -858053 -1009868 -570699 -739969 -324169 -300444 -439795
3348.4 -439795 343200 1013049 -78519 684942 886836 90197 369197 800395 828923 543222
3336.5 543222 772670 -68961 291228 1114471 526103 347235 1081970 1423325 65397 -312855
3324.5 -312855 -201871 -101436 457359 1212264 378158 370788 698092 722005 -210948 -1100011 -1283383
3311.3 -1283383 -1065943 -662378 -1511726 -1811173 -1132205 -426117 -1140573 -1701581 -1488627 -1109783
3299.4 -1109783 -952726 -1899378 -1316065 -545609 -955022 -1430232 -469056 -825627 -1092989 374138
3287.4 374138 2333855 2846815 1811080 1010269 1101918 1694431 1757491 1512633 868767 668542
3275.4 668542 1537725 250036 -555624 -324033 329766 78479 -791024 -989762 -9484 -416072
3263.5 -416072 -601843 -663017 441885 340156 -152684 -398713 -486415 -914072 -708882 198510
3251.5 198510 -603887 -557003 -895999 -1287252 -1339653 -1637995 -352496 -496688 -216351 156694
3239.5 156694 36829 546970 1346181 1720070 1544158 2427404 2316152 1796829 1008618 491519
3227.6 491519 -71292 -896086 -757692 -130555 150877 508172 376592 -421893 -512673 -501308
3215.6 -501308 -2026829 -2128414 -1096558 -435550 516909 1587566 1824636 1222758 -182496
3204.8 -182496 -792045 -541174 -111472 -109863 -780236 -740094 -224582 597524 1263053 1037833 205396
3191.7 205396 438780 1060154 649312 640878 1369464 337634 158464 419316 555395 358929
3179.7 358929 77350 -1004692 -922467 -805220 -364920 557955 329796 -1063605 -611559 -893177
3167.7 -893177 -1060078 -1252963 -1192189 -2016365 -1297938 -793972 -549776 -1044035 -1540710 -118907
3155.8 -118907 465910 262619 -589588 -42984 280980 876490 800295 950286 2001323 1894911
3143.8 1894911 1444071 1643471 1214939 1118691 204887 99246 -52839 280205 -1089245 -218712
3131.8 -218712 512810 686381 95452 563620 974747 239500 65632 184336 284248 -355167
3119.9 -355167 -1870710 -1353168 -416182 -369958 -655128 -1474225 -928221 13830 -191891 -174114
3107.9 -174114 -215871 -209054 -255677 -1537432 -1693379 -497879 -641966 -659660 -354321 26964 -544249
3094.7 -544249 8982 -499298 -90612 -343446 -266114 190549 738094 309610 83814 161849
3082.8 161849 668490 896416 1027484 410443 100653 1070931 921519 -430757 -1230605 -1171228
3070.8 -1171228 -1597413 -1550068 -1644889 -156530 1364271 3165431 4220291 3391727 2054301
3060 2054301 1925192 1967845 1072311 870758 825764 1664770 925984 1932037 3469310 3388333
3048.1 3388333 2732524 2635697 3835653 3861312 4155906 6053430 11224308 18189925 25015618
3037.3 25015618 23676773 16542329 10646430 7501172 5734458 4549468 3258667 3014050 3404877
3026.5 3404877 4317588 4630036 5480323 7333531 11299135 18527666 33457290 58434430 73288850
3015.8 73288850 59417685 36145100 21648935 14819748 11312129 8262962 7317714 7717960
3006.2 7717960 8897390 8946588 10872544 14026031 19537160 28292668 46928555 86583380 135223040
2995.4 135223040 138133690 92455980 51610795 28451288 18522265 13279646 10257934 10130854
2985.8 10130854 10275118 10561563 11423415 13054135 18602091 26629410 41693970 73557080 128343850
2975.1 128343850 168558920 138927680 80427510 43056000 24686205 16104604 11685826 10507489
2965.5 10507489 9566386 7995054 9002805 10879484 13505064 19707180 28279105 45471850
2955.9 45471850 81473815 129841480 138126590 93660540 50623800 26851183 15172635 9998011
2946.4 9998011 7634954 7129592 6881881 8000359 6309982 5617769 7486663 10228154 16003268
2935.6 16003268 29080588 50825060 68928840 58863785 34091095 17477700 9016884 5897831
2926 5897831 4844491 3519889 3205529 3499174 2088046 1308345 998965 3233931 4926226
2915.2 4926226 6630388 12072433 19466226 20656004 14058239 6496073 2024652 -117360 -495118
2904.5 -495118 -581339 75680 618792 472929 -305930 -1457689 -2912778 -2791594 -3133880 -1986585
2892.5 -1986585 -1289009 -803284 -1105487 -1626250 -1792354 -2082264 -1169876 -506016 -1147896 -1278305
2880.5 -1278305 -1366635 -833541 -931460 -825801 -503497 -732470 -680790 -727137 -992976 -856461 -442848
2867.4 -442848 417695 360805 -281968 -792136 328846 1310477 534598 842190 198281 631004
2855.4 631004 899293 407442 -278025 -658791 17902 392661 1566270 905805 351760 -279801
2843.4 -279801 -772492 -708065 -663143 -268328 -730179 -539151 -8469 473440 -77326 310546
2831.5 310546 226608 576026 -74248 -1269973 -1424170 -1390907 -443529 415035 238690 1426869
2819.5 1426869 2039848 848816 635627 721569 -499276 -755187 -447849 -580707 -499886 -606155
2807.5 -606155 -126420 -106598 496370 818418 161611 -591796 -405346 -424371 -591178 -553305 337429
2794.4 337429 101585 -211301 451779 270291 1248166 1438627 -119297 -1671459 -2665703 -1681923
2782.4 -1681923 -724082 -777086 -365105 341179 538468 1138439 1654765 1450619 -275120 529274
2770.4 529274 978948 91533 132039 -144025 894212 1752150 323787 -136690 93307 556114
2758.5 556114 1444595 1733627 572942 256582 280562 -55693 -393773 -503158 -513386 -1326663
2746.5 -1326663 -852986 -406294 -1626985 -1804960 -1849810 -1411770 -1289579 -129222 70718 -665291
2734.6 -665291 -637548 -82350 762399 860904 870760 1943550 1768405 1023666 988684 880229 279561
2721.4 279561 378038 216488 -551542 368534 976250 102002 953 704320 187775 -323033
2709.4 -323033 -597547 -225980 303631 -403584 -502523 -716396 -1036238 -942979 -259035 -521203
2697.5 -521203 -43824 -304456 518534 -126642 697 170123 -213010 255998 -186242 -1129372
2685.5 -1129372 -960658 -388425 -812432 -1039027 -236774 -212529 -1682955 -1724046 -1406945 -621911
2673.5 -621911 640541 1171457 802125 522644 1215441 61990 -188134 492197 206740 705460
2661.6 705460 1058903 2097672 2625704 1767212 431772 -493329 373170 636372 854592 707068
2649.6 707068 464246 -578391 -1810640 -1175698 164147 187888 -906881 -802105 -1163534 -1249437
2637.6 -1249437 -556658 879954 1093394 146932 -220739 -642304 -147563 357559 947870 538409
2625.7 538409 895792 -350914 -746181 -522468 1695 -2538 -873461 -447771 -164081 -298966
2613.7 -298966 -242397 -956798 277853 63233 -686089 -511705 250159 662243 1640940 1847428
2601.7 1847428 477563 92549 -451746 -1082946 -268482 338514 706501 107413 224127 -194257
2589.8 -194257 69388 348515 -349293 41973 15991 265796 907038 -389663 -97605 17541
2577.8 17541 959133 831855 -550368 -1063836 -1202529 -1179290 -825007 -1188887 -980340 -1718025
2565.8 -1718025 -1736447 -1309981 -1709513 -1599923 -324631 417193 905837 1375666 1867597 1546757
2553.9 1546757 968417 1089339 611921 481078 927057 978607 244042 1471950 1581955 472324
2541.9 472324 216927 268294 -372219 -386924 78979 655224 -406469 -844081 -354916 211904
2529.9 211904 19603 225 -128281 -245994 38802 1285 -212969 -527546 -1160740 -713084
2518 -713084 77861 -177068 495335 -332542 -582738 -462615 -556818 157948 -427221 -1288709 -1417724
2504.8 -1417724 -261552 -242678 -445485 380012 879152 339122 901613 533824 230402 628120
2492.8 628120 672809 786284 1052024 1774564 1499473 1045146 -76104 -216730 258186 -423769
2480.9 -423769 -971057 -1220567 -977317 -756096 -328205 -410793 -1199735 -1239216 -190972 -191058 384383
2467.7 384383 697627 127502 101564 53661 1005064 248506 293869 -599479 -156005 418541 -179780
2454.5 -179780 361427 1316551 1251589 881736 680770 1610776 720431 87804 -269168 -873837
2442.6 -873837 -1669928 -2700358 -2285826 -1276998 -1292286 -1273475 -653754 -1097875 -582064 -223770
2430.6 -223770 -153537 576379 -41154 516652 874610 109889 -500471 -724707 130635 361881
2418.6 361881 543509 1196041 1231256 2516673 1374878 542992 649496 1501902 -27908 -984402
2406.7 -984402 -377284 1271960 1211372 465513 539468 -451780 -1235780 -712400 -245802 -454234
2394.7 -454234 -55323 147765 -1207368 -72642 953150 1439805 752952 -472233 -733825
2383.9 -733825 -1461576 -698170 20042 -259225 -777996 -979588 -364541 -516627 -1347210 -994691
2372 -994691 -127508 -10573 607369 -96456 171838 -99811 -941914 -328373 -12852 -180352
2360 -180352 -320335 -203719 245249 312175 1243600 -165403 499702 383334 -270602 -38521
2348 -38521 602405 734647 -368890 -185825 648086 642252 339159 -58673 -848043 397223 1372296
2334.9 1372296 639830 120727 79632 892047 1350275 806132 605599 496745 28137 -96519
2322.9 -96519 -1398028 -2149013 -1425475 29313 1016251 749051 497085 864613 664613 -160042
2310.9 -160042 107069 314415 735955 835357 671676 323923 -792456 -888151 -40848 1024425
2299 1024425 556576 168990 804880 847112 771883 512424 1185526 1638955 445329 -258599
2287 -258599 -591847 -927539 -1402534 -1683945 -1066254 -569225 -1219826 -1536618 -890975 -559184
2275 -559184 -742920 -973371 -669633 183536 79934 -152224 74892 -304489 169655 -3860
2263.1 -3860 -320645 -1244717 -1257866 -1532620 327391 265900 1091929 1069766 245375 -553354 -1100544
2249.9 -1100544 -128715 605850 547413 654312 1024609 710623 3804 394509 392405 -133242
2238 -133242 -180959 623920 125730 -633419 -875876 -391207 594789 677463 1212950 942395 676957
2224.8 676957 -349023 -544719 -596965 -187576 -294004 -410251 -489574 -356922 -762298 -669077
2212.8 -669077 584096 1170824 334003 -58518 -152002 146636 133953 534117 -384294 341789
2200.9 341789 -130862 -1587988 -2280201 -1538576 -35901 458801 333759 191783 -5060 -1106190
2188.9 -1106190 -701901 -466921 -62182 -287022 879930 1801940 1662726 1484585 904121 480583
2176.9 480583 1204327 1387310 444044 81763 -463847 -288642 -755365 -1422951 -529749 406512
2165 406512 653917 163473 305067 -84684 247696 930103 451895 -149785 -64737 -327849 -1624418
2151.8 -1624418 -1148372 -568243 -354937 310615 -95591 -1013420 -961149 -913036 -633329 -534905
2139.8 -534905 -91258 197653 411329 1218641 1767125 1018267 310252 322589 38353 -300218
2127.9 -300218 -1225385 -699710 207066 986841 537557 112151 -83721 1238400 1381774 1244586
2115.9 1244586 1510974 481588 -192487 -983288 -540309 -1442427 -1138783 -485953 855953 538940
2103.9 538940 -30332 -159946 -640028 -1128596 -959340 -806340 -1470450 -1206454 -799604 129110
2092 129110 306632 917772 612130 558648 842905 127870 522721 -108130 -70762 -296268 944342
2078.8 944342 914591 96761 1030579 -22953 293914 1248495 782625 365045 -643099 -1302629
2066.8 -1302629 -616969 -730431 -1868277 -819386 570211 675153 -167836 -561724 -991084
2056.1 -991084 -2009962 -312284 671672 743894 -789639 -456008 918280 619479 -309451 -249409
2044.1 -249409 124894 -30901 -256685 -1067856 -581821 -146660 814902 597965 -1898406 -2180450
2032.1 -2180450 -830733 -45067 636587 614302 1542441 1764924 1570071 903982 843309 607015
2020.2 607015 1087286 211737 -50460 758757 -155505 -432095 97473 138547 -280658 445192
2008.2 445192 -326760 -498827 350380 1508463 483626 924942 423717 778284 720886 90141
1996.2 90141 -84345 319661 -27239 -843680 -1368388 -1272141 -1595798 -1348813 378932 762811
1984.3 762811 1455999 622291 866573 -388981 -1269917 -642043 -972814 -1112207 -1526083 -1414309
1972.3 -1414309 -599385 -1109506 -1121960 352708 86845 836458 555768 1111461 618804 577745
1960.3 577745 232906 -404630 563741 959373 779809 1389863 1001171 370939 11357 -1141705
1948.4 -1141705 -511054 673092 986153 704963 792818 238985 -111767 -87361 283640 1126203
1936.4 1126203 -209248 -762159 -849757 -193805 -1199405 -2063930 -1965414 222930 770706 813327
1924.4 813327 -21082 -447918 -864655 -252453 -539529 311713 943448 644005 13711 382488
1912.5 382488 62575 -699265 -290247 -110224 -475158 351292 767470 1015683 859514 1326388
1900.5 1326388 1235527 800875 -171478 448974 -17396 -531548 -61222 890588 1444647 375714
1888.5 375714 -459740 -1236883 -1356761 -2200720 -1573497 -448067 -521694 261299 281494 596678
1876.6 596678 -235143 480254 140651 -154929 -534540 -1974084 -2358094 -1739366 -1430019 -2602999
1864.6 -2602999 -973533 -1297276 -491687 -82658 -379607 -280296 633025 673274 770793 639213
1852.6 639213 334753 183106 -109779 642328 1636396 2171173 1782324 1088835 319256 40716
1840.7 40716 1018514 2052039 806045 684769 573439 719078 659118 -311107 -664949 419140
1828.7 419140 1697018 503043 -413860 -764056 -1259599 -1250373 -1113864 -542595 -950707 -500901
1816.7 -500901 -180512 -443032 868454 1442363 1845368 1384313 2361358 2225375 1367499 1313904
1804.8 1313904 2466134 2244983 2976442 2948472 3724529 4422656 5148552 5893946 8023357 11626054
1792.8 11626054 16243960 27833593 61112925 140256430 155998210 66416955 28002748 13408895
1783.2 13408895 8524044 5762526 3988592 3039889 2842932 2017663 1446504 801215 -89580
1772.5 -89580 -509732 478404 1773219 1266944 -555530 -828438 -1284647 -1670364 -1024278 -448462
1760.5 -448462 -806861 293640 1457543 1113661 734534 933544 1332123 1413239 447403 -223927
1748.5 -223927 -499359 -506911 -450263 -1193285 -1221294 -639747 -529960 -274845 -226229 -441178 -475672
1735.4 -475672 819953 1052911 125567 -132498 -416838 -101737 -889474 -818513 -171032 -326010
1723.4 -326010 -503570 -468507 -44977 128811 255009 1663595 1238164 -31829 371151 339592
1711.4 339592 -920999 -1979283 -717211 -316810 -56730 199298 94549 1115791 422736
1700.7 422736 478863 565109 1363804 1384805 775228 372924 156103 -570895 -884588 -675379 -396515
1687.5 -396515 -515051 -643448 -1436440 -1859718 -1347550 88448 906803 2655355 1791589 451776
1675.5 451776 -1092093 -524608 -95560 -914615 -514306 -377099 -541420 261250 406362 295862
1663.6 295862 242453 -426481 231534 752284 264910 -134993 -743849 -905642 -294575 284537
1651.6 284537 -58165 -566497 -82618 931331 1152889 1975172 1470268 301608 102627 -731410
1639.6 -731410 447352 1047356 512641 701604 482592 -78942 -69625 -1417684 -1755401 -957349
1627.7 -957349 60474 25952 -232522 76 501600 -361330 564010 -285593 -1334829 -760789
1615.7 -760789 138847 -229936 -837814 -1466075 -979279 -986533 -470051 18611 614443 842642
1603.7 842642 12333 -531302 186743 1168535 1206723 1023353 1114624 1132720 -35281 -532014
1591.8 -532014 -737996 -1226221 -1068351 -179887 673610 162322 220327 308414 -48953 -351076
1579.8 -351076 -79470 821445 1043201 886351 194729 -562392 -971640 -748859 -291231 -154907
1567.8 -154907 -207004 619832 787593 -569760 -1159803 -332251 484673 -38607 -80633 443071
1555.9 443071 6619 787264 557473 -311159 -333877 -1459048 -1964571 -760316 -109816 -484945
1543.9 -484945 -468562 204966 187865 701132 1443113 738931 373627 227917 1590841 1669449
1531.9 1669449 1631603 2485606 2287420 1019981 -320324 -77811 682086 -161002 -265194 -531891
1520 -531891 567594 1215062 1234658 457849 -445646 -417940 -745830 25586 -563687 -1984176
1508 -1984176 -2788668 -1915716 -1195801 -1017985 -667050 -170167 295460 -891449 -1120370 -1048857
1496 -1048857 -419065 -478498 311632 425083 1312615 1238776 543259 -1158322 -1317365 -300514
1484.1 -300514 106909 -160148 -385328 418175 440954 -78614 1037622 1307802 516421 614301
1472.1 614301 -971469 -743135 159023 393283 30825 -381507 -447581 19140 -263799 -418327
1460.1 -418327 132884 413091 327218 76080 -20670 -996406 -1196820 -574393 683709 1120603
1448.2 1120603 886985 -508068 -233419 851824 157552 -1201215 -215623 1505552 1938439
1437.4 1938439 680964 1104978 684838 41407 67985 174632 -495284 -221283 -77640 -450890
1425.4 -450890 10276 -231358 -757750 -721343 -989580 -359047 533978 150480 196318 -198079
1413.5 -198079 15564 -136530 391354 454431 498818 -597604 -1379723 -991310 -135038 -59935
1401.5 -59935 577171 752434 319995 -167134 -77558 522983 437336 150460 -114455 479421 56841
1388.4 56841 322416 -211627 -597363 -660805 -281019 -739427 -498107 -314092 -84771 277183
1376.4 277183 378144 128282 490089 733477 693188 514841 -309572 -671823 415633 836450
1364.4 836450 564527 -22429 -622085 -1299945 -301734 -125663 191227 805974 528524 -960836
1352.5 -960836 306952 1838109 869650 578566 -417584 -508857 -864675 -451327 164016 9395
1340.5 9395 242415 108572 518772 -882419 -271399 -166325 30698 -47299 -381326 -527030
1328.5 -527030 19056 -242683 -130502 -76128 -514855 -134918 -1453395 -2334580 -1952950 -815680
1316.6 -815680 408230 740117 1225613 1741880 2191325 2179289 1100883 548133 434053 202958
1304.6 202958 184080 294545 560143 809320 1253844 -7021 -508395 -239425 -109877 -151872
1292.6 -151872 -238896 -928678 -981692 -731989 -1097641 -358682 -982188 -761441 -443849 -324025
1280.7 -324025 -1219428 -1075013 -1372336 -2156589 -1486138 -427223 301030 74446 -359175 307424
1268.7 307424 -3835 81775 -264222 -587552 491616 1542581 2027914 1156229 1075663 759066
1256.7 759066 1016671 1005467 646003 718429 731683 621976 -10887 81620 44197 -683311 417893
1243.6 417893 853737 372750 249533 597857 904042 134025 -375548 243802 176099 -86900
1231.6 -86900 -188504 -226833 229343 566588 230827 -1078823 -1162123 -503466 -1476432 -485642
1219.6 -485642 298688 686346 1021474 116299 -771806 -1349087 705998 1112711 23031 -787543
1207.7 -787543 -1397369 -878820 -1134646 -986925 -1419094 -698259 -171922 573863 951835 490758
1195.7 490758 -463249 -468951 -524040 -444901 -245982 244837 129050 276027 -39161 -365040 -143867
1182.5 -143867 -247179 -378052 -661594 119140 871527 1374269 1384190 806848 774282 808759 1116880
1169.4 1116880 511538 977420 679382 -401100 -866088 -1281791 -884280 -1184163 -943245 471582
1157.4 471582 893226 1168127 150690 -50313 -1184099 -594949 -978248 -1171045 107473 470974
1145.4 470974 373345 553323 -160530 168038 476272 695299 263740 1233636 1458113 1801069
1133.5 1801069 1692488 604354 1180576 760656 -97721 -437468 -452561 -859130 -919839 -978298
1121.5 -978298 -734548 227853 -1988494 -1891333 -793249 89001 -83472 -426781 -101381 -390423
1109.5 -390423 -21873 1377830 714439 -352939 -1001620 -1836284 -1151158 -477993 -256488 -14245
1097.6 -14245 593351 1295352 -340212 -525594 -975852 -752484 -115826 -1837187 -1802394 -749563
1085.6 -749563 -617627 -297515 -210643 -297199 1290054 1948160 1149860 1464778 1548678 1001835
1073.6 1001835 762374 805575 1333405 1073424 295238 105871 -689866 77187 -251478 101333
1061.7 101333 473856 -92731 -935556 -769445 -251740 -955326 -1138188 -1016052 -1078708 251453
1049.7 251453 1249128 1108594 763807 2035014 2003383 1080076 882155 597927 97593 468234
1037.7 468234 -177979 51597 -626031 -1607365 -1042464 -258580 511325 573753 446962 389555
1025.8 389555 46792 400105 183950 878217 1105361 1436228 465434 -532537 -1415433 -718674
1013.8 -718674 -828171 -984136 -1109358 -1202271 -1225556 -748707 -456236 -199397 -930712 -272697
1001.8 -272697 -709846 -1485481 -912323 646610 905126 -291599 -1517285 -230701 -272798 162585
989.9 162585 139973 322994 1145072 1192043 285885 352677 38300 175862 -438685 536001 523184
976.7 523184 -223722 -213810 -130532 -396042 72237 -25830 254283 834667 1275985 9778 320711
963.6 320711 170454 -578526 -1083480 -987210 -333018 131302 -207586 -309391 -911280 -794346
951.6 -794346 776070 924248 588109 210097 708803 849802 40099 -398256 -619219 -849216
939.6 -849216 -960556 17347 -53581 -714702 -60549 916878 1594388 1066144 1337160 1379646 1064739
926.5 1064739 613004 511164 -115063 -649140 -492523 276483 -554603 -426342 47234 -812877
914.5 -812877 -1361902 -1573455 -1188770 -364117 211725 212442 565073 -517896 -1065347 -527434 28110
901.3 28110 576472 -191408 -535433 -982070 58129 994617 768257 -49098 576776 -75358
889.4 -75358 282223 677690 -697077 -887505 263513 1259835 1727548 1561960 428611 576150
877.4 576150 546558 771053 287115 -415144 -882969 -1812276 -1548688 -762544 -725482 -438162 13971
864.2 13971 -223362 1097586 1147989 2251789 2366580 1358129 1196789 835543 232560 -1295277
852.3 -1295277 -1854136 -971843 -384875 -410336 395849 1080685 143916 -651914 -139536 -173509
840.3 -173509 -637664 -1275409 -476978 -499723 -520910 -372995 -411212 -270442 -55500 -142548 -1309940
827.1 -1309940 -2177525 -950829 356726 130380 -246923 -989861 -148391 240830 137467 -268861
815.2 -268861 70753 529443 517814 783072 438592 -207774 -96473 410458 947756 1178842
803.2 1178842 1611524 1177899 524227 459495 -509294 -541206 646679 794748 982092 1195048
791.2 1195048 1309348 483247 78497 -395237 -372474 -956078 -1371191 -1233095 -1069326 -443359
779.3 -443359 953280 1670692 606142 -324183 -687203 -1365665 -103419 365464 882982 -314340
767.3 -314340 108013 384923 240722 -646591 -550747 493708 299890 -448814 29307 -119368
755.3 -119368 -138718 515843 801236 428337 -196955 640064 769858 696599 -46508 -380644 172044
742.2 172044 -283403 -337243 -883101 -959749 -1283504 -1035493 -481675 -40538 566281 452502 -802560
729 -802560 -655577 210606 560384 529215 1049049 1352364 312694 271525 -124207 -23489 -57793
715.9 -57793 975763 1530843 952384 -5562 -522205 -80562 -551311 -315777 -519939 -673420
703.9 -673420 -510725 -335018 -1354080 -1757998 -1272207 -361979 497881 452355 -7623 -1266725
691.9 -1266725 -432734 -764715 -825378 2337 175768 778995 848132 1615839 517292 -227494
680 -227494 1010591 80308 -956921 -1636576 -2154859 -1938308 -1106532 -86548 -475664 102595
668 102595 -244324 89189 -471987 -565116 -483785 -477585 270301 -38124 570308 -600496 -1186474
654.8 -1186474 -886885 -350201 262936 1226856 1465433 1454490 1084296 1594550 1321218 -88812
642.9 -88812 -304091 -620754 -770244 365247 1115992 1238132 945957 1080848 1256116 1438255
630.9 1438255 970876 1296043 1098513 1388012 1057633 -393587 -647251 599786 1042285 -32680
618.9 -32680 -373699 -576432 -1016923 -395550 -679348 -798095 -265475 216986 1243545 361156
607 361156 -1133442 -1027076 -1105495 -1527866 -1091800 -1192055 -817359 -717171 -874005 -784645 778967
593.8 778967 1307548 576408 -782490 -536609 -402044 -270081 -530904 -78907 500428 98984
581.8 98984 -1244735 -5465 237430 2192693 3086388 2051643 1446201 1399086 887924 351890
569.9 351890 212365 -1309844 -1817811 -829923 -150601 -525384 -1996310 -326828 1252382 605750
557.9 605750 436871 -216128 -898747 -1101993 -1135243 -1291227 -1521878 -1536632 -1695592 148606
545.9 148606 1098450 -350136 -715078 -524867 -1006899 -951872 -183995 814649 1271593 50833
534 50833 556374 533111 483038 558938 552028 506720 143562 55427 -801225 253621 1203179 1789832
519.6 1789832 1552886 1726622 452155 -145024 -221624 -217738 47661 452435 438521 -866063
507.6 -866063 -68544 302565 -726565 -935733 -732824 -1308880 -1027300 -486311 -1096434 -1101642
495.7 -1101642 -1093272 -664646 -151436 310992 682026 -39149 -309555 283162 1248000 401860
483.7 401860 -358848 -443176 26655 -166485 653852 750775 66933 -835284 -961981 402346
471.7 402346 597137 887608 -134982 -759711 -681827 -457674 564676 1137203 2035487 1246211
459.8 1246211 717408 1486231 635099 592119 461035 760397 1893416 1246892 847626 581104
447.8 581104 -360444 -452657 46338 154068 878815 464220 216587 627747 -496324 -600731
435.8 -600731 -980111 -1191283 -573121 -570499 -684047 -181021 -528996 -95159 -319067 -766162 -1473509
422.7 -1473509 -1247973 -1460572 299904 1521181 1092257 -86090 -1903985 -1155792 -591194
411.9 -591194 130108 -549947 -983760 -567517 -1166527 -770403 -1084726 -1417295 -1028742 -285504
399.9 -285504 -238987 -697280 489961 1089880 1220134 807056 765550 216427 894880 1820812
388 1820812 2199147 974240 807089 1655760 1214495 -175099 133869 393450 -318020 -61874
376 -61874 180665 -806321 -1620104 -1334847 -758657 -222717 442432 231875 -9150 322446 230763
362.8 230763 -429018 -723114 -1267822 -994811 -294944 -316552 -451631 298506 986035 -988653
350.9 -988653 -1126401 -599209 218861 801397 852400 858444 353433 -66079 306133 664554 1095463
337.7 1095463 1647650 1209791 188455 525417 1087268 292758 -296922 -237128 -756970 -526214
325.8 -526214 13730 -207370 -981860 -557821 -296134 -494321 86692 -249008 -1273905 -1427603
313.8 -1427603 -2340840 -892626 543068 505628 370225 -755677 -203630 -25164 945220 917959
301.8 917959 1007012 938863 448531 434697 1543938 932404 96928 858803 1216811 1389451 1334150
288.7 1334150 899067 -571894 -499632 -253283 -221806 156599 1010521 716062 786836 862976 1536868
275.5 1536868 1667266 496310 -1310394 -1061256 -855815 -1231378 -1110880 -393231 -1322019 -1943880
263.5 -1943880 -1859111 -1513787 -1301506 -1481297 -1228715 -1344227 -125274 1299331 548887 565583
251.6 565583 449953 -676752 251857 487430 -454378 -320775 121682 518628 -103860 561647
239.6 561647 477498 -98745 -663327 -258758 690595 601432 243228 181795 -535476 -1029641 -1118438
226.4 -1118438 -955224 -525822 202599 -480980 -581641 -406638 246043 312259 430418 814539
214.5 814539 746843 1147356 988909 674001 81999 841659 962699 777475 1137554 477647
202.5 477647 515155 -515622 -1684629 -1593332 -305257 907496 1261269 -52178 -1022296 -1195704
190.5 -1195704 -992123 -1196363 -916628 -390542 -748698 75561 427829 128611 184360 522596
178.6 522596 -23739 -558887 -1144267 -1243994 -319993 -8614 321750 5208 -173830 -263167 331997
165.4 331997 503478 679392 398488 945086 1873330 2311246 1361952 1055500 720396 534667
153.4 534667 -384582 -1145888 -1369298 -856060 -729962 -377829 1137957 1962114 642273 -406410
141.5 -406410 170919 359683 -644280 -692094 -633860 -191951 -133670 -253594 194267 263356 496624
128.3 496624 80994 341767 -86418 -368129 200671 -189922 -749140 -1331283 -1002438 111075
116.3 111075 940826 1157752 1066035 1282037 1271162 630048 -776671 -904599 6570 -93672
104.4 -93672 120196 383789 68726 277388 -399766 -925851 -386429 -61696 332240 -257062
92.4 -257062 -1096253 -1208445 -1000955 -198172 524550 437775 87698 97181 172205 332343 1034774
79.2 1034774 226636 164917 -160632 -697613 -23598 -185034 -403455 63713 306738 -473131
67.3 -473131 -625983 -661278 -1549108 -2171335 -1490896 -470212 -81911 -765781 -765686 431862 596132
54.1 596132 805247 832216 1307612 408458 439198 971291 1194944 992635 573821 33036 101872
41 101872 -286533 -148925 1110528 1514491 407799 -313212 195446 728985 462846 352722
29 352722 -473218 -792899 -402880 -389906 -329309 -402816 -377883 472474 839018 1106833 488820
15.8 488820 -492116 -975949 -1067502 -491363 127104 199608 -1384299 -1105899 -605742 626433
3.9 626433 966699 1276901 12537 -498866 87794 642895 -408580 -868381 -985951 -1188722
-8.1 -1188722 -1384561 -1208736 -75502 -271363 -505728 -362383 -477077 -169220 -346150 -344882
-20.1 -344882 -211320 74453 715696 1463487 275974 439445 -4165 1059057 1530653 612183
-32 612183 484950 -94140 920600 932587 220938 563347 275272 -244967 -500044 -19663 715759
-45.2 715759 743639 -749008 -964346 -1309073 -1304344 -959499 -1170163 -96662 -39013 -800246 -679921
-58.4 -679921 -1236100 -744210 -455007 -15104 858686 -42726 416308 981976 181983 365282
-70.3 365282 -12266 -403043 -829874 -445976 867292 1366090 1190280 852307 774704 1578415
-82.3 1578415 756587 565113 1455998 2330776 1946791 516191 509293 62407 -134201 -356342
-94.3 -356342 -448572 -849331 -102539 126710 -346564 -123107 -627624 -408477 -277979 -540990
-106.2 -540990 -1452991 -1857667 -1329430 -854654 -848581 -334339 -45232 1217233 1606283 1754210
-118.2 1754210 177384 -448739 116324 23108 -108750 -1025054 -1315983 -919714 -1491527 -931172
-130.2 -931172 -1390535 -1641917 -751854 1387561 2083010 1605793 1189243 1222941 1722271 453937
-142.1 453937 -293864 238579 -764480 -362029 52706 -98224 -305347 11837 445193 18401
-154.1 18401 768169 1057308 810835 1009592 369485 292515 225948 387894 -229002 -773614 -186801
-167.3 -186801 -28801 -318510 158775 -466110 -1729493 -668138 408989 1027106 691960 504494
-179.2 504494 -213530 -364136 -1636609 -2784845 -1893430 -1599269 -1380960 -983645 -700820 -456264
-191.2 -456264 -1088243 -1258880 -648244 823614 1307045 788549 1286259 1403274 183600 -143028
-203.2 -143028 -446417 302316 -387341 191080 874402 897623 772793 326852 106732 436181
-215.1 436181 283285 -80844 293872 706024 635718 680695 851461 966300 852846 697155
-227.1 697155 -5701 -287451 -364025 -247402 -238874 -394583 -519213 -1029091 658752 534736
-239.1 534736 679299 78128 -28169 360743 -155843 -242796 168467 186325 -257154 -634086
-251 -634086 41376 454640 563747 -87333 378691 -290977 -244991 121509 -635436 -904351 -1174580
-264.2 -1174580 -1834549 -1263289 -990535 -581262 261672 957653 784695 558096 658964 898829
-276.1 898829 -835097 -907287 46888 528714 324220 125233 -140830 438493 1070454 854679
-288.1 854679 109929 -632549 -715017 -554765 -224170 -630415 -343725 231135 482793 -1369070
-300.1 -1369070 -2166410 -2046907 -989241 393179 811634 265255 -49002 389839 264949 -389139
-312 -389139 504125 1457174 1603190 977337 10569 -11795 136323 126214 825601 1782356 1730806
-325.2 1730806 640296 -1082618 -923367 -585101 382701 1382018 1039933 696385 -127625 134458
-337.2 134458 467291 -143562 -1443689 -884295 -280591 -693389 -1216522 -357247 1300222 350075
-349.1 350075 -240882 -460609 -11363 -3867 -103567 -281947 551875 222555 964774 574164 -127341
-362.3 -127341 -105360 440451 -424024 -490494 -510960 313447 -65441 -538735 -767440 -1166204 -727492
-375.5 -727492 -1290595 -941532 -57171 804218 815405 -1033987 -814593 -158437 -384190 589920
-387.4 589920 723743 560286 1149208 992328 732174 1274309 630577 -142376 -172666 -88377
-399.4 -88377 338192 -64407 180095 -231763 -139555 -105634 676615 -81857 -79222 -714782 -427258
-412.6 -427258 602436 626302 227032 -582991 118566 809679 161287 -1404663 -1006691 75425
-424.5 75425 -124471 -840779 -797900 -233081 536535 -382911 -335003 547501 842642 873099 1374387
-437.7 1374387 876972 -367453 -883383 -328265 -599006 181896 1155957 39203 -1172132
-448.5 -1172132 -1352889 -1319758 -972686 -697782 -530968 -174517 -712433 -338805 -1020250 -1327469
-460.4 -1327469 -1372358 -1022052 -1215928 -405794 -86780 -5502 14175 209918 -420080 -478534 -532823
-473.6 -532823 788923 969164 -152433 76907 917774 1929970 1905231 1628688 980105 1041679
-485.6 1041679 891631 512513 1504948 2046967 1147445 388147 337522 234361 158363 749351
-497.5 749351 530663 468681 476009 -70613 -753788 -829271 -110104 -41335 -196346 -744230 -1215944
-510.7 -1215944 -992990 -1294679 -1526846 -938595 -794360 -1052985 -1206073 -636174 -97314 -126486
-522.7 -126486 627013 1608881 1568438 1499308 975790 604040 1041349 445051 744442 975406
-534.6 975406 774774 1182921 283730 812771 690000 448994 -74182 142168 104249 -255791
-546.6 -255791 -745816 -917553 -349464 -1186061 -1355493 -490946 375402 195822 -636547 -1333137
-558.6 -1333137 -615236 -1200540 -1801185 -2406161 -1498385 -462488 -323626 165574 677553 123392
-570.5 123392 -448851 340550 492633 191582 416334 -441519 -13446 35568 305686 749126
-582.5 749126 717726 754560 432771 298455 693473 1456084 1281575 973314 -2866 -622642
-594.5 -622642 -313115 -958654 -947696 -214113 -73002 233050 331280 653561 -274299 -275839 -137867
-607.6 -137867 -1730402 -1610756 -428620 -697384 -511509 832160 617216 -32009 569417 241549
-619.6 241549 -464431 -164895 -342390 -485176 184685 -153892 325781 1113581 1782906 1783969
-631.5 1783969 1221323 486436 -962448 -1869259 -1987001 -1086330 -877951 -1909227 -703238
-642.3 -703238 960181 1426970 809053 925443 706300 678973 188700 -69253 974762 613256
-654.3 613256 -404661 -498657 -572783 -222822 -327589 -1407616 -1425148 -879600 -498894 316929
-666.2 316929 398665 13605 91292 737452 609151 487533 225909 76334 1056023 1365636
-678.2 1365636 -447678 -702659 -379957 42299 -15142 377823 1537025 38621 -1470320
-689 -1470320 -987890 -867594 -552510 -155787 95276 852019 1367154 1299923 1149095 1621595
-700.9 1621595 1903994 2157816 1698884 1349548 276721 -1502704 -2021724 -2231045 -2094861 -1366622
-712.9 -1366622 -834260 -475209 -483207 512324 -74281 -310456 565268 612994 263863 -880043
-724.9 -880043 -1087740 -1028120 -1086805 224120 1474140 1595632 860761 27321 -228542 -326466
-736.8 -326466 -91306 -18536 368233 796592 613599 -260966 -65911 -704283 -1266196 -525141
-748.8 -525141 -581561 -1356919 -1024723 -209179 106975 853599 29342 -423713 488983 883421
-760.8 883421 931133 708660 27693 760993 1103548 381533 -272193 -416255 -683677 -736371
-772.7 -736371 -381411 -416098 -1437442 132954 678637 497555 286201 -21193 173475 -239349
-784.7 -239349 -179260 362539 1311876 944064 -46060 -581094 -129620 -23774 -394205 -741710
-796.7 -741710 -389387 8041 742999 1570819 1307402 709379 221872 -22694 -98018 488369
-808.6 488369 1160814 -639708 -1770285 -780121 -277120 -1189916 -1371658 -1002936 -1573544 -1142777
-820.6 -1142777 -112455 -289744 -649468 -191393 72946 1215583 872778 827341 549740 -682753
-832.6 -682753 -923476 -1385220 -2014669 -658486 393643 1574957 1763873 1803145 1249998 -577586
-844.5 -577586 -1202577 54328 51096 -153687 357776 -45863 -637936 -316283 393029 1463142
-856.5 1463142 1426158 -28021 -121378 751933 148785 -175784 521173 541426 775811 737194
-868.5 737194 -20177 -284229 33530 689788 352830 -986149 -788575 243065 709655 -333381
-880.4 -333381 -620305 -519682 -1384286 -1068781 -664236 -124087 1032936 928327 -70043 -572973
-892.4 -572973 -756087 -767203 -609558 -609799 429041 -35730 -85910 110450 -270670 -71034 1312543
-905.6 1312543 1057253 1145931 1019435 1299710 954597 633541 -316216 -567765 359556 268669
-917.5 268669 892784 1181390 472657 488994 1417903 1710056 129066 -956962 -1302675 -1854999
-929.5 -1854999 -1819281 -2493975 -2080858 -1199795 528048 1253264 1378118 854218 -742416 -822531
-941.5 -822531 -1008906 -1779494 -1199051 -336950 -318545 -550127 -538752 538377 472014 721579
-953.4 721579 389646 -292815 -569758 -1712784 -804830 -37104 -310923 1184586 1005586 423237
-965.4 423237 187950 147869 -51229 661755 297918 335942 799015 123043 -240320 807520
-977.4 807520 650972 -317431 -866299 -285869 749393 613209 -206925 362086 -578861 -1798102
-989.3 -1798102 -1014480 131392 927461 123268 -998347 -895336 -1297150 -1082872 28609
-1000.1 28609 1101936 1248181 703991 884301 1048581 1831022 1273773 -628380 194566 159316
-1012.1 159316 283827 1102586 1090859 747219 706213 589618 -86741 -145769 -443769 749998
-1024 749998 993543 715711 -314493 327137 907407 -169211 -997640 -720638 170584 -236284
-1036 -236284 -1046790 -864285 -518671 -995444 -635423 -465522 -119917 244915 493585 -519851
-1048 -519851 -1510121 -2084880 -1115711 -8122 256197 -785351 -1128932 168300 130322 314704
-1059.9 314704 -646297 -905488 -562132 -500341 900172 1205031 1176766 576057 180330 670581
-1071.9 670581 457139 -495012 -133597 1277744 1522044 1683892 1138659 1009463 1058450 583095
-1083.9 583095 -732399 -1397545 -503544 -280244 -378963 26311 2330 204962 -943298 -1876474
-1095.8 -1876474 -1784715 -412635 380734 366772 563419 645082 -63680 -707676 -307053 316742
-1107.8 316742 1497894 1050160 602877 238878 -1459968 -2343482 -1767241 -2161752 -2062789 -726163
-1119.8 -726163 220604 188651 -122553 -421187 225880 257177 758738 752776 1148614 633252 889636
-1132.9 889636 1914805 1602910 -131977 73683 -31845 -626466 -800042 -606197 -528348 -317736
-1144.9 -317736 -31671 80366 499705 1161991 253351 586101 581784 2410 230309 1499658
-1156.9 1499658 1442155 1610123 1406463 658848 -442490 -41652 -628419 -924842 -949115 -855213
-1168.8 -855213 -153330 646738 498236 298858 -77870 199306 -410065 -88221 179217 184264
-1180.8 184264 517566 1134677 -144055 -604372 -617610 -175388 -939942 -2207345 -2316435 -2235488
-1192.8 -2235488 -2817899 -2597331 -2068145 -342568 952535 942769 246860 -642579 -764174 -848064
-1204.7 -848064 95324 -349453 -541769 710476 1599166 1585883 488137 164216 205645 -103687
-1216.7 -103687 139453 -911179 -937353 -946222 924536 1486862 1487715 1168548 757919 1144142 990994
-1229.9 990994 414257 -1650570 -1488631 -1063278 -1275360 110545 440670 467268 1253595 2688308
-1241.8 2688308 2791815 1936379 1160896 -117236 -715702 -1063530 -6181 -157063 -476349
-1252.6 -476349 -1555637 -884897 658591 807072 798494 734645 471215 -224612 674624 1017424
-1264.6 1017424 625859 813995 920912 342537 640052 -262982 -41768 -153028 59187 88013
-1276.5 88013 46119 -923327 230568 141640 104211 55587 -117352 -958752 -2235815 -2043347
-1288.5 -2043347 -630103 -413187 -51718 -853632 -1281637 -473043 -657256 -1268684 -587777 -411611
-1300.5 -411611 -504348 718863 437621 1020864 1236379 842430 721938 -5490 -406302 -97269
-1312.4 -97269 378514 1051927 432057 -646891 -307117 -294891 599252 169757 -933077 -1566866
-1324.4 -1566866 -1313162 -1388399 -2441353 -2090108 -856798 -355879 -499180 -355905 -176219 601825
-1336.4 601825 1146972 1125986 1319275 360696 816703 1754015 1645639 656542 2043 56368
-1348.3 56368 97910 -157452 227960 737788 1252336 827561 278061 282649 370487 360005 -188028
-1361.5 -188028 -395245 -227877 -415019 -278406 665724 273517 415110 564317 357582 776647
-1373.5 776647 963495 796535 -697838 -1320671 -1093498 -63550 -318173 -178429 533410 -154241
-1385.4 -154241 -361322 41585 -390373 -1013493 -177956 238118 -147899 -320072 -128836 -5033
-1397.4 -5033 -616072 -432601 136638 456369 -172707 -527134 177755 33225 -154809 -701930
-1409.3 -701930 -1006909 -351576 -61199 106723 518367 1278240 1462363 1049821 470141 490831
-1421.3 490831 353898 -397226 -526429 -635002 -87688 36945 129681 566378 325674 171622
-1433.3 171622 25853 -428952 -873591 -1074546 -1004440 -970504 -293639 343796 683341 543137
-1445.2 543137 -147330 -816311 -766899 -500660 -1223162 -1107931 -192339 29454 7597 -55084
-1457.2 -55084 -367492 408798 522510 -208487 -417050 -328711 171589 65237 539144 745771
-1469.2 745771 368375 1076767 735134 1071474 1503461 925167 -162449 144282 190463 -77652
-1481.1 -77652 -190074 -19396 78818 -186226 10266 154859 -24179 103986 260250 -2527
-1493.1 -2527 -362673 -325098 -172017 39237 -59948 554954 638784 905110 599680 181970 376361
-1506.3 376361 467608 226230 -50378 -1328552 -1394584 -755531 -942208 -701784 -149325 49278
-1518.2 49278 57785 -638911 85027 -92889 -918374 -184134 14174 120706 88905 -608174 284111
-1531.4 284111 508961 651476 698579 -273555 -103802 63924
-1538.6 63924
##END=$$ End of the data block
##END=$$ End of the link block
