##TITLE=PARACETAMOL (p-Acetylaminophenol) $$ Begin of the link block
##JCAMP-DX=5.00 $$ ACD/Spectrus 2012 v 14.01
##ORIGIN= 
##OWNER= 
##DATA TYPE=LINK
##BLOCKS=4
##TITLE=PARACETAMOL (p-Acetylaminophenol) $$ Begin of the structure block
##JCAMP-CS=3.7 $$ ACD/Spectrus 2012 v 14.01
##ORIGIN= 
##OWNER= 
##BLOCK_ID=1
##ATOMLIST=
$$        AN        AS        NH
          1         C 
          2         C 
          3         C 
          4         C 
          5         C 
          6         C 
          7         N 
          8         C 
          9         C         3
          10        O 
          11        O 
          12        H 
          13        H 
          14        H 
          15        H 
          16        H 
          17        H 
##BONDLIST=
$$        AN1       AN2       BT
          1         2         S
          1         3         D
          1         7         S
          2         4         D
          2         12        S
          3         5         S
          3         13        S
          4         6         S
          4         14        S
          5         6         D
          5         15        S
          6         11        S
          7         8         S
          7         16        S
          8         9         S
          8         10        D
          11        17        S
##XY_RASTER=
$$        AN        X         Y         Z
          1         146       63
          2         146       105
          3         109       42
          4         109       126
          5         73        63
          6         73        105
          7         182       42
          8         219       63
          9         255       42
          10        219       105
          11        36        126
          12        182       126
          13        109       0
          14        109       168
          15        36        42
          16        182       0
          17        0         105
##$MOLFILE=  $$ Empty String
  ACD/Labs03071415012D
  $$ Empty String
 17 17  0  0  0  0  0  0  0  0 18 V2000
  145.7152  -63.0963    0.0000 C   0  0  0  0  0  0  0  0  0  0  0  0
  145.7152 -105.1601    0.0000 C   0  0  0  0  0  0  0  0  0  0  0  0
  109.2840  -42.0644    0.0000 C   0  0  0  0  0  0  0  0  0  0  0  0
  109.2840 -126.1920    0.0000 C   0  0  0  0  0  0  0  0  0  0  0  0
   72.8567  -63.0963    0.0000 C   0  0  0  0  0  0  0  0  0  0  0  0
   72.8567 -105.1601    0.0000 C   0  0  0  0  0  0  0  0  0  0  0  0
  182.1432  -42.0639    0.0000 N   0  0  0  0  0  0  0  0  0  0  0  0
  218.5719  -63.0953    0.0000 C   0  0  0  0  0  0  0  0  0  0  0  0
  255.0000  -42.0630    0.0000 C   0  0  0  0  0  0  0  0  0  0  0  0
  218.5723 -105.1591    0.0000 O   0  0  0  0  0  0  0  0  0  0  0  0
   36.4281 -126.1917    0.0000 O   0  0  0  0  0  0  0  0  0  0  0  0
  182.1431 -126.1928    0.0000 H   0  0  0  0  0  0  0  0  0  0  0  0
  109.2830   -0.0006    0.0000 H   0  0  0  0  0  0  0  0  0  0  0  0
$$ [...]
   36.4282  -42.0646    0.0000 H   0  0  0  0  0  0  0  0  0  0  0  0
  182.1428    0.0000    0.0000 H   0  0  0  0  0  0  0  0  0  0  0  0
    0.0000 -105.1594    0.0000 H   0  0  0  0  0  0  0  0  0  0  0  0
  1  2  1  0  0  0  0
  1  3  2  0  0  0  0
  1  7  1  0  0  0  0
  2  4  2  0  0  0  0
  2 12  1  0  0  0  0
  3  5  1  0  0  0  0
  3 13  1  0  0  0  0
  4  6  1  0  0  0  0
  4 14  1  0  0  0  0
  5  6  2  0  0  0  0
  5 15  1  0  0  0  0
  6 11  1  0  0  0  0
  7  8  1  0  0  0  0
  7 16  1  0  0  0  0
  8  9  1  0  0  0  0
  8 10  2  0  0  0  0
 11 17  1  0  0  0  0
M  ZZC   1 4
M  ZZC   2 3
M  ZZC   3 5
M  ZZC   4 2
M  ZZC   5 6
M  ZZC   6 1
M  ZZC   7 8
M  ZZC   8 9
M  ZZC   9 11
M  ZZC  10 10
M  ZZC  11 7
M  ZZC  12 3a
M  ZZC  13 5a
M  ZZC  14 2a
M  ZZC  15 6a
M  ZZC  16 8a
M  ZZC  17 7a
M  END
$$$$

##CROSS REFERENCE=NMR PEAK ASSIGNMENTS: BLOCK_ID = 2
##END=$$ End of the structure block
##TITLE=PARACETAMOL (p-Acetylaminophenol) $$ Begin of the assignment block
##JCAMP-DX=5.00 $$ ACD/Spectrus 2012 v 14.01
##ORIGIN= 
##OWNER= 
##CROSS REFERENCE=STRUCTURE: BLOCK_ID = 1
##BLOCK_ID=2
##.OBSERVE FREQUENCY=300.03180
##.OBSERVE NUCLEUS=^1H
##DATA TYPE=NMR PEAK ASSIGNMENTS
##DATA CLASS=ASSIGNMENTS
##NPOINTS=7
##XUNITS=PPM
##YUNITS=ARBITRARY UNITS
##PEAK ASSIGNMENTS=(XYMA)
(1.99527,1.00, ,<9>)
(6.71349,0.34, ,<14>)
(6.71349,0.34, ,<15>)
(7.36380,0.34, ,<12>)
(7.36380,0.34, ,<13>)
(9.66946,0.16, ,<17>)
(9.66946,0.16, ,<16>)
##END=$$ End of the assignment block
##TITLE=PARACETAMOL (p-Acetylaminophenol) $$ Begin of the peaks block
##JCAMP-DX=5.00 $$ ACD/Spectrus 2012 v 14.01
##ORIGIN= 
##OWNER= 
##BLOCK_ID=3
##DATA TYPE=NMR SPECTRUM
##DATA CLASS=PEAK TABLE
##.OBSERVE FREQUENCY=300.03180
##.OBSERVE NUCLEUS=^1H
##NPOINTS=7
##FIRSTX=1.99751592
##LASTX=9.65193939
##MAXX=21455662.00000000
##MINX=3521054.50000000
##MAXY=0.00000000
##MINY=0.00000000
##XFACTOR=1.0000000000
##YFACTOR=21455662.000000000000000
##FIRSTY=21455662.00000000
##XUNITS=PPM
##YUNITS=ARBITRARY UNITS
##PEAK TABLE=(XY..XY)
1.99752, 1
6.69714, 0.3253
6.72637, 0.3424
7.35181, 0.338
7.38201, 0.3103
9.15509, 0.2234
9.65194, 0.1641
##END=$$ End of the peaks block
##TITLE=PARACETAMOL (p-Acetylaminophenol) $$ Begin of the data block
##JCAMP-DX=5.00 $$ ACD/Spectrus 2012 v 14.01
##BLOCK_ID=4
##DATE=12 Nov 2007 10:22:46 
##DATA TYPE=NMR SPECTRUM
##DATA CLASS=XYDATA
##ORIGIN=Bruker BioSpin GmbH
##OWNER=ochem
##.OBSERVE FREQUENCY=300.03180
##.ACQUISITION TIME=3.42119
##.ZERO FILL=0
##.SHIFT REFERENCE=INTERNAL,  ,16384, -1.9802
##.OBSERVE NUCLEUS=^1H
##.ACQUISITION MODE=SIMULTANEOUS
##SPECTROMETER/DATA SYSTEM=??
##.SOLVENT NAME=DMSO-d6
##SWCYCLICAL=4788.97949
##NPOINTS=16384
##FIRSTX=4194.56005859
##LASTX=-594.12670898
##MAXX=4194.56005859
##MINX=-594.12670898
##MAXY=21455662.00000000
##MINY=-1462.12866211
##XFACTOR=1.0000000000
##YFACTOR=0.100000000000000
##FIRSTY=-149.15119934
##DELTAX=-0.29229608
##XUNITS=HZ
##YUNITS=ARBITRARY UNITS
##XYDATA=(X++(Y..Y))
$$ [...]
$$ plain form
3826.9 -962 980 904 1352 1455 1054 -803 -1749 -2686 -1277 -957 -80 -117 560 -562 -1023 -2237 170 5254 5955
3821.3 5955 5416 6120 1164 -2130 -3354 93 499 -114 -3218 -2381 -1421 -712 235 -3086 -2681 -107 -1596 -511
3816 -511 4 -549 -265 -802 -1651 -1612 1268 657 2650 2083 1233 4476 5062 2631 1806 -2354 -2462 -583 -2428
3810.5 -2428 -435 690 1950 679 1403 210 185 -2880 -2122 -2636 248 2750 -86 -130 1724 1865 862
3805.5 862 -4323 -3011 -1354 -5784 -4797 -84 4316 4173 -5041 -2627 -3121 -2194 -4683 -3412 209 1779 -1153
3800.5 -1153 -148 -759 -1033 1837 2716 177 -82 897 -1167 -1549 8 672 -448 1129 6935 11319 13074
3795.6 13074 10911 5707 -1006 -3275 114 1467 -258 -1822 -2937 -2861 -1895 -408 -1145 -121 739 304 -648
3790.6 -648 1425 2342 -497 365 2275 1371 -95 627 -235 -726 5912 11102 12780 11281 8608 1368 -4356
$$ packed form
3826.9i62J942p6M48J03m01j857r46r37J409L20Q77l7O77j122m61j214K407N084P01
3821.3E955n39P04m956l294j224L447M06o13l104Q37R60P09R47l321M05K574j489J085
3816e11N15n53K84n37q49L9K880o11J993n67q50L243N86k431q25m160j08J879j845
3810.5b428J993J125J260j271P24j193k5l065P58n14K884K502k836m4J854J41j003
3805.5H62n185J312J657m430R87M713M400j43r214K414m94R27k489J271L621J570k932
3800.5a153J005o11k74K870Q79k539k59R79k064l82J557O64j120J577N806M384J755
3795.6A3074k163n204o713k269L389J353j725j564j115P6R66J487p37J024Q60m35r52
3790.6f48K073R17k839Q62J910r04j466P22q62m91O638N190J678j499k673p240n724
$$ plain form
3785.6 -4356 -2603 -2573 -5684 -5199 -3491 -2643 -213 1962 301 -461 -1029 95 -14 -718 -1471 -1369 -2429 -2570
3780.4 -2570 -2010 -2521 -4617 -526 3442 1328 -4939 -5439 -3562 -1999 -937 763 3284 2855 1269 240
3775.7 240 -591 -284 -2327 -2831 -681 1745 2258 1238 -198 601 -464 288 1115 350 872 1312 2035 1419 -441
3770.1 -441 -272 204 482 1418 991 2108 240 -579 -367 -185 1675 -766 1126 1812 693 -1159 -1169 -1385 1110
3764.6 1110 833 2064 1717 964 -1334 -85 -1085 -1178 -1118 -2583 -2431 -1366 -1041 -1118 -750 983 -1446 203
3759.3 203 -255 -710 626 2224 691 -300 -1815 -2061 -1797 -2049 -823 -508 -187 143 -19 -1583 641 550 -402
3753.8 -402 1326 1861 2303 751 359 -695 -22 79 -527 99 849 1292 1372 1407 -163 -263 121 -349 2081 404
3747.9 404 -1016 -375 109 2037 2600 178 -925 -509 -982 -1249 -834 -96 956 -861 -568 -871 -1053 -964 -1601
$$ packed form
3785.6d356J753L0l111M85J708Q48K430K175j661p62n68J124j09p04p53J02j060j41
3780.4b570N60n11k096M091L968k114o267n00J877J563J062J700K521m29j586j029
3775.7B40q31L07k043n04K150K426N13j020j436P99j065P52Q27p65N22M40P23o16j860
3770.1d41J69M76K78R36m27J117j868q19K12J82J860k441J892O86j119j852j0k16K495
3764.6A110k77J231l47p53k298J249j000r3O0j465J52J065L25p7L68J733k429J649
3759.3B03m58m55J336J598j533r91j515k46K64k52J226L15L21L30j62j564K224r1r52
3753.8d02J728N35M42j552l92j054O73J01o06O26P50M43Q0L5j570j00L84m70K430j677
3747.9D04j420O41M84J928N63k422j103M16m73k67M15P38J052j817K93l03j82Q9o37
$$ plain form
3742.4 -1601 11 297 1897 86 -741 -2015 1037 1934 1388 1740 51 1105 556 601 -1180 -928 -1709 -638
3737.1 -638 315 985 1811 1341 -483 -131 -574 -2821 -2650 -447 -1024 -586 -791 651 -496 1898 2195 733
3731.9 733 -746 1244 1514 275 -886 -271 292 -342 -1776 -1744 -545 1067 1226 2016 991 1747 126 1063
3726.6 1063 -1584 326 -1166 -1978 -1893 -317 -46 1443 57 -792 -1245 -78 -813 -824 -1369 -1336 287 210 -1043
3721 -1043 833 1246 346 104 1122 1181 156 -1025 -832 -1007 20 495 1442 395 -746 -724 -684 -122 521 1351
3715.2 1351 532 -143 -157 834 518 -1144 -547 -1027 526 -902 -470 -159 1289 3509 1769 -895 -1151 -875
3709.9 -875 183 222 674 923 1507 -1255 -1514 -78 -1635 -605 -470 -1396 -240 -381 653 -734 -1439 -723
3704.7 -723 916 -770 411 2324 358 1266 -347 -1103 482 144 795 835 784 -127 657 1934 1619 923 1905
$$ packed form
3742.4a601J612K86J600j811q27j274L052Q97n46L52j689J054n49M5j781K52p81J071
3737.1f38R53O70Q26m70j824L52m43k247J71K203n77M38k05J442j147K394K97j462
3731.9G33j479J990K70j239j161O15N63o34j434L2J199J612J59P90j025P56j621R37
3726.6A063k647J910j492q12Q5J576K71J489j386q49m53J167p35j1n45L3J623p7j253
3721a043J876M13r00k42J018N9j025j181J93j75J027M75R47j047j141K2M0N62O43Q30
3715.2A351q19o75j4R91l16j662N97m80J553j428M32L11J448K220j740k664k56K76
3709.9h75J058L9M52K49N84k762k59J436j557J030J35r26J156j41J034j387p05P16
3704.7g23J639j686J181J913j966R08j613p56J585l38O51M0n1r11P84J277l15o96R82
$$ plain form
3699.1 1905 1202 337 1657 539 190 -2408 -2984 -801 -1650 -1746 -1377 -1052 -229 -48 1478 1749 -61 -47 -1617
3693.6 -1617 -789 66 600 -392 -521 -1375 -810 -1265 -2371 -257 -324 -165 -1466 -60 -214 -331 617 1184 -102
3688 -102 1266 535 126 1419 541 78 2218 2003 1212 -404 -911 217 -341 624 -204 1049 597 1624 -882
3682.5 -882 -2134 -2496 -2209 -1449 -2398 -2413 -2158 -1609 -1340 -1046 -512 823 -392 116 1247 1480 44 775 528
3676.9 528 -257 1188 2529 2071 -121 624 -1510 -2352 -1004 -55 163 572 2313 1613 1266 3376 417 1496
3671.6 1496 3316 1699 961 873 757 -1130 -1871 -1063 294 -303 -1400 -691 -1507 -144 -2947 -867 -1129 -2236
3666.4 -2236 -3862 -1911 253 283 393 -206 -758 2741 -543 -1708 -2108 65 1953 1480 2438 727 118 579
3661.1 579 -1158 -890 -1053 -418 -1093 2259 1303 396 11 1484 2014 846 -146 517 1116 1945 1212 907 -463
$$ packed form
3699.1A905p03q65J320j118l49k598n76K183q49r6L69L25Q23J81J526K71j810J4j570
3693.6a617Q28Q55N34r92j29q54N65m55j106K114o7J59j301J406j54j17R48N67j286
3688a02J368p31m09J293q78m63K140k15p91j616n07J128n58R65q28J253m52J027k506
3682.5h82j252l62K87P60r49j5K55N49K69K94N34J335j215N08J131K33j436P31k47
3676.9E28p85J445J341m58k192P45k134q42J348R49K18M09J741p00l47K110k959J079
3671.6A496J820j617p38q8j16j887p41Q08J357n97j097P09q16J363k803K080k62j107
3666.4b236j626J951K164L0J10n99n52L499l284j165m00K173J888m73R58j711o09M61
3661.1E79j737K68j63O35o75L352r56r07l85J473N30j168r92O63N99Q29p33l05j370
$$ plain form
3655.6 -463 -967 -1188 957 850 716 -1838 -1224 -1929 54 -790 -81 -273 261 -1350 -1031 -119 -29 239 239 2220
3649.7 2220 207 -1426 -662 -1680 -255 310 537 1413 1142 -397 342 -368 -2 458 1305 1661 2583 1308
3644.5 1308 609 640 -357 1055 -1672 -1373 -266 -1881 344 -928 -893 -1133 -882 -869 -649 124 280 357 -3140
3638.9 -3140 -4228 -3653 -458 -1454 -560 404 -614 -438 836 1261 515 230 -290 -4352 -4181 1230 3876 5641
3633.6 5641 6486 6251 -593 -3584 -2569 745 2049 3425 3028 -129 -2063 -1034 -794 -706 -1138 -1861 -2316 49
3628.4 49 -2485 -3435 482 364 -2594 2049 5394 -686 -10000 -8080 4480 14151 13988 13952 2560 -10244
3623.7 -10244 -8761 66 3863 -1087 -661 2586 1653 142 -797 62 2779 -1177 -2968 -3089 -861 -2608
3619 -2608 -2038 -1337 1339 2850 1423 3278 -631 -1226 2900 7881 8574 6471 3988 125 -3716 -1844 1754
$$ packed form
3655.6d63n04k21K145j07j34k554O14p05J983q44P09j92N34j611L19R12R0K68%J981
3649.7B220k013j633P64j018J425N65K27Q76k71j539P39p10L66M60Q47L56R22j275
3644.5A308o99L1r97J412k727K99J107j615K225j272L5k40K51J3K20P73J56P7l497
3638.9c140j088N75L195r96Q94R64j018J76J274M25p46k85n20m062J71N411K646J765
3633.6E641Q45k35o844k991J015L314J304J376l97l157j934J029K40Q8m32p23m55K365
3628.4D9k534r50L917j18k958M643L345o080r314J920J2560R671j63l6j1392j2804
3623.7a0244J483Q827L797m950M26L247r33j511r39Q59K717l956j791j21K228j747
3619b608N70P01K676J511j427J855l909n95M126M981O93k103k483l863l841J872L598
$$ plain form
3614.1 1754 1569 -469 1359 890 134 -1586 -2261 -4226 -3837 -68 -149 -1491 -432 -254 -2199 -2189 -393 -827
3608.8 -827 -2063 -975 -1019 -1889 1562 -31 -1000 -952 115 1471 778 45 110 2269 2453 1544 2043 2092 30
3603.2 30 -1049 411 339 -1663 -1280 1434 11 -775 3041 6252 1847 -3525 -5065 -2136 -3804 -3603 90
3598.3 90 5238 2907 31 -1807 -2813 -1764 156 -1106 791 1383 2551 1110 -361 -726 1686 583
3593.6 583 1550 -856 -322 -856 -1790 -645 2730 4048 175 -2866 -4646 -4226 -4317 -2481 2802 4893 1248
3588.6 1248 -1829 -1514 187 2004 -308 -819 -2235 -1473 -1308 968 -180 -135 40 348 2209 1657 945 -579
3583.4 -579 -130 -693 668 1796 1659 243 1433 -903 -1271 -1868 149 1318 -186 2860 1420 -162 -2082
3578.4 -2082 -1517 -1110 -411 440 1086 2495 -1365 -660 -504 880 150 -1149 420 0 -285 978 -1730 -1954
$$ packed form
3614.1A754j85k038J828m69p56j720o75j965L89L769q1j342J059J78j945J0J796m34
3608.8h27j236J088m4q70L451j593r69M8J067J356o93p33O5K159J84r09M99M9k062
3603.2C0j079J460p2k002L83K714j423p86L816L211m405n372j540K929j668K01L693
3598.3I0N148k331k876j838j006J049J920j262J897N92J168j441j471l65K412j103
3593.6E83R67k406N34n34r34J145L375J318l873l041j780M20r1J836N283K091l645
3588.6A248l077L15J701J817k312n11j416P62J65K276j148M5J75L08J861n52p12j524
3583.4e79M49n63J361J128j37j416J190k336l68n97K017J169j504L046j440j582j920
3578.4b082N65M07O99Q51O46J409l860P05J56J384p30j299J569m20k85J263k708k24
$$ plain form
3573.1 -1954 -1504 -1206 -697 90 317 -1966 -1278 1418 1704 1300 906 -451 986 338 -1242 -929 -77 150 -1409
3567.6 -1409 -1114 1108 1282 2123 949 211 1023 135 -599 944 1077 1724 1388 -1290 -2835 209 -732 -1232
3562.3 -1232 -1938 -436 2379 1305 -883 -19 -1410 -1287 -1129 665 85 265 503 261 104 1062 1016 586 377
3556.8 377 124 469 366 -1167 -1220 -1321 837 405 1073 730 -683 -674 856 942 -295 125 1153 -791 217
3551.2 217 922 -406 -2505 -170 -549 -364 -184 -487 10 -550 -1764 -1191 -1765 -976 -1505 -394 -572 -2443 -28
3545.7 -28 -673 -242 -255 -150 880 205 -166 -170 1554 1819 2205 1634 1919 896 -999 -936 203 380 -738 969
3539.8 969 462 20 -160 1073 2012 572 -1563 10 -849 289 1371 -771 1587 -619 -432 1431 1204
3534.8 1204 605 1880 3096 1499 -31 -207 -343 1183 28 -1044 -1978 -1568 -1143 -972 -1077 -2338 -3226 -1043
$$ packed form
3573.1a954M50K98N09P87K27k283O88K696K86m04l94j357J437o48j580L13Q52K27j559
3567.6a409K95K222J74Q41j174p38Q12q88p34J543J33O47l36k678j545L044r41n00
3562.3a232p06J502K815j074k188Q64j391J23J58J794n80J80K38k42j57R58m6m30k09
3556.8C77k53L45j03j533n3j01K158m32O68l43j413RJ530Q6j237M20J028j944J008
3551.2B17P05j328k099K335l79J85J80l03M97n60j214N73n74P89n29J111j78j871K415
3545.7b8o45M31j3J05J030o75l71mJ724K65L86n71K85j023j895O3J139J77j118J707
3539.8I69n07m42j80J233R39j440k135J573q59J138J082k142K358k206J87J863k27
3534.8A204n99J275J216j597j530j76j36J526j155j072r34M10M25J71j05j261q88K183
$$ plain form
3529.6 -1043 721 2490 -850 -1131 -561 1195 908 648 33 1315 -33 1384 -765 -1739 -2012 -1121 432
3524.6 432 1255 -325 -300 296 -182 -2003 -771 11 979 -1587 64 -1311 -842 -1099 -1206 767 1123 2772
3519.4 2772 3086 955 967 1263 -498 -328 -695 1150 718 -1942 -3428 -2830 -1053 -682 -1006 -320 1084 -1078
3514.1 -1078 1568 1550 215 895 159 -1331 159 1248 -892 -766 868 1793 4039 2722 896 1029 33
3509.1 33 1137 1012 49 -259 -897 -614 -76 -314 49 -1493 -693 -932 -3299 -1082 -2309 -2393 -872 1083 445
3503.6 445 -857 2317 512 -1668 -114 1662 -1259 397 425 -568 1251 361 -849 -15 -288 157 -488 378
3498.3 378 334 -1708 1767 2040 871 1829 874 -303 948 1440 1455 1560 -218 -62 1258 104 -416 -1268 1349
3492.8 1349 -428 -727 -1588 -2595 -1279 -572 -498 379 -8 172 -3247 -2227 -1311 122 1149 537 153 -638
$$ packed form
3529.6a043J764J769l340k81N70J756k87k60o15J282j348J417k149r74k73Q91J553
3524.6D32Q23j580K5N96m78j821J232P82R68k566J651j375M69k57j07J973L56J649
3519.4B772L14k131J2K96j761J70l67J845m32k660j486N98J777L71l24O86J404k162
3514.1a078K646j8j335O80p36j490J490J089k140J26J634R25K246j317j826J33r96
3509.1C3J104j25r63l08o38K83N38k38L63j542Q00k39k367K217j227q4J521J955o38
3503.6D45j302L174j805k180J554J776k921J656K8r93J819q90j210Q34k73M45o45Q66
3498.3C78m4k042L475K73j169R58r55j177J251M92J5J05j778J56J320j154n20q52K617
3492.8A349j777k99q61j007J316P07P4Q77l87J80l419J020R16J433J027o12l84p91
$$ plain form
3487.5 -638 -380 729 805 -149 85 214 72 -478 135 1657 445 -1343 -2210 1241 120 -598 250 -2328 -150
3481.9 -150 -271 673 2941 1460 22 -44 1715 58 -1050 -71 814 -558 -478 844 178 -1619 -98 -587
3476.7 -587 -334 199 -1122 182 47 745 726 943 -1721 820 1674 1619 -294 217 17 -428 252 -417 1861
3471.1 1861 -590 -471 -3821 -296 -119 -1824 -1376 -327 144 -1631 -2552 -1799 -3130 -402 -583 1429 954
3466.2 954 1874 -23 774 1436 1209 2119 -208 851 765 -2020 -848 1028 676 1024 265 -1175 258 695
3460.9 695 -130 -88 -219 2617 1730 2982 833 679 311 -297 1007 1552 1147 -389 1033 -1140 -468 -217 -584
3455.3 -584 -1057 -1743 -503 69 -21 -116 -3 1286 530 9 816 -3123 -3810 -3404 -2413 -2269 -1970 491 823 -275
3449.5 -275 1808 955 -871 571 1684 -452 100 559 1010 817 -2040 -1255 -1631 -13 -512 3704 400 -1853
$$ packed form
3487.5f38K58J109P6r54K34J29j42n50O13J522j212j788q67L451j121p18Q48k578K178
3481.9a50j21R44K268j481j438o6J759j657j108R79Q85j372Q0J322o66j797J521m89
3476.7e87K53N33j321J304j35O98j9K17k664K541Q54n5j913N11k00m45O80o69K278
3471.1A861k451J19l350L525J77j705M48J049M71j775r21P53j331K728j81K012m75
3466.2I54R20j897P97O62k27R10k327J059q6k785J172J876l52L48p59j440J433M37
3460.9F95q25M2j31K836q87J252k149j54l68o08J304N45m05j536J422k173O72K51l67
3455.3e84m73o86J240N72r0r5J13J289p56n21Q07l939o87M06R91J44K99K461L32j098
3449.5b75K083q53j826J442J113k136N52M59M51j93k857P85l76J618m99M216l304k253
$$ plain form
3444.2 -1853 -2680 -1096 -291 -1185 -1341 -1178 321 -2673 -352 83 1542 1844 904 1325 1717 -132 1533 1735
3439 1735 165 -500 -2026 2336 3531 4308 4378 1790 -200 -1367 -1038 -1630 653 2061 2823 1062 539 107
3433.7 107 -468 -1481 -375 -1853 -3730 -2319 -90 -1828 -4741 -2736 -2821 -1951 -1809 -1415 -3365 -5054 704
3428.7 704 6563 6617 6815 3153 -4133 -6554 3 2366 2439 1575 4104 1268 -224 -117 1024 727 1101 1076
3423.5 1076 -351 -1685 -941 -1352 -1974 759 2541 1717 806 -2076 -3026 -1158 1352 3570 796 -234 761
3418.5 761 -1196 -691 1077 -1082 -1217 1318 1076 -1575 -652 -565 -1956 -1397 -1922 -453 505 475 230 -856 -3494
3413 -3494 -1169 -7 1752 1748 -1338 -942 9 -2051 -2011 -625 512 903 -568 1607 1587 210 757 1694 1471
3407.4 1471 1880 2043 386 573 -138 -1583 783 1360 -1163 -2324 -1512 473 -1144 -137 1611 -1 -1607
$$ packed form
3444.2a853q27J584Q05q94j56J63J499k994K321M35J459L02r40M21L92j849J665K02
3439A735j570o65j526M362J195P77P0k588j990j167L29n92K283J408P62j761n23m32
3433.7A07n75j013J106j478j877J411K229j738k913K005q5Q70J42L94j950j689N758
3428.7G04N859N4J98l662p286k421O557K363P3q64K529k836j492J07J141k97L74k5
3423.5A076j427j334P44m11o22K733J782q24r11k882r50J868K510K218k774j030R95
3418.5G61j957N05J768k159j35K535k42k651R23Q7j391N59n25J469R58l0k45j086k638
3413c494K325J162J759ml086L96R51k060M0J386J137L91j471K175k0j377N47R37k23
3407.4A471M09J63j657J87p11j445K366N77k523j161Q12J985j617J007J748j612j606
$$ plain form
3402.4 -1607 1039 854 -1038 -3066 -613 1255 -34 -494 -159 -1957 -19 1069 4416 2962 608 -334
3397.8 -334 -215 -1941 -374 109 -52 2734 1407 1144 2637 -3363 -1250 -1351 -1671 863 77 -554 -1382 -2291
3392.5 -2291 -717 441 2127 -276 -29 756 -87 -1738 -1898 -796 1096 291 528 804 2248 -36 1750
3387.5 1750 816 -261 676 484 1161 1966 1513 -1255 -1007 -1301 -1711 -2151 -1341 -1154 -2094 46 317 -412 226
3382 226 523 -1342 -1634 -166 908 -252 -852 1059 -768 -376 1785 1316 528 485 1925 85 -120 2742
3376.7 2742 2270 813 318 891 -1443 -2631 -210 -706 399 -324 -1336 -570 336 -1113 -338 -904 190 982
3371.5 982 470 -1232 -329 -330 -1159 -1815 73 -1316 1198 -94 -273 950 906 1885 728 -593 1564 413
3366.2 413 1992 -533 2612 2531 -583 -1897 -1142 -2427 -1299 -1933 -1453 -2734 -782 -678 1719 2525 -9
$$ packed form
3402.4a607K646j85j892k028K453J868j289m60L35j798J938J088L347j454k354r42
3397.8c34J19j726J567M83j61K786j327k63J493o000K113j01l20K534p86o31q28r09
3392.5b291J574J158J686k403K47P85q43j651j60J102J892q05K37K76J444k284J786
3387.5A750r34j077R37j92O77Q05m53k768K48k94m10m40Q10J87r40K140K71p29O38
3382B26K97j865k92J468J074j160o00J911j827L92K161m69p88m3J440j840k05K862
3376.7B742m72j457m95N73k334j188K421m96J105p23j012P66R06j449P75n66J094P92
3371.5I82n12j702R03jq29o56J888j389K514j292j79J223m4R79j157j321K157j151
3366.2D13J579k525L145q1l114j314P55j285J128o34M80j281J952J04K397Q06k534
$$ plain form
3361.2 -9 112 -1258 -1869 -822 -336 270 -1187 433 1775 65 637 699 1030 1125 1234 1242 -59 1199 721 1351
3355.4 1351 2013 461 -2531 -1953 -3368 -2215 176 1054 -711 -881 -533 1026 1606 2008 1140 -1250 -1780 663
3350.1 663 1397 -765 -2528 -2213 875 1226 626 844 -1550 -176 -278 -581 859 988 872 -104 676 -1069
3344.9 -1069 -189 -546 -206 -272 -631 1233 74 -484 -1784 844 -706 721 -777 450 982 393 -1008 63
3339.6 63 -666 -666 409 -907 -127 -236 -339 1594 1292 271 -1982 -1170 -1779 446 1557 400 -833 -879 -289
3334 -289 797 1718 1119 1124 1604 996 991 1834 1929 450 372 -1585 -54 -2796 -796 -1225 262 794 761 1149 -879
3327.9 -879 -1549 58 2134 479 -807 -1910 -1205 660 -771 355 -1775 -400 293 2192 1504 426 -281
3322.9 -281 1518 716 173 -88 -345 -1961 -608 -791 -465 1145 491 -185 -527 -837 885 -247 -838 -2078
$$ packed form
3361.2iJ21j370o11J047M86O06j457J620J342j710N72O2L31R5J09Qj301J258m78O30
3355.4A351O62j552k992N78j415J153K391Q78j765j70L48J559N80M02q68k390n30K443
3350.1F63P34k162j763L15L088L51o00K18k394J374j02l03J440J29j16r76P80j745
3344.9a069Q80l57L40o6l59J864j159n58j300K628j550J427j498J227N32n89j401J071
3339.6F3p29%J075j316P80j09j03J933l02j021k253Q12o09K225J111j157j233m6N90
3334b89J086R21n99NM80o08nQ43R5j479p8j957J531k742K000m29J487N32l3L88k028
3327.9h79o70J607K076j655j286j103P05J865j431J126k130J375O93J899o88j078p07
3322.9b81J799q02n43k61k57j616J353j83L26J610o54o76l42l10J722j132n91j240
$$ plain form
3317.7 -2078 -1517 -580 -1506 1145 1973 805 919 -289 -1659 -2286 -828 -480 1735 2704 -810 1391 998 -879
3312.4 -879 -103 356 11 -308 -494 802 -42 508 -1259 -774 1072 1677 1361 -101 -1202 -243 94 990 1882
3306.9 1882 462 1340 -266 1739 -635 -768 -386 -578 -814 -554 -778 -952 -1514 -859 -1145 -2809 -2419 -1102
3301.6 -1102 -599 1715 1381 -121 890 775 52 831 -706 547 11 245 -740 1341 1715 -104 -427 404
3296.3 404 69 1130 -1143 -1642 -2999 -1736 -2194 -737 358 109 -1001 -166 -669 1697 1251 1443 692 344
3291.1 344 -452 -1680 -82 1005 735 -659 1050 -446 1796 2690 -415 -516 -2708 250 129 343 399 76
3285.8 76 51 -101 -2746 1103 2354 -220 -216 150 803 641 60 -2474 -1030 387 579 2254 3011 1555 -219
3280.3 -219 -556 830 684 1114 159 -558 -1157 -723 -1174 -967 -139 394 -1334 -343 1160 3083 -724 1192 -1055
$$ packed form
3317.7b078N61R37r26K651Q28j168J14j208j370o27J458L48K215R69l514K201l93j877
3312.4h79P76M59l45l19j86J296q44N50j767M85J846O05l16j462j101R59L37Q96Q92
3306.9A882j420Q78j606K005k374j33L82j92k36K60k24j74n62O55k86j664L90J317
3301.6a102N03K314l34j502J011j15p23P79j537J253n36K34r85K081L74j819l23Q31
3296.3D04l35J061k273m99j357J263m58J457J095k49j110Q35n03K366m46J92p51l48
3291.1C44p96j228J598J087k70j394J709j496K242Q94l105j01k192K958j21K14N6l23
3285.8G6k5j52k645L849J251k574ML66O53j62n81k534J444J417J92J675P57j456j774
3280.3b19l37J386j46M30r55p17n99M34m51K07Q28N33j728R91J503J923l807J916k247
$$ plain form
3274.7 -1055 288 11 -1418 -690 -786 -1323 1744 1221 -208 -542 -284 -978 -1165 509 -852 -653 -2222 -2329
3269.4 -2329 -1457 -211 2505 3345 3466 1139 -988 -1530 -1623 771 -1377 -388 1742 676 -1100 -2442 -1185
3264.5 -1185 -3242 -2756 -2749 -714 -731 -1006 -1325 -1354 -3131 -2396 371 1585 740 1417 2697 1290 679 524 2130
3258.9 2130 189 83 -401 2872 794 -865 73 2076 486 251 3531 7208 7188 8808 9939 7696 2526
3254 2526 -2126 -3993 -4239 -3730 -4724 -5194 -3868 -3397 -2331 397 758 -218 -1522 -270 -154 -1262 -2094 -1668
3248.7 -1668 1023 88 -558 -2005 -2023 -1580 -1695 -2431 -2840 -2757 -2283 -1841 1262 3344 2169 959 973 -1194 -764
3243.1 -764 -465 509 -829 -1688 1052 843 1424 333 172 845 1054 3183 979 -916 -220 844 1258 1768
3237.9 1768 1428 1258 885 -252 478 1495 888 -1989 -805 801 -681 -2009 -1941 -283 546 -20 959 961 -2
$$ packed form
3274.7a055J343k77j429P28r6n37L067n23j429l34K58o94j87J674j361J99j569j07
3269.4b329Q72J246K716Q40J21k327k127n42r3K394k148R89K130j066j776j342J257
3264.5a185k057M86PK035j7k75l19k9j777P35K767J214q45O77J280j407o11j55J606
3258.9B130j941j06m84L273k078j659R38K003j590k35L280L677k0J620J131k243n170
3254B526m652j867k46N09r94m70J326M71J066K728L61r76j304J252J16j108q32M26
3248.7a668K691r35o46j447j8M43j15p36m09Q3M74M42L103K082j175j210J4k167M30
3243.1g64K99R74j338q59K740k09N81j091j61O73K09K129k204j895O96J064M14N10
3237.9A768l40j70l73j137P30J017o07k877J184J606j482j328O8J658Q29n66R79Kr63
$$ plain form
3232.3 -2 719 -2182 -1578 178 1655 2442 1143 -3025 -1918 -50 823 -584 -121 97 -902 500 2410 1510
3227.1 1510 577 -1278 -1183 -1977 -1471 505 -924 -257 537 1134 875 1447 -468 -1505 290 -574 1709 761
3221.8 761 -497 532 -1220 -477 1501 1294 1582 719 856 -112 -1014 301 -192 -747 -535 -1250 -1115 -1910 -1196
3216.2 -1196 -1018 -1 894 592 -255 27 -2668 -978 1116 3031 1027 45 827 1781 1028 530 -1452 -2232
3211 -2232 -2206 -280 -1415 1059 1949 1322 130 1623 1149 -331 -2288 -1875 -894 -290 -2334 -1618 -4199 -1416
3205.7 -1416 -1123 1235 -2156 -2960 -1617 724 708 2827 2425 1024 594 -942 -632 316 -216 -546 393 2567
3200.5 2567 2553 1832 1575 819 1199 821 1847 2799 671 1900 -190 2200 1130 918 2641 -133 -1433 -859
3195.2 -859 -1263 -2875 -4656 -2206 -1551 -2936 -3016 551 210 799 459 -62 -702 454 -930 -601 583 460
$$ packed form
3232.3bP21k901O04J756J477P87j299m168J107J868Q73j407M63K18r99J402J910r00
3227.1A510r33j855R5p94N06J976j429O67P94N97k59N72j915j037J795q64K283r48
3221.8G61j258J029j752P43J978k07K88q63J37r68r02J315m93n55K12p15J35p95P14
3216.2a196J78J017Q95l02q47K82k695J690K094J915k004r82P82R54p53m98j982p80
3211b232K6J926j135K474Q90o27j192J493m74j480j957M13R81O04k044P16k581K783
3205.7a416K93K358l391q04J343K341j6K119m02j401m30j536L10R48n32l30R39K174
3200.5B567j4p21k57p56L80l78J026R52k128J229k090K390j070k12J723k774j300N74
3195.2h59m04j612j781K450O55j385q0L567l41N89l40n21o40J156j384L29J184j23
$$ plain form
3189.9 460 -2491 -1397 -1271 -1748 -1794 -934 1397 2381 3349 1474 290 1439 521 3071 2275 32 -940 115
3184.7 115 -88 1396 846 -73 -706 -1122 -1886 -868 -996 1370 1150 1259 -853 -1423 1011 -709 -422 -379 -1007
3179.1 -1007 456 787 448 1181 -455 -578 1642 -3 252 -735 -995 613 -322 -40 3100 -605 -13 1017
3173.9 1017 941 -2065 -1188 -602 -806 -1708 -243 1514 -844 -2639 -1314 137 -712 -346 -261 -1114 434 541
3168.6 541 -1160 -1427 -563 -370 -28 -364 1034 425 1499 309 456 -769 -1176 1232 -106 964 1346 -452
3163.3 -452 219 526 791 1288 867 -1274 579 3208 2057 -1544 -826 1284 2080 1012 -632 -120 -442 1299
3158.1 1299 462 746 -2144 -325 -532 -1554 -1462 -1286 -1752 -467 -951 -35 -188 -1087 1659 1631 1438 -811 -1142
3152.5 -1142 -358 1448 763 -661 -2000 -568 -2428 -849 -732 -772 -981 -408 724 -748 849 824 -1192 77
$$ packed form
3189.9D60k951J094J26m77m6Q60K331R84R68j875j184J149r18K550p96k243r72J055
3184.7A15k03J484n50r19o33m16p64J018j28K366k20J09k112n70K434j720K87M3o28
3179.1a007J463L31l39P33j636j23K220j645K55r87k60J608r35K82L140l705N92J030
3173.9A017p6l006Q77N86k04r02J465J757k358j795J325J451q49L66Q5q53J548J07
3168.6E41j701k67Q64J93L42l36J398o09J074j190J47j225m07K408j338J070L82j798
3163.3d52O71L07K65M97m21k141J853K629j151l601P18K110P96j068j644N12l22J741
3158.1A299q37K84k890J819k07j022R2J76m66J285m84R16j53q99K746k8j93k249l31
3152.5a142P84J806o85j424j339J432j860J579J17m0k09N73J132j472J597k5k016J269
$$ plain form
3147.3 77 579 684 396 1565 858 1663 1669 3377 -217 -1421 -293 -179 -1037 -856 -1317 40 39 355 -858 2016
3141.4 2016 631 -468 242 -721 -685 -980 -1219 869 151 -14 -2615 -863 179 -1236 -697 -283 1660 1762
3136.2 1762 -1198 105 230 -626 -1157 -633 -306 2933 792 -445 -486 -210 -319 -294 -1066 -184 818 1938 2782
3130.6 2782 1658 1918 217 -395 -181 1062 723 1413 187 392 -432 -202 45 -470 360 -215 -937 -1203 -1151
3125 -1151 -1578 44 -504 -662 -523 1067 -419 963 641 192 140 -43 747 2124 225 -628 -389 -1230 -1697
3119.5 -1697 -1273 -611 2131 1915 -1467 -1024 -2257 -1930 -2230 -320 1511 1738 1108 1577 557 -2472 -2978 -2591
3114.2 -2591 -2961 -2177 -1755 -158 -852 -103 553 216 -777 -384 554 -1262 -408 164 84 351 -210 -1611 441
3108.7 441 1258 3004 4686 3247 2469 2759 4011 2572 5810 5069 4652 3862 4415 2014 2497 -835 -1980 -1989
$$ packed form
3147.3G7N02J05k88J169p07Q05OJ708l594j204J128J14q58J81m61J357jL16j213K874
3141.4B016j385j099P10r63L6k95k39K088p18j65k601J752J042j415N39M14J943J02
3136.2A762k960J303J25q56n31N24L27L239k141j237m1K76j09K5p72Q82J002J120Q44
3130.6B782j124K60j701o12K14J243l39O90j226K05q24K30K47n15Q30n75p22k66N2
3125a151m27J622n48j58J39J590j486J382l22m49n2j83P90J377j899q53K39q41m67
3119.5a697M24O62K742k16l382M43j233L27l00J910J831K27o30M69j020l029n06L87
3114.2b591l70P84M22J597o94P49O56l37r93L93R38j816Q54N72q0K67n61j401K052
3108.7D41Q17J746J682j439p78K90J252j439L238p41m17p90N53k401M83l332j145r
$$ plain form
3103.4 -1989 311 -1174 -1371 -2795 -3585 -2438 -1792 -1728 -1866 -798 -2682 -3289 -2339 -1249 -941 -354 -1790 -1310
3098.2 -1310 -1006 -1751 -3773 -4412 -1347 -870 -749 -1570 -1147 1489 2239 618 756 689 -799 1934 -637 666
3092.9 666 -224 -1660 -1078 2380 1884 -1817 -1244 -778 230 1484 3217 3079 2650 430 -255 61 -718 -964
3087.6 -964 -13 497 -692 1631 -1233 -1344 822 -320 381 326 503 -1963 -1093 551 -482 375 -185 -131 -1530
3082.1 -1530 -781 790 1263 1143 1091 803 957 1702 1474 205 -759 -290 -341 -1143 -791 -2460 -668 -319 -946 -1095
3076.2 -1095 333 899 3117 67 -746 694 2922 1077 1590 -960 -1418 -1144 1351 -252 -251 318 -164 424
3071 424 1310 185 507 257 466 1904 2564 -311 -1454 -2311 -2323 -2481 -3877 -800 -262 1381 1635 1602 1007 587
3065.1 587 229 2246 1376 1308 122 -307 -344 -192 412 -304 639 -2233 -1469 -1850 -1528 -2140 -1242 -910 -953 -967 -2430
$$ packed form
3103.4a989K300j485j97j424p90J147O46O4j38J068j884o07R50J090L08N87j436M80
3098.2a310L04p45k022o39L065M77J21q21M23K636P50j621J38o7j488K733k571J303
3092.9F66q90j436N82L458m96l701N73M66J008J254J733j38m29k220o85L16p79k46
3087.6i64R51N10j189K323k864j11K166j142P01n5J77k466Q70J644j033Q57n60N4j399
3082.1a530P49J571M73j20n2k88J54P45k28j269r64M69n1q02L52j669J792L49o27j49
3076.2a095J428N66K218l050q13J440K228j845N13k550m58K74K495j603JN69m82N88
3071D24Q86j125L22k50K09J438O60k875j143q57j2j58j396L077N38J643K54l3n95m20
3065.1E87l58K017q70o8j186m29l7J52O04p16R43k872P64l81L22o12Q98L32m3j4j463
$$ plain form
3059 -2430 -4060 -4442 -4298 -1520 318 1722 918 1017 2881 2549 1407 1303 1866 3347 3546 1826 584 1494
3053.7 1494 -164 2950 1050 1045 1970 -774 -3577 -1921 -1855 980 -855 -914 -1639 -191 -1758 -1219 -1998 -258
3048.5 -258 634 144 -1280 -1091 -8 2736 -11 1464 167 636 -1651 -867 -2114 916 916 1214 -3 -1184
3043.2 -1184 -188 1944 2166 742 -1143 -709 530 128 2091 2895 858 -1347 -1037 -585 -760 -142 500 1849
3037.9 1849 -381 -560 700 -169 -1642 -3363 -2562 380 -853 67 -2041 -1600 870 626 2361 2702 -2159
3033 -2159 -1336 -245 1433 235 2206 1072 2619 -1077 1195 95 -414 -2621 -1287 -2526 -633 635
3028.3 635 1666 1397 -835 -222 133 1181 1103 84 415 535 342 356 1037 2276 2649 1256 78 -524 -1527
3022.7 -1527 -1915 -97 174 988 -216 -1334 -4219 -1235 1074 -1347 -1786 -3973 -3185 -1161 -837 -385 40
$$ packed form
3059b430j630l82J44K778J838J404q04R9J864l32j142j04N63J481J99j720j242R10
3053.7A494j658L114j900nR25k744k803J656O6K835j835n9p25J448j567N39p79J740
3048.5b58Q92m90j424J89J083K744k747J475j297M69k287P84j247L030%K98j217j181
3043.2a184R96K132K22j424j885M34J239m02J963Q04k037k205L10M52j75O18O42J349
3037.9A849k230j79J260q69j473j721Q01K942j233R20k108M41K470k44J735L41m861
3033b159Q23J091J678j198J971j134J547l696K272j100n09k207J334j239J893J268
3028.3F35J031k69k232O13L55J048p8j019L31J20j93J4O81J239L73j393j178o02j003
3022.7a527l88J818K71Q14j204j118k885K984K309k421m39k187P88K024L24M52M25
$$ plain form
3017.8 40 -775 -948 -688 1075 3329 1228 -860 -967 1521 3530 4141 2358 -188 -200 -238 326 -1258 -1248 127
3012.2 127 1972 724 676 637 945 -80 1092 1489 -840 -1962 -1461 -2383 -682 -521 654 -872 -2200 -2462
3007 -2462 -181 -709 1685 1570 1976 -743 -1512 -119 866 1309 2141 44 489 2928 567 512 -1023 773
3001.7 773 -515 -1396 -1131 -1713 -1374 -2190 -878 630 -657 -1507 -3886 -2205 -2719 -963 -361 830 511 -1252
2996.4 -1252 -43 696 -636 -690 -384 -4 -2125 342 -148 106 -520 74 -198 583 -243 1401 210 -1504
2991.2 -1504 122 809 2700 1349 289 -41 -792 615 486 535 274 464 -428 -1562 -1540 27 -761 449
2985.9 449 -703 1233 1873 -516 420 420 2592 1783 1496 868 1389 970 231 844 -396 -87 -648 32 -493 -771
2980.1 -771 -2819 -1035 -627 -1130 -1253 471 996 -147 635 1266 1376 -147 -910 256 1802 2350 1215 -595
$$ packed form
3017.8D0q15j73K60J763K254k101k088j07K488K009O11j783k546j2l8N64j584J0J375
3012.2A27J845j248m8l9L08j025J172L97k329j122N01r22J701J61J175j526j328k62
3007b462K281n28K394j15M06k719p69J393R85M43Q32k097M45K439k361n5j535J796
3001.7G73j288q81K65n82L39q16J312J508j287q50k379J681n14J756O02J191l19j763
2996.4a252J209P39j332n4L06L80k121K467m90K54o26N94k72P81q26J644j191j714
2991.2a504J626O87J891j351j060l30p51J407j29M9k61J90q92j134K2J567p88J210
2985.9D49j152J936O40k389R36%K172q09k87o28N21m19p39O13j240L09n61O80n25k78
2980.1g71k048J784M08n03j23J724N25j143P82O31J10j523p63J166J546N48j135j810
$$ plain form
2974.8 -595 -1543 -1962 -2531 -914 -200 174 -662 1605 754 315 -804 -507 -1438 -1496 98 1497 -147 -1087 -2652
2969.3 -2652 -2706 -3186 -3878 -2919 -440 -2104 -2272 -2433 -889 1268 -415 -423 -469 33 2661 954 -262 1002 1658
2963.7 1658 1691 997 653 -152 -1535 -1998 -357 -931 -722 316 1073 -438 -582 -484 367 541 -79 -1394 -450
2958.1 -450 191 -210 -1476 -1823 -252 -2761 -954 -985 -2006 -974 -3114 -1608 -2707 -2110 -1546 -3126 -1990
2953.2 -1990 -1001 -1330 411 2105 2958 3723 4694 4164 2830 3063 4079 4541 7098 6237 5092 5042 7857 7700
2947.9 7700 8893 9205 10969 10957 11880 13514 14721 14198 13076 16110 17293 17402 13805 15155 14120 18760 22521
2942.9 22521 30182 40530 54291 76253 111199 149277 169214 152846 114869 78313 56347 47092 40005
2939.1 40005 39872 38326 34779 34187 33866 35323 33334 32776 33969 33630 32599 35554 34878 36574 35104 36538 36905
$$ packed form
2974.8e95r48m19n69J617P14L74q36K267q51m39j119K97r31n8J594J399j644r40j565
2969.3b652n4m80o92R59K479j664j68j61J544K157j683qm6N02K628j707j216J264O56
2963.7A658L3o94l44q05j383m63J641n74K09J038P57j511j44R8Q51J74o20j315R44
2958.1d50O41m01j266l47J571k509J807l1j021J032k140J506j099N97N64j580J136
2953.2a990R89l29J741J694Q53P65R71n30j334K33J016M62K557q61j145n0K815j57
2947.9G700J193L12J764j2R23J634J207n23j122L034J183J09l597J350j035M640L761
2942.9B2521P661J0348J3761K1962L4946L8078J9937j6368l7977l6556k1966r255p087
2939.1D0005j33j546l547n92l21J457j989n58J193l39j031K955o76J696j470J434L67
$$ plain form
2934.2 36905 35638 37049 41570 42831 44441 47097 45750 48845 51740 48912 51506 52498 53538 54579 54955 54970
2929.5 54970 58126 58966 58870 61390 62074 62263 65302 66383 65996 66183 68648 67918 69593 72279 75365 78080 81718
2924.5 81718 84608 87322 91420 96284 98078 102102 103963 107576 111537 114246 119313 124397 127616 130782 134282
2920.1 134282 139102 142249 145423 148624 152279 155157 160127 165278 174393 185999 201639 219555 241712 260322
2916.1 260322 277934 294239 304741 307707 303659 297395 292158 288002 289661 293573 299523 304768 311712 318228
2912 318228 322091 327189 334822 344024 351742 361834 374314 383190 393680 405569 421497 436881 456898 482797
2907.9 482797 509908 541233 577873 614717 655424 697485 742015 791957 849412 910737 981421 1057219
2904.4 1057219 1137847 1227416 1332618 1447765 1573503 1717900 1882260 2069453 2285445 2536664
$$ packed form
2934.2C6905j267J411M521J261J610K656j347L095K895k828K594R92J040J041L76J5
2929.5E4970L156Q40r6K520O84J89L039J081l87J87K465p30J675K686L086K715L638
2924.5H1718K890K714M098M864J794M024J861L613L961K709N067N084L219L166L500
2920.1A34282M820L147L174L201L655K878M970N151R115J1606J5640J7916K2157J8610
2916.1B60322J7612J6305J0502K966m048o264n237m156J659L912N950N245O944O516
2912C18228L863N098P633R202P718J0092J2480Q876J0490J1889J5928J5384K0017K5899
2907.9D82797K7111L1325L6640L6844M0707M2061M4530M9942N7455O1325P0684P5798
2904.4A057219Q0628Q9569J05202J15147J25738J44397J64360J87193K15992K51219
$$ plain form
2901.4 2536664 2829584 3171641 3570919 4049820 4624366 5321261 6168871 7211023 8496138 10088239
2898.5 10088239 12066550 14501869 17461830 20951521 24860478 28868850 32395408 34708690
2896.2 34708690 35210545 33765920 30778045 26972258 23046835 19447683 16357749 13790374 11694665
2893.6 11694665 9988242 8601776 7471246 6541258 5777300 5140176 4606598 4156377 3771224
2890.9 3771224 3442164 3156278 2906310 2687396 2494925 2326146 2176559 2041077 1919372 1812432
2888 1812432 1715295 1627423 1548377 1472795 1405812 1341138 1281484 1227084 1174073 1122693 1077976 1031911
2884.5 1031911 988136 945562 899948 855748 811915 767791 725400 684730 647956 614982 580644 547224
2881 547224 518282 492058 463849 441690 422488 404488 387389 374622 358869 338469 312628 286773
$$ packed form
2901.4B536664K92920L42057L99278M78901N74546O96895Q47610J042152J285115J592101
2898.5A0088239J978311K435319K959961L489691L908957M008372L526558K313282
2896.2C4708690N01855j444625k987875l805787l925423l599152l089934k567375k095709
2893.6A1694665j706423j386466j130530r29988p63958o37124n33578m50221l85153
2890.9C771224l29060k85886k49968k18914j92471j68779j49587j35482j21705j06940
2888A812432r7137q7872p9046p5582o6983o4674n9654n4400n3011n1380m4717m6065
2884.5A031911m3775m2574m5614m4200m3833m4124m2391m0670l6774l2974l4338l3420
2881E47224k8942k6224k8209k2159j9202j8000j7099j2767j5753k0400k5841k5855
$$ plain form
2877.5 286773 262489 241394 229455 223286 220292 221329 222478 220640 217293 211493 205715 198910 193335 184244
2873.4 184244 178093 170903 165032 158031 153623 148723 145932 139897 137043 131104 129589 124491 121142 116533 112900
2869 112900 111226 108395 105728 103401 101048 97145 93656 91780 90954 88783 84954 83031 80614 81076 80277 78607
2864.3 78607 76989 75822 73300 73604 69297 67837 66645 66683 63603 64693 60834 60444 56848 57525 55084 54588 56689
2859.4 56689 53510 53298 54212 52674 52571 56515 59609 61007 64743 66524 67517 66632 66220 62956 58203 51799 47816
2854.4 47816 44603 41814 39819 40958 39312 41257 43078 49211 59437 79308 112055 152565 174535 162245
2850.3 162245 123551 83974 59061 44107 33905 29629 26481 20819 16690 16813 15920 13972 10836 10439
2846.2 10439 10226 9728 9780 6740 6209 6983 5855 6093 5334 5116 7044 6531 5617 4740 4503 3974 2315 3340 2821
$$ packed form
2877.5B86773k4284k1095j1939o169k994J037J149j838l347n800n778o805n575r091
2873.4A84244o151p190n871p001m408m900k791o035k854n939j515n098l349m609l633
2869A12900j674k831k667k327k353l903l489j876q26k171l829j923k417M62p99j670
2864.3G8607j618j167k522L04m307j460j192L8l080J090l859l90l596O77k441m96K101
2859.4E6689l179k12R14j538j03L944L094J398L736J781R93q85m12l264m753o404l983
2854.4D7816l213k789j995J139j646J945J821O133J0226J9871L2747M0510K1970j2290
2850.3A62245l8694l9577k4913j4954j0202m276l148n662m129J23q93j948l136l97
2846.2A0439k13m98N2l040n31P74j128K38p59k18J928n13r14q77k37n29j659J025n19
$$ plain form
2840.6 2821 4170 5919 7762 5507 4661 4712 3892 1523 -60 -525 980 -1510 -1441 78 -847 -1035 -1781 -2127
2835.4 -2127 -1147 -3166 -3029 -1308 -1523 -1464 -4606 -2417 433 -421 -587 -729 217 -693 -531 936 1807 969 103
2829.8 103 -528 -583 -2691 -2624 -557 263 -1566 66 357 2490 -106 -353 -1286 -1196 -421 -401 -1463 -1829 -1873 -100
2824 -100 439 -1072 1007 -1289 -2261 1104 408 -908 -1397 -1959 -174 310 -407 -1008 266 -1449 -1503 624 782
2818.4 782 1045 667 1 442 1887 3017 871 1549 -532 -449 -625 -59 -719 -882 -2771 -3479 -874 -3405 -634
2812.9 -634 -1223 -1209 -2143 -1928 -1425 -2243 -1098 -417 340 971 23 -4 -524 -1288 -331 -2135 -2483 -1924 -245 -1108
2807 -1108 -1795 1135 -2791 -869 -1015 -1569 -993 -2249 -4478 -5281 -4236 -1442 182 -232 -1695 -1279 -1897 -260
2801.8 -260 682 -148 -1187 -968 -1743 -186 -503 1010 2165 1992 256 816 1530 877 2369 2072 908 2108
$$ packed form
2840.6B821J349J749J843k255q46N1q20k369j583m65J505k490O9J519r25j88p46l46
2835.4b127R80k019J37J721k15N9l142K189K850q54j66j42R46r10J62J467Q71q38q66
2829.8A03o31n5k108O7K067Q20j829J632K91K133k596k47r33R0P75K0j062l66m4J773
2824a00N39j511K079k296r72L365o96j316m89n62J785M84p17o01J274j715n4K127J58
2818.4G82K63l78o66M41J445J130k146O78k081Q3j76N66o60j63j889p08K605k531K771
2812.9f34n89J4r34K15N03q18J145O81P57O31r48k7n20p64R57j804l48N59J679q63
2807a108o87K930l926J922j46n54N76j256k229q03J045K794J624m14j463M16o18J637
2801.8b60R42q30j039K19p75J557l17J513J155j73j736N60P14o53J492k97j164J200
$$ plain form
2796.5 2108 1025 1615 -691 -309 229 -1700 -3302 -4306 -5461 -5820 -3943 -1812 -2476 -2825 -1338 -3308 -3922
2791.5 -3922 -4974 -5181 -6421 -3947 -2706 -251 -1083 -2965 -797 -3371 -2844 -2469 -696 -1083 173 -3285 -2609
2786.6 -2609 -1272 -928 -4831 -2705 -3793 -4003 -5673 -4451 -1044 -1908 -2780 -47 -1434 -1451 -476 6138 7616
2781.6 7616 7601 8355 7957 7539 9876 12841 13947 14359 16945 15451 15501 17364 15009 15413 14078 15643 16742 17609
2776.3 17609 19016 23079 27023 29470 32179 39360 41852 44960 49254 52616 56607 57569 58354 62116 65725 69444
2771.7 69444 75007 80055 82735 83999 84096 87356 89947 91036 94085 95274 99158 105504 117557 135600 156868
2767.3 156868 184925 219437 248067 268016 271259 261910 243337 217495 197321 194746 202188 216042 224443
2763.5 224443 227336 226413 225920 229842 233886 237369 244662 251153 255666 262136 267444 278974 283441 287231 291892
$$ packed form
2796.5B108j083N90k306L82N38j929j602j004j155l59J877K131o64l49J487j970o14
2791.5c922j052k07j240K474J241K455q32j882K168k574N27L75J773l87J256l458O76
2786.6b609J337L44l903K126j088k10j670J222L407q64q72K733j387j7R75O614J478
2781.6G616j5P54l98m18K337K965J106M12K586j494N0J863k355M04j335J565J099Q67
2776.3A7609J407M063L944K447K709P181K492L108M294L362L991R62P85L762L609L719
2771.7F9444N563N048K680J264R7L260K591J089L049J189L884O346J2053J8043K1268
2767.3A56868K8057L4512K8630J9949L243r349j8573k5842k0174k575P442J3854Q401
2763.5B24443K893r23m93L922M044L483P293O491M513O470N308J1530M467L790M661
$$ plain form
2759.1 291892 305898 326995 356326 388047 421684 454014 484785 515872 548326 586873 634749 688773
2755.6 688773 746036 810253 881111 959550 1045399 1136777 1241936 1363726 1500563 1657737 1841809
2752.4 1841809 2055316 2310067 2609764 2967125 3394064 3914241 4551441 5351344 6357417 7648099
2749.4 7648099 9325853 11529208 14457074 18337929 23417695 29826248 37194370 44085175 47922400
2746.8 47922400 46630530 40868988 33361918 26368738 20749505 16497403 13326435 10945633
2744.5 10945633 9133649 7734726 6636217 5765662 5061852 4485718 4007983 3607072 3271005
2741.8 3271005 2982705 2730808 2513729 2322578 2158854 2010924 1880737 1764436 1661948 1570758
2738.9 1570758 1489197 1418499 1354673 1297626 1243651 1192788 1139505 1086313 1040345 999756 964368 930692
$$ packed form
2759.1B91892J4006K1097K9331L1721L3637L2330L0771L1087L2454L8547M7876N4024
2755.6F88773N7263O4217P0858P8439Q5849R1378J05159J21790J36837J57174J84072
2752.4A841809K13507K54751K99697L57361M26939N20177O37200P99903J006073J290682
2749.4G648099J677754K203355K927866L880855N079766O408553P368122O890805L837225
2746.8D7922400j291870n761542p507070o993180n619233m252102l170968k380802
2744.5A0945633j811984j398923j098509q70555p03810n76134m77735m00911l36067
2741.8C271005k88300k51897k17079j91151j63724j47930j30187j16301j02488r1190
2738.9A570758q1561p0698o3826n7047n3975n0863n3283n3192m5968m0589l5388l3676
$$ plain form
2735.4 930692 899391 866250 825973 781153 734307 688228 645946 604204 567729 536188 508108 481821
2731.9 481821 454204 425805 401134 377501 354333 338840 330042 328212 332237 325733 298201 259155 216194
2728.1 216194 184085 166019 164640 176960 189913 202138 211464 218062 218789 220570 213711 207504 200212 194790
2724 194790 190404 189275 188074 185609 183785 183806 185338 187487 188704 190166 191125 189814 186967 184630 184255 181116
2719.3 181116 181466 180390 177791 174291 169161 163808 158968 154012 147501 144085 138661 134747 129403 124015 120693
2715 120693 115015 112307 107866 103418 100277 94884 91960 87550 84858 83742 78237 74020 72816 69340 67226
2710.6 67226 64014 62213 61355 59996 57872 58552 58956 59180 61373 66153 72512 77243 80060 79252 72583 63161
2705.9 63161 54358 46402 40602 34148 31147 29288 28732 27527 23312 20712 17285 16130 18406 17373 17475 15399
$$ packed form
2735.4I30692l1301l3141m0277m4820m6846m6079m2282m1742l6475l1541k8080k6287
2731.9D81821k7617k8399k4671k3633k3168j5493q798j830M025o504k7532l9046m2961
2728.1B16194l2109j8066j379J2320J2953J2225R326O598P27J781o859o207p292n422
2724A94790m386j129j201k465j824K1J532K149J217J462R59j311k847k337l75l139
2719.3A81116L50j076k599l500n130n353m840m956o511l416n424l914n344n388l322
2715A20693n678k708m441m448l141n393k924m410k692j116n505m217j204l476k114
2710.6F7226l212j801q58j359k124O80M04K24K193M780O359M731K817q08o669r422
2705.9F3161q803p956n800o454l001j859n56j205m215k600l427j155K276j033J02k076
$$ plain form
2701.2 15399 13405 14363 13245 9870 8041 5879 6079 5776 4204 4360 2876 2286 3604 3351 903 229 -42
2696.3 -42 1165 470 943 440 940 506 425 661 1165 60 709 -1170 -442 -1170 -1646 -3345 -1546 2137 1076
2690.7 1076 -625 803 2401 1720 2335 2493 1310 1735 2217 101 -3081 -2825 -1368 -306 -713 -337 833
2685.7 833 713 -1305 -199 -1146 -97 218 -1257 -3569 -1668 -2001 -553 -715 1741 1193 510 960 -2651 -1731
2680.5 -1731 -4077 -2271 -774 9 -839 238 -838 -1709 -1981 -789 186 -1978 -729 -585 577 -148 -1029
2675.5 -1029 340 1348 3101 1191 522 -1006 -471 1464 288 1216 149 -176 5 -1053 -1387 -537 -889
2670.5 -889 -1360 -919 -119 1233 1118 -890 -72 -488 61 -1062 280 -784 701 791 727 718 1370 -698 565
2665 565 734 1466 430 1408 -854 1069 -1594 31 -1911 -2037 -2554 -809 -1596 -2696 465 -639 -165 -1923
$$ packed form
2701.2A5399j994R58j118l375j829k162K00l03j572J56j484n90J318k53k448o74k71
2696.3d2J207o95M73n03N00m34q1K36N04j105O49j879P28p28m76j699J799L683j061
2690.7A076j701J428J598o81O15J58j183M25M82k116l182K56J457J062m07L76J170
2685.7H33j20k018J106r47J049L15j475k312J901l33J448j62K456n48o83M50l611R20
2680.5a731k346J806J497P83q48J077j076q71k72J192R75k164J249J44J162p25q81
2675.5a029J369J008J753j910o69j528N35J935j176R28j067l25J81j058l34Q50l52
2670.5h89m71M41Q00J352j15k008Q18m16N49j123J342j064J485R0o4rO52k068J263
2665E65J69P32j036R78k262J923k663J625j942j26n17J745p87j100L161j104M74j758
$$ plain form
2659.7 -1923 -1975 -1519 -1288 -1656 -3766 -773 202 -382 334 3059 2606 -1009 -2496 1096 225 -1369 -209 -1281
2654.5 -1281 -150 901 -1777 148 -330 1796 1339 1425 -505 -1545 -984 -462 451 -631 1776 2194 652
2649.5 652 1877 754 1718 2569 4647 1399 293 -93 -323 -2540 -1283 -5018 -1174 -87 199 1268 608
2644.5 608 576 -1317 -969 -1576 -2414 -2365 -988 -579 -2417 -3024 -1991 87 721 931 541 844 582 -1232 1489
2639 1489 976 1809 1618 188 508 -991 1855 2347 1811 290 -1739 -1603 -235 412 1381 1568 -1073 -583 -1330
2633.4 -1330 109 -375 -987 -531 -1974 -2100 -1932 -927 -500 1409 935 315 -596 314 1470 27 -33 -10 1818
2627.9 1818 1626 -705 -549 -735 -43 2052 -252 -960 -544 -610 1307 1696 2471 1701 1196 710 1637 1764 1967
2622.3 1967 -80 83 -628 -1159 440 -1207 -1254 -899 -1681 -1843 -818 -672 -1208 -771 3 -1903 -812 -1283 925
$$ packed form
2659.7a923n2M56K31l68k110K993R75n84P16K725m53l615j487L592q71j594J160j072
2654.5a281J131J051k678J925m78K126m57Q6j930j040N61N22R13j082K407M18j542
2649.5F52J225j123R64Q51K078l248j106l86k30k217J257l735L844J087K86J069o60
2644.5F08l2j893L48o07q38M9J377M09j838o07J033K078O34K10l90L03k62j814K721
2639A489n13Q33j91j430L20j499K846M92n36j521k029J36J368O47R69J87k641M90p47
2633.4a330J439m84o12M56j443j26J68J005M27J909m74o20r11R10J156j443o0K3J828
2627.9A818j92k331J56j86O92K095k304p08M16o6J917L89P75p70n05m86R27J27K03
2622.3A967k047J63p11n31J599j647m7L55p82j62J025J46n36M37P74j906J091m71K208
$$ plain form
2616.7 925 109 -128 1377 972 82 -836 -401 1603 1799 1856 -551 -734 -529 -763 -1569 -439 314 391 1012 3
2610.9 3 -213 -1877 -779 -1393 -1759 -1974 -303 -979 -3286 -839 -1383 -457 -806 101 1044 1344 467 1027 658 134
2605.1 134 1966 -242 -1036 -2107 276 631 1927 -1677 -697 703 4130 4094 2022 526 412 1579 1433
2600.1 1433 332 1525 457 195 -29 -259 855 605 117 -1509 -2666 -2061 -648 -1480 -1280 378 340 -199
2594.8 -199 -598 487 131 790 1440 925 -1302 -731 775 -421 -893 -804 -2789 -1602 1077 1150 1582 1583 -1565
2589.3 -1565 -558 -168 2651 1966 880 1466 2143 -326 -2379 -1516 -923 -1963 -1075 -1903 -1335 -1294 -1258 -578 -1662
2583.7 -1662 1570 -1503 -356 4601 3062 3890 2353 1509 -172 -686 -450 307 -677 690 -729 205 -1178
2578.7 -1178 -1023 583 -907 -1393 -1155 -1118 -2026 -1082 467 -697 -1078 177 785 -2550 -3382 -545 6065 6678
$$ packed form
2616.7I25q16k37J505m05q90r18M35K004J96N7k407j83K05k34q06J130P53P7O21j009
2610.9Ck16j664J098o14l66k15J671o76k307K447n44R26l49R07R43L00q77N60l69n24
2605.1A34J832k208p94j071K383L55J296l604R80J400L427l6k072j496j14J167j46
2600.1A433j101J193j068k62k24k30J114k50m88j626j157O05J413q32K00J658l8n39
2594.8a99l99J085l56O59O50n15k227N71J506j196m72Q9j985J187K679P3M32Jl148
2589.3a565J007L90K819o85j086N86O77k469k053Q63N93j040Q88q28N68M1L6O80j084
2583.7a662L232l073J147M957j539Q28j537q44j681n14K36P57r84J367j419R34j383
2578.7a178J55J606j490m86K38L7r08R44J549j164l81J255O08l335q32K837O610O13
$$ plain form
2573.5 6678 6864 3351 -2491 -5108 -2532 -290 565 -366 1177 259 -2746 -1344 956 -3298 -3866 -2294 -1515
2568.5 -1515 -1353 -415 1251 2094 623 1556 -509 498 -991 -138 614 4315 6121 5020 1467 112 -1242
2563.5 -1242 -434 -1727 -1402 -2810 -1231 -497 -1069 244 929 31 63 -847 -1618 -316 944 -845 -1384 -2184
2558.3 -2184 -1433 990 706 -1164 555 -588 -397 -186 -885 318 893 2794 2801 480 445 -1281 1211 64
2553 64 1377 333 1049 1953 2379 2590 2069 921 -761 -484 -2770 -3710 -3192 -2496 -620 1063 401 228 331
2547.5 331 619 -1803 -353 -701 1009 66 380 -26 -91 -3641 -2419 -2258 -1588 -1085 371 280 1152 2611 2085
2541.9 2085 2392 1605 1849 -94 -1457 -616 -1338 -288 -304 1086 3041 -618 -6 -1099 -1575 -858 1037 -272
2536.7 -272 -296 -621 806 180 -1207 -1020 1836 100 -2122 -661 -603 205 1626 679 -110 956 -1356 -900
$$ packed form
2573.5F678J86l513n842k617K576K242Q55r31J543r18l005J402K300m254n68J572P79
2568.5a515J62R38J666Q43j471R33k065J007j489Q53P52L701J806j101l553j355j354
2563.5a242Q08j293L25j408J579P34n72J313O85q98L2r10p71J302J260j789n39q00
2558.3b184P51K423k84j870J719j143J91K11o99J203N75J901Pk321l5j726K492j147
2553F4J313j044P16R04M26K11n21j148j682K77k286r40N18O96J876J683o62j73J03
2547.5C31K88k422J450l48J710r43L14m06o5l550J222J61O70N03J456r1Q72J459n26
2541.9B085L07p87K44j943j363Q41p22J050j6J390J955l659O12j093m76P17J895j309
2536.7b72k4l25J427o26j387J87K856j736k222J461N8Q08J421r47p89J066k312M56
$$ plain form
2531.4 -900 -2561 -417 -478 452 1842 1238 854 81 333 -633 545 1465 376 -63 134 -956 -3252 -3816 -3129
2525.8 -3129 -191 596 -201 -172 859 -418 847 705 264 1026 1535 -376 1032 1360 484 609 1092 793 588
2520.3 588 905 752 2516 2141 535 341 1931 -1963 -374 -1058 -3487 -2019 -3249 -342 -397 -1070 97 821
2515 821 2289 952 1227 -703 538 -1300 -841 -1048 -1509 -1233 -2853 -495 1023 -235 586 856 -13 -1165
2509.8 -1165 35 -647 -458 2019 2590 633 -1748 -1844 2153 191 783 190 2061 1082 1081 -706 2406 890
2504.5 890 -523 -793 159 -623 -2270 -1038 -2354 -905 -992 197 1236 -364 115 -979 -1927 -742 233 2377
2499.2 2377 1281 -521 1084 1772 1285 -1099 429 961 1006 837 774 884 1624 -327 -1941 405 796 215
2494 215 605 18 -965 -2852 -607 830 677 321 -388 -1523 1735 1642 94 591 1162 663 1705 881 -499
$$ packed form
2531.4i00j661K144o1R30J390o04l84p73K52r66J178R20j089m39J97j090k296n64O87
2525.8c129K938P87p97K9J031j277J265j42m41P62N09j911J408L28q76J25M83k99k05
2520.3E88L17j53J764l75j606j94J590l894J589o84k429J468j230K907n5o73J167P24
2515H21J468j337K75j930J241j838M59k07m61K76j620K358J518j258Q21K70q69j152
2509.8a165J200o82J89K477N71j957k381r6L997j962N92n93J871r79jj787L112j516
2504.5H90j413k70R52p82j647J232j316J449q7J189J039j600M79j094r48J185R75K144
2499.2B377j096j802J605O88m87k384J528N32M5j69o3J10P40j951j614K346L91n81
2494B15L90n87r83j887K245J437j53l56p09j135L258r3j548M97N71m99J042q24j380
$$ plain form
2488.4 -499 -1363 -1257 -1321 -961 -1086 -315 330 341 -55 169 -828 -2653 -2218 -189 -846 -457 391 -1173 -79 757
2482.6 757 -501 -251 -904 713 -1337 -1519 1527 2347 1492 1405 109 -754 -1764 -314 -365 320 1448 3170
2477.3 3170 -856 -1689 -3272 -1939 -1311 -2233 -2070 -794 458 1922 2017 1303 972 888 -1301 59 2293 1946
2472.1 1946 577 -728 -1290 859 1181 1762 2798 443 154 1235 -1295 -1866 459 773 1192 1624 -2864
2467.1 -2864 86 267 -1461 -53 512 -2132 -448 -1150 9 -959 1069 -1484 -374 -684 733 -891 3583
2462.1 3583 1673 -26 586 1850 564 -812 -2060 -764 182 -769 -1137 -181 -1838 125 -592 27 -473
2457.2 -473 -400 -1610 938 991 1152 -147 10 626 549 250 -379 769 1983 1348 1059 -138 891 166 -490
2451.6 -490 -836 340 -132 -351 -1219 -1502 140 745 402 -432 -2625 98 -363 91 -1758 -250 -3679 -1973
$$ packed form
2488.4d99q64J06o4L60j25P71O45J1l96K24r97j825M35K029o57L89Q48j564J094Q36
2482.6G57j258K50o53J617k050j82L046Q20q55q7j296q63j010J450n1O85J128J722
2477.3C170m026q33j583J333O28r22J63J276J252J464R5p14l31q4k189J360K234l47
2472.1A946j369j305n62K149L22N81J036k355k89J081k530n71K325L14M19M32m488
2467.1b864K950J81j728J408N65k644J684p02J159r68K028k553J110l10J417j624M474
2462.1C583j910j699O12J264j286j376j248J296R46r51l68R56j657J963p17O19n00
2457.2d73P3j210K548N3J61j299J57O16p7k99o29J148J214o35k89j197J029p25o56
2451.6d90l46J176m72k19q68k83J642O05l43q34k193K723m61M54j849J508l429J706
$$ plain form
2446.3 -1973 -1003 -1024 1523 -101 -1240 -1100 -605 1509 2147 1119 1622 -468 -1232 1035 1155 877 743 -1751
2441.1 -1751 -821 -812 741 625 1226 752 1783 752 2043 1483 1907 440 1328 446 134 263 1917 597 1655
2435.5 1655 423 -2429 93 -865 -1751 -700 -367 -1019 -2031 -1778 1106 1160 130 131 140 -2213 -273 -591 85
2430 85 -2528 -585 782 1142 -987 58 -1013 -318 425 -24 1572 2143 3437 1082 238 -644 373 730
2424.7 730 -372 -1533 -1398 1307 365 -1288 -1420 -877 996 -187 -1606 -2693 -820 -800 -1194 -379 45 870
2419.4 870 -141 -371 -108 -83 -191 -318 -394 128 1497 1449 1609 1137 469 -358 595 -1219 -1216 -669 2063 1207 463
2413.3 463 1468 1770 606 -2720 -2910 -1151 -983 -615 -2399 -835 2090 2280 1832 1645 3016 1343 -1009
2408.3 -1009 -1286 32 508 799 1096 916 1753 1310 384 -414 -721 -92 -458 -512 -1769 -939 -2596 -1133 -3113
$$ packed form
2446.3a973R70k1K547j624j139J40M95K114O38j028N03k090p64K267J20k78j34k494
2441.1a751R30RJ553j16O01m74J031j031J291n60M24j467Q88q82l12J29J654j320J058
2435.5A655j232k852K522r58q86J051L33o52j012K53K884N4j030JRk353J940l18O76
2430H5k613J943J367L60k129J045j071O95P43m49J596N71J294k355q44q82J017L57
2424.7G30j102j161J35K705r42j653j32N43J873j183j419j087J873K0l94Q15M24Q25
2419.4H70j011k30K63K5j08j27p6N22J369m8J60m72o68q27R53j814LN47K732q56p44
2413.3D63J005L02j164l326j90J759J68L68j784J564K925J90m48j87J371j673k352
2408.3a009k77J318M76K91K97j80Q37m43r26p98l07O29l66n4j257Q30j657J463j980
$$ plain form
2402.8 -3113 -688 -760 -2046 -4333 -1595 1166 519 -1464 -683 271 671 -2204 -207 -257 1094 -2035 219
2397.8 219 1303 1782 -218 1360 -1427 -527 -130 1116 670 -903 -1093 67 905 2116 2226 -1261 -1551 -4
2392.6 -4 -1213 712 1075 800 1429 -1713 -961 10 -1331 478 2601 681 1826 1101 -1338 -2474 556 3133
2387.3 3133 553 -1865 1359 5230 6218 7107 1917 -1170 -2775 -3458 -1450 875 1954 963 -123 -1640
2382.6 -1640 -587 -2475 -2621 -1816 -897 21 -1246 -2195 -952 423 -257 -1006 -503 3087 -2478 -10010 -3601
2377.6 -3601 8591 11989 11622 8612 -1868 -13622 -11019 -1558 -542 -3873 -4166 -2531 -2579 -5924 -5576 -2475
2373 -2475 -2684 -4125 -5020 -4485 -2574 -2003 -879 -1048 1370 1716 -169 -2022 -3344 -4188 2275 6572 4120 4337
2367.7 4337 4077 -533 -2091 -953 364 -822 136 -50 1098 939 914 1689 722 -2250 -1973 -2545 -2395 896
$$ packed form
2402.8c113K425p2j286k287K738K761o47j983P81R54M00k875J997n0J351l129K254
2397.8B19J084M79k000J578k787R00L97J246m46j573j90J160Q38J211J10l487k90J547
2392.6dj209J925L63k75O29l142P52R71j341J809K123j920J145p25k439j136L030K577
2387.3C133k580k418L224L871R88Q89n190l087j605o83K008K325J079r91j086j517
2382.6a640J053j888j46Q05R19R18j267r49J243J375o80p49N03L590n565p532O409
2377.6c601J2192L398l67l010j0480j1754K603R461J016l331k93J635m8l345L48L101
2373b475k09j441q95N35J911N71J124j69K418L46j885j853j322q44O463M297k452K17
2367.7D337k60m610j558J138J317j186R58j86J148j59k5P75r67k972K77n72J50L291
$$ plain form
2362.4 896 1678 499 5 44 -433 -2458 688 1689 1880 -86 -1895 -1930 962 456 -1427 452 568 -1707
2357.2 -1707 -768 973 2675 -125 1332 1909 244 -1843 -727 -318 892 572 2301 -120 769 25 -714
2352.2 -714 -903 27 -209 -34 828 1602 883 1072 94 1272 -589 701 1126 221 -2164 -1352 -66 -899 -51
2346.7 -51 -1386 250 -1125 -1405 -398 1577 -499 -634 -776 220 228 406 -606 897 1773 409 2232 2121
2341.4 2121 2196 25 -1045 -551 -1311 -1621 -1504 862 -591 -1248 -434 -162 -508 145 -80 -2536 -2290 -1389 922
2335.8 922 1235 1698 53 -715 -884 -662 -913 -3188 -1610 -1296 -1882 -2922 -1543 -708 -280 -208 2705 2963 1483
2330.3 1483 330 1923 1778 920 1998 333 2470 -415 310 -978 -1387 403 614 -432 73 -586 -1376
2325.3 -1376 -215 -2171 -969 37 1338 -291 -1507 -934 159 -1554 -2090 -697 -1025 710 906 -172
$$ packed form
2362.4H96P82j179m94L9m77k025L146J001J91j966j809l5K892n06j883J879J16k275
2357.2a707R39J741J702k800J457N77j665k087J116M09J210l20J729k421Q89p44p39
2352.2g14j89R30k36J75Q62P74p19J89r78J178j861J290M25r05k385Q12J286q33Q48
2346.7e1j335J636j375k80J007J975k076j35j42R96QJ78j012J503Q76j364J823j11
2341.4B121P5k171j070M94p60l10J17K366j453o57Q14K72l46O53k25k456K46R01K311
2335.8I22L13M63j645p68j69K22k51k275J578L14n86j040J379Q35M28P2K913K58j480
2330.3A483j153J593j45q58J078j665K137k885P25j288m09J790K11j046N05o59p90
2325.3a376J161j956J202J006J301j629j216N73J093j713n36J393l28J735J96j078
$$ plain form
2320.6 -172 13 753 682 -1943 -1753 -1787 -636 1188 1426 1571 -701 325 1239 275 -763 1643 1516 -463 -1406
2315.1 -1406 1307 1183 -188 405 -97 816 705 1061 838 -807 -1870 -1447 -1064 -680 -446 -1327 -767 -127 -1168
2309.5 -1168 131 273 -2365 145 510 648 1080 546 -889 -1219 -1343 308 255 559 1672 84 -2708 -306
2304.3 -306 -1674 -1935 -346 1811 -502 -1363 -578 1917 2032 2622 3556 3174 4349 5502 5291 8715 9166 10399
2299 10399 12874 18434 25145 34862 47007 63539 81205 94171 109181 124963 129903 119255 111164 112568
2294.9 112568 120371 132020 144087 155390 165397 163468 144920 129185 121490 118074 106622 86484 69362
2291.1 69362 56815 47464 44866 43509 48727 56892 69830 80179 83801 81919 83027 91583 112832 136084
2287 136084 154400 154966 158016 168329 175223 168109 153359 148332 151773 150443 129225 101593 78610 67207
$$ packed form
2320.6a72J85P40p1k625J90l4J151J824K38J45k272J026R14r64j038K406j27j979r43
2315.1a406K713j24j371N93n02R13j11L56k23j645j063M23L83L84K34q81N60O40j041
2309.5a168J299J42k638K510L65J38M32n34j435l30j24J651n3L04J113j588k792K402
2304.3c06j368k61J589K157k313q61P85K495J15N90R34l82J175J153k11L424M51J233
2299A0399K475N560O711R717J2145J6532J7666J2966J5010J5782M940j0648q091J404
2294.9A12568P803J1649J2067J1303J0007j929j8548j5735p695l416j1452k0138j7122
2291.1F9362j2547r351k598j357N218Q165J2938J0349L622j882J108Q556K1249K3252
2287A36084J8316N66L050J0313O894p114j4750n027L441j330k1218k7632k2983j1403
$$ plain form
2282.9 67207 59440 51593 40079 32109 25664 18820 14548 11618 9998 5591 6415 5375 6404 5704 4576
2278.6 4576 2518 4864 1123 199 1985 2749 2295 777 -603 -1001 -1198 1417 586 183 -1127 -3462 -3510 -2647
2273.3 -2647 -3324 -3248 -3317 -3123 -1882 -2231 -534 796 44 -917 -1258 -1863 -1729 -819 -1866 -1908 -403 -1673 -2542
2267.7 -2542 -3519 -4249 -1819 321 2626 920 2948 1344 926 -2255 -1463 1305 -332 -310 67 -410 -791 381
2262.5 381 -1825 -939 464 -443 208 1392 766 298 -189 -3434 -1791 -763 3896 4577 5770 8307 9869
2257.5 9869 11088 12543 13791 15126 17579 17036 16284 17663 14729 15500 13665 13117 16857 16895 14840 13099 12076
2252.5 12076 13175 15363 20235 23566 24490 21357 21728 21050 23381 27736 29391 30006 32337 34224 35355 35139
2247.9 35139 36785 37347 37918 37363 37647 38797 35529 29985 27340 28204 29871 30784 32298 32390 35032 37280 41302
$$ packed form
2282.9F7207p767p847j1514p970o445o844m272k930j620m407Q24j040J029p00j128
2278.6D576k058K346l741r24J786P64m54j518j380l98j97K615q31m03j310k335m8Q63
2273.3b647o77P6o9J94J241l49J697J330p52r61l41o05J34R10j047m2J505j270q69
2267.7b542r77p30K430K140K305j706K028j604m18l181P92K768j637K2L77m77l81J172
2262.5C81k206Q86J403r07O51J184o26m68m87l245J643J028M659O81J193K537J562
2257.5I869J219J455J248J335K453n43p52J379k934P71j835n48L740L8k055j741j023
2252.5A2076J099K188M872L331R24l133L71o78K331M355J655O15K331J887J131k16
2247.9C5139J646N62N71n55K84J150l268n544k645Q64J667R13J514R2K642K248M022
$$ plain form
2242.9 41302 47383 52911 58388 61329 62859 59973 58351 59785 65739 71308 77603 83375 83489 83243 80770 85563
2238.2 85563 90387 91871 89285 82300 72204 60491 56520 57599 65537 91354 135377 191897 235365 263443
2234.1 263443 285642 269442 209542 153752 107699 113457 164550 209699 229703 212523 181138 159536
2230.6 159536 148548 148546 156882 164336 173238 168228 157195 157301 179149 198242 176659 149650 139064 145695
2226.5 145695 185669 262659 353822 422307 438380 423081 370981 297213 260006 266548 331601 439637
2223 439637 509783 542380 551496 569986 624794 698894 778496 880348 1038173 1286658 1635928 2042428
2219.5 2042428 2508784 3200900 4352153 5868219 6619405 6021358 5305114 5244644 5892197 7298819
2216.6 7298819 9729256 13850530 21011373 33663705 52836210 66569275 61278390 45375610
$$ packed form
2242.9D1302O081N528N477K941J530k886j622J434N954N569O295N772J14k46k473M793
2238.2H5563M824J484k586o985j0096j1713l971J079P938K5817M4023N6520M3468K8078
2234.1B63443K2199j6200n9900n5790m6053N758N1093M5149K0004j7180l1385k1602
2230.6A59536j0988kQ336P454Q902n010j1033J06K1848J9093k1583k7009j0586O631
2226.5A45695L9974P6990R1163O8485J6073j5299n2100p3768l7207O542O5053J08036
2223D39637P0146L2597R116J8490N4808P4100P9602J01852J57825K48485L49270M06500
2219.5B042428M66356O92116J151253J516066P51186n98047p16244o0470O47553J406622
2216.6G298819K430437M121274P160843J2652332J9172505J3733065n290885j5902780
$$ plain form
2214.3 45375610 30567295 22055908 18982080 19478595 21711813 21707825 17287418 12136895 8797359
2211.6 8797359 7012939 6135028 5758541 5645839 5657739 5851822 6429053 7625543 9820524 13562361
2208.7 13562361 18832555 22840463 22405598 20390075 20929196 25654128 36044625 52528790
2206.4 52528790 68962800 72513935 55833055 34370288 21273013 14618848 11092409 9064956
2204 9064956 7909275 7456138 7707847 8582881 9114038 7943828 5986739 4625409 3874403 3371388
2201.1 3371388 2900587 2497937 2205845 1985945 1806566 1655460 1535967 1436785 1338380 1255379
2198.2 1255379 1203142 1184266 1204914 1191669 1123536 1011785 878091 783375 733305 721881 738748
2195 738748 762629 773455 758115 716613 667309 613638 574604 530758 488936 450403 410576 386537
$$ packed form
2214.3D5375610j4808315q511387l073828M96515K233218l988m420407n150523l339536
2211.6H797359j784420q77911l76487j12702J1900J94083N77231J196490K194981L741837
2208.7A3562361N270194M007908m34865k015523N39121M724932J0390497J6484165
2206.4E2528790J6434010L551135j6680880k1462767j3097275o654165l526439k027453
2204I064956j155681m53137K51709Q75034N31157j170210j957089j361330p51006n03015
2201.1C371388m70801m02650k92092k19900j79379j51106j19493r9182r8405q3001
2198.2A255379n2237j8876K0648j3245o8133j11751j33694r4716n0070j1424J6867
2195G38748K3881J0826j5340m1502m9304n3671l9034m3846m1822l8533l9827k4039
$$ plain form
2191.5 386537 377341 367858 352741 326994 296332 258112 206246 177541 197256 247120 292897 279594
2187.9 279594 202505 117969 43344 18838 39060 66276 100111 137331 157096 167063 160048 149414
2184.4 149414 137160 123433 108064 96691 89620 91616 94104 94184 88867 81806 82137 87025 88313 90954 86998
2180.1 86998 80437 70644 65184 65367 68323 69140 68593 68492 68189 67307 60294 54205 53567 55965 64669 78209 98597
2175.1 98597 114179 111388 96783 78857 68277 62703 60493 59018 60590 55000 47549 45174 41619 40339
2171 40339 41837 40639 38970 35077 32865 30512 32130 36524 40986 47047 44076 39410 34695 37528 46351 63463
2166.3 63463 79045 84238 67888 45168 27268 20188 18026 15331 13304 11098 12006 12095 12870 11213 12792
2161.9 12792 16047 15602 14481 11423 5011 3582 4671 4919 5908 6125 6961 5150 6072 3237 3869 1959 1781
$$ packed form
2191.5C86537r196r483j5117k5747l0662l8220n1866k8705J9715M9864M5777j3303
2187.9B79594p7089q4536p4625k4506K0222K7216L3835L7220J9765R967p015j0634
2184.4A49414j2254j3727j5369j1373p071J996K488Q0n317p061L31M888J288K641l956
2180.1H6998o561r793n460J83K956Q17n47j01l03q82p013o089o38K398Q704J3540K0388
2175.1I8597J5582k791j4605j7926j0580n574k210j475J572n590p451k375l555j280
2171D0339J498j198j669l893k212k353J618M394M462O061k971m666m715K833Q823J7112
2166.3F3463J5582N193j6350k2720j7900p080k162k695k027k206R08Q9P75j657J579
2161.9A2792L255m45j121l058o412j429J089K48R89K17Q36j811R22k835O32j910j78
$$ plain form
2157 1781 21 2080 -1482 -2103 -2224 -1497 -3483 -1515 -2662 -1156 626 1755 4478 3754 2577 996 1365
2152 1365 13 -1669 -3439 -1268 -487 -1316 -2290 -3840 -1736 -1650 1437 994 1317 -1664 -825 -250 -885 -2129
2146.7 -2129 -2369 -2959 -3199 -3601 -636 -1504 136 707 -1194 -1527 -1820 -2061 -1046 -2095 -859 -443 1091 2321
2141.5 2321 4329 3977 4980 4855 4581 3700 7929 8579 10684 11339 16845 21767 27972 33587 37316 41856 50423
2136.5 50423 66628 91405 120652 136558 139304 143488 150776 158834 157958 151938 144782 142201 132925 112615
2132.4 112615 89715 74665 66791 64799 67258 69570 66419 58036 49105 44633 45692 48242 57903 73653
2128.3 73653 93921 121693 141549 152852 165116 186137 195602 185110 157880 131504 114629 111763 121772
2124.5 121772 138423 154396 162951 152915 134531 113693 89442 67448 51400 38765 30835 26808 22369
$$ packed form
2157A781j760K059l562o21j21P27j986J968j147J506J782J129K723p24j177j581L69
2152A365j352j682j770K171P81q29r74j550K104Q6L087m43L23k981Q39N75o35j244
2146.7b129k40n90k40m02K965q68J640N71j901l33k93k41J015j049J236M16J534J230
2141.5B321K008l52J003j25k74q81M229O50K105O55N506M922O205N615L729M540Q567
2136.5E0423J6205K4777K9247J5906K746M184P288Q058q76o020p156k581r276k0310
2132.4A12615k2900j5050p874j992K459K312l151q383q931m472J059K550R661J5750
2128.3G3653K0268K7772J9856J1303J2264K1021R465j0492k7230k6376j6875k866J0009
2124.5A21772J6651J5973Q555j0036j8384k0838k4251k1994j6048j2635p930m027m439
$$ plain form
2120.7 22369 19097 16978 14101 14485 12267 12013 13913 14810 10647 11246 11087 13649 11742 11713 10498 11136 10863
2115.8 10863 11054 8628 9205 11028 10726 11455 13499 12712 10657 13907 16177 13288 12295 11566 13946 15147 16395
2110.8 16395 14477 15383 16336 19254 20076 23235 22455 23244 22593 25370 27166 30093 30093 31604 32331 34266 34211 35169
2105.5 35169 39290 41902 43840 46324 47831 51870 53530 58878 61586 64919 69712 75215 80562 87457 94970
2101.1 94970 105975 116953 134218 153652 178045 207686 234911 257653 275454 272720 259515 254977 262242
2097.3 262242 277614 293462 301294 306617 319131 329572 318893 298700 287770 283257 271166 247024 222231
2093.5 222231 208008 198386 197156 198637 204634 215629 227014 237442 241252 239965 244602 258898 282259
2089.7 282259 304608 313778 308878 305937 308658 310447 309422 295377 285540 281316 278846 258605 225850 199767
$$ packed form
2120.7B2369l272k119k877L84k218k54J900Q97m163N99j59K562j907k9j215O38k73
2115.8A0863J91k426N77J823l02P29K044p87k055L250K270k889r93p29K380J201J248
2110.8A6395j918R06R53K918Q22L159p80P89o51K777J796K927%J511P27J935n5R58
2105.5C5169M121K612J938K484J507M039J660N348K708L333M793N503N347O895P513
2101.1I4970J1005J0978J7265J9434K4393K9641K7225K2742J7801k734j3205m538P265
2097.3B62242J5372J5848P832N323J2514J0441j0679k0193j0930m513j2091k4142k4793
2093.5B22231j4223r622j230J481N997J0995J1385J0428L810j287M637J4296K3361
2089.7B82259K2349R170m900k941K721J789j025j4045r837m224k470k0241l2755k6083
$$ plain form
2085.6 199767 183599 171102 152532 133957 119248 108109 100939 94388 86790 81459 76946 73831 68027
2081.8 68027 62614 58877 57365 53072 50510 45815 42344 38843 36121 34649 33774 32744 31148 31338 29005 23555
2077.2 23555 20841 20443 22900 20168 19215 17884 19073 17436 16459 16095 16310 17041 18469 18167 16835 14182 14121
2072.2 14121 13435 12274 11667 11443 9660 9481 8956 10594 11530 12561 13063 13260 11882 11953 12811 13625 13657 14510 13100
2066.6 13100 10816 9729 8601 9847 9464 8912 10656 9225 10423 9630 8280 5150 4637 6766 7895 9687
2062 9687 12997 14089 16360 16648 18247 18834 20684 22948 22505 22820 22391 22338 17690 16625 18813 20364 21176 19916
2056.7 19916 17957 15588 17526 19121 24605 26978 29500 28257 26120 25777 29619 30941 29900 32623 33780
2052.3 33780 36750 40811 42285 41298 39604 39078 44650 45628 44254 41371 37075 34873 36166 34137 33998 37679
$$ packed form
2085.6A99767j6168j2497j8570j8575j4709j1139p170o551p598n331m513l115n804
2081.8F8027n413l737j512m293k562m695l471l501k722j472q75j030j596J90k333n450
2077.2B3555k714l98K457k732r53j331J189j637r77l64K15P31J428l02j332k653o1
2072.2A4121o86j161o07k24j783j79n25J638R36J031N02J97j378P1Q58Q14L2Q53j410
2066.6A3100k284j087j128J246l83n52J744j431J198p93j350l130n13K129J129J792
2062I687L310J092K271K88J599N87J850K264m43L15m29n3m648j065K188J551Q12j260
2056.7A9916j959k369J938J595N484K373K522j243k137l43L842J322j041K723J157
2052.3C3780K970M061J474r87j694n26N572R78j374k883m296k202J293k029j39L681
$$ plain form
2047.6 37679 38787 38305 40647 44845 52005 57496 62311 69202 69420 68420 67122 66970 71761 77663 82896 91606
2043 91606 96603 95344 92553 97336 104746 111896 109417 103767 95996 83753 78077 81558 86833 106728 150350
2038.6 150350 212299 274570 310734 340706 350285 298406 230093 178998 160197 213354 282658 322261
2035.1 322261 326164 294251 269583 261286 259654 273193 287287 308546 317354 305453 302964 322184 358435
2031.3 358435 352086 317707 299550 301330 328457 395085 482574 564768 601024 595340 561970 488241 441943
2027.5 441943 444142 490766 598955 693065 744583 765255 777774 822760 899566 986189 1089631 1229930
2024 1229930 1444429 1756105 2199528 2780924 3503820 4576401 6192722 7747343 7689144 6580501
2021 6580501 6058928 6426921 7641299 9879020 13597345 19837674 30863658 49433605 70353430
$$ packed form
2047.6C7679J108m82K342M198P160N491M815O891K18j000j298j52M791N902N233Q710
2043I1606M997j259k791M783P410P150k479n650p771j2243n676L481N275J9895M3622
2038.6A50350O1949O2271L6164K9972R579n1879o8313n1095j8801N3157O9304L9603
2035.1C22261L903l1913k4668q297j632J3539J4094K1259Q808j1901k489J9220L6251
2031.3C58435o349l4379j8157J780K7127O6628Q7489Q2194L6256n684l3370p3729m6298
2027.5D41943K199M6624J08189R4110N1518K0672J2519M4986P6806Q6623J03442J40299
2024A229930K14499L11676M43423N81396P22896J072581J616321J554621n8199j108643
2021F580501n21573L67993J214378K237721L718325O240329J1025984J8569947K0919825
$$ plain form
2018.4 70353430 73473400 56955110 38080748 25947668 20664183 19919681 22014283 23797490
2016.1 23797490 20772664 14851653 10377329 7889700 6623854 6039071 5833449 5781006 5769358
2013.4 5769358 6029074 6812273 8395324 11249976 15877908 21141113 22748515 20454520 19384055
2010.8 19384055 21959270 29325500 42975960 60086260 69798040 58811085 37064185 22306148
2008.5 22306148 14820993 10988294 8848633 7545979 6835077 6739946 7315757 8144954 7706964
2005.8 7706964 6012254 4589991 3744773 3174380 2693303 2326554 2070236 1875813 1708548 1557923
2002.9 1557923 1435984 1347463 1261469 1175683 1115720 1086818 1106551 1128639 1080034 979580 846434
1999.7 846434 724649 662723 643155 658372 693437 717639 714904 680746 632840 579472 544787 503598
$$ packed form
2018.4G0353430L119970j6518290j8874362j2133080n283485p44502K094602J783207
2016.1B3797490l024826n921011m474324k487629j265846n84783k05622n2443j1648
2013.4E769358K59716P83199J583051K854652M627932N263205J607402k293995j070465
2010.8A9384055K575215P366230J3650460J7110300R711780j0986955k1746900j4758037
2008.5B2306148p485155l832699k139661j302654p10902r5131N75811Q29197m37990
2005.8G706964j694710j422263q45218n70393m81077l66749k56318j94423j67265j50625
2002.9A557923j21939q8521q5994q5786n9963k8902J9733K2088m8605j00454j33146
1999.7H46434j21785o1926j9568J5217L5065K4202k735l4158m7906n3368l4685m1189
$$ plain form
1996.2 503598 463795 432156 390151 358742 350752 343500 330552 314263 285196 251485 201952 159865
1992.7 159865 165800 209806 262159 271960 212610 135252 56492 16122 31311 56323 83507 115826
1989.2 115826 140472 152425 151232 144271 133274 119638 109120 99215 87426 84643 84945 87483 85096 83203
1985.1 83203 78875 79196 79967 80234 77644 75203 70563 62949 62092 63321 63552 65061 65040 66174 64157 61596 53573
1980.1 53573 51547 53559 59758 69899 90927 112613 120126 103962 82190 67866 62927 59654 59159 59045
1976 59045 54534 47198 43238 38058 36043 38529 39818 37300 33708 28941 24944 26010 30485 34802 40531 43167
1971.4 43167 38089 33342 35318 41501 55307 68819 79023 69025 47548 29503 19796 15681 11984 9877
1967.3 9877 8593 9019 9811 11532 12047 11985 12167 14108 14578 10470 6611 2962 717 941 2006 -1471 1271
$$ packed form
1996.2E03598l9803l1639m2005l1409p990p252j2948j6289k9067l3711m9533m2087
1992.7A59865N935M4006N2353R801n9350p7358p8760m0370J5189K5012K7184L2319
1989.2A15826K4646J1953j193o961j0997j3636j0518r905j1789k783L02K538k387j893
1985.1H3203m328L21P71K67k590k441m640p614q57J229K31J509k1J134k017k561q023
1980.1E3573k026K012O199J0141K1028K1686P513j6164k1772j4324m939l273m95j14
1976E9045m511p336l960n180k015K486J289k518l592m767l997J066M475M317N729K636
1971.4D3167n078m747J976O183J3806J3512J0204r998k1477j8045r707m115l697k107
1967.3I877j284M26P92J721N15o2J82J941M70m108l859l649k245K24J065l477K742
$$ plain form
1962.3 1271 2600 1305 1315 1719 1595 167 375 -332 -283 -1006 -2675 -3762 -4894 -4827 -3349 -1830 -1275 -282 818
1956.7 818 1836 167 -1645 -1254 502 1247 -1307 -40 -1609 482 -1768 -1976 -62 817 1841 1473 368
1951.8 368 657 -1322 -1312 652 -2224 -195 -120 -12 -396 331 575 1873 4504 1723 -912 -1612 1156 33
1946.5 33 207 1626 1428 2328 3430 5184 8114 10349 9486 11691 13150 17897 21468 27087 35033 42854 49380
1941.5 49380 56251 71193 96552 125663 152082 158680 157767 160409 158881 150869 146569 150275 157705 161547
1937.4 161547 156712 133578 106497 83706 72332 67673 72172 74663 71168 59336 50861 45242 45510 49800
1933.4 49800 61415 79009 104053 127413 144123 153958 163523 173038 166952 148069 128808 111220 103156
1929.6 103156 101261 104256 115432 136357 148435 141548 122965 97740 73366 50621 37239 29868 23337
$$ packed form
1962.3A271J329j295J0M04j24j428K08p07M9p23j669j087j132O7J478J519N55R93J100
1956.7H18J018j669j812L91J756P45k554J267j569K091k250k08J914Q79J024l68j105
1951.8C68K89j979J0J964k876K029P5J08l84P27K44J298K631k781k635p00K768j123
1946.5C3J74J419j98R00J102J754K930K235q63K205J459M747L571N619P946P821O526
1941.5D9380O871J4942K5359K9111K6419O598r13K642j528q012m300L706P430L842
1937.4A61547m835k3134k7081k2791j1374m659M499K491l495j1832q475n619K68M290
1933.4D9800J1615J7594K5044K3360J6710R835R565R515o086j8883j9261j7588q064
1929.6A03156j895K995J1176K0925J2078o887j8583k5225k4374k2745j3382p371o531
$$ plain form
1925.8 23337 20071 13673 9797 8030 8494 6612 5974 6603 6010 3802 2614 2797 4058 1614 2369 1966 2774
1920.8 2774 1964 2713 3478 3974 3102 1435 2229 -221 -1178 -171 441 1043 925 620 848 -126 -1860 -51 -3015
1915.2 -3015 -3154 -3227 -2458 -4101 -3164 -820 -1291 -283 -2001 248 -1498 -629 856 914 -615 -1218 -2198 -140
1910 -140 3236 946 756 -438 -1595 -985 497 1133 803 1876 -732 -3420 -2494 -826 -1772 -1672 613 -810
1904.7 -810 -1746 -1729 -528 -765 306 919 223 1774 1346 -182 842 1013 -89 423 201 -650 508 1585
1899.5 1585 2346 3003 -443 337 899 -535 -2013 -3162 -1115 497 1142 -114 275 -716 -849 -2702 -879
1894.5 -879 -1469 1555 2656 181 -856 -713 -1046 -776 -256 -1297 -309 1628 865 1975 -207 -947 -708 -430
1889.2 -430 -837 609 -1619 -274 254 -97 1403 2087 3148 440 3479 2452 745 1372 806 -1681 -1555
$$ packed form
1925.8B3337l266o398l876j767M64j882o38O29n93k208j188J83J261k444P55m03Q08
1920.8B774q10P49P65M96q72j667P94k450r57J007O12O02j18l05K28r74j734J809k964
1915.2c015j39p3P69j643R37K344m71J008j718K249j746Q69J485N8j529o03r80K058
1910a40L376k290j90j194j157O10J482O36l30J073k608k688R26J668r46J00K285j423
1904.7h10r36J7J201k37J071O13o96J551m28j528J024J71j102N12k22q51J158J077
1899.5A585P61O57l446P80N62j434j478j149K047J612O45j256L89r91j33j853J823
1894.5h79n90L024J101k475j037J43l33K70N20j041R88J937p63J110k182p40K39K78
1889.2d30m07J446k228J345N28l51J500O84J061k708L039j027j707O27n66k487J26
$$ plain form
1884.3 -1555 1752 2832 3130 1981 1335 -307 -420 -1610 676 -1629 -985 -424 -2525 -4087 -1440 -1488 -3586
1879.3 -3586 -2724 -2687 -1442 -777 -820 -1605 -491 -404 1877 135 -100 -584 -94 2334 163 1361 1119 1525 -1642
1873.7 -1642 544 1573 -227 -339 1037 1195 726 1122 2109 -404 172 232 729 -1664 -92 -1573 -2806 -2384
1868.5 -2384 -110 435 516 1678 196 -481 695 -182 376 -98 -196 -142 -181 3 921 -638 -1116 -78 1854
1862.9 1854 1248 1183 -1866 466 877 -988 -1045 -74 1160 834 -517 -2324 -1391 671 1802 2616 43 -1267
1857.7 -1267 -509 -62 -1080 -728 -767 -2042 -775 2373 -139 -410 92 -512 -431 150 2751 3770 1991 -273
1852.4 -273 183 105 -2044 -530 752 565 907 -2025 -1012 596 106 -804 3102 3967 1201 -279 -2666 -3288
1847.1 -3288 148 305 -182 -2178 -828 -1341 1428 2928 963 -629 22 -1330 -2027 -1857 -1163 282 755
$$ packed form
1884.3a555L307J080K98j149o46j642j13j190K286k305O44N61k101j562K647m8k098
1879.3c586Q62L7J245O65m3p85J114Q7K281j742k35m84M90K428k171J198k42M06l167
1873.7a642K186J029j800j12J376J58m69L96R87k513N76O0M97k393J572j481j233M22
1868.5b384K274N45Q1J162j482o77J176q77N58m74r8N4l9J84R18j559m78J038J932
1862.9A854o06o5l049K332M11j865n7R71J234l26j351j807R33K062J131Q14k573j310
1857.7a267P58M47j018L52l9j275J267L148k512k71N02o04Q1N81K601J019j779k264
1852.4b73M56p8k149J514J282j87L42k932J013J608m90r10L906Q65k766j480k387o22
1847.1c288L436J57m87j996J350n13K769J500j965j592O51j352o97J70O94J445M73
$$ plain form
1842.2 755 2172 -228 -534 -320 -2153 -1758 -2488 -4227 -1509 -575 1087 -823 1773 102 -69 1101 -305
1837.2 -305 427 3645 2026 4045 4223 2417 1288 -632 -670 -707 -3762 -1479 -269 -1203 480 835 -636 -1415
1831.9 -1415 506 41 1333 1111 592 1232 -383 -2158 -1171 616 4225 2943 915 2862 4171 2837 374
1827 374 -960 -1520 -816 -587 -778 -85 -1864 -2977 -299 -453 -2856 -1438 3973 -605 -4818 -4285 -1359 1324
1821.7 1324 539 -3008 -1937 749 2314 -790 -745 -179 1403 -2095 -1552 -796 985 2002 108 1343 2186
1816.7 2186 -911 -3312 400 1397 1916 -2664 -2042 3101 1852 2536 -2682 -2117 3058 1523 -1469 71 825
1811.8 825 2954 2786 744 -897 412 -175 489 1844 788 -1505 344 613 2073 464 1614 -598 -1086
1806.8 -1086 -2032 -172 866 -147 -1826 -1739 -1875 -2390 -640 -1858 -5945 -5235 -1746 834 1732 4792 -512
$$ packed form
1842.2G55J417k400l06K14j833L95p30j739K718R34J662j910K596j671j71J170j406
1837.2c05P32L218j619K019J78j806j129j920l8l7l055K283J210r34J683L55j471p79
1831.9a415J921m65J292k22n19O40j615j775R87J787L609j282k028J947J309j334k463
1827C74j334n60P04K29j91O93j779j113K678j54k403J418N411m578m213N33K926K683
1821.7A324p85l547J071K686J565l104M5N66J582l498N43P56J781J017j894J235Q43
1816.7B186l097k401L712R97N19m580O22N143j249O84n218N65N175j535k992J540P54
1811.8H25K129j68k042j641J309n87O64J355j056k293J849K69J460j609J150k212m88
1806.8a086r46J860J038j013j679Q7j36n15J750j218m087P10L489K580Q98L060n304
$$ plain form
1801.8 -512 175 1439 -661 383 -11085 -14621 5723 9790 3357 -1621 3780 5629 2571 -455 -1325 -4543
1797.1 -4543 -39 101 -826 -131 1258 688 3195 5005 1554 -338 -2292 -492 -757 1039 515 1775 1319
1792.2 1319 -1804 309 2277 145 -1431 -1154 1120 -1231 -3332 678 -23 2644 2003 938 -749 1478
1787.5 1478 -861 -1623 -68 175 2396 747 539 357 457 -576 -274 -2261 -1032 -614 -281 132 -1832 -253
1782.2 -253 -1928 -2217 87 -912 -2703 119 37 -91 -841 -100 135 911 -190 47 1928 1678 573 2046
1777 2046 -1851 -1642 -373 348 70 451 1789 1484 -13 -18 -2328 -2922 -2607 -2469 -171 -695 10 1418 -447
1771.4 -447 1246 -569 981 2418 2330 1493 1253 174 1177 1928 2343 1820 1164 2767 1871 -377 364 1409
1766.2 1409 70 2136 694 -3139 -1376 324 566 1067 -1009 -278 -1624 -2657 -1386 -599 -1558 -2386 -4795
$$ packed form
1801.8e12O87J264k100J044j1468l536K0344M067o433m978N401J849l058l026q70l218
1797.1d543M504J40r27O95J389n70K507J810l451j892j954J800k65J796n24J260m56
1792.2A319l123K113J968k132j576K77K274k351k101M010p01K667o41j065j687K227
1787.5A478k339p62J555K43K221j649k08j82J00j033L02j987J229M18L33M13j964J579
1782.2b53j675k89K304r99j791K822q2j28p50P41K35P76j101K37J881k50j105J473
1777B046l897K09J269P21k78L81J338l05j497nk310n94L15J38K298n24P05J408j865
1771.4d47J693j815J550J437q8q37k40j079J003P51M15n23o56J603q96k248P41J045
1766.2A409j339K066j442l833J763J700K42N01k076P31j346j033J271P87r59q28k409
$$ plain form
1761.2 -4795 -1770 -3000 -620 1614 -107 352 2111 827 -610 -983 220 113 765 504 -924 -1445 -241
1756.2 -241 -514 -1363 2367 2748 990 220 898 -1778 -23 60 1965 1689 2288 2879 713 -97 453 -1747 -1104
1750.7 -1104 13 -238 430 -181 -371 -567 -290 1716 1504 721 248 -1830 -1712 -522 -1277 -936 -290 887 981
1745.1 981 335 -831 -831 -1743 1000 -88 -1467 -1756 -1231 -877 32 -273 413 -202 -695 -1126 953 1444 2357 2295
1739.3 2295 -1017 -1387 -411 -1336 -422 1042 723 2 181 2275 2158 2814 1528 262 812 -835 625 198
1734 198 -1174 -2788 479 219 -1035 -910 -1094 -317 445 -1321 31 -1182 -543 291 61 -966 -1775 -3840
1728.8 -3840 -365 449 -297 -548 1599 1824 2560 2273 100 -1162 -312 -1291 1505 605 491 1279 -1437 -2382
1723.5 -2382 2232 1400 1694 -2329 195 -721 238 102 -2661 -3931 -3117 520 2214 1996 2673 2018 -1801 1269
$$ packed form
1761.2d795L025j230K380K234j721M59J759j284j437l73J203j07O52k61j428n21J204
1756.2b41k73q49L730L81j758p70O78k676J755Q3J905k76N99N91k166q10N50k200O43
1750.7a104J117k51O68o11j90j96K77K006k12p83m73k078J18J190p55L41O46J177R4
1745.1I81o46j166%r12K743j088j379k89N25L54R09l05O86o15m93m31K079M91R13o2
1739.3B295l312l70R76r25R14J464l19p21J79K094j17O56j286j266N50j647J460m27
1734A98j372j614L267k60j254J25j84P77P62j766J352j213O39Q34k30j027q09k065
1728.8c840L475Q14p46k51K147K25P36k87k173j262Q50r79K796r00j14P88k716r45
1723.5b382M614q32K94m023K524r16R59j36k763j270Q14L637J694k18O77o55l819L070
$$ plain form
1718.2 1269 127 -405 169 -594 1517 892 -1457 -1561 -292 -568 -737 -6 1582 -440 -197 -625 -40 1086
1713 1086 855 -638 -1474 -700 1462 1170 1059 1173 841 -706 -1144 -222 386 595 480 265 469 1865 -1868
1707.4 -1868 -1866 -1045 -3214 -1257 -308 1155 1222 -1361 -1366 569 312 -639 377 -861 -1716 -701 -1124 -652 352
1701.9 352 -443 57 -477 1082 906 1226 1420 834 -79 -803 1245 1202 1728 1246 1962 -1109 790 -138 767 1632
1696 1632 2528 1053 1071 2192 1336 -403 -60 -1310 -2079 -769 -532 206 698 -1454 -1515 -673 -1127 -3166 -2845
1690.5 -2845 -2376 -2375 -1965 328 -145 -108 1119 2473 1989 2802 4216 2235 1610 561 493 -460 -1717 961 2255
1684.9 2255 3366 -43 -476 -3215 -1004 1198 1443 556 -142 1372 -318 -1025 -457 -651 -690 -1985 520 -817
1679.6 -817 -556 1329 1792 23 -1603 -2259 -1086 -1717 -784 -551 -266 -1857 -18 -1073 -904 2205 992 1790
$$ packed form
1718.2A269j142n32N74p63K111o25k349j04J269k76j69P31J588k022K43m28N85J126
1713A086k31j493q36P74K162k92j11J14l32j547m38R22O08K09j15k15K04J396l733
1707.4a868KQ21k169J957R49J463O7k583nJ935k57r51J016j238q55J015m23M72J004
1701.9C52p95N00n34J559j76L20J94n86r13p24K048m3N26m82P16l071J899r28R05Q65
1696A632Q96j475J8J121q56j739L43j250p69J310K37P38M92k152o1Q42m54k039L21
1690.5b845M69JM10K293m73L7J227J354m84Q13J414j981o25j049o8r53j257K678J294
1684.9B255J111l409m33k739K211K202K45q87o98J514j690p07N68j94l9j295K505j337
1679.6h17K61J885M63j769j626o56J173o31R33K33K85j591J839j055J69L109j213P98
$$ plain form
1674.4 1790 984 -368 -174 -563 -699 -462 1448 2175 334 1318 -140 527 -1260 -2483 -811 -2060 1364
1669.4 1364 845 -482 -1581 1334 918 369 246 -656 -1003 1517 2284 2222 1589 527 -2146 1568 54 -759
1664.2 -759 940 212 40 760 -305 -261 -33 518 -1514 -1254 -2481 -911 -992 -540 -3407 -2036 -4543 -1578
1658.9 -1578 1893 1026 -1163 303 -910 -2069 -561 1839 1402 675 1194 1707 2731 1044 1691 831 2117
1653.9 2117 242 -393 1617 1021 -57 -1179 1267 1619 -12 -1249 -1835 -685 -811 -2217 -702 -1040 -567
1649 -567 620 3383 713 -758 -626 -467 326 -612 -2533 -2129 -1169 962 1749 -206 -704 112 -674 118 -988
1643.4 -988 823 1185 1130 -600 -1959 -1851 -2308 -1801 313 3502 2137 4600 3985 2113 4443 3120 1382
1638.4 1382 -224 107 617 -1980 -1470 -546 -2472 -674 -2648 -2425 -2372 -1724 735 1037 897 333 -2344 61
$$ packed form
1674.4A790q06j352J94l89j36K37J910P27j841R84j458O67j787j223J672j249L424
1669.4A364n19j327j099K915m16n49j23r02l47K520P67o2o33j062k673L714j514q13
1664.2g59J699p28j72P20j065M4K28N51k032K60j227J570q1M52k867J371k507K965
1658.9a578L471q67k189J466j213j159J508K400m37p27N19N13J024j687O47q60J286
1653.9B117j875o35K010n96j078j122K446L52j631j237n86J150j26j406J515l38M73
1649e67J187K763k670j471J32J59P93r38j921M04R60K131P87j955m98Q16p86P92j106
1643.4i88J811L62n5j730j359J08m57N07K114L189j365K463o15j872K330j323j738
1638.4A382j606L31N10k597N10R24j926J798j974K23N3O48K459L02j40n64k677K405
$$ plain form
1633.2 61 -268 -147 624 1134 426 -1482 -927 -1839 -807 1186 215 285 -1995 -1346 -703 -262 -838 -465 -336 -602
1627.3 -602 1096 696 -1794 -1815 173 1505 1096 1295 504 2207 1749 2253 1266 537 -40 682 2058 3552 521
1621.8 521 -1788 -2238 -237 -1318 -1354 -1542 -1356 -1902 -683 -656 442 959 -1310 -1454 8 1325 2577 1329
1616.5 1329 1557 1551 1261 -1104 -570 705 2906 2074 -2214 -496 -224 577 1869 1748 715 -874 404 -963
1611.2 -963 -1808 -2197 -815 217 -638 -2018 20 -2052 -1596 -1558 -503 122 772 1467 1503 459 -544 308 1417
1605.7 1417 2988 1328 -941 -2367 -2161 -1536 -2607 -3319 -2045 280 -951 -36 -386 -703 -1115 -778 -538 -335
1600.4 -335 1060 -552 419 1659 573 739 -860 -1516 -2455 281 -2008 1350 2811 2131 2063 1482 1100 2560
1595.2 2560 1592 20 -515 -573 1002 2488 3134 2561 -228 419 2131 1331 -498 -693 -1973 807 2167 2051
$$ packed form
1633.2F1l29J21P71N10p08j908N55r12J032J993r71P0k280O49O43M41n76L73J29k66
1627.3f02J698m00k490k1J988J332m09J99p91J703m58N04r87p29n77P22J376J494l031
1621.8E21k309m50K001j081l6j88J86n46J219K7J098N17k269j44J462J317J252j248
1616.5A329K28ok90k365N34J275K201q32m288J718K72Q01J292j21j033j589J278j367
1611.2i63q45l89J382J032q55j380K038k072M56L8J055O25O50O95L6j044j003Q52J109
1605.7A417J571j660k269j426K06O25j071p12J274K325j231R15l50l17m12L37K40K03
1600.4c35J395j612R71J240j086J66j599o56r39K736k289L358J461o80o8n81l82J460
1595.2B560r68j572n35n8J575J486O46n73k789O47J712q00j829j95j280K780J360j16
$$ plain form
1589.9 2051 -338 1125 460 -1675 -783 173 195 -648 1410 2172 -284 11 -495 -580 -1184 -3674 -2586 -764
1584.6 -764 -568 23 2135 1337 -1599 -1319 -2019 -978 -1080 -777 -1536 291 -2521 -444 2494 301 1544 -455
1579.4 -455 -285 -1001 -2357 -480 1812 1357 -222 -1278 363 153 -263 2127 1916 -767 -304 399 -2899 -544
1574.1 -544 -1679 -2249 662 -10 -759 -184 504 267 81 -94 -1133 -2612 -784 954 1465 1604 170 319
1568.9 319 -335 1027 1597 387 -153 -504 146 548 1584 1335 628 1021 2355 3487 2564 2879 258 -11 -913
1563.3 -913 -1286 -1829 -3314 -3659 -1224 -708 -141 764 1565 1813 1018 1348 1676 -213 -348 -1416 -1461 -958 -179 72
1557.5 72 609 -658 -2184 -2616 -1447 1297 2431 221 589 -1286 -507 390 235 362 189 -836 2455 1885
1552.2 1885 -723 -2721 -956 -105 30 -745 -1003 426 -182 -256 -1392 -1451 -419 -2277 -1324 -752 265 1321
$$ packed form
1589.9B051k389J463o65k135Q92R56K2q43K058P62k456K95n06q5o04k490J088J822
1584.6g64J96N91K112p98k936K80p00J041j02L03p59J827k812K077K938k193J243j999
1579.4d55J70p16j356J877K292m55j579j056J641k10m16K390k11k683M63P03l298K355
1574.1e44j135n70K911o72p49N75O88k37j86j75j039j479J828J738N11J39j434J49
1568.9C19o54J362N70j210n40l51O50M02J036k49p07L93J334J132r23L15k621k69r02
1563.3i13l73n43j485l45K435N16N67R05Q01K48p95L30L28j889j35j068m5N03P79K51
1557.5G2N37j267j526m32J169K744J134k210L68j875P79Q97j55J27j73j025L291n70
1552.2A885k608j998J765Q51J35p75k58J429o08p4j136n9J032j858R53N72J017J056
$$ plain form
1546.9 1321 1288 1854 -322 -1822 531 645 312 1025 1091 881 861 1734 2035 2481 1719 -325 1187 359 -732
1541.4 -732 -1285 328 400 1924 -296 -2212 -1355 -794 512 38 691 517 -1396 565 601 -1187 -1517 -1633 39
1535.8 39 1678 488 712 -1293 343 791 1351 509 -520 685 2056 438 -1212 315 -1749 -560 -920
1530.9 -920 -1140 427 1273 1252 -632 109 -448 -1117 -3246 -735 -778 988 -1096 1990 269 -904 183 -786
1525.6 -786 155 -136 -2056 -561 -1362 -1084 -432 230 -541 724 787 273 429 -1217 190 972 -458 488 641
1520.1 641 52 -254 557 2304 1971 -363 -31 -379 828 645 784 -54 312 1341 300 -3052 324 -136
1514.8 -136 736 644 977 -1458 -1554 -999 -279 1064 975 1454 2016 -581 -1253 -2091 -556 -1738 -840 -576 98 758
1508.9 758 -950 909 582 -1161 -22 -436 -1951 -169 584 -312 428 19 519 -723 -2109 -719 -786 -1798
$$ packed form
1546.9A321l3N66k176j500K353J14l33P13O6k10k0Q73L01M46p62k044J512q28j091
1541.4g32n53J613P2J524k220j916Q57N61J306m74O53j74j913J961L6j788l30j16J672
1535.8C9J639j190K24k005J636M48N60q42j029J205J371j618j650J527k064J189l60
1530.9i20k20J567Q46k1j884P41n57o69k129K511m3J766k084L086j721j173J087r69
1525.6g86R41k91j920J495q01K78O52O62p71J265O3n14J56j646J407P82j430R46J53
1520.1F41n89l06Q11J747l33k334L32l48J207j83J39q38L66J029j041l352L376m60
1514.8a36Q72r2L33k435r6N55P20J343q9M79N62k597o72q38J535j182Q98K64O74O60
1508.9G58j708J859l27j743J139m14j515J782P53q96P40m09N00j242j386J390o7j012
$$ plain form
1503.7 -1798 1805 2244 2045 -1541 -1412 -1792 -654 -247 135 -1044 -62 741 810 1979 2943 2856 1658 3132 1982
1498.1 1982 330 -2625 -1764 91 1224 1913 1482 -1152 1044 569 531 -1535 -1664 -403 -259 -367 -1072 -520
1492.9 -520 663 151 225 2065 884 -575 807 2058 2048 2001 2409 2538 -603 -1745 -2036 -1258 -1242 -181 -1373
1487.3 -1373 -2586 -404 -133 1282 1059 -1560 -1387 -432 -595 496 1318 518 -709 318 -879 -1708 -1545 -267
1482.1 -267 -68 -57 -680 -178 -2349 -2158 -2569 -1396 6 1480 287 -386 -891 -172 1865 312 1473 524
1476.8 524 -496 -2446 -1357 -139 1702 2444 1261 2085 173 1217 3377 864 309 1812 1495 -1926 -2355
1471.8 -2355 62 -237 -1172 -775 -1651 -1896 -1659 -796 110 -1258 371 1986 -500 -756 -2453 -46 -164 -686
1466.6 -686 1763 866 785 -1496 265 1016 648 1786 730 430 1136 -1259 -185 209 183 20 105 291 -723
$$ packed form
1503.7a798L603M39j99l586J29l80J138M07L82j179R82Q03O9J169R64q7j198J474j150
1498.1A982j652k955Q61J855J133O89m31k634K196m75l8k066j29J261J44j08p05N52
1492.9e20J183n12P4J840j181j459J382J251j0m7M08J29l141j142k91P78J6J061j192
1487.3a373j213K182K71J415k23k619J73R55j63J091Q22q00j227J027j197q29J63J278
1482.1b67J99J1o23N02k171J91m11J173J402J474j193o73n05P19K037j553J161r49
1476.8E24j020j950J089J218J841P42j183Q24j912J044K160k513n55J503l17l421m29
1471.8b355K417k99r35L97q76k45K37Q63R06j368J629J615k486k56j697K407j18n22
1466.6f86K449q97q1k281J761P51l68J138j056l00P06k395J074L94k6j63Q5J86j014
$$ plain form
1461 -723 -361 -606 1721 1105 -158 804 -918 1743 1021 2125 650 -1570 -1220 510 1193 -271 1322 2027
1455.7 2027 1068 -1414 -3096 -1201 925 1 1558 -489 -206 1166 2241 846 -1636 -479 174 122 2207
1450.8 2207 1825 -400 -2029 -840 770 -2232 -2077 -378 -700 -2225 -629 30 -1611 -2664 -535 -1205 -792
1445.8 -792 -981 -3 -839 -636 1374 1380 2015 -847 -657 1019 2788 1871 546 -2034 1704 -199 698 -1699
1440.5 -1699 -332 -310 397 -545 34 -1736 -147 900 872 752 1834 227 -580 -974 -1481 -59 535 -1630
1435.3 -1630 -344 -1581 -860 752 1988 498 2752 63 -569 -411 1777 154 952 2604 1549 243
1430.6 243 189 547 -1756 -1767 292 -973 -449 -621 1019 2629 1820 241 171 -1608 -977 -600 -1293 -1689 -395
1425.1 -395 -1340 -1333 304 670 -88 -1392 -637 130 1027 0 -2619 -889 -1882 725 603 -127 -1219 -1353 -301
$$ packed form
1461g23L62k45K327o16j263R62j722K661p22J104j475k220L50J730O83j464J593P05
1455.7B027r59k482j682J895K126r24J557k047K83J372J075j395k482J157O53n2K085
1450.8B207l82k225j629J189J610l002J55J699l22j525J596O59j641j053K129o70M13
1445.8g92j89R78q36K03K010OO35k862J90J676J769r17j325k580L738j903Q97k397
1440.5a699J367K2P07r42N79j770J589J047k8j20J082j607q07l94n07J422N94k165
1435.3a630J286j237P21J612J236j490K254k689o32J58K188j623P98J652j055j306
1430.6B43n4L58k303j1K059j265N24j72J640J610q09j579p0j779O31L77o93l96J294
1425.1c95r45PJ637L66p58j304P55P67Q97j027k619J730r93K607j22p30j092j34J052
$$ plain form
1419.5 -301 1987 2774 1367 279 1345 1070 643 594 897 971 2355 -631 349 -1329 -200 -1470 -366 846
1414.2 846 -646 -1305 -705 -2180 412 1136 1221 533 -1659 1656 384 -1554 -1837 -1443 -1761 -1119 -153 1832
1409 1832 737 377 1305 -1069 647 994 -477 1021 1210 1533 1840 -268 67 -166 812 70 716 1632 710
1403.4 710 -1713 -848 -617 -669 391 862 -1035 -2259 -525 -1352 -1662 892 1086 825 868 216 -984 838 279
1397.9 279 962 822 1796 511 -366 -788 1340 590 -1662 -109 -738 559 -2962 -2518 -1766 -496 1209 58
1392.6 58 649 -648 -1522 -715 -1405 -952 1077 -77 235 435 210 -159 -432 1079 1565 1081 1047 1202 -680 -2553
1386.8 -2553 -998 1189 557 -1833 -67 -1020 520 11 -472 326 -937 -205 -763 83 -368 -163 261 1192
1381.5 1192 1795 1953 81 1838 2549 1523 386 -54 98 523 -503 345 2938 1332 -671 -47 968
$$ packed form
1419.5c01K288P87j407j088J066k75m27m9L03P4J384k986R80j678J129j270J104J212
1414.2H46j492o59O00j475K592P24Q5o88k192L315j272j938k83L94l18O42R66J985
1409A832j095l60R28k374J716L47j471J498J89L23L07k108L35k33R78p42O46R16r22
1403.4G10k423Q65K31n2J060M71j897j224J734q27l10K554J94k61M3o52j200J822n59
1397.9B79O83j40R74j285q77m22K128p50k252J553o29J297l521M44P52J270J705j151
1392.6E8N91j297q74Q07o90M53K029j154L12K00k25l69k73J511M86m84l4J55j882j873
1386.8b553J555K187o32k390J766r53J540n09m83P98j263P32n58Q46m51K05M24R31
1381.5A192O03J58j872J757P11j026j137m40J52M25j026Q48K593j606k003O24J015
$$ plain form
1376.5 968 942 -994 -2260 -2113 -1425 -1630 -306 -428 -2797 -1090 -2261 -2453 -1106 -566 -560 151 971 315 -737
1371 -737 -1779 -568 762 2363 2284 -1207 654 896 2057 1879 -829 -1882 -236 1093 2515 1624 2048 1212
1365.7 1212 -1286 966 -174 -195 4492 4127 446 -355 -834 -734 433 -1654 -288 -778 -1250 -324 -98 887
1360.5 887 92 -396 508 -169 -2247 -2195 1075 -924 -476 -1616 -1166 -993 -927 -1360 -905 -1052 -2376 -251 544
1354.9 544 -709 534 2327 -34 2708 784 -440 2263 829 223 -453 -1303 -128 958 -873 -1037 -688
1349.9 -688 -600 148 344 497 1411 244 1132 1418 846 478 756 895 895 -11 827 1637 -525 -228 -870 -1153 564
1343.8 564 -2188 -1633 191 639 -527 816 -1310 -2489 -4122 -3058 -3531 -1623 -1895 -1201 -390 -361 99 -234
1338.5 -234 -701 -478 -1342 371 2045 3554 3229 2209 1303 -338 1198 2651 2013 2315 1899 -374 -1801 -374
$$ packed form
1376.5I68k6j936j266J47O88k05J324j22k369J707j171j92J347N40OP11Q20o56j052
1371g37j042J211J330J601p9l491J861K42J161j78k708j053J646J329J422q91M24q36
1365.7A212k498K252j140k1M687l65l681q01m79J00J167k087J366m90m72R26K26R85
1360.5H87p95m88R04o77k078N2L270j999M48j140M50J73O6m33M55j47j324K125P95
1354.9E44j253J243J793k361K742j924j224K703j434o06o76q50J175J086j831j64L49
1349.9f88Q8P48J96J53R14j167Q88K86n72l68K78J39%r06Q38Q10k162K97o42k83J717
1343.8E64k752N55J824M48j166J343k126j179j633J064m73J908k72O94Q11K9M60l33
1338.5b34m67K23q64J713J674J509l25j020r06j641J536J453o38L02m16k273j427J427
$$ plain form
1333.3 -374 164 1225 323 -338 -1852 -1326 -2079 -618 -586 155 790 156 -909 236 860 3004 3255 2705 2569
1327.7 2569 2411 -202 64 -1457 -2445 -2670 -1159 -2897 -611 -1314 -123 705 -526 -2000 35 -585 2115
1322.8 2115 1205 2285 419 1451 1324 39 -3600 -981 244 -399 -1228 -1003 -1178 -46 590 1744 1192
1317.8 1192 1369 349 1129 2471 1015 -2913 -138 -170 -52 -2369 -1377 -1435 590 -1647 -2742 -2765 -557 824
1312.5 824 -753 337 2097 407 -594 1526 2330 3744 3115 1497 648 750 304 -666 1463 1812 497
1307.6 497 -1192 1280 -606 2845 2967 1370 -116 1135 754 49 -1163 125 -896 -393 -930 -623 -270
1302.6 -270 -1061 -278 -1545 -2342 -626 -652 -1476 -3749 -2380 -2807 -983 -1217 -534 -1862 -241 -2408 -895 -2141
1297.3 -2141 -299 676 39 1862 1255 1276 1166 725 1993 2600 2291 1222 -535 1457 867 -1322 -1992 -377
$$ packed form
1333.3c74N38J061r02o61j514N26p53J461L2P41O35o34j065J145O24K144K51n50j36
1327.7B569j58k613K66j521r88k25J511j738K286p03J191Q28j231j474K035o20K700
1322.8B115r10J080j866J032j27j285l639K619J225o43q29K25j75J132O36J154n52
1317.8A192J77j020P80J342j456l928K775l2J18k317R92n8K025k237j095k3K208J381
1312.5H24j577J090J760j690j001K120Q04J414o29j618q49J02m46r70K129L49j315
1307.6D97j689K472j886L451J22j597j486J251l81p05j212J288j021N03n37L07L53
1302.6b70p91P83j267p97J716k6q24k273J369m27J824k34O83j328J621k167J513j246
1297.3b141J842R75o37J823o07K1j10m41J268O07l09j069j757J992n90k189o70J615
$$ plain form
1292.1 -377 -493 -878 1706 930 2082 -907 -316 1122 1513 901 -846 -138 1660 -840 -740 -1294 556 -82
1286.8 -82 -2135 -2355 -1417 -2354 -1890 -2878 -1153 -1834 -1291 -568 8 -834 1181 1061 1819 315 978 2098 3359
1281.2 3359 2448 3840 3002 2676 2288 530 -1458 758 -65 -1174 -1071 -967 -403 1181 674 2542 1208 -445
1276 -445 -974 -2655 -3637 -2089 374 -562 -2902 -3278 -2672 671 1625 532 -15 79 -301 386 440 363 505 77
1270.1 77 -258 15 947 602 1394 -1216 177 401 718 248 -319 653 -20 75 -152 -738 -1024 296 -746 -650
1264.3 -650 -43 1551 394 -1427 -392 1115 406 -175 -491 2953 473 -541 810 -990 -1271 2404 2518
1259.3 2518 878 -324 -1742 299 322 -307 -924 -2067 332 2106 -349 -1389 -550 -497 -1346 -575 1245 1590
1254.1 1590 1519 2004 230 1029 1281 -36 -2182 -985 -1858 -1859 -323 -32 2097 2228 1695 -533 585 448 -1263
$$ packed form
1292.1c77j16l85K584p76J152k989N91J438L91o12j747P08J798k500J00n54J850o38
1286.8h2k053k20R38r37M64r88J725o81N43P23N76q42K015j20P58j504O63J120J261
1281.2C359r11J392q38l26l88j758j988K216q23j109J03J04N64J584n07J868j334j653
1276d45n29j681r82J548K463r36k340l76O06L343R54j093n47R4l80O87N4p7J42m28
1270.1G7l35K73R32l45P92k610J393K24L17m70n67R72o73R5k27n86k86J320j042R6
1264.3f50O07J594j157j821J035J507p09n81l16L444k480j014J351j800k81L675J14
1259.3B518j640j202j418K041K3o29o17j143K399J774k455j040Q39N3q49P71J820L45
1254.1A590p1M85j774P99K52j317k146J197q73jJ536K91K129J31n33k228J118j37j711
$$ plain form
1248.5 -1263 -2490 -2434 -305 78 -2729 -1670 -1663 -1145 290 469 963 264 -863 -1640 -1 -103 -2274 20
1243.2 20 -345 1537 495 -596 -502 -297 2125 2729 1675 193 575 -697 -1006 1716 1563 880 2513 2705
1238 2705 777 436 -1534 -2953 -1355 -475 -1527 129 -334 440 262 -251 1158 1703 -419 -1306 -544 998
1232.7 998 -1703 -173 2142 2366 258 -773 -464 -420 -2138 -1500 -2806 -478 1912 1418 2489 2412 990 1543
1227.5 1543 -785 216 991 1671 -702 -2859 -2437 936 458 -1441 206 571 357 -658 -592 216 -269 715
1222.2 715 992 2860 1571 228 -568 -509 -1582 -2070 -566 -74 1661 -1512 -211 -671 -1692 -3451 -2645 -942
1216.9 -942 475 -280 1732 3211 1377 -1019 -912 516 466 -356 434 -291 -245 1102 797 873 -327 718 421
1211.4 421 1906 1181 -550 100 -1017 593 2248 1056 944 1336 -269 -1144 -261 -2646 39 691 777 -1914
$$ packed form
1248.5a263j227N6K129L83k807J059PN18J435J79M94o99j127p77J639j02k171K294
1243.2B0l65J882j042j091R4K05K422O04j054j482L82j272l09K722j53o83J633J92
1238B705j928l41j970j419J598Q80j052J656m63P74j78n13J409N45k122q87P62J542
1232.7I98k701J530K315K24k108j031L09M4j718O38j306K328K390m94J071p7j422N53
1227.5A543k328J001P75O80k373k157M22L373m78j899J647L65k14j015O6Q08m85R84
1222.2G15K77J868j289j343p96N9j073m88J504M92J735l173J301m60j021j759Q06J703
1216.9i42J417p55K012J479j834k396J07J428n0q22P90p25M6J347l05P6j200J045k97
1211.4D21J485p25j731O50j117J610J655j192j12L92j605q75Q83k385K685O52Q6k691
$$ plain form
1206.1 -1914 -1682 790 1650 -258 -657 649 -1071 -1243 -1661 -1635 -1314 -461 -1140 -1984 -768 -471 313 -464 1716
1200.6 1716 2090 -838 775 1298 -466 272 -590 -330 -13 -233 634 76 1794 2568 -590 131 -2035 375
1195.3 375 1036 -2663 -1897 474 -1005 132 591 519 -102 40 223 -471 -859 311 515 481 -1011 -1643 -1616 566
1189.5 566 -304 1236 -180 -1540 -1982 246 3014 3779 -1084 -1498 519 483 898 1184 2337 -462 -1463 -1018
1184.2 -1018 213 545 -506 79 2261 1890 1429 824 61 -1467 -13 751 -3251 -2269 575 1277 -74 -788
1178.9 -788 -2945 -917 -330 233 1032 2184 204 870 770 780 -1206 -1105 -1292 -291 64 -356 510 1054 715
1173.4 715 -672 619 449 -203 -1413 -2337 116 -932 -285 590 -1477 -863 -779 1349 -109 548 1520 665
1168.1 665 1774 1908 929 -512 198 -732 -646 -1497 -2603 -983 1022 654 -253 1661 170 984 -569 -623 -986
$$ packed form
1206.1a914K32K472Q60j908l99J306j720j72m18K6L21Q53o79q44J216K97P84p77K180
1200.6A716L74k928J613N23j764P38q62K60L17k20Q67n58J718P74l158P21k166K410
1195.3C75O61l699P66K371j479J137M59p2o21J42J83o94l88J170K04l4j492o32K7K182
1189.5E66q70J540j416j360m42K228K768P65m863m14K017l6M15K86J153k799j001M45
1184.2a018J231L32j051N85K182l71m61o05p63j528J454P64m002R82K844P02j351p14
1178.9g88k157K028N87N63P99J152j980O66j00J0j986J01j87J001L55m20Q66N44l39
1173.4G15j387J291j70o52j210r24K453j048O47Q75k067O14Q4K128j458O57R72q55
1168.1F65J109J34r79j441P10r30Q6q51j106J620K005l68r07J914j491Q14j553n4l63
$$ plain form
1162.6 -986 -306 133 1408 2280 2468 -331 -1487 -2549 -2045 -2256 19 1113 908 1017 1088 -167 232 294 374
1157 374 -162 -889 -555 -949 -1799 -983 -446 1570 -760 -1229 -968 -905 -61 57 2216 -405 -166 774 -856 -917
1151.2 -917 -10 -1363 -100 -490 -1536 -1271 -770 -3 -247 -1803 -1595 -1255 -1507 -777 556 1275 1455 72 788
1145.6 788 472 -387 -2856 -3060 -2522 632 -415 -245 -1073 -616 -199 274 2572 2203 -427 -213 1031 1936 3807
1140.1 3807 1895 3413 2288 712 1334 -317 -2531 -2821 -383 -2512 -4616 -3780 -3501 -1627 -3620 -3321 -1215
1135.1 -1215 141 792 -1352 -2060 -1954 825 1958 994 -1219 -2009 104 -228 1754 1480 2401 1542 -781 -2227
1129.8 -2227 -1278 1291 -443 -1671 -496 -2224 -1205 -779 391 -900 -2552 -2789 -1297 -1457 -1151 -1465 -827
1124.9 -827 -2126 -3578 -1934 -1930 -3205 -1970 -1036 -2777 -3436 -3209 -2136 -4381 -4561 -2591 -2989 -992 -2299 -1818
$$ packed form
1162.6i86O80M39J275Q72J88k799j156j062N04k11K275J094k05J09P1j255L99O2Q0
1157C74n36p27L34l94q50Q16N37K016k330m69K61O3Q44J18K159k621K39R40j630o1
1151.2i17R07j353J263l90j046K65N01P67k44j556K08L40k52P30J333P19J80j383P16
1145.6G88l16q59k469k04N38L154j047J70q28M57M17M73K298l69k630K14J244R05J871
1140.1C807j912J518j125j576O22j651k214k90K438k129k104Q36K79J874j993K99K106
1135.1a215J356O51k144p08J06K779J133r64k213p90K113l32J982k74R21q59k323j446
1129.8b227R49K569j734j228J175j728J019M26J170j291j652k37J492j60L06l14O38
1124.9h27j299j452J644Mj275J235R34j741o59K27J073k245j80J970l98J997j307M81
$$ plain form
1119.6 -1818 -637 1180 1339 4672 4136 5675 4753 7980 8320 7035 11150 12467 12764 12885 11490 14364 16274
1114.6 16274 17465 17304 20197 21000 21251 25114 24663 26358 26538 31053 31677 33976 34938 36773 37926 39866 41755
1109.7 41755 45349 48204 51237 52083 52954 58625 60103 60658 64153 67359 71686 72505 75555 78878 81469 85886
1105 85886 88559 92528 98858 104182 110032 115551 120795 128575 137887 145589 154202 162894 173316 184704 193803
1100.6 193803 206777 218725 230937 247507 263788 282236 302555 322814 346516 372046 399062 430287
1097.1 430287 464119 501599 542711 590771 638835 694589 755821 824127 900199 983574 1074809 1172723
1093.6 1172723 1279618 1394741 1512462 1637191 1758936 1878249 1986997 2076166 2140409 2174331
1090.7 2174331 2178467 2152113 2095665 2013493 1913282 1802337 1684899 1565173 1450708 1337401 1231515
$$ packed form
1119.6a818J181J817J59L333n36J539r22L227L40j285M115J317K97J21j395K874J910
1114.6A6274J191j61K893Q03K51L863m51J695J80M515O24K299R62J835J153J940J889
1109.7D1755L594K855L033Q46Q71N671J478N55L495L206M327Q19L050L323K591M417
1105H5886K673L969O330N324N850N519N244P780R312P702Q613Q692J0422J1388R099
1100.6A93803J2974J1948J2212J6570J6281J8448K0319K0259K3702K5530K7016L1225
1097.1D30287L3832L7480M1112M8060M8064N5754O1232O8306P6072Q3375R1235R7914
1093.6A172723J06895J15123J17721J24729J21745J19313J08748Q9169O4243L3922
1090.7B174331M136k6354n6448q2172j00211j10945j17438j19726j14465j13307j05886
$$ plain form
1087.5 1231515 1136464 1048010 966620 890634 822661 761834 704253 653344 610477 566728 528977 492971
1083.9 492971 460753 434219 406540 381670 358570 339212 320746 304169 289763 272869 256952 244159
1080.4 244159 231133 219740 212595 201070 191172 181397 171261 160131 152930 145127 137888 130448 126507 119703
1076.3 119703 113953 105841 100851 95319 89819 84934 81274 76420 69306 66376 64185 61545 57958 52491 49993
1072 49993 47307 47038 42849 41885 38746 35682 34413 33383 31174 30769 27476 25152 24671 22146 20512 20062 18711
1067 18711 16937 14973 15321 14471 13582 10437 9621 8526 8597 7010 6471 5126 5457 5240 4679 2386 3296 4184 2321
1061.4 2321 2361 102 -1158 -1940 -2185 -1498 -2066 -2154 -3538 -2919 -2685 -2607 -3316 -3516 -3512 -2793 -348 -2749 -3074 -1922
1055.6 -1922 -2175 -1573 -1576 -3325 -1974 -1998 -4222 -3246 -3225 696 1235 -674 -990 642 -113 1476 3053 588 1839
$$ packed form
1087.5A231515r5051q8454q1390p5986o7973o0827n7581n0909m2867m3749l7751l6006
1083.9D92971l2218k6534k7679k4870k3100j9358j8466j6577j4406j6894j5917j2793
1080.4B44159j3026j1393p145j1525r898r775j0136j1130p201p803p239p440l941o804
1076.3A19703n750q112m990n532n500m885l660m854p114k930k191k640l587n467k498
1072D9993k686k69m189r64l139l064j269j030k209m05l293k324m81k525j634m50j351
1067A8711j774j964L48q50q89l145q16j095P1j587n39j345L31k17n61k293R10Q88j863
1061.4B321M0k259j260p82k45O87n68q8j384O19K34P8p09k00MP19K445k401l25J152
1055.6a922k53O02lj749J351k4k224R76K1L921N39j909l16J632p55J589J577k465J251
$$ plain form
1050 1839 2873 1375 -692 -1636 -8 -211 -888 -278 1470 -912 -2490 -2686 -1744 -698 -2034 -1983 -942 68
1044.8 68 -714 2069 2156 2869 3945 4211 47 -240 1963 804 182 -2990 -2864 -2584 -1740 -2244 -1895 -1449 -2793
1039.2 -2793 -1736 -844 -1798 -1442 1485 1947 3889 3291 3065 2550 3823 4980 4461 2996 805 1028 -942 -2187
1034 -2187 -2796 -2635 -1642 -1950 -1014 -1712 -2163 -1046 -1680 -286 606 -562 838 -31 -705 -829 -1832 -1135 -1254
1028.4 -1254 -241 -828 -915 -1446 -1885 -468 1348 1286 2063 -139 -1180 -707 1326 -1325 -2238 -1760 -579 -689
1023.1 -689 -573 1406 234 -935 25 -1108 316 -172 805 -656 181 -1251 -204 899 1613 -1753 -2416
1018.2 -2416 -544 -672 -1176 347 -442 -1078 -341 433 1695 397 -671 1191 -1043 -1032 -1607 -1375 -2011 -1511
1012.9 -1511 523 -488 428 288 2824 2834 2389 -1276 -777 -1814 -2287 -64 2537 3189 973 -933 -568 702
$$ packed form
1050A839J034j498k067r44J628k03o77O10J748k382j578j96R42J046j336N1J041J010
1044.8F8p82K783Q7P13J076K66m164k87K203j159o22l172J26K80Q44n04L49M46j344
1039.2b793J057Q92r54L56K927M62J942n98k26n15J273J157n19j465k191K23j970j245
1034b187o09J61R93l08R36o98m51J117o34J394Q92j168J400q69o74j24j003O97j19
1028.4a254J013n87q7n31m39J417J816o2P77k202j041M73K033k651r13M78J181j10
1023.1f89J16J979j172j169R60j133J424m88R77j461Q37j432J047J103P14l366o63
1018.2b416J872j28n04J523p89o36P37P74J262j298j068J862k234J1n75K32o36N00
1012.9a511K034j011R16j40K536J0m45l665M99j037m73K223K601O52k216j906L65J270
$$ plain form
1007.7 702 1068 -307 -87 -1075 268 602 -195 -664 -22 885 -577 -977 -2 -930 -2167 -1789 -114 2225 2744
1002.1 2744 3561 -411 -792 236 1153 548 -563 -2451 -869 250 -835 -1011 582 737 -233 62 832 1143
996.8 1143 339 1282 1744 784 -2250 -2319 1078 1051 -3518 -2536 1677 42 -1639 -1660 -1093 -515 269 1400 -44
991.3 -44 -2263 -2269 -535 -1036 -2223 -2825 -449 2413 440 544 -442 -2264 -928 1041 683 -718 -1677 960
986 960 2585 2476 2026 3706 1734 -265 -247 856 1080 -1604 1017 653 -1196 -3042 -1922 1736 1564 100
980.8 100 -1583 -8 570 1609 1780 1700 817 -834 -1889 -1562 -1563 -912 -940 -313 -1999 183 373 -106 -930 -668
974.9 -668 -68 802 1500 -240 1002 1179 1059 -865 -2652 -530 -2049 -1271 -362 -428 680 265 -3054 -3088 -3823
969.4 -3823 -1225 -826 2804 1607 -882 1451 3848 8963 7371 3477 1877 2256 4048 544 -382 955
$$ packed form
1007.7G02L66j375K20r88J343L34p97m69O42R07j462m00R75r28j237L78J675K339N19
1002.1B744Q17l972l81J028R17o05j111j888J582J119j085j76J593J55r70K95P70L11
996.8A143q04R43M62r60l034o9L397k7m569R82M213j635j681k1N67N78P84J131j444
991.3d4k219oJ734n01j187o02K376K862j973J04r86j822J336J969l58j401r59K637
986I60J625j09m50J680j972j999J8J103K24k684K621l64j849j846J120L658j72j464
980.8A00j683J575N78J039J71q0q83j651j055L27jO51k8O27j686K182J90m79q24K62
974.9f68O00Q70O98j740J242J77j20j924j787K122j519P78R09o6J108m15l319l4p35
969.4c823K598L99L630j197k489K333K397N115j592l894j600L79J792l504r26J337
$$ plain form
964.7 955 927 -1012 -556 -1067 971 1707 1851 1815 1485 331 -1974 -3117 -1585 -2737 -643 -3235 -1085 1147
959.4 1147 691 -225 925 -614 672 -2283 -4718 -2020 1494 915 -1740 -2322 680 -71 -1616 -676 -542
954.5 -542 -134 -355 258 842 1616 -1240 -801 -504 -815 -715 -110 1375 -7 289 -952 900 -308 -159 -887
948.9 -887 -495 -1598 -768 -792 859 2512 1028 -780 -1717 979 75 -1216 -429 270 1405 -1549 490 2237
943.6 2237 2722 1144 622 -889 -2434 -2468 -2589 -734 -616 970 1351 307 -75 94 447 -1820 589 -618
938.4 -618 617 551 172 -1392 72 -615 11 374 1347 2320 656 1058 1737 1761 69 1166 -87 -2186 130
932.8 130 431 1066 411 2127 -188 -541 -1681 -605 -607 -734 -706 522 -414 -1275 -916 172 1117 -801 1049
927.3 1049 2004 632 -1914 -1528 1360 1105 1879 2267 1341 2276 884 280 978 -32 -1211 -365 661 362
$$ packed form
964.7I55k8j939M56n11K038P36J44l6l30j154k305j143J532j152K094k592K150K232
959.4A147m56r16J150j539J286k955k435K698L514n79k655n82L002p51j545R40J34
954.5e42M08k21O13N84P74k856M39K97l11J00O05J485j382K96j241J852j208J49p28
948.9h87L92j103Q30k4J651J653j484j808r37K696r04j291P87O99J135k954K039J747
943.6B237M85j578n22j511j545l4j21J855J18J586L81j044l82J69L53k267K409j207
938.4f18J235o6l79j564J464o87O26L63R73R73j664M02O79K4j692J097j253k099K316
932.8A30L01O35o55J716k315l53j140J076kj27K8J228r36q61L59J088R45j918J850
927.3A049R55j372k546L86K888k55P74L88r26R35j392o04O98j010j179Q46J026k99
$$ plain form
922 362 -1276 -2112 -2678 -1444 -466 -1311 -2124 -3503 -2349 -2120 -2004 -2402 1423 -237 -641 139 -116 -1543 -440
916.5 -440 -504 1613 1304 2398 1012 23 622 163 -285 -866 123 1113 -43 2363 1897 3074 2559 2212 882
910.9 882 -462 -97 -141 412 -109 -1345 -578 85 565 360 -159 323 -31 1052 79 -1603 -772 -921 543 2772
905.1 2772 2667 920 1497 764 -962 -2894 -2841 -2991 -539 -522 379 -1826 -1950 111 344 -446 -1840 318 316
899.5 316 -243 277 718 610 1401 1161 -414 -231 472 2059 1864 508 540 789 -1288 251 -368 546 -1116
894 -1116 -1650 -2118 -1870 -1485 -626 -1723 -1951 -645 1560 909 1213 1613 -644 -322 -1417 486 1075 31 237
888.4 237 243 -1276 -1262 480 1415 1142 -835 -677 -757 2092 2014 2585 1698 1249 -1986 -24 -1149 -4327 -3545 -1568
882.6 -1568 -37 1175 1671 712 1360 1056 1842 1420 1785 2149 1030 17 -68 -1011 461 296 2365 454 -1328
$$ packed form
922C62j638q36n66J234R78q45q13j379J154K29J16l98L825j660m04P80k55j427J103
916.5d40o4K117l09J094j386r89N99m59m48n81R89R90j156K406m66J177n15l47j330
910.9H82j344L65m4N53n21j236P67O63M80k05n19M82l54J083r73j682Q31j49J464K229
905.1B772j05j747N77p33j726j932N3j50K452J7R01k205j24K061K33p90j394K158k
899.5C16n59N20M41j08P91k40j575J83P03J587j95j356L2K49k077J539o19R14j662
894a116n34m68K48L85Q59j097k28J306K205o51L04M00k257L22j095J903N89j044K06
888.4B37Oj519J4J742R35k73j977J58q0K849p8N71q87m49l235J962j125l178P82J977
882.6a568J531J212M96r59O48l04P86m22L65L64j119j013q5r43J472j65K069j911j782
$$ plain form
877 -1328 -178 -1413 814 -1244 -1228 287 1315 -567 260 -450 -783 -1205 -1049 -2476 -51 249 999 1767 495
871.4 495 -1622 299 -484 -463 6 -833 -1792 -1009 -1696 -1330 -1658 -1464 -1143 -1617 -1338 2311 2495 1483 517 284
865.6 284 -217 1661 -1491 -1914 -111 67 -1451 1696 447 1123 -360 -84 2126 2486 2985 82 -1612 328
860.3 328 756 876 533 597 -871 -591 -20 595 495 2286 1721 774 1922 189 148 815 779 1740 -959 -834
854.5 -834 -142 -2467 -2715 -847 -318 -1091 -1102 -1027 -2328 -1515 238 1640 -1319 -582 1529 609 1632 1910 -254
848.9 -254 962 2182 -483 -3159 -1806 -1380 -1027 568 615 1030 -328 -818 291 -471 -1404 634 -518 -50
843.7 -50 705 -502 257 -989 -1829 -1424 -912 -1474 -747 -1279 698 733 1902 -359 -348 -476 2920 1942 3601 826
837.8 826 1345 513 294 -1408 -210 -595 -1426 433 1911 940 1189 70 269 -1430 815 -1905 -2839 -1135
$$ packed form
877a328J150j235K227k058J6J515J028j882Q27p10l33m22J56j427K425L00P50P68j272
871.4D95k117J921p83K1M69q39r59P83o87L66l28J94L21m74K79L649J84j012r66k33
865.6B84n01J878l152m23J803J78j518L147j249O76j483K76K210L60M99k903j694J940
860.3C28M28J20l43O4j468K80N71O15j00J791n65r47J148j733m1O67l6R61k699J25
854.5h34O92k325k48J868N29p73j1P5j301Q13J753J402k959P37K111r20J023K78k164
848.9b54J216J220k665k676J353M26L53J595M7M15j358m90J109p62r33K038j152M68
843.7e0P55j207P59j246q40M05N12n62P27n32J977L5J169k261J1j28L396r78J659k775
837.8H26N19q32k19j702J198l85q31J859J478r71K49j119J99j699K245k720r34J704
$$ plain form
832.6 -1135 -1275 -1816 -2816 -3496 -1788 279 1640 488 515 -1502 -813 309 1107 546 1673 -165 167 709
827.3 709 -907 -1401 -491 -1307 -174 -765 -1707 -1266 -3338 -2163 -1303 -2281 -3248 -2981 -1702 -2287 -2034 -1994 -1885 -1531
821.5 -1531 -815 1222 1736 1675 1086 38 2085 4016 5660 6274 6105 7641 6268 8241 9060 9586 7164 5569
816.2 5569 4655 3344 3341 5442 4729 1982 -864 -484 -171 666 3443 4181 2130 -1977 -1550 -1280 -1970 -2784 -2146
810.6 -2146 1 406 -1599 79 -2522 -2035 -1746 -1935 -2746 -5074 -6484 -6666 -5356 -2498 -2018 -3142 -886
805.7 -886 2845 3889 5183 4359 3042 -699 -199 2912 3196 2988 2183 122 -1182 -1792 -1797 -1993 -2400 -844 -1695
800.1 -1695 -1398 -1261 -1209 -586 1550 -320 -1430 2687 -253 -10077 -9681 4775 14491 15751 10201 5072 -7036
795.2 -7036 -10254 -2529 1685 -2463 -2066 665 1118 -2348 -1273 -616 -1898 -201 1386 -1800 1227 1515 251
$$ packed form
832.6a135j40n41j000o80J708K067J361j152K7k017O89J122P98n61J127j838L32N42
827.3G09j616m94R10q16J133n91r42M41k072J175Q60r78r67K67J279n85K53M0J09L54
821.5a531P16K037N14o1n89j048K047J931J644O14j69J536j373J973Q19N26k422j595
816.2E569r14j311lK101p13k747k846L80L13Q37K777P38k051m107M27K70o90q14O38
810.6b146K147M05k005J678k601M87K89j89q11k328j410j82J310K858M80j124K256
805.7h86L731J044J294q24j317l741N00L111K84k08q05k061j304o10nj96m07J556q51
800.1a695K97J37N2O23K136j870j110M117k940r824L96J4456R716J260n550n129j2108
795.2g036l218P725M214m148L97K731M53l466J075O57j282J697J587l186L027K88j264
$$ plain form
790.2 251 -1637 -1197 -333 -1141 1276 -2594 -4858 -59 5158 7849 5083 2662 -769 -3470 -671 -783 -535
785.2 -535 -3001 -5253 225 2700 2946 1660 -362 -2104 -1005 -2267 -2309 -2604 377 -997 -1943 -1593 1677
780.2 1677 44 2136 3891 2278 107 -393 -2516 -779 667 -372 -1577 -1372 -1339 -1507 614 333 -820
775.3 -820 -3220 -2208 673 2505 79 -588 -1041 -447 -3159 -2079 513 -110 -2283 -3435 -447 1852 2122
770.3 2122 788 2552 1735 2771 2749 2250 3454 4501 4359 3076 2443 356 1377 2592 2509 990 1027 887
765.1 887 -210 -1817 -15 1844 807 330 100 -1219 -3876 -2799 -719 2567 1646 -1457 -3202 -1609 527
760.1 527 -241 -2099 -1581 333 3332 3758 5245 5675 8621 11505 14760 17649 23022 27282 32764 37849 46889
755.1 46889 59332 78870 103646 140486 195894 294236 448829 630400 739934 734680 724326 801284
$$ packed form
790.2B51j888M40Q64q08K417l870k264M799N217K691k766k421l431k701K799j12K48
785.2e35k466k252N478K475K46j286k022j742J099j262m2k95K981j374r46L50L270
780.2A677j633K092J755j613k171n00k123J737J446j039j205K05L3j68K121k81j153
775.3h20k400J012K881J832k426o67m53N94k712J080K592o23k173j152K988K299K70
770.3B122j334J764q17J036k2m99J204J047j42j283o33k087J021J215q3j519L7j40
765.1H87j097j607J802J859j037m77k30j319k657J077K080L286r21l103j745J593K136
760.1E27p68j858N18J914K999M26J487M30K946K884L255K889N373M260N482N085R040
755.1D6889J2443J9538K4776L6840N5408R8342J54593J81571J09534n254j0354P6958
$$ plain form
751.6 801284 1010851 1357366 1634426 1575335 1379988 1321776 1471241 1823147 2206880 2188166 1778303
748.4 1778303 1435668 1319323 1403617 1597785 1634475 1342179 996869 799176 740290 756178 758374
745.2 758374 644876 462521 316517 224629 169733 139520 118032 102881 91709 81188 73494 68384
741.7 68384 62642 57949 54719 53998 51036 50761 48305 43548 41792 41116 38865 36638 34029 33555 32126 31504 29479
736.7 29479 27267 25893 25624 22858 22367 21540 20418 20406 18836 16529 13663 12392 10078 7786 4974 3477 2962
731.7 2962 3259 5078 2934 1203 -885 -310 -194 2159 1191 1926 160 -1367 -2202 -1786 -1548 -1451 -1753 73
726.5 73 -223 -810 -1036 -1637 663 -580 -1632 -1417 -1290 570 -2218 -1486 -118 -861 -2174 -625 -2319 -1213
721.2 -1213 1079 1780 -539 359 -751 -1914 -1050 544 -421 2383 1668 924 -763 -1968 -3746 -907 -788
$$ packed form
751.6H01284K09567L46515K77060n9091j95347n8212J49465L51906L83733j8714m09863
748.4A778303l42635j16345Q4294J94168L6690k92296l45310j97693n8886J5888K196
745.2G58374j13498j82355j46004r1888n4896l0213k1488j5151j1172j0521p694n110
741.7F8384n742m693l230p21k962k75k456m757j756o76k251k227k609m74j429o22k025
736.7B9479k212j374k69k766m91q27j122j2j570k307k866j271k314k292k812j497n15
731.7B962K97J819k144j731k088N75J16K353r68P35j766j527q35M16K38R7l02J826
726.5G3k96n87k26o01K300j243j052K15J27J860k788P32J368p43j313J549j694J106
721.2a213K292P01k319Q98j110j163Q64J594r65K804p15p44j687j205j778K839J19
$$ plain form
716.2 -788 -234 -1379 -312 -751 -504 -2302 -2084 -1502 1297 1159 2524 1424 -420 -613 619 1676 3316 2458
711 2458 1850 1415 -494 -2487 -2094 2 782 128 1311 1894 1828 -1839 -3392 -2029 1053 -1001 546 -492
705.7 -492 1505 383 -57 -1150 -328 387 2090 1459 2404 3142 2624 -1603 -1963 -1975 -1669 -413 -316 -2217 -328
700.2 -328 -210 1564 -377 -2 742 -792 -3017 -3329 -3385 -4056 -2592 -1079 214 98 -1825 1722 1502 929
694.9 929 957 826 314 618 1215 589 -695 256 436 -310 -2638 -2092 798 -269 -202 7 -777 -799 -2780 -4052
689.1 -4052 -3820 -3241 -4690 -5736 -4228 -3567 -3573 -3649 -3193 -4005 -2543 -2573 -3380 -1334 1725 4173 5995 4620 3975
683.5 3975 4116 3927 5819 9025 11692 13849 13729 10142 8283 7173 6311 12896 16350 12834 12112 11833 12703
678.5 12703 13178 15457 11575 9005 9659 9870 10030 11140 8574 6290 4012 2814 2632 4510 2498 2214 3475
$$ packed form
716.2g88N54j145J067m39K47j798K18N82K799j38J365j100j844j93J232J057J640q58
711B458o08m35j909j993L93K096P80o54J183N83o6l667j553J363L082k054J547j038
705.7d92J997j122m40j093Q22P15J703o31R45P38n18m227l60j2L06J256R7j901J889
700.2c28J18J774j941L75P44j534k225l12n6o71J464J513J293j16j923L547k20n73
694.9I29K8j31n12L04N97o26j284R51J80p46k328N46K890j067O7K09p84k2j981j272
689.1d052K32N79j449j046J508O61op6M56q12J462l0q07K046L059K448J822j375o45
683.5C975J41j89J892L206K667K157j20l587j859j110q62O585L454l516p22k79Q70
678.5A2703M75K279l882k570O54K11J60J110k566k284k278j198j82J878k012k84J261
$$ plain form
673.6 3475 4657 4836 6697 6718 7032 5851 7245 9991 10995 14361 16657 17387 20153 22109 23477 24359 25823
668.6 25823 25239 27718 30387 36424 38650 43857 51118 59259 68351 85699 103840 123812 154123 200734
664.5 200734 267768 372553 532266 765623 1060238 1253656 1058430 727186 492890 346056
661.6 346056 253149 195425 157592 130813 116190 103520 97188 90283 80904 72458 63192 57680 51805 48311
657.5 48311 46039 45534 44028 46304 48925 51173 53478 54546 54539 54150 52294 49298 49997 47963 44104 43825 46652
652.5 46652 47988 51430 54994 57264 59551 58989 58550 59484 61444 63785 62513 62977 65174 62919 59940 58736
647.8 58736 56538 52851 48922 47636 47298 50069 55147 58589 59396 56829 53643 47976 43376 46546 53801 58124
643.2 58124 63733 69296 74132 78408 79974 80580 81824 84149 88627 91202 94088 90290 84876 80541 84927 91421
$$ packed form
673.6C475J182J79J861K1L14j181J394K746J004L366K296P30K766J956J368Q82J464
668.6B5823n84K479K669O037K226N207P261Q141R092J7348J8141J9972L0311M6611
664.5B00734O7034J04785J59713K33357K94615J93418j95226l31244k34296j46834
661.6C46056r2907n7724l7833k6779j4623j2670o332o905r379q446r266n512n875l494
657.5D8311k272n05j506K276K621K248K305J068pl89j856k996O99k034l859k79K827
652.5D6652J336L442L564K270K287n62m39R34J960K341j272M64K197k255k979j204
647.8E8736k198l687l929j286l38K771N078L442Q07k567l186n667m600L170P255M323
643.2E8124N609N563M836M276J566O06J244K325M478K575K886l798n414m335M386O494
$$ plain form
638.5 91421 95373 95192 97354 97619 96480 98827 106424 113044 118439 124259 124788 125052 132421 135458 138333 137230
633.8 137230 138875 138848 144760 149532 153052 152603 152600 152731 154596 151947 144512 134331 126053 123185 123158 129209 134069
628.8 134069 140295 150588 159455 172184 187394 199570 210107 218933 224412 222517 218157 220468 237901 260468
624.7 260468 276232 290412 298717 299753 299898 299719 301387 304891 295663 278727 270127 268246 272653 293778 330824
620.4 330824 399616 532125 701690 858756 947063 981670 960877 786947 564195 423508 339468
617.1 339468 446705 620002 678599 663831 601645 568224 569218 562537 543349 545969 572767 594603 572433
613.3 572433 562359 595738 656812 634079 516955 481100 524888 603496 700722 820902 926818 960393
609.8 960393 981511 1028684 1100607 1191208 1303530 1425930 1554016 1688314 1838537 2002474 2170767
$$ packed form
638.5I1421L952j81K162K65j139K347P597O620N395N820N29K64P369L037K875j103
633.8A37230J645k7N912M772L520m49lJ31J865k649p435j0181q278k868k7O051M860
628.8A34069O226J0293Q867J2729J5210J2176J0537Q826N479j895m360K311J7433K2567
624.7B60468J5764J4180Q305J036J45j79J668L504r228j6936q600j881M407K1125L7046
620.4C30824O8792J32509J69565J57066Q8307L4607k0793j73930k22752j40687q4040
617.1C39468J07237J73297N8597j4768o2186l3421R94o681j9188K620K6798K1836k2170
613.3E72433j0074L3379O1074k2733j17124l5855M3788P8608R7226J20180J05916L3575
609.8I60393K1118M7173P1923R0601J12322J22400J28086J34298J50223J63937J68293
$$ plain form
606.6 2170767 2352532 2568492 2819041 3111643 3458299 3881517 4392102 4997379 5725188 6626393
603.7 6626393 7764323 9206078 11073940 13482511 16290535 19601638 24430963 31720398 42632145
601.1 42632145 58984375 83533160 119619790 167237230 212738580 214556620 162362200 110424150
598.7 110424150 75619250 53821020 40137518 31216253 25104195 20805523 17771156 15607975
596.4 15607975 13775021 11909573 10336258 9113443 8145390 7358448 6707443 6159296 5684669
593.8 5684669 5267886 4899997 4575563 4294834 4045190 3810191 3603714 3444647 3322365 3222056
590.8 3222056 3123301 3022600 2910754 2775656 2641928 2515834 2401071 2343846 2303683 2275558 2232989
587.6 2232989 2146413 1978349 1845429 1732010 1568680 1450088 1341645 1237442 1183455 1138408 1059393
$$ packed form
606.6B170767J81765K15960K50549K92602L46656M23218N10585O05277P27809R01205
603.7F626393J137930J441755J867862K408571K808024L311103M829325P289435J0911747
601.1D2632145J6352230K4548785L6086630M7617440M5501350J818040n2194420n1938050
598.7A10424150l4804900k1798230j3683502q921265o112058m298672l034367k163181
596.4A5607975j832954j865448j573315j222815r68053p86942o51005n48147m74627
593.8E684669m16783l67889l24434k80729k49644k34999k06477j59067j22282j00309
590.8C222056r8755j00701j11846j35098j33728j26094j14763n7225m0163k8125m2569
587.6B232989q6576j68064j32920j13419j63330j18592j08443j04203n3987m5047p9015
$$ plain form
584.4 1059393 965253 885381 828822 756023 671041 641967 696424 817373 911091 789716 559958
581.2 559958 313645 100574 70360 111639 189682 303764 405870 458779 473783 466214 445852 416156
577.7 416156 386149 358374 326543 297811 284205 275045 265334 253193 246124 243032 244020 242595 241675 233403
573.6 233403 222908 202736 189247 189848 196288 199509 203545 207377 205900 199822 187163 178042 174881 171219
569.5 171219 169090 168184 174388 180483 180922 175559 170555 171289 172385 169219 165258 164396 164390 163954 159538 156930 154026
564.5 154026 153057 153156 151585 148365 145117 142595 140412 141367 139626 141537 142841 148090 161433 189546 231237
560.2 231237 285212 347065 362632 305118 236827 189598 161293 147508 136126 129214 127040 126066 127881
556.4 127881 131349 133617 137472 143889 149808 149853 145399 143169 142629 144242 150658 158739 164730 168647 170156 172165
$$ packed form
584.4A059393r4140p9872n6559p2799q4982k9074N4457J20949R3718j21375k29758
581.2E59958k46313k13071l0214M1279P8043J14082J02106N2909J5004p569k0362k9696
577.7D16156l0007k7775l1831k8732j3606r160r711j2141p069l092R88j425r20q272
573.6B33403j0495k0172j3489O01O440L221M036L832j477o078j2659r121l161l662
569.5A71219k129r06O204O095M39n363n004P34J096l166l961q62om36m416k608k904
564.5A54026r69R9j571l220l248k522k183R55j741J911J304N249J3343K8113M1691
560.2B31237N3975O1853J5567n7514o8291m7229k8305j3785j1382o912k174r74J815
556.4A27881L468K268L855O417N919M5m454k230n40J613O416Q081N991L917J509K009
$$ plain form
551.7 172165 175011 180378 189904 195558 201143 208826 219789 231420 242396 257280 270781 285234 298476
547.9 298476 311624 326804 343194 357802 375739 388271 398150 406251 411279 411757 410094 405850 400682 395474
543.8 395474 388337 376447 364409 353225 340172 327246 310798 293840 280054 264124 249218 233434
540.3 233434 220528 209132 204027 203460 200625 202645 209523 214327 220937 234306 261685 306324 377365 487121
536.2 487121 658605 908098 1203804 1294454 1010208 702204 494877 366314 285154 231086 194369
533 194369 166649 146638 130629 118719 108925 95876 84670 77831 70612 64781 61608 59329 54049 52209
528.9 52209 50358 49497 46890 45557 43585 41239 38324 38128 36444 35319 35423 35511 32908 32113 28861 28027 25010
523.9 25010 23361 23645 23952 22963 21450 19348 18628 18347 18396 16854 16388 16717 16264 15538 15910 13427 13300 12253 11750
$$ packed form
551.7A72165K846N367R526N654N585P683J0963J1631J0976J4884J3501J4453J3242
547.9B98476J3148J5180J6390J4608J7937J2532R879Q101N028M78j663m244n168n208
543.8C95474p137j1890j2038j1184j3053j2926j6448j6958j3786j5930j4906j5784
540.3B33434j2906j1396n105n67k835K020O878M804O610J3369K7379M4639P1041J09756
536.2D87121J71484K49493K95706R0650k84246l08004k07327j28563q1160n4068l6717
533A94369k7720k0011j6009j1910r794j3049j1206o839p219n831l173k279n280j840
528.9E2209j851q61k607j333j972k346k915j96j684j125J04Q8k603p95l252q34l017
523.9B5010j649K84L07r89j513k102p20k81M9j542m66L29m53p26L72k483j27j047n03
$$ plain form
518.4 11750 8929 10259 8340 6202 3657 2686 924 1647 -2021 -1667 -1831 -478 1647 1095 -184 483 1678
513.4 1678 -301 -1819 -2417 -1313 578 -1519 -953 1191 964 1502 1425 763 1975 1011 -597 -568 -553 75 -280
507.8 -280 30 1295 2181 -839 -3379 -2506 -4295 -5153 -5648 -3604 -1251 -2030 -2424 -2388 -2591 -1098 32 -907 4
502.3 4 1704 345 -339 637 2444 -458 -425 225 -278 1041 2986 1710 2803 2758 1061 1164 1628 -1542 -2221
496.7 -2221 -3098 -1922 834 979 1916 942 -345 -69 467 1085 1499 -471 -690 -2016 -1708 -2033 -1289 -290 -2132
491.2 -2132 -2257 -2225 -3167 -1709 601 555 3293 -563 1279 1777 -1234 -1177 -1421 -2749 -2547 -1041 -894 -1357 -2023
485.6 -2023 -2174 -2918 -882 -466 -1911 -3521 -1093 1051 1933 3421 1670 2940 3919 2475 3963 4941 4296
480.6 4296 3243 2784 1809 2042 738 383 528 1135 -389 580 1595 -538 216 537 2318 1297 803 -2275
$$ packed form
518.4A1750k821J330j919k138k545r71j762P23l668L54j64J353K125n52j279O67J195
513.4A678j979j518n98J104J891k097N66K144k27N38p7o62J212r64j608K9J5O28l55
507.8b80L10J265Q86l020k540Q73j789q58m95K044K353p79l94L6k03J493J130r39R11
502.3DJ700j359o84R76J807k902L3O50n03J319J945j276J093m5j697J03M64l170o79
496.7b221q77J176K756J45R37r74j287K76N36O18M14j970k19j326L08l25P44R99j842
491.2b132j25L2r42J458K310m6K738l856J842M98l011N7k44j328K02J506J47m63o66
485.6b023j51p44K036M16j445j610K428K144Q82J488j751J270R79j444J488R78o45
480.6D296j053m59r75K33j304l55J45O07j524R69J015k133P54L21J781j021m94l078
$$ plain form
475.4 -2275 -3207 -3001 -2830 -2372 -2377 -644 1061 848 922 1786 2060 1016 1432 2167 1043 -1149 332 -799 -3703
469.8 -3703 -2157 -1879 -1725 -2598 -1294 -1928 47 13 982 2272 2035 1132 2478 1091 762 -782 -1574 -1651 154
464.3 154 2651 1420 584 -1804 -1487 -738 43 287 970 886 -173 -950 -458 -1539 -971 -2414 -2723 -3078 -4202
458.7 -4202 -2630 -3678 -3223 -1286 -1715 -618 -2067 -549 955 1618 1338 1665 1801 2767 1724 845 -400 2068
453.5 2068 3256 2042 1471 -577 -275 724 2824 2838 2055 977 -1809 -766 -501 -221 -2479 -862 -509 -2192
448.2 -2192 -2469 -1735 -2466 -1716 512 -690 -1994 -2526 -1544 -526 -385 -624 -738 -356 103 1081 517 39 2054
442.6 2054 1660 2998 617 938 253 -303 846 1900 4033 3009 1439 1728 5494 6851 1677 -1345 -1437
437.7 -1437 -3810 -2885 -2020 1175 2174 333 -491 -553 200 118 -597 1490 696 2354 1035 3240 3782 2427 2405
$$ packed form
475.4b275r32K06J71M58nJ733J705k13P4Q64K74j044M16P35j124k192J481j131k904
469.8c703J546K78J54q73J304o34J975l4R69J290k37r03J346j387l29j544p92p7J805
464.3A54K497j231q36k388L17P49P81K44O83q4j059p77M92j081N68j443l09l55j124
458.7d202J572j048M55J937m29J097j449J518J504O63k80L27J36R66j043q79j245K468
453.5B068J188j214n71k048L02R99K100J4p83j078k786J043K65K80k258J617L53j683
448.2b192k77P34p31P50K228j202j304n32R82J018J41k39j14L82M59R78n64m78K015
442.6B054l94J338k381L21o85n56J149J054K133j024j570K89L766J357n174l022r2
437.7a437k373R25Q65L195R99j841q24o2P53q2p15K087p94J658j319K205N42j355k2
$$ plain form
432.1 2405 1290 264 1564 -1060 -3421 -4252 329 2157 1717 -2870 -5104 -2995 -2103 -2318 -875 1758 600
427.2 600 -2070 -1923 -1183 -761 -1409 -2609 -2826 -214 759 1032 434 159 882 1021 -923 -1434 -1249 1292 -863
421.6 -863 -173 -611 -718 -1520 -1959 -2842 -1616 -1465 -1668 199 -744 729 3788 3832 2378 439 36 -2362 -3685
416 -3685 -3939 2981 2613 1598 -1652 -3809 -4555 -2021 -1516 -3669 -4345 815 6564 6434 4461 4392 -811 -4288
410.8 -4288 -909 2574 3988 5672 3710 2600 866 69 -470 -514 -190 -241 -1247 997 -299 -2507 921
405.8 921 469 -1695 398 2157 -2790 -8605 -5312 8784 18485 14201 12501 3603 -9718 -8758 912 39
401.1 39 -2800 -4219 -1091 -2993 -5206 -3875 -165 981 257 -33 -653 -681 -37 -1401 758 2814 -838 -1488
395.9 -1488 -1813 -3321 -3850 -1450 2183 5431 3963 4903 2698 -4360 -2327 -513 133 -1063 -1990 106 1886
$$ packed form
432.1B405j115j026J300k624k361q31M581J828m40m587k234K109Q92k15J443K633j158
427.2F00k670J47P40M22o48j200k17K612R73K73n98k75P23J39j944n11J85K541k155
421.6h63O90m38j07q02m39q83J226J51k03J867r43J473L059M4j454j939m03k398j323
416c685k54O920l68j015l250k157p46K534N05k153o76N160N749j30j973o9n203l477
410.8d288L379L483J414J684j962j110j734p97n39m4L24n1j006K244j296k208L428
405.8I21m52k164K093J759m947n815L293J4096R701m284j700q898j3321R60R670q73
401.1C9k839j419L128j902k213J331L710J146p24k90o20k8O44j364K159K056l652o50
395.9a488l25j508n29K400L633L248j468R40k205p058K033J814O46j196r27K096J780
$$ plain form
390.9 1886 1874 -738 -1589 634 673 -3050 -712 1675 -1192 -2734 -1574 227 -1827 -559 -1861 337 -826
385.9 -826 -529 -259 -1895 -112 554 1892 2979 416 -1304 -415 -240 512 -821 -1636 207 1122 957 -3016
380.7 -3016 -3329 -3565 -473 -1780 -2988 -3847 -1421 26 -52 -170 159 -939 -2040 -945 1273 1488 2200 3056
375.4 3056 3427 3250 3995 3214 2111 372 1384 2432 4160 4667 6765 7977 9179 6710 6767 7907 9282
370.5 9282 9712 9419 10606 11209 13187 14629 15203 16721 19799 23194 25530 24983 28200 32440 35140 38411 40787
365.5 40787 46104 47834 50980 50644 51288 50670 49134 47747 46204 38605 36680 30868 28248 23467 21011 17741
360.8 17741 16303 11804 10336 8119 8884 6025 8328 6624 5722 4897 4576 1465 1854 1949 -597 -1399 2169
355.8 2169 -630 503 1041 101 -2131 427 1248 1172 -1155 -661 -1918 132 693 341 -224 -1628 -2268 -2427
$$ packed form
390.9A886j2k612q51K223L9l723K338K387k867j542J160J801k054J268j302K198j163
385.9h26K97K70j636J783O66J338J087k563j720Q89J75P52j333q15J843R15j65l973
380.7c016l13k36L092j307j208q59K426J447p8j18L29j098j101J095K218K15P12Q56
375.4C056L71j77P45p81j103j739J012J048J728N07K098J212J202k469N7J140J375
370.5I282M30k93J187O03J978J442N74J518L078L395K336n47L217M240K700L271K376
365.5D0787N317J730L146l36O44o18j536j387j543p599j925n812k620m781k456l270
360.8A7741j438m499j468k217P65k859K303j704r02q25l21l111L89R5k546q02L568
355.8B169k799J133N38r40k232K558Q21p6k327M94j257K050N61l52n65j404o40j59
$$ plain form
350.6 -2427 -851 -993 -686 -963 1675 -614 -2046 -973 1741 -513 123 -465 -31 -1337 -545 -377 -582 -556
345.3 -556 -446 -1040 -904 -555 81 -828 267 446 -128 343 -402 29 -1074 -864 -277 -396 2404 210 750 944
339.5 944 1877 1986 985 169 1816 722 -1468 -253 -3894 -2428 -1750 -2812 -3768 -3849 -4022 -4934 -1305 -2011
334.2 -2011 -3219 -62 -615 -1811 -3035 -1623 -1028 -1641 -2862 -1664 -618 -1218 -15 556 1260 -542 161
329.2 161 -352 740 5651 9358 18470 28359 13690 3205 545 2378 797 -1938 -1994 -2410 -2872 -3182 -1100
324.3 -1100 -316 -1197 139 1006 4808 9990 9731 7494 8074 10777 18542 43533 57974 27136 11183 4132
319.6 4132 1915 321 -1978 1063 1425 1775 122 -404 -477 1431 1228 2618 1452 2459 4357 3937 2902
314.6 2902 5303 6956 18488 25691 11275 3887 213 -954 -2221 -1891 -2739 -1608 284 -751 245 923
$$ packed form
350.6b427J576j42L07k77K638k289j432J073K714k254O36n88M34j306P92J68k05K6
345.3e56J10n94J36L49O36r09J095J79n74M71p45M31j103K10N87j19K800k194N40J94
339.5I44R33J09j001q16J647j094k190J215l641J466O78j062r56q1j73r12L629p06
334.2b011j208L157n53j196j224J412N95o13j221J198J046o00J203N71P04j802P03
329.2A61n13J092M911L707R112R889j4669j0485k660J833j581k735n6m16m62l10K082
324.3a100P84q81J336Q67L802N182k59k237N80K703P765K4991J4441l0838j5953p051
319.6D132k217j594k299L041L62L50j653n26p3J908k03J390j166J007J898m20j035
314.6B902K401J653J1532P203j4416p388l674j167j267L30q48J131J892j035R96O78
$$ plain form
309.9 923 -1791 -3168 -1549 -2248 -981 -716 -1749 -2193 -1491 -2397 -1602 -1304 -3259 -3233 -2032 -3309 252 340 548
304.4 548 9 826 -1464 -405 -435 -1128 424 -516 -1446 909 -1033 410 -366 -1249 -1371 -1358 -2330 -2829 -1436
298.8 -1436 -1466 -430 -272 772 4045 1791 1333 -135 504 729 4204 1928 -557 -311 1490 969 4 -537
293.6 -537 -836 -1987 666 -1450 371 274 1244 -1161 -1907 -2498 -2204 -996 233 -481 -517 -254 -348 -653 142 1049
287.7 1049 1993 767 22 -800 716 -515 -993 -617 292 -1150 338 -8 893 -116 -94 -210 390 882 298
282.2 298 -1160 1083 1557 867 209 184 1004 1447 613 1565 1286 720 -121 1940 1474 476 714 -1289 -2210 -3328
276.3 -3328 -1787 -1281 -752 -1535 -2588 -1937 318 2747 590 -980 73 25 1533 1410 -39 532 -216 -429
271.1 -429 1384 397 -122 -1254 -949 2402 145 226 -109 787 482 1477 -2956 -2512 -1584 -2083 -1103 -1199 -424 -1578
$$ packed form
309.9I23k714j377J619o99J267K65j033m44P02r06P95K98j955K6J201j277L561Q8K08
304.4E48n39Q17k290J059l0o93J552r40r30K355j942J443p76q83j22J3r72m99J393
298.8a436l0J036J58J044L273k254m58j468O39K25L475k276k485K46J801n21r65n41
293.6e37k99j151K653k116J821r7R70k405p46n91K94J208J229p14l6K63r4l05P95R07
287.7A049R44j226p45q22J516j231m78L76R09j442J488l46R01j009K2j16O00M92n84
282.2B98j458K243M74o90o58k5Q20M43q34R52k79n66q41K061m66r98K38k003r21j118
276.3c328J541N06N29p83j053O51K255K429k157j570J053m8J508j23j449N71p48k13
271.1d29J813r87n19j132L05L351k257Q1l35Q96l05R95m433M44R28m99R80r6P75j154
$$ plain form
265.2 -1578 -1240 376 1039 156 -895 574 -754 423 2068 443 -3302 -380 1737 -934 -1797 -1945 -2554
260.3 -2554 -3592 -2545 -1032 273 1419 1186 -663 -964 861 549 2156 1085 3501 1786 2902 2427 2123
255.3 2123 -373 -175 -925 1206 -437 -1090 -2044 -379 -937 -860 162 1108 3918 6214 6306 3547 853 912 1190
249.7 1190 460 -557 -890 -1055 -1926 -752 -535 -1123 674 619 1007 2481 686 -636 1011 3979 4241 5742
244.5 5742 3996 1529 2736 1976 688 -866 1571 2212 435 -3492 -4502 -5437 -6037 -5970 -2457 1783 -7
239.5 -7 -3556 -4723 -1257 -1482 -1616 -2972 -569 -1653 -1376 -129 642 1193 890 1367 2948 2146 246 -646 418
233.9 418 -1454 4437 5310 862 -2000 -3271 -1571 -1880 -2267 486 1619 -807 -1245 -2138 450 1281 -1665
229 -1665 -2195 1055 726 -256 1398 3343 229 -47 -1779 -754 684 -14 431 991 -396 -1705 -335 -384
$$ packed form
265.2a578L38J616O63q83j051J469j328J177J645j625l745K922K117k671q63j48o09
260.3b554j038J047J513J305J146k33j849l01J825l12J607j071K416j715J116m75l04
255.3B123k496J98p50K131j643o53r54J665n58P7J022R46K810K296R2k759k694N9K78
249.7A190p30j017l33j65q71J174K17n88J797n5L88J474j795j322J647K968K62J501
244.5E742j746k467J207p60j288j554K437O41j777l927j010r35o00O7L513M240j790
239.5gl549j167L466k25j34j356K403j084K77J247P71N51l03M77J581q02j900q92J064
233.9D18j872N891Q73m448k862j271J700l09l87K753J133k426m38q93K588Q31k946
229a665n30L250l29r82J654J945l114k76j732J025J438o98M45N60j387j309J370m9
$$ plain form
223.7 -384 -787 -1365 -1927 -1482 -583 638 472 667 -1151 -1848 -1359 -16 1693 700 -631 873 1018 343 113
218.2 113 -1143 -637 -825 -658 2477 2484 843 144 913 -1352 -440 320 1422 -172 196 -1108 -557 -2001 -1034
212.6 -1034 352 533 -545 -1854 -3554 -515 90 963 1400 497 -1232 -20 1851 117 -2139 -785 2660
207.6 2660 3935 2432 719 3359 617 2065 1923 1707 197 -1033 -210 776 -187 -2113 -947 -392 -1367
202.7 -1367 -651 893 1145 364 824 2348 -619 614 -1068 -867 794 -192 -2511 1146 990 -1530 -3200
197.7 -3200 242 -1426 -1945 -2006 -1939 -2612 -2562 1173 2724 2165 1146 88 24 1078 3126 2718 638 1017 83
192.1 83 331 368 -1466 346 579 -584 -597 -1714 -1976 -1689 -3377 -2058 119 235 -35 2300 390 184 1310
186.6 1310 1416 419 1267 1026 -259 415 -1348 -1564 -762 1390 1740 -993 -927 -880 -2056 -1586 503 1072 887
$$ packed form
223.7c84m03n78n62M45Q99J221j66J95j818o97M89J343J709r93j331J504J45o75k30
218.2A13j256N06j88J67L135Pj641o99P69k265R12P60J102j594L68j304N51j444R67
212.6a034J386J81j078j309j700L039O05Q73M37r03j729J212J871j734k256J354L445
207.6B660J275j503j713K640k742J448j42k16j510j230Q23R86r63j926J166N55r75
202.7a367P16J544K52p81M60J524k967J233j682K01J661r86k319L657j56k520j670
197.7c200L442j668n19o1O7o73N0L735J551n59j019j058o4J054K048m08k080L79r34
192.1H3K48L7j834J812K33j163j3j117k62K87j688J319K177J16k70K335j910k06J126
186.6A310J06r97Q48k41j285O74j763k16Q02K152L50k733O6M7j176M70K089N69j85
$$ plain form
181 887 94 -1952 -1307 -844 25 -143 825 1171 -618 65 -87 -173 -954 -1332 208 1813 473 76 -79 -558
175.2 -558 157 -527 -1624 2249 3465 4775 1768 735 -49 1555 1384 1733 372 296 -153 -182 -1804 -1791 -2093
169.6 -2093 -3208 -3648 -3622 318 1674 1234 711 -1222 -3026 -1569 132 989 -420 -2095 -448 -394 -72 1877
164.4 1877 3475 -135 639 918 1715 1169 1412 303 494 -870 -98 1894 1396 519 360 476 1291 215 -694
158.8 -694 -660 -101 -270 -1075 -490 -827 -244 163 -7 -389 908 2002 1012 -619 -338 -113 -545 -656 -1038 -502
153 -502 -1357 -1196 -561 1512 -411 1155 707 1630 213 785 140 907 -735 -1294 866 -796 -1627 566 347
147.4 347 -935 -1150 -1739 812 -372 -1552 -2041 -1345 -605 -1099 -973 -724 334 -511 -981 -371 767 -916 1179
141.9 1179 319 908 -355 -135 -218 659 832 1319 820 -1208 -1294 1544 1001 1028 100 698 810 1069 832 1120 1148
$$ packed form
181H87p93k046O45M63Q69j68R68L46j789O83j52q6p81l78J540J605j340l97j55m79
175.2e58P15o84j097L873J216J310l007j033p84J604j71L49j361p6m49k9j622J3l02
169.6b093j115m40K6L940J356m40n23j933j804J457J701Q57j409j675J647N4L22J949
164.4A877J598l610P74K79P97n46K43j109J91j364P72J992m98q77j59J16Q15j076r09
158.8f94L4N59j69q05N85l37N83M07j70l82J297J094r90j631K81K25m32j11l82N36
153e02q55J61O35K073j923J566m48R23j417N72o45P67j642n59K160j662q31K193k19
147.4C47j282k15n89K551j184j180m89O96P40m94J26K49J058q45m70O10J138j683K095
141.9A179q60N89j263K20q3Q77J73M87m99k028q6K838n43K7r28N98J12K59k37K88K8
$$ plain form
135.7 1148 1212 -1246 126 2325 1749 540 115 -1169 -877 -838 121 -461 -767 -925 475 1507 826 59 609
130.2 609 -1021 -82 -2678 -1183 -1741 -2488 -2891 -1959 -603 60 96 624 1492 630 1167 -494 -1237 -252 -503 -1415
124.3 -1415 346 1776 1194 1826 1417 2007 1569 1658 484 1800 281 -1231 -907 1263 2862 1060 180 374
119.1 374 -163 -277 -2012 -838 -1018 -239 -804 -128 -1874 -2117 -592 -1099 135 131 -566 -943 -961 936 1315 751
113.2 751 97 762 -297 -210 -1864 -810 991 1104 1396 822 2587 171 -1165 -2043 1392 1788 1740 2084 1566
107.7 1566 936 241 313 612 -360 -1465 543 762 -1023 -1764 -586 -771 346 909 -307 -1195 -2424 -3634
102.4 -3634 -4260 -1405 365 -971 844 1910 -182 525 1806 1022 1241 735 402 -1106 -916 1267 854 922
97.2 922 1140 -189 1200 1631 1010 -344 741 -1164 -262 -1079 -666 -1487 414 -748 -308 -1316 -1180 -1627 -909
$$ packed form
135.7A148O4k458J372K199n76j209m25j284K92L9R59n82l06j58J400J032o81p67N50
130.2F09j630R39k596J495n58p47m03R32J356O63L6N28Q68q62N37j661p43R85k51r12
124.3a415J761J430n82O32m09N90m38Q9j174J316j519j512L24K170J599j802q80J94
119.1C74n37j14j735J174j80P79n65O76j746k43J525n07J234mo97l77j8J897L79n64
113.2G51o54O65j059Q7j654J054J801J13K92n74J765k416j336q78L435L96m8L44n18
107.7A566o30o95P2K99r72j105K008K19j785p41J178j85J117N63j216q88j229j210
102.4c634o26K855J770j336J815J066k092P07J281p84K19n06l33j508J90K183m13O8
97.2I22K18j329J389M31o21j354J085j905R02q17M13q21J901j162M40j008J36m47P18
$$ plain form
91.6 -909 -567 -138 -1189 -2113 -1803 -1410 -1560 -758 798 1560 -1654 -1885 -1217 596 83 273 -390 2359 -38
86 -38 -834 -87 690 309 709 1816 3642 1537 2116 2486 2224 283 1357 1622 2044 1713 3101 -638 68 119
80.2 119 -1177 -1315 -231 -669 -45 -1139 -1928 -1303 -620 -2579 -902 32 1044 -278 87 1505 152 -2427
74.9 -2427 -1164 -262 -623 749 1310 -442 -1765 1274 1085 -377 -1452 -787 456 756 779 -2010 -995 -2738
69.7 -2738 -1346 -449 583 -1333 -161 1287 4814 2786 2518 -3056 -336 799 542 -940 -507 -743 -87
64.7 -87 718 -129 -626 -164 -273 239 -14 131 385 1567 128 -1141 -953 -383 690 1214 2601 1326 2896
59.2 2896 3251 2525 -555 -2217 -957 1034 747 -2479 -1322 -942 -570 -1962 -597 -634 228 -809 -1270 -2623
53.9 -2623 -2095 -188 -26 -1817 -1760 -1480 -940 -880 312 1343 1943 2512 2459 3205 2048 690 -998 -633 66 -247
$$ packed form
91.6i09L42M29j051r24L10L93j50Q02J556P62l214k31O68J813n13J90o63K749k397
86c8p96P47P77l81M00J107J826k105N79L70k62j941J074K65M22l31J388l739P06N1
80.2A19j296j38J084m38O24j094p89O25O83j959J677R34J012j322L65J418j353k579
74.9b427J263R02l61J372N61j752j323L039j89j462j075O65J243L00K3k789J015j743
69.7b738J392Q97J032j916J172J448L527k028k68n574K720J135k57j482M33k36O56
64.7h7Q05q47m97M62j09N12k53J45K54J182j439j269J88N70J073N24J387j275J570
59.2B896L55p26l080j662J260J991k87l226J157L80L72j392J365l7Q62j037m61j353
53.9b623N28J907J62j791N7K80N40O0J192J031O00N69n3P46j157j358j688L65O99l13
$$ plain form
48 -247 -678 -2096 -920 -427 733 1411 2833 2502 482 -1383 -1137 -686 -1876 -448 -236 1656 2464 1404 -1139
42.5 -1139 -1506 -647 393 -268 -453 -1066 -1125 -93 -333 336 -1438 -1972 -355 -1561 -685 180 -578 808 1870
36.9 1870 1562 1088 562 2054 -51 -2236 -1838 -1615 -1718 -731 921 510 -278 1026 2005 413 -317 -1616 526
31.4 526 147 487 -716 -1095 438 528 1401 3393 829 1403 346 -255 1656 294 1891 266 -1334 -810
26.1 -810 1144 625 -767 -1873 -2961 48 373 2412 496 234 1481 290 534 1010 -335 1486 70
21.2 70 436 1975 777 -837 -785 -449 -1093 305 589 101 -188 39 -278 -654 -823 -203 -351 -2652 -1058 -1569
15.3 -1569 669 -1319 -444 -839 -465 792 -136 -2326 -1803 -2380 -832 -1773 -1657 -2683 -1229 262 268 1546 659
9.8 659 657 2780 1863 2284 1857 705 -1156 -2545 -1587 -1862 -3495 -1277 666 -499 296 1668 2233 1639 2937
$$ packed form
48b47m31j418J176M93J160O78J422l31k020j865K46M51j190J428K12J892Q08j060k543
42.5a139l67Q59J040o61j85o13n9J032k40O69j774n34J617j206Q76Q65p58J386J062
36.9A870l08m74n26J492k105k185L98K23j03R87J652m11p88J304R79j592p30j299K142
31.4E26l79L40j203l79J533R0Q73J992k564N74j057o01J911j362J597j625j600N24
26.1h10J954n19j392j106j088L009L25K039j916k62J247j191K44M76j345J821j416
21.2G0L66J539j198j614N2L36o44J398K84m88k89K27l17l76j69O20j48k301J594n11
15.3a569K238j988Q75l95L74J257r28k190N23n77J548r41J16j026J454J491OJ278q87
9.8F59kK123r17M21m27j152j861j389R58k75j633K218J943j165P95J372N65n94J298
$$ plain form
4.2 2937 1873 2203 2896 721 841 208 -1248 403 325 1954 1236 -686 -911 928 3095 3750 72 -720 -403
-1.4 -403 1586 1161 126 -287 -970 -2205 265 379 -866 -1419 426 2097 -375 -136 -553 -2910 -3582 -1911
-6.6 -1911 -331 -729 259 -1109 -1038 -880 -2410 -103 1930 1373 -1021 -1887 -848 640 1817 -15 177 -153
-11.9 -153 -561 262 321 1095 -829 314 1877 1133 2307 1094 -102 -568 40 1113 752 208 273 1085 1378
-17.4 1378 2632 44 -1079 -506 111 877 -847 -2451 -1427 -1262 -2461 42 -1820 -1812 -382 -2527 1138
-22.4 1138 -8 -2003 -275 240 450 258 732 857 -398 340 610 -381 -1170 220 60 -967 -271 -210 -1129
-27.9 -1129 565 1324 1624 -408 867 -292 -413 225 1278 866 71 287 -849 -1496 -319 -1254 -1702 95
-33.2 95 -831 -197 1546 2718 1416 1894 -164 -294 -1158 18 1544 1555 2045 222 -208 1930 1297 -398 -1002
$$ packed form
4.2B937j064L30O93k175J20o33j456J651p8J629p18j922k25J839K167O55l678p92L17
-1.4d03J989m25j035m13o83j235K470J14j245n53J845J671k472K39m17k357o72J671
-6.6a911J580l98R88j368P1J58j530K307K033n57k394q66J039J488J177j832J92l30
-11.9a53m08Q23N9P74j924J143J563p44J174j213j196m66O08J073l61n44O5Q12K93
-17.4A378J254k588j123N73O17P66j724j604J024J65j199K503j862QJ430k145L665
-22.4A138j146j995J728N15K10j92M74J25j255P38K70r91p89J390j60j027O96O1r19
-27.9a129J694P59L00k032J275j159j21O38J053m12p95K16j136o47J177r35m48J797
-33.2I5r26O34J743J172j302M78k058j30q64J176J526J1M90j823m30K138o33j695o04
$$ plain form
-38.8 -1002 -754 251 -814 -685 182 -97 -933 1465 1062 -1951 -574 1647 -535 -1234 -486 148 620 502
-44 502 1035 -815 -472 -1227 -650 -48 1137 -966 -1792 -1366 -793 1107 -160 -317 -157 -1363 -1544 19 -489
-49.6 -489 441 -468 -1234 34 1946 1195 2060 2431 1390 510 -412 326 964 1287 -39 -25 -664 -605 -152 -1224
-55.4 -1224 -1713 -1989 201 -526 952 746 -356 -984 -73 -989 -583 -396 625 1224 1412 1691 -17 1128 1424
-61 1424 -158 1064 -643 -2105 -1294 -217 343 1691 1017 117 136 671 80 318 -1215 -231 -253 934 -1419
-66.5 -1419 407 985 -697 -164 -910 -1787 -2368 -373 862 -707 1222 2074 -36 -508 469 132 -230 539
-71.8 539 791 -147 -598 -1309 -671 -856 -987 -614 -1431 -1999 666 -399 -428 -767 1558 591 2437 1627 -116 -352
-77.6 -352 607 -209 325 664 1090 167 -1169 -2532 101 79 15 -3 -334 963 2286 -380 2037 2283 -1189
$$ packed form
-38.8a002K48J005j065J29Q67k79q36K398m03l013J377K221k182o99P48O34M72j18
-44E02N33j850L43p55N77O02J185k103q26M26N73J900j267j57J60j206j81J563n08
-49.6d89R30r09p66J268J912p51Q65L71j041q80r22P38O38L23j326J4o39N9M53j072
-55.4a224m89k76K190p27J478k06j102o28R11r16M06J87J021N99J88K79j708J145K96
-61A424j582J222j707j462Q11J077N60J348o74r00J9N35n91K38j533R84k2J187k353
-66.5a419J826N78j682N33p46q77n81J995J235j569J929Q52k110m72R77l37l62P69
-71.8E39K52r38m51p11O38j85j31L73q17n68K665j065k9l39K325r67J846q10j743k36
-77.6c52R59q16N34L39M26r23j336j363K633k2o4j8l31J297J323k666K417K46l472
$$ plain form
-83.2 -1189 -640 55 592 -465 -408 -410 -1408 -1335 -2849 -1637 620 1014 -1106 515 -591 -1718 -1717 -351 491 -500
-89 -500 -99 -127 -16 687 1208 1454 -76 1480 -176 868 2895 521 -1504 -1398 -1122 -37 627 1134 1371
-94.6 1371 3419 2480 2565 112 -931 -2457 725 2032 1644 -1224 -615 317 272 -1466 -2263 74 677 1140
-99.9 1140 -660 -1150 -1457 -1455 584 -996 233 -1831 -908 -3638 -2251 -167 1453 1532 400 -108 810 -142
-105.1 -142 153 -263 -1155 -987 -153 1238 -1699 -125 650 1142 276 1292 2043 1721 621 -928 -1031 204
-110.4 204 287 685 2679 505 763 -875 713 -19 678 -330 1352 -217 -794 -582 2412 1698 100 -1578
-115.6 -1578 -1761 -1048 -1454 -255 149 1344 1080 790 1128 -872 286 492 190 -361 397 964 -165 -1104 -2372
-121.2 -2372 -126 622 -347 -463 -545 -595 -1486 -1236 -288 1216 -585 -2735 379 818 37 945 1391 1480 -425
$$ packed form
-83.2a189N49O95N37j057N7kr98P3j514J212K257L94k120J621j106j127JJ366Q42r91
-89e00M01k8J11P03N21K46j530J556j656J044K027k374k025J06K76J085O64N07K37
-94.6A371K048r39Q5k453j043j526L182J307l88k868O09R32m5j738p97K337O03M63
-99.9A140j800m90l07KK039j580J229k064R23k730J387K084J620P9j132n08R18r52
-105.1a42K95m16q92J68Q34J391k937J574P75M92q66J016P51l22j100j549j03J235
-110.4B04Q3L98J994k174K58j638J588p32O97j008J682j569n77K12K994p14j598j678
-115.6a578j83P13m06J199M04J195k64k90L38k000J158K06l02n51P58N67j129r39j268
-121.2b372K246P48r69j16q2n0q91K50R48J504j801k150L114M39p81R08M46Q9j905
$$ plain form
-126.7 -425 -558 -896 -471 -661 1368 207 1736 774 579 -292 -1127 203 1272 364 -1902 -770 -1197 294
-132 294 -915 -1090 -643 -2964 -2570 -2143 -1755 624 996 806 415 -1571 -1088 -903 451 1714 2316 2819 4673
-137.6 4673 3610 988 -591 -1118 176 354 755 -789 -349 708 764 155 -328 -548 -1389 -1175 -114 609
-142.8 609 -613 -224 -2089 -1942 66 228 176 2715 1277 999 2344 2475 2083 33 -2019 -1862 -1322 -1641
-148.1 -1641 -1399 -882 -165 182 -666 704 1568 557 -1335 -1425 -5 -65 1309 1773 1768 4026 787 -2113 -2590
-153.6 -2590 -2519 -1246 575 292 1375 484 1492 671 729 -175 -1892 -704 1629 727 -208 -555 -651 -1069 -68
-159.2 -68 -593 -291 -2473 -994 -366 953 -83 190 -1179 -2389 -2704 -711 271 -1141 -2511 -946 711
-164.2 711 1138 1563 1154 983 2371 1130 533 -457 -819 1165 1084 -1696 1446 1451 895 -1181 -1617 -497 -964
$$ packed form
-126.7d25j33l38M25j90K029j161J529r62j95q71q35J330J069r08k266J132m27J491
-132B94j209j75M47k321L94M27L88K379L72j90l91j986M83J85J354J263O02N03J854
-137.6D673j063k622j579n27J294J78M01j544M40J057N6o09m83k20q41K14J061P23
-142.8F09j222L89j865J47K008J62n2K539j438k78J345J31l92k050k052J57N40l19
-148.1a641K42N17P17L47q48J370Q64j011j892r0J420o0J374M64nK258l239k900m77
-153.6b590P1J273J821k83J083q91J008q21N8r04j717J188K333r02r35l47r6m18J001
-159.2f8n25L02k182J479O28J319j036K73j369j210l15J993R82j412j370J565J657
-164.2G11M27M25m09j71J388j241n97r90l62J984q1k780L142Nn56k076m36J120m67
$$ plain form
-169.7 -964 1 958 341 1264 1005 -445 -759 1709 1303 1199 -191 -369 -2944 -746 443 175 -1698 -1288
-175 -1288 262 644 1578 739 -78 -677 1395 1995 -489 -270 -925 1533 24 1343 293 426 -1540 -800
-180.2 -800 -37 417 421 -1384 -2735 297 -258 -553 -1794 -861 1234 2793 3833 1121 411 1289 -474 564
-185.5 564 -149 -267 -993 -1011 -1698 170 2103 179 190 381 -568 -471 -775 -311 -38 -772 -937 -109 45 437 1262
-191.6 1262 780 526 384 -68 -1477 -860 -953 -3014 -345 -1513 -579 501 1336 2465 1984 713 1697 802
-196.9 802 -250 -628 359 -4 -630 -1181 -824 -1150 -1154 -801 -1700 -1562 673 1529 1130 501 -1030 -67 159 430
-202.7 430 689 1 2185 -616 -771 -76 -490 -358 -1672 -3039 -105 1168 1137 1424 231 526 519 -64 393
-208.3 393 334 -200 1490 502 -1074 -331 -850 -1571 -155 2383 1119 355 -658 334 -1257 838 1491 2076
$$ packed form
-169.7i64R65R57o17R23k59j450l14K468m06j04j390j78k575K198J189k68j873M10
-175a288J550L82R34q39q17n99K072O00k484K19o55K458j509J319j050J33j966P40
-180.2h00P63M54Mj805j351L032n55k95j241R33K095J559J040k712p10Q78j763J038
-185.5E64p13j18p26j8o87J868J933j924J1J91r49R7l04M64K73p34j65Q28J54L92Q25
-191.6A262m82k54j42m52j409O17r3k061K669j168R34J080Q35J129m81j271R84q95
-196.9H02j052l78R87l63o26n51L57l26mL53q99J38K235Q56l99o29j531R63K26K71
-202.7D30K59o88K184k801j55O95m14J32j314j367K934J273l1K87j193K95pn83M57
-208.3C93n9n34J690r88j576P43n19p21J416K538j264p64j013R92j591K095O53N85
$$ plain form
-213.6 2076 1536 -493 421 2069 1565 -997 -1549 -1124 -876 349 -148 -113 620 538 555 -641 -1115 -331 -693 940
-219.4 940 600 -1265 -1659 1973 127 94 356 281 -1136 -1298 -2336 -1434 -1598 140 -918 1791 1734 429 787
-225 787 1709 450 -363 -1861 -816 -1739 717 -921 -2260 -1870 -832 -299 1219 1231 1510 1002 1550 1669 1578
-230.5 1578 825 -820 668 671 1097 869 -1766 -153 -1143 -729 -1136 -1413 -1512 -1794 -818 599 1143 1369 1456 -90
-236.4 -90 265 -176 -779 -2016 -551 1230 -896 -1726 -3031 -751 930 2349 1276 -703 -1180 -838 30 1281
-241.6 1281 -295 -1764 -2920 -2048 -384 830 1826 1595 1 1852 3423 2795 1648 149 926 1378 1191
-246.6 1191 1191 -358 -724 -1631 -741 -1902 -1300 -675 200 -615 426 1613 1513 -1051 1188 -886 -2039 -2048 173
-252.1 173 391 414 2140 1632 771 991 1748 460 1542 -1602 -3313 -3557 368 -223 -383 -1523 -1006 -1266 261
$$ packed form
-213.6B076n40k029R14J648n04k562n52M25K48J225m97L5P33q2J7j196m74P84l62J633
-219.4I40l40j865l94L632j846l3K62p5j417j62j038R02j64J738j058K709n7j305L58
-225G87R22j259q13j498J045r23K456j638j339L90J038N33J518J2K79n08N48J19r1
-230.5A578p53j645J488LM26k28k635J613r90M14m07k77r9k82R76J417N44K26Q7j546
-236.4i0L55m41o03j237J465J781k126q30j305K280J681J419j073j979m77L42Q68J251
-241.6A281j576j469j156Q72J664J214R96k31j594J851J571o28j147j499P77M52j87
-246.6A191%j549l66r07Q90j161O02O25Q75q15J041J187j00k564K239k074j153rK221
-252.1A73K18K3J726n08q61K20P57j288J082l144j711k44L925n91j60j140N17k60J527
$$ plain form
-257.7 261 -814 -1366 -290 120 2059 2230 1356 580 190 850 2085 1762 1419 1865 -1015 241 1297 669
-263 669 2369 2346 459 1073 -723 -1355 732 1369 209 -801 163 199 -425 -116 184 -1243 450 415 -1310
-268.5 -1310 566 -259 -726 -3979 -4354 -1842 -2047 -1608 -1385 -91 -649 480 2021 533 -1610 -418 -913
-273.5 -913 65 572 1064 -226 -2055 -826 -1038 -2476 -899 137 -1210 1669 88 65 -863 -1470 -781 2191
-278.7 2191 2618 2034 1524 1378 -1573 -3176 104 -96 1472 548 1247 -216 -406 -168 1244 2493 2887 1336
-284 1336 1072 77 -618 -784 -1121 -738 -489 167 707 485 676 264 1026 -626 -206 -1379 -872 668 -429 -28
-289.8 -28 1341 -304 -95 -97 -1944 -358 1358 -366 -674 445 1369 155 554 -1481 -1029 667 58 234
-295.1 234 -666 -800 1166 1487 4302 1579 -132 -279 -1139 -3017 -2210 1652 -5 -139 -394 224 757 284
$$ packed form
-257.7B61j075n52J076M10J939J71q74p76l90O60J235l23l43M46k880J256J056o28
-263F69J700k3j887O14j796o32K087O37j160j010R64L6o24L09L00j427J693l5j725
-268.5a310J876q25m67l253l75K512k05M39K23J294n58J129J541j488k143J192m95
-273.5i13R78N07M92j290j829J229k12j438J577J036j347K879j581k3r28o07O89K972
-278.7B191M27n84n10j46k951j603L280k00J568r24O99j463j90K38J412J249L94j551
-284A336k64r95o95j66l37L83K49O56N40k22J91m12P62j652M20j173N07J540j097M01
-289.8b8J369j645K09kj847J586J716j724l08J119R24j214L99k035M52J696o09J76
-295.1B34r00j34J966L21K815k723j711j47q60j878Q07L862j657j34k55O18N33m73
$$ plain form
-300.4 284 -1523 -1424 -2101 429 -768 -896 -626 -727 -2410 1263 162 227 -236 -2057 115 1646 -198 -1338
-305.6 -1338 76 198 2096 -156 1470 1246 2650 1825 1648 -392 15 -204 -1843 -2174 -2011 168 -649 -3147
-310.9 -3147 -136 -357 129 795 867 -292 1844 1199 4666 1374 345 24 -760 75 -80 16 -64 -991 -799
-316.4 -799 -1588 -895 -1355 387 -1665 959 -80 1136 160 1176 -72 -578 1526 2538 -1159 -439 66
-321.4 66 2793 323 2356 1174 779 2544 1709 -164 -1359 -1423 -628 -1005 -207 -297 -203 739 543 -1223 1004
-327 1004 -619 -979 -1142 -1409 -719 -1211 186 504 -1002 -14 -972 234 902 -275 377 -1545 -1904 -1431 -1004
-332.5 -1004 -2016 494 313 1605 -224 -1186 -2120 330 1679 -727 1089 -633 1417 2537 1950 -591
-337.2 -591 -1607 -1694 1119 696 2666 24 -866 -1505 218 1329 -30 -798 563 1387 -681 -345 1533 384
$$ packed form
-300.4B84j807R9o77K530j197j28K70j01j683L673j101O5m63j821K172J531j844j140
-305.6a338J414J22J898k252J626k24J404q25j77k040M07k19j639l31J63K179q17k498
-310.9c147L011k21M86O66P2j159K136o45L467l292j029l21p84Q35j55R6q0r27J92
-316.4g99p89O93m60J742k052K624j039J216r76J016j248n06K104J012l697P20N05
-321.4F6K727k470K033j182l95J765q35j873j195o4P95l77P98r0R4R42j96j766K227
-327A004j623l60j63k67O90m92J397L18j506R88r58J206O68j177O52j922l59M73M27
-332.5a004j012K510j81J292j829r62r34K450J349k406J816j722K050J120n87k541
-337.2e91j016q7K813m23J970k642q90o39J723J111j359p68J361Q24k068L36J878j149
$$ plain form
-342.5 384 1258 1142 1488 564 -3283 -404 -205 1327 2078 -101 -945 -1197 -1657 -977 -2703 -793 -1468 1122
-347.7 1122 -115 715 -847 -621 386 908 2756 1031 -1404 -1198 54 -1829 -2028 -717 3 972 1825
-352.7 1825 -609 241 1573 1435 730 518 -38 1066 1592 2477 -851 -1324 598 835 -561 -833 -953 -1114
-358 -1114 666 1285 -616 -520 -1791 -1852 -1944 -2190 -721 -1058 -821 20 -496 -244 1175 1843 451 -357 -1050 0
-363.8 0 865 967 -396 2691 -340 -1705 -527 292 1215 991 -1492 1486 2196 2132 -183 -1917 -1892 -734 -1646
-369.4 -1646 -439 103 1226 -1513 -81 1983 274 852 147 330 639 1350 1997 433 -1872 -402 269
-374.3 269 -49 1458 742 1265 -409 -78 547 -1074 -350 158 214 1377 -452 793 -1818 -239 -1323 -2033
-379.6 -2033 -2042 -467 1291 587 824 2530 446 -244 54 -127 -1194 1370 390 -1333 -1430 -692 -1407 -847 -1414
$$ packed form
-342.5C84Q74j16L46r24l847K879J99J532P51k179q44k52m60O80j726J910o75K590
-347.7A122j237Q30j562K26J007N22J848j725k435K06J252j883j99J311P20R69Q53
-352.7A825k434Q50J332j38p05k12n56J104N26Q85l328m73J922K37j396k72j20j61
-358a114J780O19j901R6j271o1r2k46J469l37K37Q41n16K52J419O68j392q08o93J050
-363.8@Q65J02j363L087l031j365J178Q19R23k24k483K978P10o4k315j734K5J158r12
-369.4a646J207N42J123k739J432K064j709N78p05J83L09P11O47j564k305J470O71
-374.3B69l18J507p16N23j674L31O25j621P24N08N6J163j829J245k611J579j084p10
-379.6b033rJ575J758p04K37J706k084o90K98j81j067K564r80j723r7P38p15N60n67
$$ plain form
-385.1 -1414 877 188 -751 -2154 -143 2335 2108 -920 -1104 687 -1916 -2788 -943 -798 1155 2009 2490
-390.1 2490 740 2060 401 -782 1720 58 668 96 1963 756 -665 -39 -947 -138 -1504 -1247 -2122
-395.1 -2122 -1960 715 -129 -2330 -170 2111 3671 1426 463 -1728 546 -1535 42 -881 -925 623 2071
-400 2071 56 453 -989 3048 -486 44 132 537 699 -1674 -1080 -1773 -2169 -519 1299 -300 729 -196
-405.3 -196 485 1004 115 978 296 815 1959 1326 83 162 1729 988 612 923 1041 2351 -395 -1172 -739
-410.9 -739 77 -432 -2667 -222 -464 -1841 -1970 -295 185 -1502 -1742 -395 -1262 -31 1002 -1070 -1459 -697
-416.1 -697 -1778 -616 536 -771 -234 361 -63 -1080 -32 1301 1732 -190 -644 -212 103 957 1825 3751
-421.4 3751 1029 427 -295 163 -345 122 -428 815 1315 -819 -1933 -2079 -2345 -1405 1864 735 441 14
$$ packed form
-385.1a414K291o89r39j403K011K478k27l028j84J791k603q72J845J45J953Q54M81
-390.1B490j750J320j659j183K502j662O10n72J867j207j421O26r08Q09j366K57q75
-395.1b122J62K675q44k201K160K281J560k245r63k191K274k081J577r23m4J548J448
-400B071k015L97j442M037l534N30Q8M05J62k373N94o93l96J650J818j599J029r25
-405.3a96O81N19q89Q63o82N19J144o33j243P9J567p41l76L11J18J310k746p77M33
-410.9g39Q16n09k235K445k42j377j29J675M80j687k40J347q67J231J033k072l89P62
-416.1f97j081J162J152j307N37N95m24j017J048J333M31j922m54M32L15Q54Q68J926
-421.4C751k722o02p22M58n08M67n50J243N00k134j114j46k66R40L269j129k94m27
$$ plain form
-426.6 14 149 -3263 -2477 2071 1825 214 19 2137 2410 -969 -1502 -751 820 282 1790 2104 953 1241
-431.9 1241 1127 933 455 2106 1121 -1098 -479 441 1308 1612 1316 77 -41 -630 -874 -2291 -2388 -3118 -917
-437.5 -917 431 1030 -1325 1872 1244 415 334 -1939 -3224 -1678 168 279 -512 -230 -637 -18 -575 135 273
-443 273 795 567 3618 -539 -1663 -2530 -32 -240 -1006 -228 1919 1303 1685 2464 191 -317 1310 -648 -579
-448.6 -579 -1862 -3226 -2320 -2454 -3448 -916 400 1370 565 -1297 -2353 -1071 -639 878 146 -940 83
-453.5 83 989 1355 504 -938 -395 -141 1587 -304 648 -921 2616 3155 2002 1756 984 796 -485 -3476
-458.8 -3476 -989 2234 2333 1929 1704 -1516 -1391 -2187 464 2238 2001 -678 9 -1058 -1095 -1909 146 2157
-464.1 2157 2181 2213 1653 -1104 -1769 -3739 -1465 -1390 -1535 473 2037 197 1369 230 179 233 694 185 -561
$$ packed form
-426.6A4J35l412P86M548k46j611j95K118K73l379n33P51J571n38J508L14j151K88
-431.9A241j14j94m78J651r85k219O19R20Q67L04k96j239j18n89k44j417r7p30K201
-437.5i17J348N99k355L197o28q29q1k273j285J546J846J11p91K82m07O19n57P10J38
-443B73N22k28L051m157j124q67K498k08p66P78K147o16L82P79k273n08J627j958O9
-448.6e79j283j364R06j34r94K532J316R70q05j862j056J282M32J517p32j086J023
-453.5H3R06L66q51j442N43K54J728j891R52j569L537N39j153k46p72j88j281k991
-458.8c476K487L223R9m04k25l220J25p96K651J774k37k679O87j067l7q14K055K011
-464.1B157K4L2n60k757o65j970K274P5j45K008J564j840J172j139n1N4M61n09p46
$$ plain form
-469.6 -561 -1136 548 1381 374 -12 1225 2401 950 -1247 -1600 -938 -342 -1523 -1154 240 -479 -289 -435
-474.9 -435 -1108 -311 408 -497 -915 -361 -1222 1358 -201 -2220 -1477 509 347 1349 1814 1964 823 -10 -943
-480.4 -943 1024 1618 403 -754 -17 1614 740 842 -1030 -1624 1526 1294 779 -423 2000 992 1601 -511
-485.7 -511 -1800 -2859 -1452 -2941 -2268 -3047 -3473 -2171 310 -1796 -562 60 472 1323 2143 3006 2451 2215
-490.9 2215 1408 -167 -437 1840 1049 262 -191 591 1971 1003 -29 -987 -171 -888 1085 -322 1341 -143
-496.2 -143 -609 -2747 -1714 -1614 -442 -858 -373 -745 -609 58 5 -1097 -1488 -1928 -913 -1311 -629 -1059 1016
-501.8 1016 3084 11 -603 835 1775 1943 1007 1090 1323 2476 -1087 276 1477 -406 -124 1090 1659 1468
-507 1468 545 -426 -2 -576 552 1204 415 54 164 1750 404 -167 -284 -251 -741 -1141 -515 -1203 -1315 1871
$$ packed form
-469.6e61n75J684Q33j007l86J237J176j451k197l53O62N96j181L69J394p19J90j46
-474.9d35o73P97P19r05m18N54q61K580j559k019P43J986j62J002M65J50j141q33r33
-480.4i43J967N94j215j157P37J631q74J02j872n94L150k32n15j202K423j008O09k112
-485.7e11j289j059J407j489O73p79m26J302K481k106J234O22M12Q51Q20Q63n55k36
-490.9B215q07j575k70K277p91p87m53P82J380r68j032r58Q16p17J973j407J663j484
-496.2a43m66k138J033J00J172m16M85l72J36O67n3j102l91m40J015l98O82m30K075
-501.8A016K068l073o14J438R40J68r36Q3K33J153l563J363J201j883K82J214N69j91
-507A468r23r71M24n74J128O52p89l61J10J586j346n71j17L3m90m00O26o88j12L186
$$ plain form
-512.9 1871 254 -269 -1095 537 -2243 -1781 -30 708 -2291 1060 -1463 -1300 -2515 -1398 -1254 510 -131
-517.8 -131 -762 -1149 -216 1596 238 -604 513 -899 113 -383 373 -362 -1409 423 1784 364 1478
-522.8 1478 -148 2009 2040 3037 589 -1497 -1396 -113 -1301 -87 -329 -807 -613 -512 350 983 -452 463
-528.1 463 2440 -242 -414 -235 -90 488 1112 1735 1214 1342 259 586 1914 1017 -745 -181 57 1038 0
-533.6 0 -1367 -1308 838 706 -500 -158 -2296 -1132 -1280 -1240 -1153 -2663 -329 -1113 -1028 300 1105 -754 -97 1610
-539.5 1610 1742 -127 68 730 -1449 -2861 123 -918 929 338 -221 1206 1537 832 339 -404 -638 -2474
-544.7 -2474 -980 -411 1042 70 1920 1222 1035 954 1863 600 -676 -492 -907 -94 959 176 -1145 -789
-550 -789 65 941 994 674 222 -1475 -990 -93 1147 1116 951 -25 -970 684 -291 -381 -575 -3231 84 497 340
$$ packed form
-512.9A871j617n23q26J632k780M62J751P38k999L351k523J63j215J117J44J764o41
-517.8a31o31l87R33J812j358q42J117j412J012m96P56p35j047J832J361j420J114
-522.8A478j626K157L1R97k448k086J01J283j188J214k42m78J94J01Q62O33j435R15
-528.1D63J977k682j72J79J45N78O24O23n21J28j083L27J328q97j762N64K38R81j038
-533.6@j367N9K146j32j206L42k138J164j48M0Q7j510K334p84Q5J328Q05j859O57J707
-539.5A610J32j869J95O62k179j412K984j041J847n91n59J427L31p05m93p43k34j836
-544.7b474J494N69J453r72J850o98j87q1R09j263j276J84m15Q13J053p83j321L56
-550g89Q54Q76N3l20m52j697M85Q97J240l1j65r76r45J654r75r0j94k656L315M13j57
$$ plain form
-556.1 340 -556 -1057 354 1165 1400 759 2091 1367 145 -37 -726 978 799 -491 -1646 -733 -483 188 269
-561.7 269 -1028 -1879 153 1705 -37 -1356 -768 -105 -1064 -2280 -667 -461 1804 -534 33 -1911 654
-566.7 654 1019 -23 -902 -398 1009 703 -58 -127 129 594 454 555 -457 -490 -387 -44 254 -939 -604 1753
-572.5 1753 803 2002 839 1697 97 -13 -526 1797 2368 533 -699 742 -842 71 298 327 62 -224
-577.8 -224 -1871 -560 -700 -684 -837 -1025 -1847 -579 522 -659 105 -261 -1712 -1867 -828 -1042 -1183 853
-583 853 747 499 345 -553 -902 -70 1307 1018 163 1132 2059 1256 876 1982 403 -885 -1460 1036 -348
-588.6 -348 205 794 1847 1598 -742 -807 -122 -1712 -1899 -518 -657 -646 25 774 -336 119 398 -703 203
$$ packed form
-556.1C40q96n01J411Q11K35o41J332p24j222j82o89J704j79j290j155R13K50O71Q1
-561.7B69j297q51K032J552j742j319N88O63r59j216J613K06K265k338N67j944K565
-566.7F54L65j042q79N04J407l06p61o9K56M65j40J01j012l3J03L43K98j193L35K357
-572.5A753r50J199j163Q58j600j10n13K323N71j835j232J441j584R13K27K9k65k86
-577.8b24j647J311j40J6j53j88q22J268J101j181P64l66j451j55J039k14j41K036
-583H53j06k48j54q98l49Q32J377k89q55R69R27q03l80J106j579j288n75K496j384
-588.6c48N53N89J053k49k340o5O85j590j87J381j39J1O71P49j110M55K79j101R06
-594.1B03
$$ =====================================================
$$ Start of Advanced Chemistry Development specific data
$$ =====================================================
##$INTEGRALS=ACDTABLE(X1,X2,LogValue)
(1.8652,2.1253,3.073)
(6.675,6.752,1.9999)
(7.3253,7.4023,1.9835)
(8.9849,9.3135,1.0261)
(9.5188,9.8201,1.0136)

$$ =====================================================
$$ End of Advanced Chemistry Development specific data
$$ =====================================================
##END=$$ End of the data block
##END=$$ End of the link block
