##TITLE=  ethanolamine
##JCAMP-DX=4.24
##DATA TYPE=LINK
##BLOCKS =2
##ORIGIN= Department of Chemistry, UWI, JAMAICA
##OWNER= public domain
##LONGDATE= 2011/04/21 09:47:11.0754 -0500 $$ export date from JSpecView
##TITLE= ethanolamine
##JCAMP-DX= 5.01
##DATA TYPE= INFRARED SPECTRUM
##DATA CLASS= XYDATA
##BLOCK ID=1
##ORIGIN= Department of Chemistry, UWI, JAMAICA
##OWNER= public domain
##LONGDATE= 2011/04/21 09:47:11.0754 -0500 $$ export date from JSpecView
##$MODELS=
<Models>
<ModelData id="EA" type="MOL">
ethanolamine
RLDSViewer          3D                             0

 11 10  0  0  0  0  0  0  0  0999 V2000
    0.0123   -0.0126   -0.0215 C   0  0  0  0  0  0  0  0  0  1
    1.5413    0.0270   -0.0245 C   0  0  0  0  0  0  0  0  0  2
    2.0118    1.4135   -0.0173 N   0  0  0  0  0  0  0  0  0  3
   -0.4962   -1.3389   -0.0726 O   0  0  0  0  0  0  0  0  0  4
   -0.3634    0.5002   -0.9107 H   0  0  0  0  0  0  0  0  0  5
   -0.3736    0.5344    0.8559 H   0  0  0  0  0  0  0  0  0  6
    1.9136   -0.5862    0.8198 H   0  0  0  0  0  0  0  0  0  7
    1.8951   -0.4575   -0.9408 H   0  0  0  0  0  0  0  0  0  8
    3.0158    1.4440   -0.1721 H   0  0  0  0  0  0  0  0  0  9
    1.8525    1.8323    0.8964 H   0  0  0  0  0  0  0  0  0 10
   -0.2283   -1.7871    0.7404 H   0  0  0  0  0  0  0  0  0 11
  1  4  1  0  0  0
  1  2  1  0  0  0
  1  5  1  0  0  0
  1  6  1  0  0  0
  2  3  1  0  0  0
  2  8  1  0  0  0
  2  7  1  0  0  0
  3  9  1  0  0  0
  3 10  1  0  0  0
  4 11  1  0  0  0
M  END
</ModelData>
<ModelData id="1" type="XYZVIB" baseModel="EA" vibrationScale=".5">
 11
Model[1]: Jmol 12.1.43_dev  2011-02-16 09:29
C     0.01231   -0.01259   -0.02146
C     1.54132    0.02698   -0.02446
N     2.01181    1.41354   -0.01735
O    -0.49623   -1.33890   -0.07258
H    -0.36340    0.50021   -0.91070
H    -0.37364    0.53445    0.85587
H     1.91355   -0.58616    0.81981
H     1.89508   -0.45750   -0.94078
H     3.01578    1.44403   -0.17213
H     1.85253    1.83232    0.89642
H    -0.22835   -1.78711    0.74040
11
Model[2]: PATH=Frequencies;IRIntensity=2.30 km/mol;Frequency=145.98 cm^-1
C     0.01231   -0.01259   -0.02146    0.00357    0.00168   -0.11947
C     1.54132    0.02698   -0.02446    0.00518   -0.00080   -0.11591
N     2.01181    1.41354   -0.01735   -0.00703    0.00058    0.10565
O    -0.49623   -1.33890   -0.07258   -0.00247   -0.00342    0.10449
H    -0.36340    0.50021   -0.91070   -0.01201   -0.13732   -0.19308
H    -0.37364    0.53445    0.85587    0.01811    0.14499   -0.20208
H     1.91355   -0.58616    0.81981   -0.01078   -0.12139   -0.19590
H     1.89508   -0.45750   -0.94078    0.03342    0.13134   -0.17484
H     3.01578    1.44403   -0.17213   -0.01020    0.04204    0.09527
H     1.85253    1.83232    0.89642   -0.00448   -0.15337    0.17628
H    -0.22835   -1.78711    0.74040    0.01864    0.12949    0.17083
11
Model[3]: PATH=Frequencies;IRIntensity=16.85 km/mol;Frequency=239.01 cm^-1
$$ [...]
H     3.01578    1.44403   -0.17213    0.74322    0.02435   -0.11942
H     1.85253    1.83232    0.89642    0.08602   -0.24045   -0.52626
H    -0.22835   -1.78711    0.74040    0.00007   -0.00019    0.00063
11
Model[28]: PATH=Frequencies;IRIntensity=12.05 km/mol;Frequency=3809.19 cm^-1
C     0.01231   -0.01259   -0.02146   -0.00156   -0.00019   -0.00256
C     1.54132    0.02698   -0.02446    0.00022   -0.00048    0.00024
N     2.01181    1.41354   -0.01735   -0.00009   -0.00004    0.00000
O    -0.49623   -1.33890   -0.07258   -0.01555    0.02973   -0.05020
H    -0.36340    0.50021   -0.91070    0.00543   -0.00361    0.01355
H    -0.37364    0.53445    0.85587   -0.00131   -0.00284    0.00216
H     1.91355   -0.58616    0.81981    0.00137    0.00174   -0.00193
H     1.89508   -0.45750   -0.94078   -0.00020    0.00028    0.00007
H     3.01578    1.44403   -0.17213   -0.00068   -0.00048    0.00002
H     1.85253    1.83232    0.89642    0.00001    0.00023    0.00025
H    -0.22835   -1.78711    0.74040    0.25938   -0.45849    0.81026
</ModelData>
</Models>
##$PEAKS=
<Peaks type="IR" xUnitsExpected="1/cm"  >
<PeakData id="1" title="OH stretch (~3400 cm-1)" peakShape="broad" model="1.28" xMax="3375" xMin="3335"    />
<PeakData id="2" title="asymm stretch of NH2 group (~3290 cm-1)" peakShape="broad" model="1.27" xMax="3310" xMin="3270"    />
<PeakData id="3" title="symm stretch of NH2 group (~3170 cm-1)" peakShape="broad" model="1.26" xMax="3220" xMin="3120"    />
<PeakData id="4" title="asymm stretch of CH2 group (~2925 cm-1)" peakShape="broad" model="1.25" xMax="2955" xMin="2895"    />
<PeakData id="5" title="symm bend of CH2 group (~2858 cm-1)" peakShape="broad" model="1.24" xMax="2888" xMin="2828"    />
<PeakData id="6" title="Carbonyl stretching band (~1685 cm-1)" peakShape="broad" model="1.21" xMax="1635" xMin="1575"    />
<PeakData id="7" title="C-C of aromatic group (~1600 cm-1)" peakShape="broad" model="1.20" xMax="1490" xMin="1430"    />
<PeakData id="8" title="symm stretch of CH3 group (~1450 cm-1)" peakShape="broad" model="1.19" xMax="1395" xMin="1335"    />
<PeakData id="9" title="C-H twist of methyl group (~1360 cm-1)" peakShape="broad" model="1.16" xMax="1260" xMin="1220"    />
<PeakData id="10" title="scissors of aromatic C-H groups (~1265 cm-1" peakShape="broad" model="1.13" xMax="1192" xMin="1152"    />
<PeakData id="11" title="symm stretch of CH3 group (~1080 cm-1)" peakShape="broad" model="1.12" xMax="1095" xMin="1065"    />
<PeakData id="12" title="symm stretch of CH group (~1025 cm-1)" peakShape="broad" model="1.10" xMax="1050" xMin="1015"    />
<PeakData id="13" title=" (~955 cm-1" peakShape="broad" model="1.9" xMax="960" xMin="920"    />
<PeakData id="14" title=" (~760 cm-1)" peakShape="broad" model="1.6" xMax="892" xMin="852"    />
</Peaks>
##XUNITS= 1/CM
##YUNITS= TRANSMITTANCE
##XFACTOR= 3.39838861E-3
##YFACTOR= 8.76278995E-7
##FIRSTX= 599.8394
##FIRSTY= 0.42957044
##LASTX= 3998.22801094
##NPOINTS= 3525
##XYDATA= (X++(Y..Y))
176507D90221D82958D77431D73462D70911D69565D72895D76261D78352D77537
$$ 490221 482958 477431 473462 470911 469565 472895 476261 478352 477537
179345D76509D76616D77537D77997D77183D75092D72470D69919D67864D66270
$$ 476509 476616 477537 477997 477183 475092 472470 469919 467864 466270
182182D65065D64250D63683D63294D62904D62372D61841D61345D60849D60176
$$ 465065 464250 463683 463294 462904 462372 461841 461345 460849 460176
185020D58865D56739D54046D51318D49192D47952D47527D47491D47350D46677
$$ 458865 456739 454046 451318 449192 447952 447527 447491 447350 446677
187858D45295D43311D40901D38315D35870D33815D32221D30910D29670D28182
$$ 445295 443311 440901 438315 435870 433815 432221 430910 429670 428182
190695D26410D24426D22477D20670D19111D17765D16738D16064D15745D15639
$$ 426410 424426 422477 420670 419111 417765 416738 416064 415745 415639
193533D15745D16171D17198D19147D21592D23221D22158D16808D07207C95479
$$ 415745 416171 417198 419147 421592 423221 422158 416808 407207 395479
196371C85027C79110C79358C85310C94629D03912D10218D12450D11281D08624
$$ 385027 379110 379358 385310 394629 403912 410218 412450 411281 408624
199208D06108D04549D03841D03557D03274D02955D02778D02849D03274D03876
$$ 406108 404549 403841 403557 403274 402955 402778 402849 403274 403876
202046D04549D05187D05719D06215D06604D06994D07384D07844D08411D08978
$$ 404549 405187 405719 406215 406604 406994 407384 407844 408411 408978
204884D09474D09793D09899D09899D09935D10041D10254D10431D10537D10395
$$ 409474 409793 409899 409899 409935 410041 410254 410431 410537 410395
207722D09970D09368D08588D07703D06852D06108D05506D05081D04762D04443
$$ 409970 409368 408588 407703 406852 406108 405506 405081 404762 404443
210559D03947D03097D01892D00404C98880C97569C96542C95833C95302C94735
$$ 403947 403097 401892 400404 398880 397569 396542 395833 395302 394735
213397C94062C93211C92326C91475C90767C90164C89598C88995C88287C87472
$$ 394062 393211 392326 391475 390767 390164 389598 388995 388287 387472
216235C86550C85558C84531C83468C82334C81165C80031C78933C77941C77090
$$ 386550 385558 384531 383468 382334 381165 380031 378933 377941 377090
219072C76311C75602C74787C73795C72555C71103C69508C67808C66213C64725
$$ 376311 375602 374787 373795 372555 371103 369508 367808 366213 364725
221910C63308C61926C60509C58985C57426C55903C54379C52962C51545C50057
$$ 363308 361926 360509 358985 357426 355903 354379 352962 351545 350057
224748C48498C46797C44990C43077C41022C38896C36628C34361C32093C29932
$$ 348498 346797 344990 343077 341022 338896 336628 334361 332093 329932
227585C27842C25893C23980C22173C20472C19019C17850C16964C16256C15547
$$ 327842 325893 323980 322173 320472 319019 317850 316964 316256 315547
230423C14661C13457C11898C10055C08071C06052C04067C02119C00205B98328
$$ 314661 313457 311898 310055 308071 306052 304067 302119 300205 298328
233261B96485B94749B93119B91667B90249B88903B87486B86069B84651B83234
$$ 296485 294749 293119 291667 290249 288903 287486 286069 284651 283234
236098B81817B80400B78876B77069B74943B72499B69735B66794B63676B60452
$$ 281817 280400 278876 277069 274943 272499 269735 266794 263676 260452
238936B57122B53720B50213B46740B43268B39973B36749B33631B30548B27466
$$ 257122 253720 250213 246740 243268 239973 236749 233631 230548 227466
241774B24384B21336B18325B15455B12727B10140B07625B05145B02629B00149
$$ 224384 221336 218325 215455 212727 210140 207625 205145 202629 200149
244611A97704A95366A93169A91079A89059A87146A85303A83567A81902A80414
$$ 197704 195366 193169 191079 189059 187146 185303 183567 181902 180414
247449A79067A77827A76729A75666A74745A73859A73080A72300A71521A70599
$$ 179067 177827 176729 175666 174745 173859 173080 172300 171521 170599
250287A69466A68048A66312A64293A61990A59368A56498A53416A50120A46790
$$ 169466 168048 166312 164293 161990 159368 156498 153416 150120 146790
253124A43530A40448A37826A35736A34354A33787A34035A35062A36834A39243
$$ 143530 140448 137826 135736 134354 133787 134035 135062 136834 139243
255962A42184A45621A49412A53522A57880A62450A67234A72265A77544A83107
$$ 142184 145621 149412 153522 157880 162450 167234 172265 177544 183107
258800A88953A94940B00964B06810B12302B17191B21407B24773B27289B28919
$$ 188953 194940 200964 206810 212302 217191 221407 224773 227289 228919
261638B29769B30017B29804B29238B28387B27289B25942B24419B22754B21053
$$ 229769 230017 229804 229238 228387 227289 225942 224419 222754 221053
264475B19352B17616B15880B14073B12195B10353B08510B06774B05109B03479
$$ 219352 217616 215880 214073 212195 210353 208510 206774 205109 203479
267313B01885B00255A98625A97031A95437A93842A92177A90405A88527A86614
$$ 201885 200255 198625 197031 195437 193842 192177 190405 188527 186614
270151A84630A82717A80910A79174A77579A76056A74639A73257A71875A70529
$$ 184630 182717 180910 179174 177579 176056 174639 173257 171875 170529
272988A69147A67765A66419A65143A63974A62946A62025A61246A60573A59970
$$ 169147 167765 166419 165143 163974 162946 162025 161246 160573 159970
275826A59439A58943A58553A58270A58092A58022A58022A58057A58199A58376
$$ 159439 158943 158553 158270 158092 158022 158022 158057 158199 158376
278664A58730A59191A59864A60714A61671A62769A63938A65214A66631A68190
$$ 158730 159191 159864 160714 161671 162769 163938 165214 166631 168190
281501A69855A71662A73540A75489A77509A79563A81654A83780A85976A88279
$$ 169855 171662 173540 175489 177509 179563 181654 183780 185976 188279
284339A90760A93417A96251A99228B02239B05251B08192B11097B13967B16943
$$ 190760 193417 196251 199228 202239 205251 208192 211097 213967 216943
287177B19990B23143B26297B29415B32426B35367B38131B40823B43304B45642
$$ 219990 223143 226297 229415 232426 235367 238131 240823 243304 245642
290014B47732B49504B50921B51984B52693B53153B53437B53543B53649B53720
$$ 247732 249504 250921 251984 252693 253153 253437 253543 253649 253720
292852B53862B54145B54641B55456B56696B58433B60700B63428B66617B70160
$$ 253862 254145 254641 255456 256696 258433 260700 263428 266617 270160
295690B74022B78168B82419B86671B90710B94253B96946B98576B98895B97761
$$ 274022 278168 282419 286671 290710 294253 296946 298576 298895 297761
298527B95033B90639B84439B76396B66582B55244B42737B29556B16270B03302
$$ 295033 290639 284439 276396 266582 255244 242737 229556 216270 203302
301365A91220A80308A70883A63053A56923A52388A49376A47782A47463A48349
$$ 191220 180308 170883 163053 156923 152388 149376 147782 147463 148349
304203A50298A53238A57136A61919A67588A74143A81689A90405B00432B11983
$$ 150298 153238 157136 161919 167588 174143 181689 190405 200432 211983
307040B25198B40186B56909B75191B94785C15228C35884C55974C74610C90979
$$ 225198 240186 256909 275191 294785 315228 335884 355974 374610 390979
309878D04372D14257D20387D22796D21733D17659D11033D02423C92290C81023
$$ 404372 414257 420387 422796 421733 417659 411033 402423 392290 381023
312716C69048C56611C43892C31030C18169C05308B92552B80116B68141B57015
$$ 369048 356611 343892 331030 318169 305308 292552 280116 268141 257015
315554B47024B38485B31718B26970B24348B23958B25836B30017B36465B45181
$$ 247024 238485 231718 226970 224348 223958 225836 230017 236465 245181
318391B56271B69770B85714C04209C25255C48710C74327D01538D29563D57306
$$ 256271 269770 285714 304209 325255 348710 374327 401538 429563 457306
321229D83525E07122E27140E43190E55237E63669E69126E72314E74086E75326
$$ 483525 507122 527140 543190 555237 563669 569126 572314 574086 575326
324067E76743E78975E82412E87231E93467F00942F09588F19154F29429F40164
$$ 576743 578975 582412 587231 593467 600942 609588 619154 629429 640164
326904F51077F61919F72548F82965F93240G03550G13931G24384G34836G45181
$$ 651077 661919 672548 682965 693240 703550 713931 724384 734836 745181
329742G55315G65306G75120G84758G94218H03288H11827H19657H26672H32837
$$ 755315 765306 775120 784758 794218 803288 811827 819657 826672 832837
332580H38152H42723H46726H50340H53600H56682H59623H62387H64938H67241
$$ 838152 842723 846726 850340 853600 856682 859623 862387 864938 867241
335417H69154H70607H71563H72059H72130H71847H71244H70252H68764H66780
$$ 869154 870607 871563 872059 872130 871847 871244 870252 868764 866780
338255H64264H61359H58099H54592H50907H46974H42829H38471H34077H29826
$$ 864264 861359 858099 854592 850907 846974 842829 838471 834077 829826
341093H25716H21818H18063H14342H10728H07363H04493H02260H00772G99957
$$ 825716 821818 818063 814342 810728 807363 804493 802260 800772 799957
343930G99709G99922H00631H01871H03855H06583H10055H14059H18488H23094
$$ 799709 799922 800631 801871 803855 806583 810055 814059 818488 823094
346768H27806H32696H37798H43077H48569H54202H59871H65469H70961H76311
$$ 827806 832696 837798 843077 848569 854202 859871 865469 870961 876311
349606H81484H86480H91227H95692H99766I03451I06675I09510I11954I14080
$$ 881484 886480 891227 895692 899766 903451 906675 909510 911954 914080
352443I15958I17659I19182I20458I21521I22265I22761I23080I23257I23399
$$ 915958 917659 919182 920458 921521 922265 922761 923080 923257 923399
355281I23469I23434I23221I22796I21981I20812I19218I17269I14931I12273
$$ 923469 923434 923221 922796 921981 920812 919218 917269 914931 912273
358119I09297I06002I02459H98668H94770H90802H86834H82972H79181H75602
$$ 909297 906002 902459 898668 894770 890802 886834 882972 879181 875602
360956H72236H69118H66319H63839H61607H59658H57887H56328H54911H53635
$$ 872236 869118 866319 863839 861607 859658 857887 856328 854911 853635
363794H52537H51687H51226H51297H51970H53281H55088H57249H59552H61855
$$ 852537 851687 851226 851297 851970 853281 855088 857249 859552 861855
366632H64123H66426H68800H71173H73441H75390H76807H77551H77657H77338
$$ 864123 866426 868800 871173 873441 875390 876807 877551 877657 877338
369470H76772H76098H75496H74929H74469H74114H73973H74114H74646H75531
$$ 876772 876098 875496 874929 874469 874114 873973 874114 874646 875531
372307H76736H78118H79500H80811H81944H82830H83397H83681H83574H83220
$$ 876736 878118 879500 880811 881944 882830 883397 883681 883574 883220
375145H82582H81803H80882H79819H78508H76949H75106H73051H70748H68304
$$ 882582 881803 880882 879819 878508 876949 875106 873051 870748 868304
377983H65646H62705H59410H55761H51793H47647H43537H39640H35991H32625
$$ 865646 862705 859410 855761 851793 847647 843537 839640 835991 832625
380820H29507H26531H23590H20578H17496H14272H10906H07363H03571G99497
$$ 829507 826531 823590 820578 817496 814272 810906 807363 803571 799497
383658G95103G90497G85856G81321G77246G73774G71117G69239G68034G67326
$$ 795103 790497 785856 781321 777246 773774 771117 769239 768034 767326
386496G67078G67078G67326G67609G67786G67609G66901G65554G63605G61196
$$ 767078 767078 767326 767609 767786 767609 766901 765554 763605 761196
389333G58468G55563G52516G49256G45748G41922G37776G33241G28423G23498
$$ 758468 755563 752516 749256 745748 741922 737776 733241 728423 723498
392171G18573G14002G09821G06066G02346F98271F93311F87146F79812F71592
$$ 718573 714002 709821 706066 702346 698271 693311 687146 679812 671592
395009F62911F54124F45408F36692F27799F18516F08844E98994E89427E80641
$$ 662911 654124 645408 636692 627799 618516 608844 598994 589427 580641
397846E73129E67283E63244E61189E61083E62961E66787E72385E79330E87089
$$ 573129 567283 563244 561189 561083 562961 566787 572385 579330 587089
400684E95026F02749F10119F17347F24858F33043F42042F51857F62273F73080
$$ 595026 602749 610119 617347 624858 633043 642042 651857 662273 673080
403522F83957F94551G04436G13329G20911G27253G32497G36855G40575G43622
$$ 683957 694551 704436 713329 720911 727253 732497 736855 740575 743622
406359G46138G48193G50071G51878G53614G55031G55740G55598G54712G53756
$$ 746138 748193 750071 751878 753614 755031 755740 755598 754712 753756
409197G53543G54641G57405G61550G66582G71790G76538G80435G83376G85537
$$ 753543 754641 757405 761550 766582 771790 776538 780435 783376 785537
412035G87238G88797G90427G91915G93048G93403G92836G91490G89612G87486
$$ 787238 788797 790427 791915 793048 793403 792836 791490 789612 787486
414872G85218G82738G80152G77742G75900G74943G74872G75050G74731G73172
$$ 785218 782738 780152 777742 775900 774943 774872 775050 774731 773172
417710G70054G65696G60700G55704G51098G46988G43304G39973G36855G33808
$$ 770054 765696 760700 755704 751098 746988 743304 739973 736855 733808
420548G30690G27431G23923G20309G16660G12833G08404G02842F95685F86862
$$ 730690 727431 723923 720309 716660 712833 708404 702842 695685 686862
423386F77012F67127F58340F51467F46932F44735F44452F45585F47499F49483
$$ 677012 667127 658340 651467 646932 644735 644452 645585 647499 649483
426223F50794F51006F50014F48384F46861F46188F46648F47853F48880F48845
$$ 650794 651006 650014 648384 646861 646188 646648 647853 648880 648845
429061F47392F44912F42609F41617F42715F45762F49908F54053F57490F60325
$$ 647392 644912 642609 641617 642715 645762 649908 654053 657490 660325
431899F63407F67836F74355F82894F92531G01920G09715G15207G18502G20380
$$ 663407 667836 674355 682894 692531 701920 709715 715207 718502 720380
434736G21832G23675G26368G29946G34198G39016G44544G51027G58787G67857
$$ 721832 723675 726368 729946 734198 739016 744544 751027 758787 767857
437574G77671G87167G95139H00772H04032H05874H07575H10410H14945H20826
$$ 777671 787167 795139 800772 804032 805874 807575 810410 814945 820826
440412H27062H32448H36274H38683H40774H44246H50553H60367H73016H86373
$$ 827062 832448 836274 838683 840774 844246 850553 860367 873016 886373
443249H97640I04230I05010I00865H94239H87968H84177H83610H85771H89562
$$ 897640 904230 905010 900865 894239 887968 884177 883610 885771 889562
446087H93920H98136I01998I05400I08234I10254I11387I11813I11671I11210
$$ 893920 898136 901998 905400 908234 910254 911387 911813 911671 911210
448925I10395I09226I07951I07029I07029I08234I10218I12273I13620I14222
$$ 910395 909226 907951 907029 907029 908234 910218 912273 913620 914222
451762I14683I16135I19289I24001I29174I33142I34524I32752I28288I22158
$$ 914683 916135 919289 924001 929174 933142 934524 932752 928288 922158
454600I15604I09651I04939I01609H99447H97888H96365H94629H93034H92326
$$ 915604 909651 904939 901609 899447 897888 896365 894629 893034 892326
457438H93353H96294I00262I03345I03345H98845H89916H78047H65611H54663
$$ 893353 896294 900262 903345 903345 898845 889916 878047 865611 854663
460275H46301H40455H36062H31845H26637H19905H11862H03075G94147G85502
$$ 846301 840455 836062 831845 826637 819905 811862 803075 794147 785502
463113G76927G67999G58043G46634G33844G20096G06207F92673F79812F67517
$$ 776927 767999 758043 746634 733844 720096 706207 692673 679812 667517
465951F55506F43707F32086F20925F10438F00872E92297E84680E77948E72137
$$ 655506 643707 632086 620925 610438 600872 592297 584680 577948 572137
468789E67248E63315E60268E58036E56689E56264E56902E58673E61508E65334
$$ 567248 563315 560268 558036 556689 556264 556902 558673 561508 565334
471626E69940E75184E81137E87868E95451F03671F12316F21067F29889F39031
$$ 569940 575184 581137 587868 595451 603671 612316 621067 629889 639031
474464F48845F59687F71450F83709F95791G07129G17652G27608G37528G47768
$$ 648845 659687 671450 683709 695791 707129 717652 727608 737528 747768
477302G58362G69062G79478G89364G98540H06973H14697H21889H28904H36380
$$ 758362 769062 779478 789364 798540 806973 814697 821889 828904 836380
480139H44884H54627H65327H75992H85346H92219H96117H97428H97286H97251
$$ 844884 854627 865327 875992 885346 892219 896117 897428 897286 897251
482977H98739I02707I09049I16915I24780I31122I35197I37465I39236I42000
$$ 898739 902707 909049 916915 924780 931122 935197 937465 939236 942000
485815I46287I51460I55570I56739I54082I48448I42035I37323I35764I37287
$$ 946287 951460 955570 956739 954082 948448 942035 937323 935764 937287
488652I40512I43594I45401I45862I45933I46747I48944I52275I55782I58404
$$ 940512 943594 945401 945862 945933 946747 948944 952275 955782 958404
491490I59644I59715I59325I59077I59184I59325I59148I58581I58298I59290
$$ 959644 959715 959325 959077 959184 959325 959148 958581 958298 959290
494328I62479I67900I74490I80513I84233I84729I82249I77927I73214I69317
$$ 962479 967900 974490 980513 984233 984729 982249 977927 973214 969317
497165I66801I65738I66093I67793I70840I75021I79911I84836I88910I91603
$$ 966801 965738 966093 967793 970840 975021 979911 984836 988910 991603
500003I92630I92205I90717I88839I86997I85544I84446I83596I82639I81505
$$ 992630 992205 990717 988839 986997 985544 984446 983596 982639 981505
502841I80300I79521I79840I81859I85757I91142I97059A002161A005208A005421
$$ 980300 979521 979840 981859 985757 991142 997059 1002161 1005208 1005421
505678A002905I98406I93268I88733I85686I84340I84269I84906I85792I86997
$$ 1002905 998406 993268 988733 985686 984340 984269 984906 985792 986997
508516I88910I92028I96421A001488A006130A009035A009389A007192A003330
$$ 988910 992028 996421 1001488 1006130 1009035 1009389 1007192 1003330
511070I99221I96138I94721I94898I95996I97201I97980I98370I98866I99929
$$ 999221 996138 994721 994898 995996 997201 997980 998370 998866 999929
513908A001878A004323A006519A007618A007122A005067A002197I99362I97307
$$ 1001878 1004323 1006519 1007618 1007122 1005067 1002197 999362 997307
516462I96492I96776I97910I99327A000602A001417A001630A001205A000390I99469
$$ 996492 996776 997910 999327 1000602 1001417 1001630 1001205 1000390 999469
519299I98937I99150A000354A002551A005385A008255A010523A011621A011267
$$ 998937 999150 1000354 1002551 1005385 1008255 1010523 1011621 1011267
521853A009637A007263A004819A002976A002020A001949A002480A003189A003756
$$ 1009637 1007263 1004819 1002976 1002020 1001949 1002480 1003189 1003756
524407A003897A003579A002834A001913A001169A001098A002020A004039A006767
$$ 1003897 1003579 1002834 1001913 1001169 1001098 1002020 1004039 1006767
526961A009495A011302A011657A010523A008539A006555A005421A005421A006342
$$ 1009495 1011302 1011657 1010523 1008539 1006555 1005421 1005421 1006342
529515A007547A008326A008149A007015A005208A003366A002055A001665A002232
$$ 1007547 1008326 1008149 1007015 1005208 1003366 1002055 1001665 1002232
532069A003366A004535A005173A005031A004252A003189A002303A001772A001594
$$ 1003366 1004535 1005173 1005031 1004252 1003189 1002303 1001772 1001594
534623A001488A001311A001098A001063A001488A002445A003791A005244A006555
$$ 1001488 1001311 1001098 1001063 1001488 1002445 1003791 1005244 1006555
537177A007653A008610A009566A010310A010558A009991A008503A006448A004358
$$ 1007653 1008610 1009566 1010310 1010558 1009991 1008503 1006448 1004358
539731A002764A001878A001559A001594A001807A002338A003472A005385A007866
$$ 1002764 1001878 1001559 1001594 1001807 1002338 1003472 1005385 1007866
542285A010417A012224A012791A012011A010204A007937A005740A003968A002693
$$ 1010417 1012224 1012791 1012011 1010204 1007937 1005740 1003968 1002693
544838A001913A001559A001488A001665A001984A002338A002551A002622A002480
$$ 1001913 1001559 1001488 1001665 1001984 1002338 1002551 1002622 1002480
547392A002268A002020A002020A002516A003720A005704A008149A010523A012117
$$ 1002268 1002020 1002020 1002516 1003720 1005704 1008149 1010523 1012117
549946A012365A011232A009035A006484A004323A002905A002268A002197A002374
$$ 1012365 1011232 1009035 1006484 1004323 1002905 1002268 1002197 1002374
552500A002586A002834A003118A003437A003685A003862A004004A004287A004854
$$ 1002586 1002834 1003118 1003437 1003685 1003862 1004004 1004287 1004854
555054A005811A006980A008043A008716A008751A008291A007653A007122A006909
$$ 1005811 1006980 1008043 1008716 1008751 1008291 1007653 1007122 1006909
557608A006874A006803A006484A005917A005244A004677A004393A004358A004393
$$ 1006874 1006803 1006484 1005917 1005244 1004677 1004393 1004358 1004393
560162A004500A004677A005067A005811A006732A007653A008114A008007A007370
$$ 1004500 1004677 1005067 1005811 1006732 1007653 1008114 1008007 1007370
562716A006696A006413A006803A007795A008999A010027A010629A010771A010736
$$ 1006696 1006413 1006803 1007795 1008999 1010027 1010629 1010771 1010736
565270A010665A010629A010523A010204A009531A008681A007830A007192A006874
$$ 1010665 1010629 1010523 1010204 1009531 1008681 1007830 1007192 1006874
567824A006803A006909A007051A007122A007051A006944A006803A006767A007122
$$ 1006803 1006909 1007051 1007122 1007051 1006944 1006803 1006767 1007122
570378A007901A009141A010594A011905A012649A012684A011976A010842A009637
$$ 1007901 1009141 1010594 1011905 1012649 1012684 1011976 1010842 1009637
572932A008574A007830A007370A007192A007299A007618A008149A008716A009177
$$ 1008574 1007830 1007370 1007192 1007299 1007618 1008149 1008716 1009177
575485A009389A009354A009177A008999A008893A008964A009177A009566A010133
$$ 1009389 1009354 1009177 1008999 1008893 1008964 1009177 1009566 1010133
578039A010842A011621A012330A012791A012932A012826A012507A012259A012188
$$ 1010842 1011621 1012330 1012791 1012932 1012826 1012507 1012259 1012188
580593A012330A012684A013074A013428A013641A013676A013570A013393A013251
$$ 1012330 1012684 1013074 1013428 1013641 1013676 1013570 1013393 1013251
583147A013251A013428A013747A014172A014668A015271A016015A016936A017893
$$ 1013251 1013428 1013747 1014172 1014668 1015271 1016015 1016936 1017893
585701A018743A019274A019381A019026A018389A017680A017042A016582A016298
$$ 1018743 1019274 1019381 1019026 1018389 1017680 1017042 1016582 1016298
588255A016121A016050A016050A016192A016369A016582A016794A016936A017042
$$ 1016121 1016050 1016050 1016192 1016369 1016582 1016794 1016936 1017042
590809A017113A017149A017113A017113A017149A017326A017645A018141A018601
$$ 1017113 1017149 1017113 1017113 1017149 1017326 1017645 1018141 1018601
593363A018955A019097A019026A018814A018566A018424A018353A018353A018353
$$ 1018955 1019097 1019026 1018814 1018566 1018424 1018353 1018353 1018353
595917A018353A018353A018318A018247A018105A017893A017574A017290A017078
$$ 1018353 1018353 1018318 1018247 1018105 1017893 1017574 1017290 1017078
598471A017042A017219A017574A017999A018389A018707A018920A019026A018991
$$ 1017042 1017219 1017574 1017999 1018389 1018707 1018920 1019026 1018991
601025A018814A018495A018034A017503A017007A016617A016369A016192A016086
$$ 1018814 1018495 1018034 1017503 1017007 1016617 1016369 1016192 1016086
603579A015979A015838A015625A015448A015271A015164A015129A015164A015306
$$ 1015979 1015838 1015625 1015448 1015271 1015164 1015129 1015164 1015306
606132A015519A015802A016086A016263A016263A016050A015660A015094A014562
$$ 1015519 1015802 1016086 1016263 1016263 1016050 1015660 1015094 1014562
608686A014066A013712A013570A013570A013676A013818A013924A013960A013924
$$ 1014066 1013712 1013570 1013570 1013676 1013818 1013924 1013960 1013924
611240A013889A013853A013889A013995A014137A014279A014385A014456A014598
$$ 1013889 1013853 1013889 1013995 1014137 1014279 1014385 1014456 1014598
613794A014810A015094A015448A015838A016227A016511A016723A016830A016865
$$ 1014810 1015094 1015448 1015838 1016227 1016511 1016723 1016830 1016865
616348A016901A016901A016901A017007A017219A017538A017928A018389A018778
$$ 1016901 1016901 1016901 1017007 1017219 1017538 1017928 1018389 1018778
618902A019062A019239A019345A019452A019629A019948A020373A020833A021329
$$ 1019062 1019239 1019345 1019452 1019629 1019948 1020373 1020833 1021329
621456A021790A022251A022747A023207A023597A023916A024093A024199A024306
$$ 1021790 1022251 1022747 1023207 1023597 1023916 1024093 1024199 1024306
624010A024518A024872A025298A025758A026113A026254A026183A026006A025829
$$ 1024518 1024872 1025298 1025758 1026113 1026254 1026183 1026006 1025829
626564A025687A025687A025829A026077A026396A026715A027034A027282A027459
$$ 1025687 1025687 1025829 1026077 1026396 1026715 1027034 1027282 1027459
629118A027565A027636A027742A027884A028026A028168A028203A028132A027955
$$ 1027565 1027636 1027742 1027884 1028026 1028168 1028203 1028132 1027955
631672A027671A027388A027140A026927A026750A026644A026573A026609A026786
$$ 1027671 1027388 1027140 1026927 1026750 1026644 1026573 1026609 1026786
634226A027069A027353A027601A027707A027601A027388A027175A027034A027034
$$ 1027069 1027353 1027601 1027707 1027601 1027388 1027175 1027034 1027034
636779A027211A027423A027636A027778A027742A027565A027388A027211A027140
$$ 1027211 1027423 1027636 1027778 1027742 1027565 1027388 1027211 1027140
639333A027175A027282A027494A027671A027849A027990A028026A027990A027884
$$ 1027175 1027282 1027494 1027671 1027849 1027990 1028026 1027990 1027884
641887A027707A027494A027282A027175A027175A027246A027423A027671A027884
$$ 1027707 1027494 1027282 1027175 1027175 1027246 1027423 1027671 1027884
644441A028026A028061A028026A027920A027742A027530A027317A027105A026927
$$ 1028026 1028061 1028026 1027920 1027742 1027530 1027317 1027105 1026927
646995A026750A026573A026396A026254A026148A026113A026077A026006A025900
$$ 1026750 1026573 1026396 1026254 1026148 1026113 1026077 1026006 1025900
649549A025687A025368A025050A024731A024483A024376A024341A024376A024483
$$ 1025687 1025368 1025050 1024731 1024483 1024376 1024341 1024376 1024483
652103A024589A024695A024802A024908A024979A025050A025050A025085A025085
$$ 1024589 1024695 1024802 1024908 1024979 1025050 1025050 1025085 1025085
654657A025014A024908A024695A024412A024058A023703A023349A023065A022817
$$ 1025014 1024908 1024695 1024412 1024058 1023703 1023349 1023065 1022817
657211A022640A022428A022286A022144A022038A021896A021755A021577A021329
$$ 1022640 1022428 1022286 1022144 1022038 1021896 1021755 1021577 1021329
659765A021117A020940A020798A020585A020231A019770A019133A018459A017822
$$ 1021117 1020940 1020798 1020585 1020231 1019770 1019133 1018459 1017822
662319A017290A016830A016404A015838A015164A014420A013676A013039A012578
$$ 1017290 1016830 1016404 1015838 1015164 1014420 1013676 1013039 1012578
664873A012224A011940A011550A011019A010346A009531A008716A008007A007405
$$ 1012224 1011940 1011550 1011019 1010346 1009531 1008716 1008007 1007405
667426A006980A006696A006519A006413A006271A006059A005811A005527A005208
$$ 1006980 1006696 1006519 1006413 1006271 1006059 1005811 1005527 1005208
669980A004889A004606A004393A004145A003933A003720A003472A003260A003012
$$ 1004889 1004606 1004393 1004145 1003933 1003720 1003472 1003260 1003012
672534A002799A002586A002338A002126A001878A001665A001417A001205A000992
$$ 1002799 1002586 1002338 1002126 1001878 1001665 1001417 1001205 1000992
675088A000744A000531A000283A000071I99823I99610I99362I99150I98937I98689
$$ 1000744 1000531 1000283 1000071 999823 999610 999362 999150 998937 998689
677926I98476I98228I98016I97768I97555I97307I97095I96882I96634I96421
$$ 998476 998228 998016 997768 997555 997307 997095 996882 996634 996421
680764I96173I95961I95713I95500I95252I95040I94827I94579I94366I94118
$$ 996173 995961 995713 995500 995252 995040 994827 994579 994366 994118
683601I93906I93658I93445I93197I92985I92772I92524I92312I92063I91851
$$ 993906 993658 993445 993197 992985 992772 992524 992312 992063 991851
686439I91603I91390I91142I90930I90717I90469I90257I90009I89796I89548
$$ 991603 991390 991142 990930 990717 990469 990257 990009 989796 989548
689277I89335I89123I88875I88662I88414I88202I87954I87741I87493I87280
$$ 989335 989123 988875 988662 988414 988202 987954 987741 987493 987280
692114I87032I86820I86607I86359I86147I85899I85686I85438I85225I85013
$$ 987032 986820 986607 986359 986147 985899 985686 985438 985225 985013
694952I84765I84552I84304I84092I83844I83631I83383I83170I82958I82710
$$ 984765 984552 984304 984092 983844 983631 983383 983170 982958 982710
697790I82497I82249I82037I81789I81576I81328I81115I80867I80655I80407
$$ 982497 982249 982037 981789 981576 981328 981115 980867 980655 980407
700627I80194I79946I79734I79556I79379I79167I78919I78564I78033I77360
$$ 980194 979946 979734 979556 979379 979167 978919 978564 978033 977360
703465I76580I75730I74915I74206I73533I72895I72258I71620I70982I70380
$$ 976580 975730 974915 974206 973533 972895 972258 971620 970982 970380
706303I69813I69317I68856I68325I67723I67049I66341I65668I64994I64286
$$ 969813 969317 968856 968325 967723 967049 966341 965668 964994 964286
709140I63506I62620I61628I60601I59573I58617I57660I56633I55570I54542
$$ 963506 962620 961628 960601 959573 958617 957660 956633 955570 954542
711978I53550I52700I52027I51353I50539I49546I48413I47208I46074I45153
$$ 953550 952700 952027 951353 950539 949546 948413 947208 946074 945153
714816I44409I43736I42992I42141I41220I40299I39413I38598I37819I37004
$$ 944409 943736 942992 942141 941220 940299 939413 938598 937819 937004
717653I36154I35232I34347I33461I32611I31725I30874I30024I29103I28182
$$ 936154 935232 934347 933461 932611 931725 930874 930024 929103 928182
720491I27154I26056I24851I23611I22406I21237I20139I19076I18013I16879
$$ 927154 926056 924851 923611 922406 921237 920139 919076 918013 916879
723329I15745I14647I13620I12698I11777I10821I09793I08695I07596I06533
$$ 915745 914647 913620 912698 911777 910821 909793 908695 907596 906533
726166I05506I04620I03770I02955I02140I01325I00475H99554H98632H97640
$$ 905506 904620 903770 902955 902140 901325 900475 899554 898632 897640
729004H96648H95585H94487H93353H92184H90944H89739H88535H87472H86480
$$ 896648 895585 894487 893353 892184 890944 889739 888535 887472 886480
731842H85594H84708H83751H82724H81590H80421H79252H78082H76984H75886
$$ 885594 884708 883751 882724 881590 880421 879252 878082 876984 875886
734680H74752H73583H72378H71138H69969H68800H67701H66603H65469H64300
$$ 874752 873583 872378 871138 869969 868800 867701 866603 865469 864300
737517H63060H61784H60544H59375H58277H57320H56470H55619H54734H53812
$$ 863060 861784 860544 859375 858277 857320 856470 855619 854734 853812
740355H52785H51687H50624H49525H48427H47364H46230H45132H44104H43148
$$ 852785 851687 850624 849525 848427 847364 846230 845132 844104 843148
743193H42297H41518H40738H39923H39038H38116H37160H36168H35140H34148
$$ 842297 841518 840738 839923 839038 838116 837160 836168 835140 834148
746030H33156H32129H31172H30215H29294H28373H27381H26318H25220H24157
$$ 833156 832129 831172 830215 829294 828373 827381 826318 825220 824157
748868H23129H22173H21287H20437H19515H18594H17567H16468H15370H14307
$$ 823129 822173 821287 820437 819515 818594 817567 816468 815370 814307
751706H13244H12323H11473H10728H10020H09276H08461H07540H06583H05556
$$ 813244 812323 811473 810728 810020 809276 808461 807540 806583 805556
754543H04528H03536H02544H01552H00560G99639G98753G97973G97265G96627
$$ 804528 803536 802544 801552 800560 799639 798753 797973 797265 796627
757381G95954G95210G94359G93367G92234G90993G89753G88549G87450G86529
$$ 795954 795210 794359 793367 792234 790993 789753 788549 787450 786529
760219G85643G84758G83801G82703G81533G80293G79124G77990G76892G75723
$$ 785643 784758 783801 782703 781533 780293 779124 777990 776892 775723
763056G74518G73172G71790G70408G69097G67893G66723G65625G64527G63464
$$ 774518 773172 771790 770408 769097 767893 766723 765625 764527 763464
765894G62365G61267G60133G58964G57724G56378G54996G53614G52303G51027
$$ 762365 761267 760133 758964 757724 756378 754996 753614 752303 751027
768732G49787G48618G47484G46351G45252G44154G43091G42063G41001G39973
$$ 749787 748618 747484 746351 745252 744154 743091 742063 741001 739973
771569G38910G37847G36749G35686G34588G33489G32426G31399G30336G29273
$$ 738910 737847 736749 735686 734588 733489 732426 731399 730336 729273
774407G28175G27076G26013G24950G23994G23073G22187G21301G20486G19636
$$ 728175 727076 726013 724950 723994 723073 722187 721301 720486 719636
777245G18785G17971G17085G16164G15207G14215G13187G12160G11168G10317
$$ 718785 717971 717085 716164 715207 714215 713187 712160 711168 710317
780082G09573G08936G08404G07908G07377G06845G06207G05534G04755G03869
$$ 709573 708936 708404 707908 707377 706845 706207 705534 704755 703869
782920G02877G01814G00716F99617F98590F97633F96712F95826F94905F93913
$$ 702877 701814 700716 699617 698590 697633 696712 695826 694905 693913
785758F92815F91681F90476F89342F88244F87181F86154F85091F83957F82752
$$ 692815 691681 690476 689342 688244 687181 686154 685091 683957 682752
788596F81406F79989F78536F77154F75843F74639F73540F72513F71450F70316
$$ 681406 679989 678536 677154 675843 674639 673540 672513 671450 670316
791433F69076F67694F66241F64753F63230F61706F60147F58518F56852F55152
$$ 669076 667694 666241 664753 663230 661706 660147 658518 656852 655152
794271F53486F51857F50227F48668F47073F45408F43707F41971F40271F38605
$$ 653486 651857 650227 648668 647073 645408 643707 641971 640271 638605
797109F37117F35771F34566F33433F32405F31413F30527F29712F29039F28508
$$ 637117 635771 634566 633433 632405 631413 630527 629712 629039 628508
799946F28082F27693F27303F26842F26311F25673F24929F24185F23370F22591
$$ 628082 627693 627303 626842 626311 625673 624929 624185 623370 622591
802784F21740F20819F19863F18835F17772F16638F15505F14335F13166F11997
$$ 621740 620819 619863 618835 617772 616638 615505 614335 613166 611997
805622F10899F09800F08808F07816F06859F05903F04946F03954F02927F01864
$$ 610899 609800 608808 607816 606859 605903 604946 603954 602927 601864
808459F00765E99632E98498E97364E96301E95238E94175E93041E91837E90561
$$ 600765 599632 598498 597364 596301 595238 594175 593041 591837 590561
811297E89321E88081E86876E85707E84503E83227E81881E80499E79117E77806
$$ 589321 588081 586876 585707 584503 583227 581881 580499 579117 577806
814135E76566E75432E74298E73236E72137E71074E70047E69055E68063E67000
$$ 576566 575432 574298 573236 572137 571074 570047 569055 568063 567000
816972E65866E64661E63350E62039E60764E59595E58461E57363E56158E54847
$$ 565866 564661 563350 562039 560764 559595 558461 557363 556158 554847
819810E53430E51835E50205E48540E46910E45316E43722E42056E40285E38336
$$ 553430 551835 550205 548540 546910 545316 543722 542056 540285 538336
822648E36281E34084E31888E29656E27388E25050E22569E19912E17078E14031
$$ 536281 534084 531888 529656 527388 525050 522569 519912 517078 514031
825485E10842E07547E04216E00850D97484D94189D90965D87741D84517D81257
$$ 510842 507547 504216 500850 497484 494189 490965 487741 484517 481257
828323D77856D74313D70628D66872D63046D59184D55357D51531D47740D43984
$$ 477856 474313 470628 466872 463046 459184 455357 451531 447740 443984
831161D40264D36543D32823D29103D25454D21840D18261D14753D11281D07844
$$ 440264 436543 432823 429103 425454 421840 418261 414753 411281 407844
833998D04478D01183C97995C94912C92042C89314C86763C84354C82122C80031
$$ 404478 401183 397995 394912 392042 389314 386763 384354 382122 380031
836836C78189C76594C75248C74185C73299C72378C71351C70111C68622C67063
$$ 378189 376594 375248 374185 373299 372378 371351 370111 368622 367063
839674C65540C64229C63237C62564C62280C62387C62847C63733C64973C66567
$$ 365540 364229 363237 362564 362280 362387 362847 363733 364973 366567
842512C68410C70500C72839C75425C78295C81484C84921C88570C92361C96294
$$ 368410 370500 372839 375425 378295 381484 384921 388570 392361 396294
845349D00368D04620D09049D13584D18119D22654D27083D31406D35622D39732
$$ 400368 404620 409049 413584 418119 422654 427083 431406 435622 439732
848187D43700D47350D50609D53373D55605D57377D58794D59928D60813D61522
$$ 443700 447350 450609 453373 455605 457377 458794 459928 460813 461522
851025D61983D62231D62160D61806D61203D60388D59432D58369D57270D56030
$$ 461983 462231 462160 461806 461203 460388 459432 458369 457270 456030
853862D54684D53090D51318D49334D47208D44940D42637D40264D37890D35587
$$ 454684 453090 451318 449334 447208 444940 442637 440264 437890 435587
856700D33461D31512D29812D28288D26871D25489D24143D22796D21521D20351
$$ 433461 431512 429812 428288 426871 425489 424143 422796 421521 420351
859538D19359D18545D18048D17871D18084D18686D19643D20777D22088D23434
$$ 419359 418545 418048 417871 418084 418686 419643 420777 422088 423434
862375D24887D26516D28323D30449D32894D35658D38811D42319D46322D50857
$$ 424887 426516 428323 430449 432894 435658 438811 442319 446322 450857
865213D55959D61699D68006D74950D82462D90505D99043E08043E17432E27246
$$ 455959 461699 468006 474950 482462 490505 499043 508043 517432 527246
868051E37415E47902E58603E69338E80003E90420F00553F10367F19863F29145
$$ 537415 547902 558603 569338 580003 590420 600553 610367 619863 629145
870888F38145F46896F55329F63372F70989F78111F84701F90795F96429G01601
$$ 638145 646896 655329 663372 670989 678111 684701 690795 696429 701601
873726G06420G10849G14994G18821G22293G25411G28175G30584G32674G34481
$$ 706420 710849 714994 718821 722293 725411 728175 730584 732674 734481
876564G36040G37457G38627G39583G40292G40717G40930G41001G41036G41071
$$ 736040 737457 738627 739583 740292 740717 740930 741001 741036 741071
879401G41107G41071G40859G40469G39902G39158G38343G37457G36536G35544
$$ 741107 741071 740859 740469 739902 739158 738343 737457 736536 735544
882239G34517G33454G32391G31328G30265G29167G28033G26864G25694G24561
$$ 734517 733454 732391 731328 730265 729167 728033 726864 725694 724561
885077G23427G22329G21124G19884G18537G17120G15632G14109G12514G10778
$$ 723427 722329 721124 719884 718537 717120 715632 714109 712514 710778
887915G08936G07022G05109G03196G01424F99795F98271F96783F95330F93807
$$ 708936 707022 705109 703196 701424 699795 698271 696783 695330 693807
890752F92212F90547F88846F87110F85410F83709F82044F80343F78678F77048
$$ 692212 690547 688846 687110 685410 683709 682044 680343 678678 677048
893590F75489F73965F72442F70883F69218F67446F65639F63832F62061F60395
$$ 675489 673965 672442 670883 669218 667446 665639 663832 662061 660395
896428F58872F57490F56179F54904F53557F52140F50581F49022F47463F46010
$$ 658872 657490 656179 654904 653557 652140 650581 649022 647463 646010
899265F44664F43389F42113F40767F39314F37791F36232F34743F33291F31909
$$ 644664 643389 642113 640767 639314 637791 636232 634743 633291 631909
902103F30563F29216F27905F26594F25283F24043F22803F21563F20323F19048
$$ 630563 629216 627905 626594 625283 624043 622803 621563 620323 619048
904941F17737F16390F15044F13733F12457F11253F10084F08914F07745F06505
$$ 617737 616390 615044 613733 612457 611253 610084 608914 607745 606505
907778F05194F03919F02679F01545F00553E99632E98781E97895E96939E95947
$$ 605194 603919 602679 601545 600553 599632 598781 597895 596939 595947
910616E94884E93785E92687E91589E90490E89392E88365E87408E86451E85530
$$ 594884 593785 592687 591589 590490 589392 588365 587408 586451 585530
913454E84573E83510E82377E81243E80145E79082E78090E77133E76176E75220
$$ 584573 583510 582377 581243 580145 579082 578090 577133 576176 575220
916291E74298E73448E72740E72066E71393E70649E69834E68948E68169E67531
$$ 574298 573448 572740 572066 571393 570649 569834 568948 568169 567531
919129E67035E66681E66220E65582E64697E63598E62429E61331E60445E59701
$$ 567035 566681 566220 565582 564697 563598 562429 561331 560445 559701
921967E59063E58390E57540E56583E55591E54670E53890E53323E52827E52402
$$ 559063 558390 557540 556583 555591 554670 553890 553323 552827 552402
924804E51906E51339E50702E50064E49391E48753E48115E47477E46840E46237
$$ 551906 551339 550702 550064 549391 548753 548115 547477 546840 546237
927642E45670E45139E44678E44289E43934E43580E43226E42871E42517E42163
$$ 545670 545139 544678 544289 543934 543580 543226 542871 542517 542163
930480E41773E41348E40923E40462E40001E39612E39364E39222E39257E39364
$$ 541773 541348 540923 540462 540001 539612 539364 539222 539257 539364
933317E39541E39718E39895E40037E40214E40462E40816E41312E41879E42517
$$ 539541 539718 539895 540037 540214 540462 540816 541312 541879 542517
936155E43119E43651E44147E44678E45281E45989E46804E47690E48576E49461
$$ 543119 543651 544147 544678 545281 545989 546804 547690 548576 549461
938993E50312E51233E52260E53394E54599E55804E56937E57965E58957E59984
$$ 550312 551233 552260 553394 554599 555804 556937 557965 558957 559984
941830E61047E62287E63563E64909E66149E67354E68417E69444E70472E71535
$$ 561047 562287 563563 564909 566149 567354 568417 569444 570472 571535
944668E72669E73873E75007E76070E77027E77912E78727E79613E80499E81349
$$ 572669 573873 575007 576070 577027 577912 578727 579613 580499 581349
947506E82200E82944E83617E84325E84999E85743E86416E86912E87231E87266
$$ 582200 582944 583617 584325 584999 585743 586416 586912 587231 587266
950344E87195E87124E87124E87302E87620E87975E88258E88506E88648E88754
$$ 587195 587124 587124 587302 587620 587975 588258 588506 588648 588754
953181E88790E88790E88754E88683E88542E88435E88329E88223E88046E87762
$$ 588790 588790 588754 588683 588542 588435 588329 588223 588046 587762
956019E87337E86841E86310E85813E85388E84999E84573E84113E83510E82837
$$ 587337 586841 586310 585813 585388 584999 584573 584113 583510 582837
958857E82058E81243E80428E79649E78904E78160E77346E76353E75149E73767
$$ 582058 581243 580428 579649 578904 578160 577346 576353 575149 573767
961694E72208E70614E69161E67885E66787E65830E64874E63811E62642E61331
$$ 572208 570614 569161 567885 566787 565830 564874 563811 562642 561331
964532E59949E58603E57327E56264E55343E54634E54103E53678E53359E53146
$$ 559949 558603 557327 556264 555343 554634 554103 553678 553359 553146
967370E53040E53146E53430E53997E54812E55910E57256E58851E60764E62925
$$ 553040 553146 553430 553997 554812 555910 557256 558851 560764 562925
970207E65334E67956E70685E73413E76035E78515E80853E83121E85459E87975
$$ 565334 567956 570685 573413 576035 578515 580853 583121 585459 587975
973045E90774E93750E96797E99702F02253F04308F05903F07143F08099F08950
$$ 590774 593750 596797 599702 602253 604308 605903 607143 608099 608950
975883F09729F10473F11040F11359F11359F11005F10402F09658F08914F08135
$$ 609729 610473 611040 611359 611359 611005 610402 609658 608914 608135
978720F07391F06611F05655F04486F03139F01580E99844E98002E95947E93715
$$ 607391 606611 605655 604486 603139 601580 599844 598002 595947 593715
981558E91234E88613E85955E83333E80853E78586E76424E74440E72527E70755
$$ 591234 588613 585955 583333 580853 578586 576424 574440 572527 570755
984396E69055E67496E66043E64697E63598E62854E62606E62819E63563E64626
$$ 569055 567496 566043 564697 563598 562854 562606 562819 563563 564626
987233E65901E67319E68913E70791E73165E76141E79719E83865E88471E93360
$$ 565901 567319 568913 570791 573165 576141 579719 583865 588471 593360
990071E98427F03671F08985F14442F20040F25779F31626F37613F43707F49837
$$ 598427 603671 608985 614442 620040 625779 631626 637613 643707 649837
992909F56002F62096F68084F73965F79705F85339F90795F96110G01353G06491
$$ 656002 662096 668084 673965 679705 685339 690795 696110 701353 706491
995747G11522G16412G21124G25553G29663G33489G37068G40505G43870G47307
$$ 711522 716412 721124 725553 729663 733489 737068 740505 743870 747307
998584G50744G54216G57547G60665G63464G66015G68353G70656G73101G75723
$$ 750744 754216 757547 760665 763464 766015 768353 770656 773101 775723
1001422G78522G81463G84332G87061G89541G91844G93934G95989G98151H00454
$$ 778522 781463 784332 787061 789541 791844 793934 795989 798151 800454
1004260H02969H05697H08567H11473H14307H17000H19480H21818H23944H25964
$$ 802969 805697 808567 811473 814307 817000 819480 821818 823944 825964
1007097H27983H30038H32200H34503H36947H39392H41801H44069H46159H48179
$$ 827983 830038 832200 834503 836947 839392 841801 844069 846159 848179
1009935H50198H52289H54450H56718H59056H61430H63804H66213H68693H71209
$$ 850198 852289 854450 856718 859056 861430 863804 866213 868693 871209
1012773H73795H76417H79039H81555H83893H85984H87861H89527H91121H92786
$$ 873795 876417 879039 881555 883893 885984 887861 889527 891121 892786
1015610H94664H96790H99128I01644I04230I06781I09226I11529I13655I15568
$$ 894664 896790 899128 901644 904230 906781 909226 911529 913655 915568
1018448I17340I19111I20989I23044I25276I27544I29776I31831I33744I35551
$$ 917340 919111 920989 923044 925276 927544 929776 931831 933744 935551
1021286I37394I39342I41397I43452I45472I47421I49369I51424I53727I56172
$$ 937394 939342 941397 943452 945472 947421 949369 951424 953727 956172
1024123I58652I60884I62798I64321I65597I66872I68325I69919I71620I73285
$$ 958652 960884 962798 964321 965597 966872 968325 969919 971620 973285
1026961I74809I76261I77749I79344I81115I82958I84800I86572I88414I90469
$$ 974809 976261 977749 979344 981115 982958 984800 986572 988414 990469
1029799I92914I95642I98370A000709A002409A003437A004110A004783A005669
$$ 992914 995642 998370 1000709 1002409 1003437 1004110 1004783 1005669
1032353A006838A008078A009141A009956A010629A011373A012401A013853A015660
$$ 1006838 1008078 1009141 1009956 1010629 1011373 1012401 1013853 1015660
1034907A017645A019735A021790A023880A026006A028168A030223A032029A033518
$$ 1017645 1019735 1021790 1023880 1026006 1028168 1030223 1032029 1033518
1037460A034580A035289A035643A035750A035821A036033A036600A037698A039257
$$ 1034580 1035289 1035643 1035750 1035821 1036033 1036600 1037698 1039257
1040014A041100A042800A044041A044643A044678A044643A045103A046592A049284
$$ 1041100 1042800 1044041 1044643 1044678 1044643 1045103 1046592 1049284
1042568A052827A056548A059595A061402A061898A061473A060835A060551A060799
$$ 1052827 1056548 1059595 1061402 1061898 1061473 1060835 1060551 1060799
1045122A061402A061862A061933A061614A061260A061154A061508A062217A062996
$$ 1061402 1061862 1061933 1061614 1061260 1061154 1061508 1062217 1062996
1047676A063811A064945A066964A070259A074688A079471A083333A085105A084361
$$ 1063811 1064945 1066964 1070259 1074688 1079471 1083333 1085105 1084361
1050230A081491A077700A074192A071889A070933A071003A071606A072279A072917
$$ 1081491 1077700 1074192 1071889 1070933 1071003 1071606 1072279 1072917
1052784A073484A074015A074476A074972A075787A077381A080074A083688A087514
$$ 1073484 1074015 1074476 1074972 1075787 1077381 1080074 1083688 1087514
1055338A090278A090986A089215A085636A081526A078338A076885A077133A078515
$$ 1090278 1090986 1089215 1085636 1081526 1078338 1076885 1077133 1078515
1057892A080109A081278A081845A081881A081491A080818A080038A079365A079259
$$ 1080109 1081278 1081845 1081881 1081491 1080818 1080038 1079365 1079259
1060446A080145A082270A085459A089215A093006A096407A099277A101580A103352
$$ 1080145 1082270 1085459 1089215 1093006 1096407 1099277 1101580 1103352
1063000A104450A104840A104592A104025A103600A103387A102997A101757A098958
$$ 1104450 1104840 1104592 1104025 1103600 1103387 1102997 1101757 1098958
1065554A094636A089605A085424A083617A085105A089498A095380A100801A104096
$$ 1094636 1089605 1085424 1083617 1085105 1089498 1095380 1100801 1104096
1068107A104521A102501A099206A095982A093715A092616A092510A092900A093467
$$ 1104521 1102501 1099206 1095982 1093715 1092616 1092510 1092900 1093467
1070661A094140A094848A095699A096832A098569A101297A105584A111501A118622
$$ 1094140 1094848 1095699 1096832 1098569 1101297 1105584 1111501 1118622
1073215A125531A130527A132015A129606A124256A117843A112316A108950A107745
$$ 1125531 1130527 1132015 1129606 1124256 1117843 1112316 1108950 1107745
1075769A107781A107887A107320A105903A104060A102289A100836A099915A099632
$$ 1107781 1107887 1107320 1105903 1104060 1102289 1100836 1099915 1099632
1078323A100234A101970A104875A108489A112139A115150A117276A118800A120181
$$ 1100234 1101970 1104875 1108489 1112139 1115150 1117276 1118800 1120181
1080877A121670A122945A123228A121811A118481A113698A108418A103564A099738
$$ 1121670 1122945 1123228 1121811 1118481 1113698 1108418 1103564 1099738
1083431A097222A096124A096584A098675A102324A106789A110863A113202A112847
$$ 1097222 1096124 1096584 1098675 1102324 1106789 1110863 1113202 1112847
1085985A109836A105017A099632A094848A091199A088790A087479A087089A087550
$$ 1109836 1105017 1099632 1094848 1091199 1088790 1087479 1087089 1087550
1088539A088648A090065A091093A091164A090065A088294A086699A086380A088081
$$ 1088648 1090065 1091093 1091164 1090065 1088294 1086699 1086380 1088081
1091093A091837A097010A102431A106930A109694A110473A109552A107568A105159
$$ 1091837 1097010 1102431 1106930 1109694 1110473 1109552 1107568 1105159
1093647A102785A100659A098781A097116A095699A094565A093608A092652A091412
$$ 1102785 1100659 1098781 1097116 1095699 1094565 1093608 1092652 1091412
1096201A089534A087160A084786A083404A084042A087337A093289A101013A109056
$$ 1089534 1087160 1084786 1083404 1084042 1087337 1093289 1101013 1109056
1098754A115611A119402A119756A117241A113131A109304A107320A107993A111076
$$ 1115611 1119402 1119756 1117241 1113131 1109304 1107320 1107993 1111076
1101308A115398A119402A122024A123087A123441A124150A125957A128472A130492
$$ 1115398 1119402 1122024 1123087 1123441 1124150 1125957 1128472 1130492
1103862A130598A128118A123547A118410A114371A112351A112245A112989A113414
$$ 1130598 1128118 1123547 1118410 1114371 1112351 1112245 1112989 1113414
1106416A112812A111324A109588A108383A108135A108808A110013A111217A112139
$$ 1112812 1111324 1109588 1108383 1108135 1108808 1110013 1111217 1112139
1108970A112422A111961A110651A108773A106682A105052A104379A104982A106611
$$ 1112422 1111961 1110651 1108773 1106682 1105052 1104379 1104982 1106611
1111524A108666A110438A111465A111501A110792A109729A108702A107958A107568
$$ 1108666 1110438 1111465 1111501 1110792 1109729 1108702 1107958 1107568
1114078A107391A107285A107037A106647A106222A106045A106293A107037A108135
$$ 1107391 1107285 1107037 1106647 1106222 1106045 1106293 1107037 1108135
1116632A109446A110828A112387A114229A116355A118481A120181A120890A120536
$$ 1109446 1110828 1112387 1114229 1116355 1118481 1120181 1120890 1120536
1119186A119296A117737A116213A114831A113379A111572A109552A107816A107037
$$ 1119296 1117737 1116213 1114831 1113379 1111572 1109552 1107816 1107037
1121740A107674A109588A112316A115186A117772A120075A122201A124114A125496
$$ 1107674 1109588 1112316 1115186 1117772 1120075 1122201 1124114 1125496
1124294A125779A124575A122024A118729A115611A113343A112174A111891A112068
$$ 1125779 1124575 1122024 1118729 1115611 1113343 1112174 1111891 1112068
1126848A112387A112812A113485A114654A116497A119012A121988A125071A127728
$$ 1112387 1112812 1113485 1114654 1116497 1119012 1121988 1125071 1127728
1129401A129429A129783A128614A126134A122732A118977A115327A112209A109977
$$ 1129429 1129783 1128614 1126134 1122732 1118977 1115327 1112209 1109977
1131955A109127A110013A112883A117595A123335A128862A132688A133787A131803
$$ 1109127 1110013 1112883 1117595 1123335 1128862 1132688 1133787 1131803
1134509A127445A122059A117241A114229A113450A114548A116638A118693A119933
$$ 1127445 1122059 1117241 1114229 1113450 1114548 1116638 1118693 1119933
1137063A120323A120288A120465A121492A123441A125815A127834A128614A127586
$$ 1120323 1120288 1120465 1121492 1123441 1125815 1127834 1128614 1127586
1139617A124929A121244A117560A114902A113804A114264A115859A117843A119685
$$ 1124929 1121244 1117560 1114902 1113804 1114264 1115859 1117843 1119685
1142171A121032A121670A121599A120784A119331A117524A115859A114867A114867
$$ 1121032 1121670 1121599 1120784 1119331 1117524 1115859 1114867 1114867
1144725A115682A116567A116780A115859A114123A112493A111961A113272A116319
$$ 1115682 1116567 1116780 1115859 1114123 1112493 1111961 1113272 1116319
1147279A120359A124327A127303A128756A128579A126913A124079A120394A116284
$$ 1120359 1124327 1127303 1128756 1128579 1126913 1124079 1120394 1116284
1149833A112316A108914A106434A105088A104840A105655A107391A109765A112351
$$ 1112316 1108914 1106434 1105088 1104840 1105655 1107391 1109765 1112351
1152387A114548A115788A115930A115186A114194A113450A113272A113485A113591
$$ 1114548 1115788 1115930 1115186 1114194 1113450 1113272 1113485 1113591
1154941A113237A112387A111465A110969A111324A112351A113591A114371A114194
$$ 1113237 1112387 1111465 1110969 1111324 1112351 1113591 1114371 1114194
1157495A112989A111076A109056A107462A106718A106859A107745A108950A110084
$$ 1112989 1111076 1109056 1107462 1106718 1106859 1107745 1108950 1110084
1160048A110863A111182A111147A111005A110828A110686A110509A110119A109446
$$ 1110863 1111182 1111147 1111005 1110828 1110686 1110509 1110119 1109446
1162602A108560A107674A106930A106505A106399A106541A106824A107072A107178
$$ 1108560 1107674 1106930 1106505 1106399 1106541 1106824 1107072 1107178
1165156A107143A106895A106470A105903A105300A104769A104450A104379A104521
$$ 1107143 1106895 1106470 1105903 1105300 1104769 1104450 1104379 1104521
1167710A104875A105407A106045A106718A107285A107710A107958A108064A108099
$$ 1104875 1105407 1106045 1106718 1107285 1107710 1107958 1108064 1108099
1170264A108099A108099A107993A107745A107355A106895A106541A106328A106293
$$ 1108099 1108099 1107993 1107745 1107355 1106895 1106541 1106328 1106293
1172818A106328A106434A106541A106789A107143A107462A107497A106966A105938
$$ 1106328 1106434 1106541 1106789 1107143 1107462 1107497 1106966 1105938
1175372A105017A105230A107533A112422A119437
$$ 1105017 1105230 1107533 1112422 1119437
##END= $$ END of IR
##TITLE= ethanolamine
##JCAMP-DX= 5.01
##DATA TYPE= RAMAN SPECTRUM
##DATA CLASS= XYDATA
##ORIGIN= Department of Chemistry, UWI, Jamaica
##OWNER= public domain
##LONGDATE= 2012/03/09 13:08:48.0525 -0500 $$ export date from JSpecView
##SPECTROMETER/DATA SYSTEM= scan
##$MODELS=
<Models>
<ModelData id="EAR" type="MOL">
ethanolamine
RLDSViewer          3D                             0

 11 10  0  0  0  0  0  0  0  0999 V2000
    0.0123   -0.0126   -0.0215 C   0  0  0  0  0  0  0  0  0  1
    1.5413    0.0270   -0.0245 C   0  0  0  0  0  0  0  0  0  2
    2.0118    1.4135   -0.0173 N   0  0  0  0  0  0  0  0  0  3
   -0.4962   -1.3389   -0.0726 O   0  0  0  0  0  0  0  0  0  4
   -0.3634    0.5002   -0.9107 H   0  0  0  0  0  0  0  0  0  5
   -0.3736    0.5344    0.8559 H   0  0  0  0  0  0  0  0  0  6
    1.9136   -0.5862    0.8198 H   0  0  0  0  0  0  0  0  0  7
    1.8951   -0.4575   -0.9408 H   0  0  0  0  0  0  0  0  0  8
    3.0158    1.4440   -0.1721 H   0  0  0  0  0  0  0  0  0  9
    1.8525    1.8323    0.8964 H   0  0  0  0  0  0  0  0  0 10
   -0.2283   -1.7871    0.7404 H   0  0  0  0  0  0  0  0  0 11
  1  4  1  0  0  0
  1  2  1  0  0  0
  1  5  1  0  0  0
  1  6  1  0  0  0
  2  3  1  0  0  0
  2  8  1  0  0  0
  2  7  1  0  0  0
  3  9  1  0  0  0
  3 10  1  0  0  0
  4 11  1  0  0  0
M  END
</ModelData>
<ModelData id="2" type="XYZVIB" baseModel="EAR" vibrationScale=".5">
 11
Model[1]: Jmol 12.1.43_dev  2011-02-16 09:29
C     0.01231   -0.01259   -0.02146
C     1.54132    0.02698   -0.02446
N     2.01181    1.41354   -0.01735
O    -0.49623   -1.33890   -0.07258
H    -0.36340    0.50021   -0.91070
H    -0.37364    0.53445    0.85587
H     1.91355   -0.58616    0.81981
H     1.89508   -0.45750   -0.94078
H     3.01578    1.44403   -0.17213
H     1.85253    1.83232    0.89642
H    -0.22835   -1.78711    0.74040
11
Model[2]: PATH=Frequencies;IRIntensity=2.30 km/mol;Frequency=145.98 cm^-1
C     0.01231   -0.01259   -0.02146    0.00357    0.00168   -0.11947
C     1.54132    0.02698   -0.02446    0.00518   -0.00080   -0.11591
N     2.01181    1.41354   -0.01735   -0.00703    0.00058    0.10565
O    -0.49623   -1.33890   -0.07258   -0.00247   -0.00342    0.10449
H    -0.36340    0.50021   -0.91070   -0.01201   -0.13732   -0.19308
H    -0.37364    0.53445    0.85587    0.01811    0.14499   -0.20208
H     1.91355   -0.58616    0.81981   -0.01078   -0.12139   -0.19590
H     1.89508   -0.45750   -0.94078    0.03342    0.13134   -0.17484
H     3.01578    1.44403   -0.17213   -0.01020    0.04204    0.09527
H     1.85253    1.83232    0.89642   -0.00448   -0.15337    0.17628
H    -0.22835   -1.78711    0.74040    0.01864    0.12949    0.17083
11
Model[3]: PATH=Frequencies;IRIntensity=16.85 km/mol;Frequency=239.01 cm^-1
C     0.01231   -0.01259   -0.02146   -0.03429    0.00172   -0.02217
C     1.54132    0.02698   -0.02446   -0.03070    0.02407    0.04332
N     2.01181    1.41354   -0.01735    0.01130    0.01356    0.02542
O    -0.49623   -1.33890   -0.07258    0.02451   -0.02758   -0.01486
H    -0.36340    0.50021   -0.91070    0.00553   -0.04165   -0.06383
H    -0.37364    0.53445    0.85587   -0.10646    0.01860   -0.06840
H     1.91355   -0.58616    0.81981   -0.04645    0.03502    0.05417
H     1.89508   -0.45750   -0.94078   -0.01830    0.00014    0.06206
H     3.01578    1.44403   -0.17213   -0.09150    0.01613   -0.62847
H     1.85253    1.83232    0.89642    0.61176   -0.13873    0.19652
H    -0.22835   -1.78711    0.74040   -0.12678    0.05262    0.07876
11
Model[4]: PATH=Frequencies;IRIntensity=9.89 km/mol;Frequency=278.18 cm^-1
C     0.01231   -0.01259   -0.02146    0.09789   -0.04380    0.01635
C     1.54132    0.02698   -0.02446    0.10192   -0.04430    0.00035
N     2.01181    1.41354   -0.01735   -0.09005    0.02943   -0.00188
O    -0.49623   -1.33890   -0.07258   -0.06548    0.02326   -0.01772
H    -0.36340    0.50021   -0.91070    0.14987    0.02490    0.03414
H    -0.37364    0.53445    0.85587    0.14656   -0.02253    0.02341
H     1.91355   -0.58616    0.81981    0.18054   -0.00768   -0.01430
H     1.89508   -0.45750   -0.94078    0.12688    0.00881   -0.01779
H     3.01578    1.44403   -0.17213   -0.11553    0.20110   -0.13020
H     1.85253    1.83232    0.89642   -0.04241   -0.03453    0.03552
H    -0.22835   -1.78711    0.74040   -0.53461    0.10090    0.17766
11
Model[5]: PATH=Frequencies;IRIntensity=156.03 km/mol;Frequency=329.00 cm^-1
C     0.01231   -0.01259   -0.02146   -0.05038    0.01548    0.03175
C     1.54132    0.02698   -0.02446   -0.05004    0.03386   -0.03118
N     2.01181    1.41354   -0.01735    0.06161   -0.00291   -0.00750
O    -0.49623   -1.33890   -0.07258    0.08134   -0.04226   -0.02469
H    -0.36340    0.50021   -0.91070   -0.11764    0.03419    0.06941
H    -0.37364    0.53445    0.85587   -0.07119   -0.07009    0.07137
H     1.91355   -0.58616    0.81981   -0.04410   -0.02898   -0.08269
H     1.89508   -0.45750   -0.94078   -0.12926    0.04786   -0.06905
H     3.01578    1.44403   -0.17213    0.09889   -0.12011    0.20120
H     1.85253    1.83232    0.89642   -0.06732    0.04187   -0.04851
H    -0.22835   -1.78711    0.74040   -0.62058    0.21897    0.34751
11
Model[6]: PATH=Frequencies;IRIntensity=4.32 km/mol;Frequency=477.41 cm^-1
C     0.01231   -0.01259   -0.02146    0.02084    0.08352    0.00731
C     1.54132    0.02698   -0.02446   -0.03886   -0.07718    0.00610
N     2.01181    1.41354   -0.01735   -0.11455   -0.09807   -0.00109
O    -0.49623   -1.33890   -0.07258    0.12980    0.07816   -0.00790
H    -0.36340    0.50021   -0.91070    0.05418    0.10195    0.00366
H    -0.37364    0.53445    0.85587    0.02776    0.09037    0.00854
H     1.91355   -0.58616    0.81981   -0.06784   -0.09729    0.00722
H     1.89508   -0.45750   -0.94078   -0.09093   -0.10400    0.00094
H     3.01578    1.44403   -0.17213   -0.13570    0.02892   -0.09712
H     1.85253    1.83232    0.89642   -0.09704   -0.11518    0.00779
H    -0.22835   -1.78711    0.74040    0.05570    0.14199    0.04975
11
Model[7]: PATH=Frequencies;IRIntensity=18.22 km/mol;Frequency=805.26 cm^-1
C     0.01231   -0.01259   -0.02146   -0.01183    0.00334    0.04866
C     1.54132    0.02698   -0.02446    0.01357    0.00996    0.05701
N     2.01181    1.41354   -0.01735    0.01331   -0.03203    0.00538
O    -0.49623   -1.33890   -0.07258   -0.00281   -0.00029   -0.01064
H    -0.36340    0.50021   -0.91070    0.30587   -0.16807   -0.18570
H    -0.37364    0.53445    0.85587   -0.33844    0.16551   -0.19960
H     1.91355   -0.58616    0.81981    0.31768   -0.23636   -0.25559
H     1.89508   -0.45750   -0.94078   -0.33227    0.25199   -0.20812
H     3.01578    1.44403   -0.17213   -0.01833    0.09691   -0.11765
H     1.85253    1.83232    0.89642   -0.08962    0.24982   -0.15103
H    -0.22835   -1.78711    0.74040   -0.00605   -0.06854   -0.04650
11
Model[8]: PATH=Frequencies;IRIntensity=155.51 km/mol;Frequency=852.19 cm^-1
C     0.01231   -0.01259   -0.02146   -0.03529    0.01705   -0.03882
C     1.54132    0.02698   -0.02446    0.03488    0.02910   -0.00820
N     2.01181    1.41354   -0.01735    0.03706   -0.08110    0.05672
O    -0.49623   -1.33890   -0.07258   -0.00878   -0.01860    0.00491
H    -0.36340    0.50021   -0.91070   -0.23095    0.11029    0.09893
H    -0.37364    0.53445    0.85587    0.11858   -0.11341    0.11300
H     1.91355   -0.58616    0.81981   -0.16480   -0.08365    0.01366
H     1.89508   -0.45750   -0.94078    0.16951    0.06410    0.02485
H     3.01578    1.44403   -0.17213   -0.06892    0.40454   -0.35348
H     1.85253    1.83232    0.89642   -0.21605    0.42080   -0.24725
H    -0.22835   -1.78711    0.74040    0.02190    0.07002    0.04403
11
Model[9]: PATH=Frequencies;IRIntensity=1.91 km/mol;Frequency=975.33 cm^-1
C     0.01231   -0.01259   -0.02146    0.12438   -0.07783   -0.03025
C     1.54132    0.02698   -0.02446   -0.10858    0.07821    0.01848
N     2.01181    1.41354   -0.01735   -0.03032   -0.03886    0.01435
O    -0.49623   -1.33890   -0.07258   -0.00039    0.03647    0.01039
H    -0.36340    0.50021   -0.91070    0.06100   -0.01454    0.03346
H    -0.37364    0.53445    0.85587    0.23948   -0.07512    0.02351
H     1.91355   -0.58616    0.81981   -0.11400   -0.04778   -0.06295
H     1.89508   -0.45750   -0.94078    0.03069    0.26973   -0.03171
H     3.01578    1.44403   -0.17213   -0.03360   -0.41268   -0.04841
H     1.85253    1.83232    0.89642    0.10480    0.28687   -0.11522
H    -0.22835   -1.78711    0.74040   -0.04898   -0.04987   -0.02267
11
Model[10]: PATH=Frequencies;IRIntensity=52.65 km/mol;Frequency=1059.36 cm^-1
C     0.01231   -0.01259   -0.02146   -0.00628   -0.07987    0.06790
C     1.54132    0.02698   -0.02446   -0.01245    0.06435   -0.07101
N     2.01181    1.41354   -0.01735    0.02036   -0.04627    0.02000
O    -0.49623   -1.33890   -0.07258    0.03269    0.07947   -0.00032
H    -0.36340    0.50021   -0.91070   -0.07224   -0.38473   -0.08527
H    -0.37364    0.53445    0.85587   -0.06927    0.18011   -0.11429
H     1.91355   -0.58616    0.81981   -0.13054    0.21632    0.10117
H     1.89508   -0.45750   -0.94078    0.05182   -0.17093    0.07960
H     3.01578    1.44403   -0.17213   -0.01092    0.18483   -0.06765
H     1.85253    1.83232    0.89642   -0.11835   -0.10375    0.01092
H    -0.22835   -1.78711    0.74040   -0.22932   -0.35545   -0.16022
11
Model[11]: PATH=Frequencies;IRIntensity=68.76 km/mol;Frequency=1082.10 cm^-1
C     0.01231   -0.01259   -0.02146   -0.06090   -0.11681   -0.02176
C     1.54132    0.02698   -0.02446   -0.03167   -0.13838    0.01888
N     2.01181    1.41354   -0.01735    0.03262    0.10884    0.00260
O    -0.49623   -1.33890   -0.07258    0.04233    0.10232    0.00740
H    -0.36340    0.50021   -0.91070   -0.09992   -0.06748    0.02099
H    -0.37364    0.53445    0.85587    0.01639   -0.11374    0.01992
H     1.91355   -0.58616    0.81981   -0.05821   -0.24610   -0.05192
H     1.89508   -0.45750   -0.94078    0.01476   -0.00974   -0.03335
H     3.01578    1.44403   -0.17213    0.03610    0.07724   -0.01555
H     1.85253    1.83232    0.89642    0.06460    0.22111   -0.03898
H    -0.22835   -1.78711    0.74040    0.00331    0.04090   -0.02053
11
Model[12]: PATH=Frequencies;IRIntensity=5.53 km/mol;Frequency=1103.62 cm^-1
C     0.01231   -0.01259   -0.02146   -0.10538   -0.08103   -0.02750
C     1.54132    0.02698   -0.02446    0.09929    0.07406    0.03073
N     2.01181    1.41354   -0.01735   -0.03737   -0.07348   -0.02003
O    -0.49623   -1.33890   -0.07258    0.01792    0.07130    0.00330
H    -0.36340    0.50021   -0.91070   -0.14100    0.03094    0.04609
H    -0.37364    0.53445    0.85587   -0.16641   -0.20453    0.03438
H     1.91355   -0.58616    0.81981    0.29695    0.09924   -0.02821
H     1.89508   -0.45750   -0.94078    0.20372    0.20552   -0.00386
H     3.01578    1.44403   -0.17213   -0.01465   -0.21694    0.06907
H     1.85253    1.83232    0.89642    0.04968   -0.13167    0.02608
H    -0.22835   -1.78711    0.74040    0.07903    0.18974    0.04388
11
Model[13]: PATH=Frequencies;IRIntensity=6.12 km/mol;Frequency=1168.97 cm^-1
C     0.01231   -0.01259   -0.02146    0.04998   -0.08553   -0.03131
C     1.54132    0.02698   -0.02446   -0.06171    0.04593   -0.01161
N     2.01181    1.41354   -0.01735    0.03971   -0.01121    0.01292
O    -0.49623   -1.33890   -0.07258   -0.01445    0.02672    0.00726
H    -0.36340    0.50021   -0.91070    0.26550    0.19319    0.03661
H    -0.37364    0.53445    0.85587   -0.14045   -0.34383    0.03978
H     1.91355   -0.58616    0.81981    0.06666    0.19666    0.03650
H     1.89508   -0.45750   -0.94078   -0.39112   -0.25097    0.01731
H     3.01578    1.44403   -0.17213    0.01113    0.27926   -0.05254
H     1.85253    1.83232    0.89642   -0.14172   -0.15754    0.03950
H    -0.22835   -1.78711    0.74040    0.14723    0.28633    0.09909
11
Model[14]: PATH=Frequencies;IRIntensity=3.02 km/mol;Frequency=1273.64 cm^-1
C     0.01231   -0.01259   -0.02146   -0.04070   -0.01041    0.07787
C     1.54132    0.02698   -0.02446   -0.02756   -0.04602   -0.11045
N     2.01181    1.41354   -0.01735   -0.00375    0.00807    0.05180
O    -0.49623   -1.33890   -0.07258   -0.00099   -0.01170   -0.01851
H    -0.36340    0.50021   -0.91070    0.39890    0.10424   -0.04243
H    -0.37364    0.53445    0.85587   -0.12204    0.10958   -0.03823
H     1.91355   -0.58616    0.81981    0.11572    0.29622    0.07302
H     1.89508   -0.45750   -0.94078    0.35470   -0.08991    0.05593
H     3.01578    1.44403   -0.17213   -0.02448   -0.21277   -0.07528
H     1.85253    1.83232    0.89642    0.03810    0.30983   -0.09040
H    -0.22835   -1.78711    0.74040    0.11965    0.22824    0.07932
11
Model[15]: PATH=Frequencies;IRIntensity=9.05 km/mol;Frequency=1330.47 cm^-1
C     0.01231   -0.01259   -0.02146    0.01618   -0.00683    0.04602
C     1.54132    0.02698   -0.02446    0.00591    0.02610   -0.01275
N     2.01181    1.41354   -0.01735    0.00284   -0.00064   -0.04485
O    -0.49623   -1.33890   -0.07258   -0.00497    0.00316    0.01062
H    -0.36340    0.50021   -0.91070    0.31192    0.10693   -0.01344
H    -0.37364    0.53445    0.85587   -0.36228   -0.19410   -0.01150
H     1.91355   -0.58616    0.81981   -0.53435   -0.34868   -0.02531
H     1.89508   -0.45750   -0.94078    0.34612    0.23759    0.01126
H     3.01578    1.44403   -0.17213    0.01829    0.12485    0.04163
H     1.85253    1.83232    0.89642   -0.01449   -0.19974    0.04958
H    -0.22835   -1.78711    0.74040    0.01120    0.00246    0.00629
11
Model[16]: PATH=Frequencies;IRIntensity=1.42 km/mol;Frequency=1382.22 cm^-1
C     0.01231   -0.01259   -0.02146   -0.05138   -0.05694    0.02962
C     1.54132    0.02698   -0.02446   -0.07088    0.01613    0.04655
N     2.01181    1.41354   -0.01735    0.03534   -0.01516   -0.03705
O    -0.49623   -1.33890   -0.07258    0.00004   -0.01286   -0.03187
H    -0.36340    0.50021   -0.91070    0.16300    0.00036   -0.01885
H    -0.37364    0.53445    0.85587    0.49246    0.40045    0.00186
H     1.91355   -0.58616    0.81981    0.07821   -0.01944   -0.03734
H     1.89508   -0.45750   -0.94078    0.16679    0.27043    0.01011
H     3.01578    1.44403   -0.17213    0.03667    0.27863    0.02872
H     1.85253    1.83232    0.89642   -0.08396   -0.25766    0.05826
H    -0.22835   -1.78711    0.74040    0.11096    0.22788    0.07103
11
Model[17]: PATH=Frequencies;IRIntensity=57.58 km/mol;Frequency=1397.76 cm^-1
C     0.01231   -0.01259   -0.02146   -0.05311    0.01724   -0.07258
C     1.54132    0.02698   -0.02446   -0.04527   -0.02440    0.00880
N     2.01181    1.41354   -0.01735    0.01745   -0.00716   -0.00281
O    -0.49623   -1.33890   -0.07258    0.03249    0.00276    0.05723
H    -0.36340    0.50021   -0.91070    0.29039    0.44814    0.01810
H    -0.37364    0.53445    0.85587    0.04803   -0.10076    0.03842
H     1.91355   -0.58616    0.81981    0.23153    0.15441   -0.00334
H     1.89508   -0.45750   -0.94078    0.12542    0.13003   -0.00962
H     3.01578    1.44403   -0.17213    0.01221    0.08623   -0.00588
H     1.85253    1.83232    0.89642   -0.03753   -0.05291    0.00763
H    -0.22835   -1.78711    0.74040   -0.25668   -0.52406   -0.15504
11
Model[18]: PATH=Frequencies;IRIntensity=0.61 km/mol;Frequency=1447.59 cm^-1
C     0.01231   -0.01259   -0.02146   -0.09028   -0.05024   -0.00581
C     1.54132    0.02698   -0.02446    0.11158    0.06092   -0.01403
N     2.01181    1.41354   -0.01735   -0.03002    0.00473    0.01110
O    -0.49623   -1.33890   -0.07258    0.01100   -0.00271    0.00580
H    -0.36340    0.50021   -0.91070    0.33006    0.20271   -0.04081
H    -0.37364    0.53445    0.85587    0.31018    0.16864    0.04124
H     1.91355   -0.58616    0.81981   -0.33853   -0.16703    0.03252
H     1.89508   -0.45750   -0.94078   -0.34700   -0.23878   -0.03547
H     3.01578    1.44403   -0.17213   -0.01899   -0.16597    0.02702
H     1.85253    1.83232    0.89642    0.07891    0.11229   -0.01743
H    -0.22835   -1.78711    0.74040   -0.02562   -0.06189   -0.01731
11
Model[19]: PATH=Frequencies;IRIntensity=0.07 km/mol;Frequency=1516.95 cm^-1
C     0.01231   -0.01259   -0.02146    0.02911   -0.04623   -0.00163
C     1.54132    0.02698   -0.02446   -0.02256    0.04919    0.00350
N     2.01181    1.41354   -0.01735   -0.00030    0.00849    0.00125
O    -0.49623   -1.33890   -0.07258    0.00043   -0.00688    0.00085
H    -0.36340    0.50021   -0.91070   -0.18254    0.35499    0.30216
H    -0.37364    0.53445    0.85587   -0.17935    0.32567   -0.29895
H     1.91355   -0.58616    0.81981    0.16182   -0.30656   -0.30296
H     1.89508   -0.45750   -0.94078    0.15810   -0.35779    0.27097
H     3.01578    1.44403   -0.17213   -0.00519   -0.03625   -0.02155
H     1.85253    1.83232    0.89642   -0.03284   -0.00747    0.00133
H    -0.22835   -1.78711    0.74040   -0.00077   -0.01651   -0.00407
11
Model[20]: PATH=Frequencies;IRIntensity=1.22 km/mol;Frequency=1532.07 cm^-1
C     0.01231   -0.01259   -0.02146   -0.03022    0.05063   -0.00295
C     1.54132    0.02698   -0.02446   -0.03169    0.04902    0.00377
N     2.01181    1.41354   -0.01735   -0.00167    0.00435    0.00055
O    -0.49623   -1.33890   -0.07258   -0.00043    0.00337    0.00170
H    -0.36340    0.50021   -0.91070    0.19279   -0.30791   -0.29018
H    -0.37364    0.53445    0.85587    0.19677   -0.30402    0.29440
H     1.91355   -0.58616    0.81981    0.21721   -0.28971   -0.32035
H     1.89508   -0.45750   -0.94078    0.20094   -0.34373    0.28507
H     3.01578    1.44403   -0.17213   -0.00439   -0.02186   -0.01108
H     1.85253    1.83232    0.89642   -0.02049   -0.01247    0.00480
H    -0.22835   -1.78711    0.74040   -0.01576   -0.02069   -0.00703
11
Model[21]: PATH=Frequencies;IRIntensity=26.45 km/mol;Frequency=1669.27 cm^-1
C     0.01231   -0.01259   -0.02146    0.00714   -0.00252    0.00086
C     1.54132    0.02698   -0.02446   -0.01590    0.01042   -0.01605
N     2.01181    1.41354   -0.01735   -0.04077   -0.05673   -0.02041
O    -0.49623   -1.33890   -0.07258   -0.00166    0.00007    0.00059
H    -0.36340    0.50021   -0.91070    0.00160    0.00575    0.00729
H    -0.37364    0.53445    0.85587   -0.01553   -0.00701   -0.01594
H     1.91355   -0.58616    0.81981    0.03252    0.02988   -0.03099
H     1.89508   -0.45750   -0.94078    0.00594   -0.05546    0.02672
H     3.01578    1.44403   -0.17213    0.05265    0.44274    0.49411
H     1.85253    1.83232    0.89642    0.61859    0.27729   -0.02585
H    -0.22835   -1.78711    0.74040    0.00132   -0.00016   -0.00027
11
Model[22]: PATH=Frequencies;IRIntensity=101.34 km/mol;Frequency=2917.07 cm^-1
C     0.01231   -0.01259   -0.02146   -0.00005    0.00262    0.00504
C     1.54132    0.02698   -0.02446   -0.03033    0.04224   -0.05331
N     2.01181    1.41354   -0.01735    0.00055    0.00229    0.00030
O    -0.49623   -1.33890   -0.07258   -0.00012   -0.00060    0.00017
H    -0.36340    0.50021   -0.91070   -0.01160    0.01832   -0.02612
H    -0.37364    0.53445    0.85587    0.02157   -0.03294   -0.04991
H     1.91355   -0.58616    0.81981    0.32682   -0.50288    0.74082
H     1.89508   -0.45750   -0.94078    0.01969   -0.03278   -0.10164
H     3.01578    1.44403   -0.17213   -0.00424    0.00296    0.00571
H     1.85253    1.83232    0.89642    0.00904   -0.00356   -0.00380
H    -0.22835   -1.78711    0.74040   -0.00543   -0.00547    0.00286
11
Model[23]: PATH=Frequencies;IRIntensity=63.65 km/mol;Frequency=2972.50 cm^-1
C     0.01231   -0.01259   -0.02146   -0.03316    0.04042    0.05219
C     1.54132    0.02698   -0.02446    0.00445   -0.00414   -0.00109
N     2.01181    1.41354   -0.01735   -0.00021   -0.00039   -0.00014
O    -0.49623   -1.33890   -0.07258    0.00074    0.00197   -0.00027
H    -0.36340    0.50021   -0.91070    0.04103   -0.06378    0.13971
H    -0.37364    0.53445    0.85587    0.33390   -0.44809   -0.76200
H     1.91355   -0.58616    0.81981   -0.01726    0.02387   -0.04065
H     1.89508   -0.45750   -0.94078   -0.02239    0.03400    0.06535
H     3.01578    1.44403   -0.17213    0.00070   -0.00397   -0.00278
H     1.85253    1.83232    0.89642   -0.00665   -0.00199    0.00012
H    -0.22835   -1.78711    0.74040    0.00362    0.00202   -0.00197
11
Model[24]: PATH=Frequencies;IRIntensity=24.45 km/mol;Frequency=3082.68 cm^-1
C     0.01231   -0.01259   -0.02146    0.00684   -0.00969    0.01113
C     1.54132    0.02698   -0.02446    0.02267   -0.03019   -0.07012
N     2.01181    1.41354   -0.01735   -0.00083    0.00083    0.00174
O    -0.49623   -1.33890   -0.07258   -0.00015    0.00020   -0.00002
H    -0.36340    0.50021   -0.91070   -0.06937    0.09744   -0.17095
H    -0.37364    0.53445    0.85587   -0.01425    0.01668    0.03364
H     1.91355   -0.58616    0.81981    0.03448   -0.04702    0.05056
H     1.89508   -0.45750   -0.94078   -0.29769    0.40230    0.78198
H     3.01578    1.44403   -0.17213    0.00399   -0.00376   -0.00006
H     1.85253    1.83232    0.89642    0.00431   -0.00389   -0.01923
H    -0.22835   -1.78711    0.74040    0.00097   -0.00162    0.00270
11
Model[25]: PATH=Frequencies;IRIntensity=30.81 km/mol;Frequency=3115.33 cm^-1
C     0.01231   -0.01259   -0.02146   -0.02259    0.02934   -0.07331
C     1.54132    0.02698   -0.02446    0.00392   -0.00427   -0.01801
N     2.01181    1.41354   -0.01735   -0.00033    0.00008    0.00069
O    -0.49623   -1.33890   -0.07258    0.00091    0.00008    0.00172
H    -0.36340    0.50021   -0.91070    0.31652   -0.42118    0.75396
H    -0.37364    0.53445    0.85587   -0.05998    0.07148    0.10908
H     1.91355   -0.58616    0.81981    0.02432   -0.03099    0.04407
H     1.89508   -0.45750   -0.94078   -0.06354    0.08171    0.16251
H     3.01578    1.44403   -0.17213    0.00199   -0.00193    0.00077
H     1.85253    1.83232    0.89642    0.00241    0.00005   -0.00493
H    -0.22835   -1.78711    0.74040   -0.00932   -0.00008   -0.01499
11
Model[26]: PATH=Frequencies;IRIntensity=0.52 km/mol;Frequency=3493.53 cm^-1
C     0.01231   -0.01259   -0.02146    0.00040   -0.00026   -0.00007
C     1.54132    0.02698   -0.02446   -0.00049    0.00196   -0.00300
N     2.01181    1.41354   -0.01735   -0.03084   -0.02638   -0.03800
O    -0.49623   -1.33890   -0.07258   -0.00008    0.00002    0.00002
H    -0.36340    0.50021   -0.91070    0.00021    0.00051   -0.00044
H    -0.37364    0.53445    0.85587   -0.00156    0.00037    0.00102
H     1.91355   -0.58616    0.81981    0.00411   -0.00032    0.00860
H     1.89508   -0.45750   -0.94078   -0.00367    0.00332    0.01102
H     3.01578    1.44403   -0.17213    0.58651    0.01736   -0.13247
H     1.85253    1.83232    0.89642   -0.15467    0.32495    0.67641
H    -0.22835   -1.78711    0.74040   -0.00006   -0.00017    0.00010
11
Model[27]: PATH=Frequencies;IRIntensity=0.10 km/mol;Frequency=3579.54 cm^-1
C     0.01231   -0.01259   -0.02146    0.00034   -0.00010    0.00007
C     1.54132    0.02698   -0.02446   -0.00101    0.00109    0.00132
N     2.01181    1.41354   -0.01735   -0.05961    0.01507    0.04648
O    -0.49623   -1.33890   -0.07258   -0.00003    0.00000   -0.00006
H    -0.36340    0.50021   -0.91070   -0.00029    0.00064   -0.00082
H    -0.37364    0.53445    0.85587    0.00189    0.00015   -0.00050
H     1.91355   -0.58616    0.81981    0.00028    0.00115   -0.00192
H     1.89508   -0.45750   -0.94078    0.00551   -0.00681   -0.01308
H     3.01578    1.44403   -0.17213    0.74322    0.02435   -0.11942
H     1.85253    1.83232    0.89642    0.08602   -0.24045   -0.52626
H    -0.22835   -1.78711    0.74040    0.00007   -0.00019    0.00063
11
Model[28]: PATH=Frequencies;IRIntensity=12.05 km/mol;Frequency=3809.19 cm^-1
C     0.01231   -0.01259   -0.02146   -0.00156   -0.00019   -0.00256
C     1.54132    0.02698   -0.02446    0.00022   -0.00048    0.00024
N     2.01181    1.41354   -0.01735   -0.00009   -0.00004    0.00000
O    -0.49623   -1.33890   -0.07258   -0.01555    0.02973   -0.05020
H    -0.36340    0.50021   -0.91070    0.00543   -0.00361    0.01355
H    -0.37364    0.53445    0.85587   -0.00131   -0.00284    0.00216
H     1.91355   -0.58616    0.81981    0.00137    0.00174   -0.00193
H     1.89508   -0.45750   -0.94078   -0.00020    0.00028    0.00007
H     3.01578    1.44403   -0.17213   -0.00068   -0.00048    0.00002
H     1.85253    1.83232    0.89642    0.00001    0.00023    0.00025
H    -0.22835   -1.78711    0.74040    0.25938   -0.45849    0.81026
</ModelData>
</Models>
##$PEAKS=
<Peaks type="RAMAN" xUnitsExpected="1/cm"  >
<PeakData id="1" title="OH stretch (~3400 cm-1)" peakShape="broad" model="2.28" xMax="3375" xMin="3335"    />
<PeakData id="2" title="asymm stretch of NH2 group (~3290 cm-1)" peakShape="broad" model="2.27" xMax="3310" xMin="3270"    />
<PeakData id="3" title="symm stretch of NH2 group (~3170 cm-1)" peakShape="broad" model="2.26" xMax="3220" xMin="3120"    />
<PeakData id="4" title="asymm stretch of CH2 group (~2925 cm-1)" peakShape="broad" model="2.25" xMax="2955" xMin="2895"    />
<PeakData id="5" title="symm bend of CH2 group (~2858 cm-1)" peakShape="broad" model="2.24" xMax="2888" xMin="2828"    />
<PeakData id="6" title="Carbonyl stretching band (~1685 cm-1)" peakShape="broad" model="2.21" xMax="1635" xMin="1575"    />
<PeakData id="7" title="C-C of aromatic group (~1600 cm-1)" peakShape="broad" model="2.20" xMax="1490" xMin="1430"    />
<PeakData id="8" title="symm stretch of CH3 group (~1450 cm-1)" peakShape="broad" model="2.19" xMax="1395" xMin="1335"    />
<PeakData id="9" title="C-H twist of methyl group (~1360 cm-1)" peakShape="broad" model="2.16" xMax="1260" xMin="1220"    />
<PeakData id="10" title="scissors of aromatic C-H groups (~1265 cm-1" peakShape="broad" model="2.13" xMax="1192" xMin="1152"    />
<PeakData id="11" title="symm stretch of CH3 group (~1080 cm-1)" peakShape="broad" model="2.12" xMax="1095" xMin="1065"    />
<PeakData id="12" title="symm stretch of CH group (~1025 cm-1)" peakShape="broad" model="2.10" xMax="1050" xMin="1015"    />
<PeakData id="13" title=" (~955 cm-1" peakShape="broad" model="2.9" xMax="960" xMin="920"    />
<PeakData id="14" title=" (~760 cm-1)" peakShape="broad" model="2.7" xMax="892" xMin="852"    />
<PeakData id="15" title=" (~480 cm-1)" peakShape="broad" model="2.6" xMax="500" xMin="460"    />
</Peaks>
##XUNITS= 1/CM
##YUNITS= RAMAN INTENSITY
##XFACTOR= 1E0
##YFACTOR= 9.5147402E-7
##FIRSTX= 33.81494141
##FIRSTY= 0.86726397
##LASTX= 3989.93711266
##NPOINTS= 1489
##XYDATA= (X++(Y..Y))
33.81494141I11495k0612m0558m8391m9659l7704l3550l3233l1394k9269E59696
$$ 911495 890883 850325 801934 752275 714571 681021 647788 616394 587125 559696
63.11494141000001E33978k4037k2419k0866j9407j7853j6014j4809j4048j3731C56651
$$ 533978 509941 487522 466656 447249 429396 413382 398573 384525 370794 356651
92.31494141C42445j3921j4016j4460j4334j3794j2811j0909r830r228q879B11194
$$ 342445 328524 314508 300048 285714 271920 259109 248200 238370 229142 220263 211194
124.2196596244355B02347q467q055p515p103o787o532o501o215n898n328m534A25353
$$ 202347 193880 185825 178310 171207 164420 157888 151387 145172 139274 133946 129412 125353
158.81965962443533A21611l615l774l710l488l171k632k347k156k061k157k124H8315
$$ 121611 117996 114222 110512 107024 103853 101221 98874 96718 94657 92500 90376 88315
193.31965962443533H6412j681j617j617j713j934k093k156k347k632k727k727k505E8602
$$ 86412 84731 83114 81497 79784 77850 75757 73601 71254 68622 65895 63168 60663 58602
230.57838614230494E6794j712j681j776j776j649j427j014q25o97o98q56q88p61D0336
$$ 56794 55082 53401 51625 49849 48200 46773 45759 44934 44237 43539 42683 41795 41034 40336
270.47366792786966C9892l17k22j58j91o3L2J90M44O34P61R51J079J236J364J554D8961
$$ 39892 39575 39353 39195 39004 38941 38973 39163 39607 40241 41002 41953 43032 44268 45632 47186 48961
315.6085739993482E0864J966K188K537K537K315J776O97O4k54m44k85m44p30j205E9553
$$ 50864 52830 55018 57555 60092 62407 64183 64880 64944 64690 64246 63961 63517 62787 61582 59553
358.1847535529571E7111k632k695k537k442k378k188j935j744j553j396j300j110C2282
$$ 57111 54479 51784 49247 46805 44427 42239 40304 38560 37007 35611 34311 33201 32282
395.44348007082675C1616k22l2J27J27%%l2%%%L2l2k54k22%M76J332J807K252K093C9734
$$ 31616 31394 31362 31489 31616 31616 31616 31584 31584 31584 31584 31616 31584 31330 31108 31108 31584 32916 34723 36975 39068 39734
453.87366792786963D0844K505N232J0306J3287J4460J7124K2705K2292J8995R355A65594
$$ 40844 43349 48581 58887 72174 86634 103758 126463 148755 167750 177105 165594
485.81494141A44855k3466k2166j2906q689p262m851j967m12M12J91j681E9585
$$ 144855 121389 99223 86317 77628 70366 65515 63548 63136 63548 63739 62058 59585
520.41494141E6921k981l298l456l552l583l584l424l203k727j871j364j110B1817
$$ 56921 53940 50642 47186 43634 40051 36467 33043 29840 27113 25242 23878 22768 21817
557.6371126601741B0834r20p61o02l81k85k22j59k85k54k22j90l2l1L1L2%%%%A6553
$$ 20834 19914 19153 18551 18170 17885 17663 17504 17219 16965 16743 16553 16521 16490 16521 16553 16553 16553 16553 16553 16553
613.3911209636087A6553l2%%%%%%l1%%%%%%%%%%l2%%%%%%%%%%l2%l2%L2O4R5J27A6870
$$ 16553 16521 16521 16521 16521 16521 16521 16521 16490 16490 16490 16490 16490 16490 16490 16490 16490 16490 16490 16458 16458 16458 16458 16458 16458 16458 16458 16458 16458 16458 16426 16426 16394 16394 16426 16490 16585 16712 16870
717.0847535529566A7092K54K85K86K22K53K86L80N08N70O35O02N71N39N71O66B4512
$$ 17092 17346 17631 17917 18139 18392 18678 19058 19566 20136 20771 21373 21944 22483 23054 23720 24512
762.2847535529567B5369R19Q88P61P61Q88J110J554J807J998J903J363J523K092D5854
$$ 25369 26288 27176 27937 28698 29586 30696 32250 34057 36055 37958 39321 40844 42936 45854
802.1673005172175E0008N359O532Q182J0496J2019J3033J3857J4460J4841J4936A78944
$$ 50008 55367 61899 70081 80577 92596 105629 119486 133946 148787 163723 178944
834.1085739993479A95117J5474J4302J0465J870q24m76L901J5823K0327K0168C15078
$$ 195117 210591 224893 235358 237228 236404 235928 239829 255652 275979 296147 315078
866.0498474814783C30553J0845N867l996k1848l0570l3803l3709k7525k4195k2356A30617
$$ 330553 341398 347265 343269 321421 290851 257048 223339 195814 171619 149263 130617
897.9498474814783A17584r355o945m883l615k410j364j015j617j554j173p93r5H3019
$$ 117584 108229 101284 96401 92786 90376 89012 87997 86380 84826 83653 82860 82765 83019
935.1085739993479H3463M44%l2L17P61J617K252K695L330M249M725M852M852M629A22404
$$ 83463 83907 83907 83875 84192 84953 86570 88822 91517 94847 99096 103821 108673 113525 118154 122404
977.6847535529566A26304L171J935J173O34J59k22n71o66r20j427j205n70Q87A32393
$$ 126304 129475 131410 132583 133217 133376 133154 132583 131917 130997 129570 128365 127795 128682 132393
1017.6022065886958A37593N772O500P611P293O247L108l837o628o786n930l234A47297
$$ 137593 143365 149865 157476 164769 171016 174124 170287 163659 156873 150943 147709 147297
1052.1434800708262A49516P674J7885K2261K3244K1659J5380J1954R799P452N486B95196
$$ 149516 157190 175075 197336 220580 242239 257619 269573 279372 286824 292310 295196
1083.9847535529566B95354l805j0116j3191j4556j3382p483o311p357j1130k0295A64135
$$ 295354 291549 281433 268242 253686 240304 232821 226510 219153 208023 187728 164135
1115.926027035087A40479k1310j4206j0623q848p293o818n708m249k822j079K22E8982
$$ 140479 119169 104963 94340 85492 78199 71381 65673 61424 58602 57523 57745 58982
1150.5260270350873F1075K791L329L647M154N169M915M027J744l012n296o183o469F4246
$$ 61075 63866 67195 70842 74996 80165 85080 89107 90851 87839 82543 76360 69891 64246
1187.6847535529569E9172m725l741j808q24j91r5q24o35%R84K600L805M662N676G0937
$$ 59172 54447 50706 48898 48074 47883 47788 46964 46329 46329 47313 49913 53718 58380 64056 70937
1230.2609331065655G8579Q023Q499R132Q943Q213O596L647J744N07r51k727l584A22816
$$ 78579 86602 95101 104233 113176 121389 127985 131632 133376 133883 132932 130205 126621 122816
1267.4609331065653A19233k823j807o98J554N835P801Q371Q150O501N391M471L203A66926
$$ 119233 116410 114603 113905 115459 121294 129095 137466 145616 152117 157508 161979 165182 166926
1304.7196596244348A67052j458l932p991r894j0401j0148q593p167n771l108J427A03980
$$ 167052 165594 161662 153671 143777 133376 123228 114635 107468 101697 98589 100016 103980
1339.2196596244348A09180O152O691O469N835L837l49k568l679m313l868m059m503A09878
$$ 109180 115332 122023 128492 134327 138164 137815 135247 131568 127255 123387 119328 114825 109878
1376.5149414100001A04107n994n866n359m186l488l076k728k790k410j871r83L49F6878
$$ 104107 98113 92247 86888 82702 79214 76138 73410 70620 68210 66339 65356 65705 66878
1413.6736679278697F8781J807j27N39K664O533J3604J7916K0676K3402K5940K7493B36943
$$ 68781 70588 70461 71000 73664 80197 93801 111717 132393 155795 181735 209228 236943
1448.3149414099998B65895L2979L0633K4988J3033r672k2261k8666l3931l6404A99271
$$ 265895 298874 329507 354495 367528 357856 335595 306929 272998 236594 199271
1477.5609331065652A62232l2757k2610j6838j3509r989o849m503k664j903k663D5410
$$ 162232 129475 106865 90027 76518 66529 59680 55177 52513 50610 47947 45410
1509.4609331065653D3380j649j205r19p30o65q88q57o97m76L2K54L80L81J58J59C6911
$$ 43380 41731 40526 39607 38877 38212 37324 36467 35770 35294 35326 35580 35960 36341 36499 36658 36911
1554.632394445739C7387Q56J078J237J237Q88J014J301K029L679M249M217L711F5039
$$ 37387 38243 39321 40558 41795 42683 43697 44998 47027 50706 54955 59172 62883 65039
1591.7911209636086F6434R83P61J078Q25K22q25k727l678m059m091l456l171l045D2397
$$ 66434 67417 68178 69256 70081 70303 69478 66751 63073 59014 54923 51467 48296 45251 42397
1631.7085739993481C9829k315k093j839j427j205j047j014j142j110j046q88o66B3498
$$ 39829 37514 35421 33582 32155 30950 29903 28889 27747 26637 25591 24703 24037 23498
1668.908573999348B3054m76n39n71n39m76l80l49k85l17l17l18l17k22j58o4o3A7631
$$ 23054 22578 22039 21468 20929 20453 20073 19724 19439 19122 18805 18487 18170 17948 17790 17726 17663 17631
1716.826027035087A7631L2%l2o3j27j27j90k54l17k85l17k54k22k22j27o3%L1A5126
$$ 17631 17663 17663 17631 17568 17441 17314 17124 16870 16553 16268 15951 15697 15475 15253 15126 15063 15063 15094 15126
1769.9609331065653A5126l2%%%%%%%l1%%%%%%%l2%%%%%%%%%%l2%%%%%%%%%%l2%A4967
$$ 15126 15094 15094 15094 15094 15094 15094 15094 15094 15063 15063 15063 15063 15063 15063 15063 15063 15031 15031 15031 15031 15031 15031 15031 15031 15031 15031 15031 14999 14999 14999 14999 14999 14999 14999 14999 14999 14999 14999 14967 14967 14967
1881.6085739993478A4967%%%l1%%%%%%%%%%l2%%%%%%%%%%l2%%%%%%l1%%%%%l2%A4809
$$ 14967 14967 14967 14967 14936 14936 14936 14936 14936 14936 14936 14936 14936 14936 14936 14904 14904 14904 14904 14904 14904 14904 14904 14904 14904 14904 14872 14872 14872 14872 14872 14872 14872 14841 14841 14841 14841 14841 14841 14809 14809 14809
1993.295839178044A4809%%%%%%l2%%%%%%%%%%%%%l1%L1R5J59J27J58J27J27J59A5855
$$ 14809 14809 14809 14809 14809 14809 14809 14777 14777 14777 14777 14777 14777 14777 14777 14777 14777 14777 14777 14777 14777 14746 14746 14777 14872 15031 15158 15316 15443 15570 15729 15855
2078.395839178044A5982J27J27J58J27J27J59R5J27R5O3O4L1%%l1%%%%%%%%L1A7282
$$ 15982 16109 16236 16394 16521 16648 16807 16902 17029 17124 17187 17251 17282 17282 17282 17251 17251 17251 17251 17251 17251 17251 17251 17251 17282 17282
2147.4847535529566A7282l1o4o3j27r5j27j27j58j27j27j59j26j27j27j27j27j58A5126
$$ 17282 17251 17187 17124 16997 16902 16775 16648 16490 16363 16236 16077 15951 15824 15697 15570 15443 15285 15126
2198.0609331065657A4967r5o3R5J27J90J90J27J59J58J27J59J58J27J59J58J27A7029
$$ 14967 14872 14809 14904 15031 15221 15411 15538 15697 15855 15982 16141 16299 16426 16585 16743 16870 17029
2245.878386142305A7156J58J27J27J27J26J59J27J27J27J26J59J27J27J26J27A9280
$$ 17156 17314 17441 17568 17695 17821 17980 18107 18234 18361 18487 18646 18773 18900 19026 19153 19280
2291.0371126601744A9439J27J26J27J27J27J58J27J27J27J27J27J58J27J27J27B1563
$$ 19439 19566 19692 19819 19946 20073 20231 20358 20485 20612 20739 20866 21024 21151 21278 21405 21563
2336.295839178044B1690J27J27R5O3O4L2%%%%%%%%%%%%o4l2%R6K85L80M13M44B4164
$$ 21690 21817 21944 22039 22102 22166 22198 22198 22198 22198 22198 22198 22198 22198 22198 22198 22198 22198 22198 22134 22102 22102 22198 22483 22863 23276 23720 24164
2410.7609331065655B4608M44M43M44M44M44M44M76M44M44L80L17K22K22J59J59C0220
$$ 24608 25052 25495 25939 26383 26827 27271 27747 28191 28635 29015 29332 29554 29776 29935 30094 30220
2455.919659624435C0347J27J27J27J58J27J27J27J58J27O4R5J58K54M76N70O66C4470
$$ 30347 30474 30601 30728 30886 31013 31140 31267 31425 31552 31616 31711 31869 32123 32599 33169 33835 34470
2503.7783861423045C5072N71O02N71O03N71O02O03O02O03N70N71M76M75M44M44D3824
$$ 35072 35643 36245 36816 37419 37990 38592 39195 39797 40400 40970 41541 42017 42492 42936 43380 43824
2548.991120963609D4268M44M44M44M44M44M12M44M44M44M44M12M13M12M12M12E1118
$$ 44268 44712 45156 45600 46044 46488 46900 47344 47788 48232 48676 49088 49501 49913 50325 50737 51118
2594.1673005172174E1530L81M12L80M13L80M12L81M12L81K53K54M12O66J237J554F1107
$$ 51530 51911 52323 52703 53116 53496 53908 54289 54701 55082 55335 55589 56001 56667 57904 59458 61107
2639.402206588696F2787J491J458J586J617J618J775K093K505L171L742M123M756I8557
$$ 62787 64278 65736 67322 68939 70557 72332 74425 76930 80101 83843 87966 92722 98557
2676.5609331065657A04804O184N676M249L552L234L076L393L235K917K315J300A44665
$$ 104804 110988 116664 120913 124465 127699 130775 134168 137403 140320 142635 143935 144665
2711.1609331065656A45140M13N70O66O66P30O97Q56J110J618K505K980L140L234A67274
$$ 145140 145553 146123 146789 147455 148185 148882 149738 150848 152466 154971 157951 161091 164325 167274
2751.01494141A70128K854K791K727K664K600K569K441K410K347K188J712A99112
$$ 170128 172982 175773 178500 181164 183764 186333 188774 191184 193531 195719 197431 199112
2785.5783861423047B01237K410K315L329M884P769J2748J5633J7631J7980J5126C17298
$$ 201237 203647 205962 209291 214175 221944 234692 250325 267956 285936 301062 317298
2817.4609331065653C36547K5368L7451M3063M5600M3983L4597L3454L5707M4680G47265
$$ 336547 361915 399366 442429 488029 532012 566609 600063 635770 680450 747265
2846.7434800708265H20168P0081N9236L3930J9280J0053J998j871r482j7695l1044H99794
$$ 820168 890249 949485 983415 1002695 1012748 1014746 1012875 1003393 985698 954654 899794
2878.602206588696H36563o2629n3433k9459j4873n993O437K3086L1711L5484L3962H24608
$$ 836563 773934 720501 691042 676169 670176 676613 699699 731410 766894 800856 824608
2910.51494141H43539J6648J4238J3319J0242N930M76o818j3096j8456k5400H05518
$$ 843539 860187 874425 887744 897986 903916 904392 897574 884478 866022 840622 805518
2942.47366792787G65118m3507m2619l4343l3709l6150m4554o4785p0652o8749B67163
$$ 765118 721611 678992 644649 610940 574790 530236 465451 394799 326050 267163
2971.6736679278697B32979k2039j6616j3477j5919j5063j2557j0560q276o469n074A03124
$$ 232979 210940 194324 180847 164928 149865 137308 126748 118472 112003 106929 103124
3003.5783861423047A00428j903j300j205j776j902j744j649j586j395j173q25k22H3875
$$ 100428 98525 97225 96020 94244 92342 90598 88949 87363 85968 84795 83970 83748 83875
3040.8149414100003H4160L18J58J27J27J27J26J27J59J27L1R6J26K54N07O03P29H8727
$$ 84160 84478 84636 84763 84890 85017 85143 85270 85429 85556 85587 85683 85809 86063 86570 87173 87902 88727
3088.708573999348H9646R83J015J047J014R83R83R84Q56Q88R83J236J713J998A06421
$$ 89646 90629 91644 92691 93705 94688 95671 96655 97511 98399 99382 100618 102331 104329 106421
3128.5260270350873A08578K061K093K125K156K220K251K252K314K442K442K346A35532
$$ 108578 110639 112732 114857 117013 119233 121484 123736 126050 128492 130934 133280 135532
3163.126027035087A37752J966J649J014o3o34r20j015p61o97o66n39l49k22r5A36547
$$ 137752 139718 141367 142381 142318 141684 140764 139749 138988 138291 137625 137086 136737 136515 136420 136547
3205.702206588696A36959N39O66O34N08N07O02O66O03P93J300J807K283L203M281A61376
$$ 136959 137498 138164 138798 139306 139813 140415 141081 141684 142477 143777 145584 147867 151070 155351 161376
3248.21494141A70160J0496J1702J2240J1384J2114J3635J6268K0866K3402C26558
$$ 170160 180656 192358 204598 215982 228096 241731 257999 278865 302267 326558
3277.4609331065653C52307K8127K7399K4702J9344R799K949k157q371j5856k0834C93499
$$ 352307 380434 407833 432535 451879 461678 464627 462470 454099 438243 417409 393499
3309.402206588696C67243k7589k7588k6701k3592j7251j3097j0337p008l171o98B11067
$$ 367243 339654 312066 285365 261773 244522 231425 221088 214080 210909 210211 211067
3341.2609331065655B12811J935J648J047o66l964o088p484r323j1955j2970j3160A39781
$$ 212811 214746 216394 217441 216775 212811 206723 199239 189916 177961 164991 151831 139781
3375.8609331065654A31124p198o659o723q055q149p516o374l964k758k125j808F7703
$$ 131124 123926 117267 110544 102489 94340 86824 80450 76486 73728 71603 69795 67703
3410.3609331065654F5610j903j903k093k061j934j649j110q24o98o98p92q57q24D7439
$$ 65610 63707 61804 59711 57650 55716 54067 52957 52133 51435 50737 49945 49088 48264 47439
3450.3149414100003D6615q25q24q25q56q24q25q24q25q24q25q24q25q56q24q25C3328
$$ 46615 45790 44966 44141 43285 42461 41636 40812 39987 39163 38338 37514 36689 35833 35009 34184 33328
3495.4498474814786C2472q25p92o66o03n71n07m76m44m44m12m44m44m44m44m44B4068
$$ 32472 31647 30855 30189 29586 29015 28508 28032 27588 27144 26732 26288 25844 25400 24956 24512 24068
3540.6673005172174B3625m13m12l80l49l49k86k53k54k54k53k86k53k54k85k54A8836
$$ 23625 23212 22800 22420 22071 21722 21436 21183 20929 20675 20422 20136 19883 19629 19344 19090 18836
3585.826027035087A8551k86k85k85j91j26o4l2l1%%%%%%%%%%%%%%%%%%%%%%%%A7251
$$ 18551 18265 17980 17695 17504 17378 17314 17282 17251 17251 17251 17251 17251 17251 17251 17251 17251 17251 17251 17251 17251 17251 17251 17251 17251 17251 17251 17251 17251 17251 17251 17251 17251 17251
3676.2434800708265A7251%%L1%%l1l2o3o4r5r5j27j59j26j27j27j59j26j27j27A5570
$$ 17251 17251 17251 17282 17282 17282 17251 17219 17156 17092 16997 16902 16775 16616 16490 16363 16236 16077 15951 15824 15697 15570
3734.795839178044A5411j26j59j27r5o3l2l2%%%%%%%%%%%%%%%%%%%%%%%%%%%%A4777
$$ 15411 15285 15126 14999 14904 14841 14809 14777 14777 14777 14777 14777 14777 14777 14777 14777 14777 14777 14777 14777 14777 14777 14777 14777 14777 14777 14777 14777 14777 14777 14777 14777 14777 14777 14777 14777 14777
3833.1498474814784A4777%%%%%%%%%%%%%%%%%%%%%%%%%%%%%%%%%%%%%%%%%%%%%A4777
$$ 14777 14777 14777 14777 14777 14777 14777 14777 14777 14777 14777 14777 14777 14777 14777 14777 14777 14777 14777 14777 14777 14777 14777 14777 14777 14777 14777 14777 14777 14777 14777 14777 14777 14777 14777 14777 14777 14777 14777 14777 14777 14777 14777 14777 14777 14777 14777
3958.032394445739A4777%%%%%%%%%%A4777
$$ 14777 14777 14777 14777 14777 14777 14777 14777 14777 14777 14777 14777
3989.937112660174A4777  $$checkpoint
##END= $$ end of Raman
##END=