##TITLE= Compound file, contains several data records
##JCAMP-DX= 5.0
##DATA TYPE= LINK
##BLOCKS=3
##ORIGIN= Department of Chemistry, UWI, JAMAICA
##OWNER= public domain
##TITLE= ethylbenzoate $$ Begin of the data block
##JCAMP-DX=5.00 $$
##DATE=05 Jun 2000 10:34:44
##DATA TYPE=INFRARED SPECTRUM
##DATA CLASS=XYDATA
##BLOCK_ID=1
##ORIGIN= Department of Chemistry, UWI, JAMAICA
##OWNER= Prof Robert Lancashire
##SPECTROMETER/DATA SYSTEM=PERKIN-ELMER 1000 FT-IR
##$MODELS=
<Models>
<ModelData id="ethylbenzoate" type="MOL">
ethyl benzoate
RLACD/Labs0214020804  

 21 21  0  0  0  0              1 V2000
  -0.91190  -1.97400  -0.06200 C   0  0  0  0  0  0
   0.52220  -1.97400  -0.06200 O   0  0  0  0  0  0
   1.15160  -0.75410  -0.06200 C   0  0  0  0  0  0
   0.37120   0.49720   0.01360 C   0  0  0  0  0  0
   0.27230   1.31770  -1.11510 C   0  0  0  0  0  0
  -0.43221   2.51880  -1.03790 C   0  0  0  0  0  0
  -1.02860   2.90400   0.16270 C   0  0  0  0  0  0
  -0.91610   2.09260   1.29230 C   0  0  0  0  0  0
  -0.21560   0.88960   1.22190 C   0  0  0  0  0  0
  -0.11640   0.25320   2.11460 H   0  0  0  0  0  0
  -1.33550  -3.42080  -0.15801 C   0  0  0  0  0  0
  -2.44920  -3.47840  -0.12220 H   0  0  0  0  0  0
   2.37610  -0.85840  -0.12980 O   0  0  0  0  0  0
  -1.58330   3.85260   0.22120 H   0  0  0  0  0  0
  -0.51190   3.16380  -1.92550 H   0  0  0  0  0  0
   0.75660   1.01710  -2.05680 H   0  0  0  0  0  0
  -1.37890   2.40130   2.24120 H   0  0  0  0  0  0
  -1.27630  -1.50250   0.88880 H   0  0  0  0  0  0
  -1.28290  -1.37870  -0.93720 H   0  0  0  0  0  0
  -0.90900  -4.00920   0.68920 H   0  0  0  0  0  0
  -0.97410  -3.87050  -1.11350 H   0  0  0  0  0  0
  1  2  1  0  0  0
  2  3  1  0  0  0
  3 13  2  0  0  0
  4  3  1  0  0  0
  5 16  1  0  0  0
  5  4  4  0  0  0
  6  5  4  0  0  0
  7  8  4  0  0  0
  7  6  4  0  0  0
  8  9  4  0  0  0
  9 10  1  0  0  0
  9  4  4  0  0  0
 11 21  1  0  0  0
 11 20  1  0  0  0
 11  1  1  0  0  0
 12 11  1  0  0  0
 14  7  1  0  0  0
 15  6  1  0  0  0
 17  8  1  0  0  0
 18  1  1  0  0  0
 19  1  1  0  0  0
M  END
</ModelData>
<ModelData id="1" type="XYZVIB" baseModel="ethylbenzoate" vibrationScale=".1">
21
1  Energy: -1930.56976  Freq: 3199.22467
C    -0.911900   -1.974000   -0.062000   -0.000060    0.000000    0.000140
O     0.522200   -1.974000   -0.062000    0.000060    0.000140    0.000000
C     1.151600   -0.754100   -0.062000    0.000600   -0.000940   -0.000060
C     0.371200    0.497200    0.013600   -0.002100    0.003580    0.000300
C     0.272300    1.317700   -1.115100   -0.015420    0.008960    0.031340
C    -0.432200    2.518800   -1.037900    0.004660   -0.038400    0.053240
C    -1.028600    2.904000    0.162700    0.034280   -0.058500   -0.003800
C    -0.916100    2.092600    1.292300    0.031240   -0.020740   -0.064240
C    -0.215600    0.889600    1.221900   -0.002700    0.021280   -0.031600
H    -0.116400    0.253200    2.114600    0.039460   -0.249220    0.347260
$$ [...]
H    -1.282900   -1.378700   -0.937200    0.080580   -0.293940   -0.432820
H    -0.909000   -4.009200    0.689200   -0.131720    0.246620    0.497180
H    -0.974100   -3.870500   -1.113500    0.189700   -0.374380    0.437880
21
57  Energy: -1930.56976  Freq: 30.92661
C    -0.911900   -1.974000   -0.062000    0.003360    0.037560   -0.137020
O     0.522200   -1.974000   -0.062000    0.004140    0.005760   -0.070280
C     1.151600   -0.754100   -0.062000    0.019900   -0.002080    0.049900
C     0.371200    0.497200    0.013600    0.012640   -0.004320    0.028220
C     0.272300    1.317700   -1.115100   -0.136960   -0.100960   -0.028160
C    -0.432200    2.518800   -1.037900   -0.151240   -0.108260   -0.043500
C    -1.028600    2.904000    0.162700   -0.018400   -0.021740   -0.005240
C    -0.916100    2.092600    1.292300    0.127040    0.071720    0.047360
C    -0.215600    0.889600    1.221900    0.141820    0.079200    0.063740
H    -0.116400    0.253200    2.114600    0.251320    0.148540    0.100780
C    -1.335500   -3.420800   -0.158000   -0.026200    0.042120   -0.066700
H    -2.449200   -3.478400   -0.122200   -0.030220    0.072740   -0.141020
O     2.376100   -0.858400   -0.129800    0.025200   -0.009500    0.171760
H    -1.583300    3.852600    0.221200   -0.029220   -0.027300   -0.017940
H    -0.511900    3.163800   -1.925500   -0.268380   -0.182640   -0.087020
H     0.756600    1.017100   -2.056800   -0.245100   -0.168500   -0.061880
H    -1.378900    2.401300    2.241200    0.229800    0.139180    0.075520
H    -1.276300   -1.502500    0.888800   -0.034120    0.110620   -0.187340
H    -1.282900   -1.378700   -0.937200    0.065760   -0.009400   -0.195880
H    -0.909000   -4.009200    0.689200   -0.100680    0.089460    0.003600
H    -0.974100   -3.870500   -1.113500    0.029380   -0.032720   -0.010540
  </ModelData>
</Models>
##$PEAKS=
<Peaks type="IR" xUnits="1/cm" yUnits="TRANSMITTANCE" >
<PeakData id="1" title="peak 1 (~3100 cm-1)" peakShape="broad" model="1.1" xMax="3398" xMin="3358"  yMax="1" yMin="0" />
<PeakData id="2" title="peak 2 (~3100 cm-1)" peakShape="broad" model="1.2" xMax="3369" xMin="3329"  yMax="1" yMin="0" />
<PeakData id="3" title="peak 3 (~3100 cm-1)" peakShape="broad" model="1.3" xMax="3093" xMin="3053"  yMax="1" yMin="0" />
<PeakData id="4" title="peak 4 (~3100 cm-1)" peakShape="broad" model="1.4" xMax="2893" xMin="2853"  yMax="1" yMin="0" />
<PeakData id="5" title="peak 5 (~3100 cm-1)" peakShape="broad" model="1.5" xMax="2774" xMin="2734"  yMax="1" yMin="0" />
<PeakData id="6" title="C=O stretch (~1750 cm-1)" peakShape="broad" model="1.11" xMax="1740" xMin="1700"  yMax="1" yMin="0" />
</Peaks>
##NPOINTS=3951
##FIRSTX=450.00000000
##LASTX=4400.00000000
##MAXX=4400.00000000
##MINX=450.00000000
##MAXY=0.96244204
##MINY=0.03821335
##XFACTOR=1.0000000000
##YFACTOR=0.0000300763
##FIRSTY=0.08247134
##DELTAX=1.00000000
##XUNITS=1/CM
##YUNITS= TRANSMITTANCE
##XYDATA=(X++(Y..Y))
450B742j058m13O6L79M42TO8r9o5K8K9l0k1Q7J82J59N7RR5K46L28K63Q1j11k08j66
476C532j7J50K43K34J71J16J02J11J21J26J37J50J55J45J23R0N0J9K2Q0J63K18K06
499F447J55J20J46K13K67K75K45K15K06K19K42K72L02L23L15K79K34K06K04K12K15
520A1312K11K12K18K22K16K14K24K45K62K60K50K49K61K68K56K28K03J99K14K31K39
541A6194K41K39K34K22K05J92J91K07K27K44TK32K12J93J79J72J71TJ73J79J84J89
563B0695J88J84J77J71J63J55J46J43J45J50J58J67J75J74J64J45J30J26J33J45J48
584B3982J44J34J26J23J26J27J26J24J22J19J18TJ19J21J17J09J04J08J10R8P7O8P9
607B6599Q6O4K7J8L0l9k90o65r00p17j00O38J083J057P10L44J45R8R6P6N4N3O9Q5R5
$$ plain form
450 2742 1684 1271 1337 1716 2158 2600 2668 2569 2504 2532 2561 2531 2510 2597 2779 2938 2995 3004 3099 3345 3673 3936 4017 3906 3698 3532
476 3532 3515 3665 3908 4142 4313 4429 4531 4642 4763 4889 5026 5176 5331 5476 5599 5689 5739 5758 5780 5860 6023 6241 6447
499 6447 6602 6722 6868 7081 7348 7623 7868 8083 8289 8508 8750 9022 9324 9647 9962 10241 10475 10681 10885 11097 11312
520 11312 11523 11735 11953 12175 12391 12605 12829 13074 13336 13596 13846 14095 14356 14624 14880 15108 15311 15510 15724 15955 16194
541 16194 16435 16674 16908 17130 17335 17527 17718 17925 18152 18396 18640 18872 19084 19277 19456 19628 19799 19970 20143 20322 20506 20695
563 20695 20883 21067 21244 21415 21578 21733 21879 22022 22167 22317 22475 22642 22817 22991 23155 23300 23430 23556 23689 23834 23982
584 23982 24126 24260 24386 24509 24635 24762 24888 25012 25134 25253 25371 25489 25608 25729 25846 25955 26059 26167 26277 26375 26452 26520 26599
607 26599 26685 26749 26776 26794 26824 26785 26495 25830 24930 24213 24113 24751 25834 26891 27601 27945 28090 28188 28284 28360 28414 28467 28536 28621 28716
632B8716R7Q8O6L9K4K9L9M3M2M1M2L8L1K3J6Lj1k1k5l2m4n8p1r4j36j91k49l11l83
661B7751m50m65m09l39l48m81p26j112j748k642l452l524k358j41K202L591L532K354
679B1235Q09n45j586k435l100l372k990j896l53J165K192K504K181J511P94J90k95
696A6009p24j142j553j914k146k167j931j472r02l70LJ68J59P0j2m7m5k7MN1P9M9j5
719B125NK43P26J332J862K184K278K199K011J764J501J261J069R24Q12P23O51N94N37
738B4801M82M30L86L43K99K53K14J84J60J38J14R4P8P3P7R3J18J42J63J72J66J48J21
761B9249Q9O0K9%k9n4p8j02j30j65k04k59l35m33n41o36o93o85n93m07j45J43L97N70
785B5048O47O41N79M89L87K89K04J36Q5M2Km2r7j67k57l62m71n55n85n31l86j72O3
$$ plain form
632 28716 28813 28901 28967 29006 29030 29059 29098 29141 29183 29224 29266 29304 29335 29358 29374 29377 29366 29345 29320 29288 29244 29186 29115 29021 28885 28694 28445 28134 27751
661 27751 27301 26836 26427 26088 25740 25259 24533 23421 21673 19031 15579 12055 9697 9556 11758 15349 18881 21235
679 21235 22044 21499 19913 17478 14378 11006 8016 6120 5767 6932 9124 11628 13809 15320 16114 16304 16009
696 16009 15285 14143 12590 10676 8530 6363 4432 2960 2058 1688 1691 1859 2018 2088 2076 2029 1984 1957 1961 2012 2091 2140 2125
719 2125 2130 2373 3099 4431 6293 8477 10755 12954 14965 16729 18230 19491 20560 21484 22296 23019 23670 24264 24801
738 24801 25283 25713 26099 26442 26741 26994 27208 27392 27552 27690 27804 27898 27976 28049 28126 28219 28337 28479 28642 28814 28980 29128 29249
761 29249 29338 29398 29427 29427 29398 29344 29266 29164 29034 28869 28665 28406 28071 27638 27097 26461 25768 25083 24490 24083 23938 24081 24478 25048
785 25048 25695 26336 26915 27404 27791 28080 28284 28420 28505 28547 28549 28507 28410 28243 27986 27624 27153 26598 26013 25482 25096 24924 24987
808B4987K59L79M12L90L55L38L49L75L88L76L35K78K24J82J51J26J02P4M7J7j0l6o1
831C0037q5j12j41j76k15k61l14l77m57n61o93q63j069j297j510j633j576j265o95
850A6737M4P85J354J638J635J424J119Q04N25K84P0j25l15m99o76q25r17r29q51p01
870B0581n08l03j02R4K95N12P40R52J112J186J164J064R19P60O09M77L69K84K23J80
890C0608J49J24J03Q2O1M4L2K4J9J4QJlk%Kkpj1j0lJ%nj2j6Tk1l3n0o9q3r8j15j44
925C0572j87k51l49m88o72q83j072j183j157r64o25k02K18N63P89Q92TQ20P07N82M65
946B8467L66K88K30J87J56J32J13R6Q0N9L9J8Jj3l2n0o5p4q2r3j09j26j44j69j97k29
972B8849k52k63k59k34j92j42j02q4q5j05j42j99k73l50m22m73m84m48l93l85m63o02
$$ plain form
808 24987 25246 25625 26037 26427 26782 27120 27469 27844 28232 28608 28943 29221 29445 29627 29778 29904 30006 30080 30127 30144 30134 30098 30037
831 30037 29952 29840 29699 29523 29308 29047 28733 28356 27899 27338 26645 25782 24713 23416 21906 20273 18697 17432 16737
850 16737 16781 17566 18920 20558 22193 23617 24736 25540 26065 26349 26419 26294 25979 25480 24804 23979 23062 22133 21282 20581
870 20581 20073 19770 19668 19762 20057 20569 21309 22261 23373 24559 25723 26787 27706 28466 29075 29552 29921 30205 30428 30608
890 30608 30757 30881 30984 31066 31127 31171 31203 31227 31246 31260 31268 31269 31266 31264 31264 31266 31264 31257 31246 31236 31233 31234 31234 31229 31217 31201 31185 31164 31131 31081 31012 30929 30831 30716 30572
925 30572 30385 30134 29785 29297 28625 27742 26670 25487 24330 23366 22741 22539 22757 23320 24109 25001 25893 26713 27420 28002 28467
946 28467 28833 29121 29351 29538 29694 29826 29939 30035 30115 30174 30213 30231 30232 30219 30187 30137 30072 29998 29916 29823 29714 29588 29444 29275 29078 28849
972 28849 28597 28334 28075 27841 27649 27507 27405 27321 27236 27131 26989 26790 26517 26167 25745 25272 24788 24340 23947 23562 23099 22497
994B2497p55r57j315j826k203j992r64N50J784K089J422L16n86r91j014r01p90o79
1012A3685n48m20l33k96k91l07l54m63o72j003j396j681j677j333p99l16LK55O36J228
1032C918J912K456K696K623K348J997J655J354J097Q86P13N75M59L59K71J91J19M7
1050B5676k5r7j71k47l36m45n80p45r49j202j501j827k142k393k520k471k221j804
1068D000j288p25j08O03J386K101K543K565K192J600R95N00J30j55l90n96p87r73j153
1087A2440j310j423j475j455j351j154q88o06l72k13j14l8K0M7K7k0n2m1JL4L3Lk6
1110B067l2j0J7L1K5Oj1j3kQNpj0J8R4K13L64N39P21Q93J028J108J129J100J037R58
1136A1276Q73P82O90N96N06M22L45K74K04J37P5J6m5j13j95k91m08n32o46p17p11o22
$$ plain form
994 22497 21742 20785 19470 17644 15441 13449 12485 13035 14819 16908 18330 18646 18060 17069 16055 15154 14364 13685
1012 13685 13137 12717 12384 12088 11797 11490 11136 10673 10001 8998 7602 5921 4244 2911 2112 1796 1799 2054 2690 3918
1032 3918 5830 8286 10982 13605 15953 17950 19605 20959 22056 22942 23655 24230 24689 25048 25319 25510 25629 25676
1050 25676 25651 25554 25383 25136 24800 24355 23775 23030 22081 20879 19378 17551 15409 13016 10496 8025 5804 4000
1068 4000 2712 1987 1879 2482 3868 5969 8512 11077 13269 14869 15864 16364 16494 16339 15949 15353 14566 13593 12440
1087 12440 11130 9707 8232 6777 5426 4272 3384 2778 2406 2193 2079 2041 2061 2108 2135 2115 2063 2022 2023 2057 2090 2093 2067
1110 2067 2035 2025 2042 2073 2098 2104 2093 2080 2078 2086 2091 2084 2074 2092 2186 2399 2763 3302 4023 4916 5944 7052 8181 9281 10318 11276
1136 11276 12149 12931 13621 14217 14723 15145 15490 15764 15968 16105 16180 16196 16151 16038 15843 15552 15144 14612 13966 13249 12538 11916
1158A1916m71l04j72j13j42k60m43o64q80j058j162j159j041q23n62l20j31L0K27N15
1178B983Q87J277J599J794J850J788J644J452J241J037Q56P02N76M69L79L02K36J79
1196B1251J29Q4M6J4j1k6l2k8qK5P0J18J58J85J96J94J81J59J29Q8M1j3o5j16j65k13
1222B2391k63l15l71m33n00n73o49p28q08q92r74j055j129j187j220j224j203j163
1240G704j100j008q82p39n97m61l24j86p2k2l9q7j06p7j9K4M0L8K9J1k6o2o6k9J9M0
1266B003K3mqLNk0n1n8l5JK3K6K2J9J7J5K3L8N0M4J6j2k5j3QL2N7R3J41J93K36K66
1298C128K90L16L53L93M26M21L54K03l3l27o09p90q10o85m91k96p5K67P91J427J983
1319F236K275K245J983J639J324J071Q69P04N76M82M17L72L39L08K78K38J88J24N3
$$ plain form
1158 11916 11445 11141 10969 10856 10714 10454 10011 9347 8467 7409 6247 5088 4047 3224 2662 2342 2211 2241 2468 2983
1178 2983 3870 5147 6746 8540 10390 12178 13822 15274 16515 17552 18408 19110 19686 20155 20534 20836 21072 21251
1196 21251 21380 21464 21510 21524 21513 21487 21455 21427 21419 21444 21514 21632 21790 21975 22171 22365 22546 22705 22834 22922 22963 22950 22885 22769 22604 22391
1222 22391 22128 21813 21442 21009 20509 19936 19287 18559 17751 16859 15885 14830 13701 12514 11294 10070 8867 7704
1240 7704 6604 5596 4714 3975 3378 2917 2593 2407 2335 2313 2274 2187 2081 2004 1985 2009 2049 2087 2116 2127 2101 2039 1973 1944 1963 2003
1266 2003 2026 2022 2014 2017 2022 2002 1951 1893 1858 1859 1882 1908 1930 1949 1966 1981 2004 2042 2092 2136 2152 2140 2115 2102 2110 2142 2199 2292 2433 2626 2862 3128
1298 3128 3418 3734 4087 4480 4906 5327 5681 5884 5851 5524 4915 4125 3315 2630 2139 1843 1768 2035 2826 4253 6236
1319 6236 8511 10756 12739 14378 15702 16773 17642 18346 18922 19404 19821 20193 20532 20840 21118 21356 21544 21668 21721
1338B1721j5o8r9j13j09r5p0l7pJ3K0Ol2r7j87l06m63o64q94j143j412j718k055k335
1362I841k418k202j711j077m47J19O48J173J665K030K179K078J775J370R72O48M04
1379A7047K05J6j76l68n74q06j054j258j344j273j053p14k92J76O18R57J146J206J188
1398A3647J132J049R39Q29P49P07O76O28N55M79M20L73L25K70K15J72J41J11P1K5j5
1419B3498m1n4p2j00j37j71j93k12k38k82l30l65l79l94m46n56p04q46r66j089j259
1440A4664j471j647j682j541j294j071r55r23q74p18m19NN09J026J457J677J602J244
1458I589P20J90k18m45m90l75j30J94N15P46Q26P42N34K54l7k72l93l50j34K31O78
1479A2375J117J438J558J465J227R33O07J94l49r15j240j063l37O81J580K036J987
$$ plain form
1338 21721 21706 21638 21539 21426 21317 21222 21152 21115 21108 21121 21141 21147 21115 21018 20831 20525 20062 19398 18504 17361 15949 14231 12176 9841
1362 9841 7423 5221 3510 2433 1986 2105 2753 3926 5591 7621 9800 11878 13653 15023 15995 16643 17047
1379 17047 17252 17268 17092 16724 16150 15344 14290 13032 11688 10415 9362 8648 8356 8532 9150 10107 11253 12459 13647
1398 13647 14779 15828 16767 17596 18345 19052 19728 20356 20911 21390 21810 22183 22508 22778 22993 23165 23306 23417 23488 23513 23498
1419 23498 23457 23403 23331 23231 23094 22923 22730 22518 22280 21998 21668 21303 20924 20530 20084 19528 18824 17978 17012 15923 14664
1440 14664 13193 11546 9864 8323 7029 5958 5003 4080 3206 2488 2069 2074 2583 3609 5066 6743 8345 9589
1458 9589 10309 10499 10281 9836 9346 8971 8841 9035 9550 10296 11122 11864 12398 12652 12615 12343 11950 11600 11466 11697 12375
1479 12375 13492 14930 16488 17953 19180 20113 20720 20914 20565 19650 18410 17347 17010 17691 19271 21307 23294
1496B3294J594J094O64L77K30J79J67J45R7M3J1QJ1Jk2m3n7o7q3r5q9o9n3n8p4p3l6
1523B7096K7Q7J25J46J59J72J70J44R5M9L0M2O1N6K0k4m3k8pqk6m0l6k6k9m8o3o9p0
1552B7962p4To7o5r7j55j95j72r3j9Lk5o1q1r4j26j71j98j90j68j88k98m87p04r02
1577B3261j118j483k083k779l145k689j246P86K606L496L262K270J111K16l19o22q65
1594B0659j146j504j924k331k590k531k039j138%J105J913K284K236J918J512J149
1610A7573Q78O96N82N15M72M29L67K96K53K74L58M62N24N02M13L01K13J56J22R7P8
1631B5561N8K9j9p6j16j30j22Tj39j63j76j72j67j75j91j89j52q4k4kj9m6m8k0J9M1
1657B3356L7J9j0m7r1j33j56j63j82k47l63m99o05o62o87p15p47p40o43m52k19k0R3
$$ plain form
1496 23294 24888 25982 26646 27023 27253 27432 27599 27744 27841 27884 27895 27903 27914 27915 27893 27850 27793 27726 27643 27548 27459 27390 27337 27279 27205 27132 27096
1523 27096 27123 27210 27335 27481 27640 27812 27982 28126 28221 28270 28300 28342 28403 28459 28479 28455 28412 28384 28377 28369 28343 28303 28267 28241 28212 28164 28101 28032 27962
1552 27962 27888 27814 27747 27682 27585 27430 27235 27063 26970 26951 26954 26929 26868 26787 26693 26567 26396 26198 26008 25840 25652 25354 24867 24163 23261
1577 23261 22143 20660 18577 15798 12653 9964 8718 9504 12110 15606 18868 21138 22249 22465 22146 21524 20659
1594 20659 19513 18009 16085 13754 11164 8633 6594 5456 5456 6561 8474 10758 12994 14912 16424 17573
1610 17573 18451 19147 19729 20244 20716 21145 21512 21808 22061 22335 22693 23155 23679 24181 24594 24895 25108 25264 25386 25483 25561
1631 25561 25619 25648 25629 25553 25437 25307 25185 25063 24924 24761 24585 24413 24246 24071 23880 23691 23539 23455 23431 23429 23410 23364 23316 23296 23315 23356
1657 23356 23393 23412 23402 23355 23264 23131 22975 22812 22630 22383 22020 21521 20916 20254 19567 18852 18105 17365 16722 16270 16051 16031 16124
1680A6124J09M7n9j73k57l10l61m47n59o42o67o68p20q51r89j042r86q96q50q53q32
1701D118p34n75m19k95j90q5LL5J3j8j0L3N4Jj06j85j60m3Q3J34R9L6LJ1K4TJ6J8K1
1730A906Mk1k0M7J80L45M99O25P22P92Q38Q70Q94R15R26R29R27R30R32R18Q80Q17P47
1753A6602O89O50O25O01N63N15M63M22L92L61L20K73K30J99J74J46J04N5Nl6o3p8q0
1776B3132p7p4o8n2j9L2R4J55K06K45K70K85K86K79K65K52K42K34K27K23TK26K23K13
1800B7022J96J78J56J32J04P6M7K0j5n2q6j11j26j37j47j58j60j49j23q2l2J7N8R7
1824B6725J34J66J87J90J79J65J62J68J80J88J90J83J71J60J51J45J36J16Q9O8O3P0
1846B9986P7TO8N8N5N8O1O2O0N4M5L5K5J8J1Lkmnj0k7m8o3o4n4m7m6n2n7n5m9m3l7
$$ plain form
1680 16124 16233 16280 16221 16048 15791 15481 15120 14673 14114 13472 12805 12137 11417 10566 9577 8535 7549 6653 5803 4950 4118
1701 4118 3384 2809 2390 2095 1905 1820 1823 1858 1871 1853 1843 1876 1930 1931 1825 1640 1480 1437 1520 1654 1753 1789 1792 1803 1827 1851 1867 1885 1906
1730 1906 1910 1889 1869 1916 2096 2441 2940 3565 4287 5079 5917 6787 7681 8596 9522 10451 11378 12308 13240 14158 15038 15855 16602
1753 16602 17291 17941 18566 19167 19730 20245 20708 21130 21522 21883 22203 22476 22706 22905 23079 23225 23329 23384 23389 23353 23290 23212 23132
1776 23132 23055 22981 22913 22861 22842 22874 22968 23123 23329 23574 23844 24129 24415 24694 24959 25211 25453 25687 25914 26137 26360 26586 26809 27022
1800 27022 27218 27396 27552 27684 27788 27864 27911 27931 27916 27864 27778 27667 27541 27404 27257 27099 26939 26790 26667 26585 26553 26570 26628 26725
1824 26725 26859 27025 27212 27402 27581 27746 27908 28076 28256 28444 28634 28817 28988 29148 29299 29444 29580 29696 29785 29853 29916 29986
1846 29986 30063 30140 30208 30266 30321 30379 30440 30502 30562 30616 30661 30696 30721 30739 30750 30753 30751 30747 30742 30732 30705 30657 30594 30530 30476 30429 30383 30331 30274 30219 30170 30127 30090
1879C0090l0k0j5j3j2Trj0j7k9l4l2k7k8l8n3o4p0p9r1j12j34j56j72j84j88j85j78
1907B8098j65j43j12p2k7J6N0P1P8P5P2P1TO4N4M6TN4O5P3Q1R2J08J22J31J33J28J18
1935B9398J02Q4O7N1K9Mk2m3n4o4p3q7r8j05j09j14j20j30j41j52j59j64j65Uj61j51
1962B7293j37j25j12j00q1n2k1QL3N2P1Q7R9J09J17J25J30J33J34J35J36J38J36J34
1986B8442J31J36J43J50J53J48J37J30J26J28J30J31J25J18J09J02R5Q9Q4P8P1O5N6
2009C1077M8L9L1K3J5Plrj0p%QJ5K3K9L4L5TL4L3L1K9K3J6RKjoj2k1k6l1Tl0Uk8k5
2047C1296k0j7j4rkOJ2J8K3L1L9M4M8TM5L6K8K0J7K0K2K3K0J3OJoj2j8k1Uj8Tj5Tj4
2084C1575j1qmklqj1j4j7k1k4k6k4k1j8j6j7j8k2k5k8l3l8m4m9n2n4n8o4p2q0q4q7
$$ plain form
1879 30090 30060 30040 30025 30012 30000 29988 29979 29969 29952 29923 29889 29857 29830 29802 29764 29711 29647 29577 29498 29407 29295 29161 29005 28833 28649 28461 28276 28098
1907 28098 27933 27790 27678 27606 27579 27595 27645 27716 27794 27869 27941 28012 28083 28147 28201 28247 28293 28347 28412 28485 28566 28658 28766 28888 29019 29152 29280 29398
1935 29398 29500 29584 29651 29702 29731 29735 29713 29670 29616 29552 29479 29392 29294 29189 29080 28966 28846 28716 28575 28423 28264 28100 27935 27770 27605 27444 27293
1962 27293 27156 27031 26919 26819 26738 26686 26665 26673 26706 26758 26829 26916 27015 27124 27241 27366 27496 27629 27763 27898 28034 28172 28308 28442
1986 28442 28573 28709 28852 29002 29155 29303 29440 29570 29696 29824 29954 30085 30210 30328 30437 30539 30634 30723 30807 30885 30956 31021 31077
2009 31077 31125 31164 31195 31218 31233 31240 31237 31228 31218 31211 31211 31219 31234 31257 31286 31320 31355 31390 31424 31457 31488 31517 31540 31556 31565 31567 31566 31560 31548 31527 31501 31470 31439 31409 31379 31349 31321 31296
2047 31296 31276 31259 31245 31236 31234 31240 31252 31270 31293 31324 31363 31407 31455 31503 31548 31584 31612 31632 31649 31669 31691 31714 31734 31747 31753 31754 31748 31736 31718 31697 31676 31655 31637 31619 31604 31589 31575
2084 31575 31564 31556 31552 31550 31547 31539 31528 31514 31497 31476 31452 31426 31402 31381 31363 31347 31330 31312 31290 31265 31237 31204 31166 31122 31073 31021 30967 30909 30845 30773 30693 30609 30522
2117C0522q8q9Tq3p2n5l5j6KK3M3N8P1Q1Q7R2R3R2R1TQ9Q5P7P0O5O2N7M9M0L4L1L0
2149C1508K9K6K3K1J9J7J4J0O%pj6k4k8k6j3OL0N0O1O3N4M3K8J8J0POUPUONTOTMjo
2190C1993qUprj0j1Tj2j3j4j6j8k0k2k1Tk4k7l0l1Tk8k7Tk5k2j7j4j3j4j5j7k0k2k6
2226C1334k8Tk3k0j7j8Tk0Tk3k8l4l9l8l5k8k0j3mPK0L7N2O2O5O1N3M4L6K9K1J4J1
2259C1392J0QLlj2j6k1k3k6l1l4Tl3k9j9lJ4K9L8M2TM1M0L6L3L0K9K6K3J9J5J2PLJ
2294C1609LQJ0J2J1TJ4J6TJ5J2J1RMmj3k4l8n2o6p5p8p2n9m0j8%J4K3K7TK2J0nk5m4
2330C1271o3p7q6r2r3q5p0m5j5J8M7P4R2R9R3Q2P4P2P1O6N2L5J8RKknj2k3l8n1o1o2
2363C1295o2To5p1p4p3o9o5o0n8n5n4n1m4l5k6k0j7j5j0mLOPNOPQOPJ0J4J9K3K5K8
$$ plain form
2117 30522 30434 30345 30256 30173 30101 30046 30011 29995 29997 30020 30063 30121 30192 30273 30360 30452 30545 30637 30728 30819 30908 30993 31070 31140 31205 31267 31324 31373 31413 31447 31478 31508
2149 31508 31537 31563 31586 31607 31626 31643 31657 31667 31673 31673 31666 31650 31626 31598 31572 31559 31565 31595 31645 31706 31769 31823 31866 31894 31912 31922 31929 31935 31941 31947 31954 31961 31968 31974 31979 31984 31990 31996 32000 31999 31993
2190 31993 31985 31977 31969 31962 31953 31943 31932 31921 31909 31896 31882 31866 31848 31828 31806 31785 31764 31740 31713 31683 31652 31621 31593 31566 31539 31514 31492 31475 31461 31448 31434 31419 31402 31382 31360 31334
2226 31334 31306 31278 31255 31235 31218 31200 31182 31162 31142 31119 31091 31057 31018 30980 30945 30917 30897 30884 30880 30887 30907 30944 30996 31058 31123 31184 31237 31281 31317 31346 31367 31381 31392
2259 31392 31402 31410 31413 31410 31398 31382 31361 31338 31312 31281 31247 31213 31180 31151 31132 31129 31143 31172 31210 31252 31294 31335 31375 31411 31444 31474 31503 31529 31552 31571 31586 31598 31605 31608 31609
2294 31609 31612 31620 31630 31642 31653 31664 31678 31694 31710 31725 31737 31748 31757 31761 31757 31744 31720 31682 31630 31564 31489 31411 31339 31280 31240 31222 31222 31236 31259 31286 31313 31335 31345 31340 31315 31271
2330 31271 31208 31131 31045 30953 30860 30775 30705 30660 30645 30663 30710 30784 30876 30975 31068 31150 31224 31296 31367 31433 31485 31520 31538 31547 31549 31547 31542 31530 31507 31469 31418 31357 31295
2363 31295 31233 31171 31106 31035 30961 30888 30819 30754 30694 30636 30581 30527 30476 30432 30397 30371 30351 30334 30319 30309 30305 30308 30314 30321 30326 30332 30339 30347 30353 30360 30370 30384 30403 30426 30451 30479
2399C0479L2L8M3M7M8M7TM6M9N0N2N1M8M5M2L9L7L1K5J8J5TJ7K1K2TK3K1K0J7J4RO
2432C1536KJjJLPJ0J1J0ROJlpj1j4j6Tj4rnjJKPJ2J5J7J6J7J8TJ5J1NLJknrj0Urj0
2477C1593j3j8k0k2k3k4k6k8k6j9rJRJ3J7K0K2TK1J8J6J4J7J9K2K0J3OK%Tkmj0j5j8
2513C1588k2k8l5m4n1n4n0l6j9jJ0J3P%qj2j4j5j7j9k0k2k3Tk1j9j7j5Tj2rpUqoTn
2551C0951prqj0j4k0k6k8k5k0j2jJ0K3L2L7L8UL7L1K5J8J1Nnj9l3m1l6j9KJ9K6K7K0
2587C1055J5J1OKmj1k0l1m5n7o2n2k8OL9O2O9O5N4L9K3RJlnprj1j2j4j6k0k4k6k5k1
2623C0953j0OK5M3N6O2O5O3N7M6L6K6J9J3PLTNPQN%nolLJ1J9K2K3K0J7J3TJ1J2RTQ
2662C1674QPOTQJ1J3TJ1RPTOPQPQPTQPONMKJjlUkTmnrj1j3Tj4j3j5j7k1k5k4k3k0j7
$$ plain form
2399 30479 30511 30549 30592 30639 30687 30734 30781 30827 30876 30926 30978 31029 31077 31122 31164 31203 31240 31271 31296 31314 31329 31344 31361 31382 31404 31426 31449 31470 31490 31507 31521 31530 31536
2432 31536 31538 31539 31538 31539 31542 31549 31559 31570 31580 31589 31595 31596 31593 31586 31575 31561 31545 31529 31515 31506 31501 31500 31501 31503 31510 31522 31537 31554 31570 31587 31605 31623 31638 31649 31654 31657 31658 31656 31651 31642 31632 31622 31612 31603 31593
2477 31593 31580 31562 31542 31520 31497 31473 31447 31419 31393 31374 31365 31366 31375 31388 31405 31425 31447 31469 31490 31508 31524 31538 31555 31574 31596 31616 31629 31635 31637 31637 31637 31635 31631 31621 31606 31588
2513 31588 31566 31538 31503 31459 31408 31354 31304 31268 31249 31248 31258 31271 31278 31278 31270 31258 31244 31229 31212 31193 31173 31151 31128 31105 31084 31065 31048 31033 31018 31006 30997 30990 30983 30976 30968 30962 30956 30951
2551 30951 30944 30935 30927 30917 30903 30883 30857 30829 30804 30784 30772 30771 30781 30804 30836 30873 30911 30949 30987 31024 31055 31080 31098 31109 31114 31109 31090 31057 31016 30980 30961 30963 30982 31008 31035 31055
2587 31055 31070 31081 31087 31089 31085 31074 31054 31023 30978 30921 30859 30807 30779 30785 30824 30886 30955 31020 31074 31113 31136 31145 31146 31143 31138 31131 31122 31111 31099 31085 31069 31049 31025 30999 30974 30953
2623 30953 30943 30949 30974 31017 31073 31135 31200 31263 31320 31366 31402 31428 31447 31460 31467 31470 31473 31478 31485 31493 31498 31498 31493 31487 31484 31487 31498 31517 31539 31562 31582 31599 31612 31625 31636 31648 31657 31666 31674
2662 31674 31682 31689 31695 31701 31709 31720 31733 31746 31757 31766 31773 31780 31786 31793 31801 31808 31816 31823 31830 31838 31845 31851 31856 31860 31862 31863 31862 31859 31856 31853 31851 31849 31845 31840 31831 31820 31807 31794 31780 31767 31752 31735 31714 31689 31665 31642 31622 31605
2710C1605j7j8k2k6l0l3l8m3m9n3n1m5l5k3j2kLNL%mrj6k4l5m4n2n5n3m7m0l3k5j6
2744C0666pLJ0J3J5TJ4Qlj6k9l9m9n7o4o8To4n9n2m6l9l1k4j5nNJ7L2M8O7Q1R2TQ7
2779C0530P8O8N7M8L7K8K0J2N%mlTmoj4k0k7k8k9l1l6m3m8n1n0n2o0o8p4p7Tq1q6q9
2814B9822q5p2n6l7j9lORLpj8l0m0n0n9o4o6To4o1n7n3m7m0l5l4l5l7l8m0m3m8n4n9
2848B8423o4o7p3p5p8Tq2r1j06j28j53j84k21k67l22l81m46n08n65o05o18n91n18m01
2872B1801k49q4P0J94K74L08L00K63K07J40P0Jo2j18j67k10k50k88l29l72m15m55m87
2895B0142n08n20n22n24n27n31n24m89m05k68q2J34L51N37O69P33P32O77N88M79L64
2916B0506K49J43M5m5j33k23l13m06m94n70o18o28o00n44m82m29l97l79l58l19k45
$$ plain form
2710 31605 31588 31570 31548 31522 31492 31459 31421 31378 31329 31276 31225 31180 31145 31122 31110 31108 31111 31116 31119 31119 31115 31106 31090 31066 31031 30987 30935 30880 30827 30780 30740 30707 30682 30666
2744 30666 30659 30662 30672 30685 30700 30715 30729 30737 30734 30718 30689 30650 30601 30544 30480 30412 30344 30280 30221 30169 30123 30084 30053 30029 30014 30009 30014 30031 30063 30111 30178 30259 30351 30443 30530
2779 30530 30608 30676 30733 30781 30818 30846 30866 30878 30883 30883 30879 30876 30873 30869 30863 30849 30829 30802 30774 30745 30714 30678 30635 30587 30536 30486 30434 30374 30306 30232 30155 30078 29997 29911 29822
2814 29822 29737 29665 29609 29572 29553 29550 29556 29565 29568 29561 29543 29513 29473 29423 29364 29300 29234 29168 29104 29043 28986 28933 28886 28846 28811 28777 28742 28705 28667 28627 28584 28536 28482 28423
2848 28423 28359 28292 28219 28144 28066 27988 27906 27815 27709 27581 27428 27244 27023 26756 26434 26053 25607 25099 24534 23929 23311 22720 22202 21801
2872 21801 21552 21468 21538 21732 22006 22314 22614 22877 23084 23224 23294 23295 23233 23115 22948 22738 22488 22200 21871 21499 21084 20629 20142
2895 20142 19634 19114 18592 18068 17541 17010 16486 15997 15592 15324 15242 15376 15727 16264 16933 17666 18398 19075 19663 20142 20506
2916 20506 20755 20898 20943 20898 20765 20542 20229 19823 19329 18759 18141 17513 16913 16369 15887 15458 15061 14682 14324 14005 13760
2937A3760j31J8J83L40M64N37N46M93L91K55J09l2j59k63l41l96m30m46m43m25l92
2958A3638l52l09k67k26j96j79j86k18k72l49m39n34o22o94p37p50p27o67n81m77l74
2979D482k76j81q5J1R5J58J98K28K62L13L73M29M62M73M76M88N15N49N82O09O37O69
3001A1467O97P14P12O97O73O53O41O48O68O95P08O95O50N81N01M20L41K70K06J48R6
3022B2881M5rp2j45k35l38m47n42n90n59m28k06N9L00M56M96M33L15J99J28J14J42
3044B1997J87K16K14J72R6jj08k19l30m45n61o72p63q19Tp50o07m01j59P4K48L23K94
3067A7167J90P9K2N5J74L41N12O45P20P25O70N73M56L38K26J19J4r0j81k46k66k23
3089B2020j10O5K72M67O09O74O60N89M84L67K56J59Q3K5j0k0JN2J21J91K42K67K63
$$ plain form
2937 13760 13629 13647 13830 14170 14634 15171 15717 16210 16601 16856 16965 16933 16774 16511 16170 15774 15344 14898 14455 14030 13638
2958 13638 13286 12977 12710 12484 12288 12109 11923 11705 11433 11084 10645 10111 9489 8795 8058 7308 6581 5914 5333 4856 4482
2979 4482 4206 4025 3940 3951 4046 4204 4402 4630 4892 5205 5578 6007 6469 6942 7418 7906 8421 8970 9552 10161 10798 11467
3001 11467 12164 12878 13590 14287 14960 15613 16254 16902 17570 18265 18973 19668 20318 20899 21400 21820 22161 22431 22637 22785 22881
3022 22881 22926 22917 22845 22700 22465 22127 21680 21138 20548 19989 19561 19355 19414 19714 20170 20666 21099 21414 21613 21741 21855 21997
3044 21997 22184 22400 22614 22786 22882 22881 22773 22554 22224 21779 21218 20546 19783 18964 18145 17395 16788 16387 16228 16302 16550 16873 17167
3067 17167 17357 17436 17458 17513 17687 18028 18540 19185 19905 20630 21300 21873 22329 22667 22893 23012 23026 22936 22755 22509 22243 22020
3089 22020 21910 21975 22247 22714 23323 23997 24657 25246 25730 26097 26353 26512 26595 26620 26610 26590 26591 26643 26764 26955 27197 27464 27727
3112B7727K41K13J82J53J30J12R7Q4P3O3N5M8M6TM7M9M8M5L6K7K1K0K4L2L5L3K9K2
3140B9738J8J5J3TJ6J8J7J3Mknk%jrj9l2m3n6p1q8j07j18j15q6l1L9J04J47J58J44
3171B9672J15Q4O1M5L5K8K3J9TJ7J4ROQJ3K0K2K0J6J0PLlj0j7k3k7k6k2j1%J4K8L8
3205C0207M6TM3L8L3K9K6K3J9TK4K7K8K5K1TK3K4TK0J5J3J2J3J4J6J7J5J4TJ3J4J3
3238C0949J1QPTONOPQJ1J0J1TJ0TPOTPRTQNMNPRJ0RPQTJ0RPNUMKJKU%UJ%mj0j4j5j7
3292C1196j7k0k2Tk1j8j5j4Tj2rpnTpqj1j4j9k6k9l1k8k5k2k1j6r%OJ0J5J8K3K6K8
3328C0855L0L1L3L4L1K6J9J5J6J8K1K0J8J5J3TJ4J3J2QPOQJ1J2RKjljTknopTrTj1Tj0
3369C1227pmoj0j5j8Tj7j6j7j9k0k1k3k5l0l3l5l4l5l8m5n3n7n8To4p6q9j01j07j11
$$ plain form
3112 27727 27968 28181 28363 28516 28646 28758 28855 28939 29012 29075 29130 29178 29224 29270 29317 29366 29414 29459 29495 29522 29543 29563 29587 29619 29654 29687 29716 29738
3140 29738 29756 29771 29784 29797 29813 29831 29848 29861 29865 29863 29858 29856 29856 29855 29846 29827 29795 29752 29696 29625 29537 29430 29312 29197 29111 29080 29119 29223 29370 29528 29672
3171 29672 29787 29871 29932 29977 30012 30040 30063 30082 30101 30118 30132 30141 30147 30155 30168 30188 30210 30230 30246 30256 30263 30266 30263 30253 30236 30213 30186 30160 30138 30127 30127 30141 30169 30207
3205 30207 30253 30299 30342 30380 30413 30442 30468 30491 30510 30529 30553 30580 30608 30633 30654 30675 30698 30722 30746 30766 30781 30794 30806 30819 30833 30849 30866 30881 30895 30909 30922 30936 30949
3238 30949 30960 30968 30975 30982 30988 30993 30999 31006 31014 31025 31035 31046 31057 31067 31077 31084 31090 31096 31103 31112 31121 31129 31134 31138 31143 31150 31159 31169 31178 31185 31193 31201 31211 31220 31227 31232 31237 31242 31246 31248 31249 31251 31253 31255 31255 31255 31255 31256 31256 31252 31242 31228 31213 31196
3292 31196 31179 31159 31137 31115 31094 31076 31061 31047 31033 31021 31012 31005 31000 30995 30988 30980 30969 30955 30936 30910 30881 30850 30822 30797 30775 30754 30738 30729 30729 30735 30745 30760 30778 30801 30827 30855
3328 30855 30885 30916 30949 30983 31014 31040 31059 31074 31090 31108 31129 31149 31167 31182 31195 31208 31222 31235 31247 31255 31262 31268 31276 31287 31299 31308 31310 31309 31306 31305 31304 31302 31297 31291 31284 31277 31268 31259 31248 31237 31227
3369 31227 31220 31216 31210 31200 31185 31167 31149 31132 31116 31099 31080 31060 31039 31016 30991 30961 30928 30893 30859 30824 30786 30741 30688 30631 30573 30515 30451 30375 30286 30185 30078 29967
3401B9967j15j19j27j36j46j53j56j55j53j50j46j36j19r9q1o4n0l2j2J1L6O2Q6J05
3425B8118J18J24J31J39J45J46J42J35J28J24J22J23J22J15J04R0Q1P8P7P0N8M6M0
3448C0576M2M6M3L5K8K4TK1J7J0QTJ0J1RLknmLJ4K2K4K0RkpoJNOKlnTlTnrTql%Kkj0
3494C0932j9k6k4j3%Q%j9l4l2j5MQqk9m1l7k6j7Tk3l0l1k6j9j6k4l5m5m4l7l4m0m8
3528C0143n1m4l4k6k7l5m2m9n0m3l3k2j2ork0l7m5l8j2J5K4J4knQK6M0M1L5K6K2L3
3561B9785N7Q2Q6N6Nl0k6J3N5P4O3M4L0K4K2J9J4PjoNL3N7N0Nm9p2m8jL0K4pl5m1k8
3596C0296j5j4k5m1n2m6k6lOj1m2o7o4m5l6m5n8m4j1Qj6o7j01q9m8j0J4L3M6L3j9q0
3628B9361j02n8J7O7O5L5J3J8L0L1J4%TJ8M1N3M9K7j4o9j13j16n9L0R0P7Mo4p8l9J5
$$ plain form
3401 29967 29852 29733 29606 29470 29324 29171 29015 28860 28707 28557 28411 28275 28156 28057 27976 27912 27862 27830 27818 27829 27865 27927 28013 28118
3425 28118 28236 28360 28491 28630 28775 28921 29063 29198 29326 29450 29572 29695 29817 29932 30036 30126 30207 30285 30362 30432 30490 30536 30576
3448 30576 30618 30664 30707 30742 30770 30794 30818 30839 30856 30866 30874 30882 30892 30903 30912 30915 30913 30908 30904 30907 30921 30943 30967 30987 30996 30994 30987 30981 30982 30987 30993 30995 30992 30987 30982 30979 30976 30971 30962 30953 30945 30942 30942 30944 30942 30932
3494 30932 30913 30887 30863 30850 30850 30858 30858 30839 30805 30773 30758 30762 30770 30762 30733 30692 30655 30629 30612 30595 30572 30542 30511 30485 30466 30450 30426 30391 30346 30302 30265 30231 30191 30143
3528 30143 30092 30048 30014 29988 29961 29926 29884 29835 29785 29742 29709 29687 29675 29669 29660 29640 29603 29558 29520 29508 29523 29547 29561 29559 29554 29562 29588 29628 29669 29704 29730 29752 29785
3561 29785 29842 29924 30010 30066 30071 30041 30015 30028 30083 30157 30220 30264 30294 30318 30340 30359 30373 30380 30379 30373 30378 30411 30468 30518 30523 30474 30402 30354 30353 30383 30407 30400 30365 30324 30296
3596 30296 30281 30267 30242 30201 30149 30103 30077 30074 30080 30069 30027 29960 29896 29851 29815 29770 29712 29668 29657 29665 29649 29582 29481 29392 29344 29334 29348 29381 29427 29460 29441 29361
3628 29361 29259 29201 29218 29285 29350 29385 29398 29416 29446 29477 29491 29491 29491 29509 29550 29603 29652 29679 29665 29596 29483 29367 29308 29338 29428 29505 29509 29445 29367 29328 29343
3659B9343M5M9M2M0N7Q9J16J02L9l5m9J3R0R5J1q3r8k5O5R9P7N3N8Q8J13J20J12R2
3687C0718N8K2jQM1P1P6O1M5M4M7L6Jm1n9m5j1J7L2L8M0K2j9o4p5l6K4O5O4L3ml1m5
3720C1132m1k4mLmrJ2M8P6P3M2jl9o7q0o8l3J9P1J05R5L3n7j14q4K3J23J33M5o9j21
3751C1218q6pO2Q9P3K3m0p9o6j1L6L7Mj9mK3K7%k6k3ML2M5M6L8J6j6m3l9nL0L9J4j4
3785C1378j9KK3K1PTK9M6L0j0k6J0O0N2k8j07j03j3P5P9Qn5n8j3L9O9P7N7On0n5KO5
3818C1605N2l6j13r7jP7P6J8k2j0J9K0lj8%K9L4Nm0o6n8l1okj0j6rRL6O9R4Q3J2r9
3852C1601j84j76p6M4J05R2N4L7L6J0m0o7l5L5O6K4n0p7l3K2K9j0k8J4P0TPn5m8J1
3882C1448M6J3m8o2oO0O8J0n7p6l6K4O2O3L6Kj8k2j8k5m7o8o4l0J2L1K3LlRJ9J8Kj7
$$ plain form
3659 29343 29388 29437 29479 29519 29576 29665 29781 29883 29922 29887 29838 29851 29941 30036 30047 29964 29866 29841 29906 30005 30082 30135 30193 30281 30394 30514 30626 30718
3687 30718 30776 30798 30797 30805 30846 30917 30993 31054 31099 31143 31190 31226 31227 31186 31127 31082 31071 31088 31120 31158 31198 31220 31201 31137 31062 31026 31050 31115 31179 31212 31208 31177 31132
3720 31132 31091 31067 31063 31066 31062 31053 31065 31113 31189 31262 31304 31303 31264 31197 31117 31049 31016 31035 31106 31211 31306 31339 31282 31168 31084 31107 31230 31363 31408 31339 31218
3751 31218 31132 31125 31187 31276 31349 31372 31332 31253 31187 31176 31212 31249 31253 31234 31230 31253 31280 31280 31254 31231 31235 31267 31312 31358 31396 31412 31396 31353 31314 31309 31339 31378 31392 31378
3785 31378 31359 31361 31384 31405 31412 31419 31448 31494 31524 31514 31488 31498 31558 31610 31582 31475 31372 31359 31434 31513 31521 31466 31408 31395 31434 31503 31580 31637 31643 31593 31538 31540 31605
3818 31605 31657 31621 31508 31411 31410 31487 31563 31581 31559 31549 31568 31588 31585 31567 31567 31596 31630 31635 31595 31529 31471 31440 31434 31432 31422 31406 31397 31406 31442 31511 31605 31688 31700 31601
3852 31601 31417 31241 31165 31209 31314 31406 31460 31497 31533 31543 31503 31436 31401 31436 31502 31526 31476 31399 31366 31388 31417 31407 31379 31393 31463 31533 31540 31485 31437 31448
3882 31448 31494 31507 31459 31397 31391 31451 31519 31529 31472 31396 31360 31384 31446 31509 31545 31547 31529 31507 31489 31464 31417 31349 31285 31255 31267 31298 31321 31324 31321 31330 31349 31367 31369 31352
3916C1352k5k3rOJ6J5%j5j9nJ8L2K6Kk4l6k8rQJ6TJ7K2J7Lj6j9nJ6K6J6%j1j3rqn%
3954C1345MPOTNJj0k1Tj2LJ2TMlqj1j5k0Tj5nLPN%Ulpj1j0pqj2j6j5j3j1j3j8k0k1
3997C1074k1Tk4k9l7m5n0n2n1m6l9k4mJ5K7L1K6J9J5J1ROJlnpj1j3j2rpTj2j4j6j4
4033C0661j1rj1j7k5l2l5l6l8m2m7n3Tn4n8o9q5j02j19j34j49j64j74j76j64j39j05
4060B8560o5k9LK7M1M8M6M1L6L2K8K3K0J9K0K3K0J4MklMJ2K0K6K7K8L3M6O3Q0Q5Q2
4093B9412P1N9N4N6O3O8O9O2N4M7M5M3M1L9L6L5M0M4M6M1K7J3NLNTKjlmoj1j4j1%R
4129C0444J0KmjPJ3RKkjMTKTMNJlnkLKmj1j5Tj3Tj6k0Tj9j4j0pTnjMRJ1J0POTRJ3J5
4177C0396J7J9K3UK4K7K9L1TK5K0J3J0UJ1RUJ0TPOTNL%TKNOTNML%mnmKJ0J7J8J1%o
$$ plain form
3916 31352 31327 31304 31295 31301 31317 31332 31332 31317 31298 31293 31311 31343 31369 31371 31347 31311 31283 31274 31282 31298 31314 31331 31353 31370 31373 31357 31338 31333 31349 31375 31391 31391 31380 31367 31358 31350 31345 31345
3954 31345 31349 31356 31362 31368 31373 31374 31364 31343 31322 31310 31313 31325 31337 31341 31338 31330 31319 31304 31284 31264 31249 31244 31247 31254 31259 31259 31259 31259 31256 31249 31238 31228 31221 31213 31201 31185 31170 31157 31146 31133 31115 31095 31074
3997 31074 31053 31032 31008 30979 30942 30897 30847 30795 30744 30698 30659 30635 30631 30646 30673 30704 30730 30749 30764 30775 30784 30790 30791 30788 30783 30776 30765 30752 30740 30731 30724 30717 30705 30691 30675 30661
4033 30661 30650 30641 30630 30613 30588 30556 30521 30485 30447 30405 30358 30305 30252 30198 30140 30071 29986 29884 29765 29631 29482 29318 29144 28968 28804 28665 28560
4060 28560 28495 28466 28469 28496 28537 28585 28631 28672 28708 28740 28768 28791 28811 28830 28850 28873 28893 28907 28911 28909 28906 28910 28922 28942 28968 28995 29023 29056 29102 29165 29245 29330 29412
4093 29412 29483 29542 29596 29652 29715 29783 29852 29914 29968 30015 30060 30103 30144 30183 30219 30254 30294 30338 30384 30425 30452 30465 30470 30473 30478 30483 30485 30484 30481 30477 30471 30460 30446 30435 30435 30444
4129 30444 30454 30456 30452 30451 30458 30471 30480 30482 30480 30479 30483 30487 30489 30491 30495 30500 30501 30498 30493 30491 30494 30496 30492 30481 30466 30451 30438 30425 30409 30389 30369 30350 30336 30326 30319 30312 30307 30306 30310 30319 30330 30340 30347 30353 30359 30368 30381 30396
4177 30396 30413 30432 30455 30478 30501 30525 30552 30581 30612 30643 30668 30688 30701 30711 30721 30731 30742 30751 30760 30769 30779 30789 30796 30802 30808 30813 30816 30816 30816 30818 30823 30829 30835 30840 30844 30847 30847 30843 30838 30834 30836 30846 30863 30881 30892 30892 30886
4224C0886okJ%npTnoj0j6Tj3olqj5j8j7j4j6k0k4k3k1j8j7j9k0j8j3qmlkj%lnm%MP
4267C0485QOMKMQJ4J5J0LTQJ8K4K5K0J2PNJ0J6J7J5PLTOJ0TOMOJ2J4RkqnKMjpj3j5
4311C0784j9k4k6k5Tl1l5l8l4l1k9Tl3m0m3m4l9Tm0l9l0k4k5l2l5k9k0j4rJJ1J5J4
4344B9944K1M1N6N4M1L3L5L9L7L2L1L6L7TL6L1J4nr%Loj7nJ6K2J2J1L2M3K1j5k1KJ2
4379C0651jKM1O9L2k7k6K2Lj13j75n9J06Q0n2J23l0m0m5m6m2
4400C0473
$$ plain form
4224 30886 30880 30878 30879 30879 30874 30867 30860 30855 30849 30839 30823 30807 30794 30788 30785 30777 30762 30744 30727 30713 30697 30677 30653 30630 30609 30591 30574 30555 30535 30517 30504 30496 30492 30489 30487 30486 30486 30483 30478 30474 30474 30478 30485
4267 30485 30493 30499 30503 30505 30509 30517 30531 30546 30556 30559 30562 30570 30588 30612 30637 30657 30669 30676 30681 30691 30707 30724 30739 30746 30749 30752 30758 30768 30778 30784 30788 30794 30806 30820 30829 30827 30819 30814 30816 30820 30819 30812 30799 30784
4311 30784 30765 30741 30715 30690 30665 30634 30599 30561 30527 30496 30467 30438 30405 30365 30322 30278 30239 30200 30160 30121 30091 30067 30042 30010 29975 29946 29926 29912 29903 29904 29915 29930 29944
4344 29944 29965 30006 30062 30116 30157 30190 30225 30264 30301 30333 30364 30400 30437 30474 30510 30541 30555 30550 30541 30541 30544 30538 30521 30516 30532 30554 30566 30577 30609 30652 30673 30658 30637 30639 30651
4379 30651 30650 30652 30693 30762 30794 30767 30741 30763 30766 30653 30478 30419 30525 30605 30553 30676 30646 30606 30561 30515 30473
4400 30473
##END=$$ End of the data block
##TITLE=Ethyl benzoate H-NMR $$ Begin of the data block
##JCAMP-DX=5.00 $$
##DATE=01/02/2002 17:59:54 
##DATA TYPE=NMR SPECTRUM
##DATA CLASS=XYDATA
##BLOCK_ID=2
##ORIGIN=Department of Chemistry, UWI, JAMAICA
##OWNER=Prof. Robert Lancashire
##.OBSERVE FREQUENCY=200.132
##.ACQUISITION TIME=2.565
##.ZERO FILL=0
##.SHIFT REFERENCE=INTERNAL,  ,6645, -0.4994
##.OBSERVE NUCLEUS=^1H
##.ACQUISITION MODE=SEQUENTIAL
##SPECTROMETER/DATA SYSTEM=??
##SOLVENT NAME=
##$MODELS=
<Models>
<ModelData id="ethylbenzoateH" type="MOL">
ethyl benzoate
RLACD/Labs0214020804  

 21 21  0  0  0  0  0  0  0  0  1 V2000
    5.5964   -5.6617    0.7538 C   0  0  0  0  0  0  0  0  0  0  0  0
    4.5155   -5.0656    0.1244 C   0  0  0  0  0  0  0  0  0  0  0  0
    3.3196   -5.7551   -0.0000 C   0  0  0  0  0  0  0  0  0  0  0  0
    3.2052   -7.0407    0.5051 C   0  0  0  0  0  0  0  0  0  0  0  0
    4.2864   -7.6367    1.1346 C   0  0  0  0  0  0  0  0  0  0  0  0
    5.4821   -6.9471    1.2591 C   0  0  0  0  0  0  0  0  0  0  0  0
    6.8644   -4.9316    0.8853 C   0  0  0  0  0  0  0  0  0  0  0  0
    6.8865   -3.8491    1.4258 O   0  0  0  0  0  0  0  0  0  0  0  0
    8.0135   -5.4740    0.4016 O   0  0  0  0  0  0  0  0  0  0  0  0
    9.2433   -4.7814    0.5545 C   0  0  0  0  0  0  0  0  0  0  0  0
   10.3841   -5.6445    0.0123 C   0  0  0  0  0  0  0  0  0  0  0  0
    4.5986   -4.1381   -0.2400 H   0  0  0  0  0  0  0  0  0  0  0  0
    2.5392   -5.3252   -0.4541 H   0  0  0  0  0  0  0  0  0  0  0  0
    2.3424   -7.5383    0.4153 H   0  0  0  0  0  0  0  0  0  0  0  0
    4.2038   -8.5642    1.4991 H   0  0  0  0  0  0  0  0  0  0  0  0
    6.2623   -7.3769    1.7134 H   0  0  0  0  0  0  0  0  0  0  0  0
    9.3705   -4.5906    1.5278 H   0  0  0  0  0  0  0  0  0  0  0  0
    9.1763   -3.9198    0.0514 H   0  0  0  0  0  0  0  0  0  0  0  0
   10.8990   -6.0340    0.7761 H   0  0  0  0  0  0  0  0  0  0  0  0
   10.9923   -5.0801   -0.5461 H   0  0  0  0  0  0  0  0  0  0  0  0
   10.0064   -6.3832   -0.5461 H   0  0  0  0  0  0  0  0  0  0  0  0
  1  2  1  0  0  0  0
  2  3  2  0  0  0  0
  3  4  1  0  0  0  0
  4  5  2  0  0  0  0
  5  6  1  0  0  0  0
  6  1  2  0  0  0  0
  7  1  1  0  0  0  0
  8  7  2  0  0  0  0
  9  7  1  0  0  0  0
 10  9  1  0  0  0  0
 10 11  1  0  0  0  0
 12  2  1  0  0  0  0
 13  3  1  0  0  0  0
 14  4  1  0  0  0  0
 15  5  1  0  0  0  0
 16  6  1  0  0  0  0
 17 10  1  0  0  0  0
 18 10  1  0  0  0  0
 19 11  1  0  0  0  0
 20 11  1  0  0  0  0
 21 11  1  0  0  0  0
M  END
</ModelData>
</Models>
##$PEAKS=
<Peaks type="HNMR" xUnits="ppm" yUnits="arbitrary units" >
<PeakData id="1" title="Me group ~1.4" peakShape="singlet" model="ethylbenzoateH" atoms="19,20,21"  xMax="1.5" xMin="1.3" />
<PeakData id="2" title="CH2 group ~4.3" peakShape="singlet" model="ethylbenzoateH" atoms="17,18"  xMax="4.5" xMin="4.2" />
<PeakData id="3" title="H 13,15" peakShape="singlet" model="ethylbenzoateH" atoms="13,15"  xMax="7.45" xMin="7.3" />
<PeakData id="4" title="H 14" peakShape="singlet" model="ethylbenzoateH" atoms="14"  xMax="7.6" xMin="7.46" />
<PeakData id="5" title="H 12" peakShape="singlet" model="ethylbenzoateH" atoms="12"  xMax="8.02" xMin="7.9"" />
<PeakData id="6" title="H 16" peakShape="singlet" model="ethylbenzoateH" atoms="16"  xMax="8.08" xMin="8.03"" />
</Peaks>
##NPOINTS=6645
##FIRSTX=2001.49072266
##LASTX=-99.95281982
##MAXX=2001.49072266
##MINX=-99.95281982
##MAXY=1030.14850000000
##MINY=-8.02694921875
##XFACTOR=1.0000000000
##YFACTOR=0.0321921424866
##FIRSTY=-3.08232861328
##DELTAX=-0.31629193
##XUNITS=HZ
##YUNITS=ARBITRARY UNITS
##XYDATA=(X++(Y..Y))
2001.5i6j0OJ6mPJ0L8j1j8M6l4L5j6nJ0j5KTPj1%kJJ3j6J3OKk4L6JJ2j1K6mlJ3kj7
1989.2CkK8j9k0L0k0j3onTMRl3lK1moMJ3Tk5%J0PlrLKj%OJ0omJ9k4POmJ2R%k4J6%J0
1974.6Fl5K0k5J2Tj1J8j7j5J0j1p%j0K6l5Qpjkj2J2Lj6lkJ1JpJ4Noj0j1KJ6k3qJ9r
1962h8pJj9MjnNj6J4MK7J6M5j6L1L3KL4j6J7j0kj%lj8j3k5Nj6j3%J7NnK3K9j8M4qj0
1949D6Rj4Pj8k1j1J2k5kj2k5J2rRkj3K3NPj8jJ9l1nJpNkj7j1K6pK2j8J0MrJ1J4lL6
1936cj4J0RL1qlM1L7l2L1TJ2nOj3lmj2n9J2k1j4Ml5j0mK1QJ3J6K6J7MJ7PL4j7Kk9k0
1923.4H3l7nk2Tm3rJ0m6j5J7mjL2l1K6j7MJ2l4j6j3j2pk6Jj6MJ8K3j7J6J4L8J4ONj
1911.7g1pk8mk3No3j0j2k4j2J1rRNK1mK5TMM7RJ5lPMJ6J1j1J3K0%j7Mk5K0qk9mRkn
$$ plain form
2001.5 -96 -106 -100 -84 -88 -81 -71 -33 -44 -62 -16 -50 -15 -31 -36 -26 -41 -39 -37 -30 -41 -41 -43 -42 -29 -45 -32 -26 -24 -48 -12 -11 1 -10 16 12 9 22 20 3
1989.2 3 1 29 10 -10 20 0 -13 -19 -24 -29 -25 -16 -49 -52 -31 -35 -41 -37 -24 -11 -36 -36 -26 -19 -22 -31 -28 -26 -27 -27 -21 -11 -17 -21 -2 -26 -19 -13 -17 -5 4 4 -20 -4 -4 6
1974.6 6 -29 -9 -34 -22 -10 -21 -3 -20 -35 -25 -36 -43 -43 -53 -27 -62 -54 -61 -62 -64 -76 -64 -61 -77 -80 -82 -71 -70 -77 -63 -58 -64 -74 -85 -83 -67 -90 -98 -79 -88
1962 -88 -95 -94 -113 -109 -110 -115 -110 -126 -112 -108 -81 -65 -20 -36 -5 28 30 64 48 65 55 53 52 52 49 31 18 -7 -2 -18 -31 -31 -14 -9 -14 9 38 20 64 56 46
1949 46 55 41 48 30 9 -2 10 -15 -17 -29 -54 -42 -51 -42 -44 -57 -34 -29 -22 -40 -41 -22 -53 -58 -57 -64 -59 -61 -78 -89 -63 -70 -48 -66 -56 -52 -61 -50 -36 -39 -3
1936 -3 -17 -7 2 33 25 22 63 100 68 99 130 142 137 143 130 127 123 111 52 64 43 29 33 -2 -12 -16 5 13 26 42 68 85 89 106 113 147 130 132 103 83
1923.4 83 46 41 19 -3 -46 -55 -45 -91 -106 -89 -93 -94 -62 -93 -67 -84 -80 -68 -102 -118 -131 -143 -150 -176 -175 -191 -187 -169 -146 -163 -147 -133 -95 -81 -75 -70 -71
1911.7 -71 -78 -106 -110 -133 -128 -191 -201 -213 -237 -249 -238 -247 -238 -233 -212 -216 -191 -166 -162 -115 -106 -91 -94 -87 -83 -67 -56 -67 -54 -34 -34 -51 -47 -72 -52 -60 -89 -93 -84 -86 -91
1898.7i1k0J9QJpJ3M2LL4K7JK9J7J1K1PmLl6K0m1K6n8Jj6j3Jj9Qj9K2J4lK9j3mL5j3
1886.7C5L6qJ4j9J5k2mKRl3j5J3j8kj8j0LkQOrLQj6M0j4J3j8K6qnKmMJ0KOLJ1j9K0
1873.7D5k3jPl2lnkj3kjk9J5nRK9j6K9lK3J6L2k8J3j5rol3km5j1k7k5k7JK3k6J8K2
1861.7a07kL0OL5N5lK6Rlk0Qj9j3m1k2k7l7Oj0j1jkK2J6M2MK6L1L6j1K4J0oj8km1j
1850a1j0j3l3%j7qk2J7J3rJ9J3K5jJ2jJ9KJ9j5J1%j1k2j2nPj2j3k2k9OkmJ6k5nK0L0
1837.7g3l0K9JKRJ6j6K4Moj6kjj3Mj5j2J3J1%kPj8J8J0K7j2j0J9J5k1jNJ8mk1kJ4q
1825.3c7QPK0kJ1K1j9%j2K5k2Qj0mQj2JTJ4j0J6j6LTK1k0J0jJ2j2MkprJ0k3K1QJ1K
1812.7B7L4qK1j2J8Jj2nj2onj9j6Pj3K1%J5lL7rJ9KK0Pl2Jnrk2qj3k7nk4Lj4L6KJK2
$$ plain form
1898.7 -91 -111 -92 -84 -83 -90 -77 -35 -32 2 29 30 59 76 87 108 115 111 114 78 98 57 83 25 26 10 -3 -2 -21 -13 -32 -10 4 1 30 17 13 48 35
1886.7 35 71 63 77 58 73 51 47 49 58 25 10 23 5 3 -15 -25 -22 -24 -16 -10 -19 -16 -8 -24 16 2 15 -3 23 15 10 12 8 12 22 24 30 33 44 25 45
1873.7 45 22 21 28 -4 -7 -12 -14 -27 -29 -30 -59 -44 -49 -40 -11 -27 2 -1 22 38 70 42 55 40 31 25 -8 -10 -55 -66 -93 -118 -145 -144 -121 -147 -129 -107
1861.7 -107 -109 -79 -73 -38 17 14 40 49 46 26 34 15 2 -39 -61 -88 -125 -119 -129 -140 -141 -143 -121 -105 -63 -59 -33 -2 34 23 47 57 51 33 31 -10 -11
1850 -11 -21 -34 -67 -67 -84 -92 -114 -97 -84 -93 -74 -61 -36 -37 -25 -26 -7 -5 14 -1 10 10 -1 -23 -35 -40 -33 -45 -58 -80 -109 -103 -105 -109 -93 -118 -123 -103 -73
1837.7 -73 -103 -74 -73 -71 -62 -46 -62 -38 -34 -40 -56 -58 -59 -72 -68 -83 -95 -82 -71 -71 -73 -66 -84 -66 -56 -29 -41 -51 -32 -17 -38 -39 -34 -16 -20 -41 -43 -29 -37
1825.3 -37 -29 -22 -2 -4 7 28 9 9 -3 22 0 8 -2 -6 2 -10 -9 -8 6 -4 12 -4 -1 2 23 3 13 12 24 12 16 14 7 -2 8 -15 6 14 25 27
1812.7 27 61 53 74 62 80 81 69 64 52 46 41 22 6 13 0 21 21 36 33 70 61 80 82 102 109 77 78 73 64 42 34 21 -6 -11 -35 -32 -46 -10 -8 -7 15
1799.7A5NMK5k1j4j3Jl1j7j9j3j8j6nJ4LL3j7K0K8L7j5LJ0Nj4j9qk5l7j9j5j9J5j7
1788.6a54J6J1RQK2L2J5K4MK1Kj9k7j5Nl6k0j0oKkj2J6LlJ4JRNJ4%kKrLMkK4k2J6K9
1775.7b8j1J4J0j5L2j1K2j3qK4j6klJJ7j0K1J9oL7rK7KrJ1l1K7rj2Pj8Ok0K6Jj2lK
1763.6F0K0j5J7moj9Kn9Mk0Tj3rk5K8kj5RK7QnQK5Kl9j0j5j0k0j1j0k8J2qj1J3L8J1
1751.6i0K1mJ0RJ8j8LrJkrj7mrJ1RJ9J2K0L6J5j0K9J4j2j4%Krk5j3l2Jj7J4MKK2rO1
1739C0K6K8QmMk0K7l6j1j6m4K4j9Kj7J4JK1TJ8QJ5K3qLj4ll1k4j6k9j3Pl3J1TOJ2K9
1726.6A1NK1K2j1L2j9m4K5k3k2k0ql6j4jj6JmK0K2J1K1J6nL4j1j2Mj1%j0Jl5J5qOj0
1714.9e3J0KK9Q%K8nLTPj1Nk8pJ4jk5J3jRTk6L4k1J3mRj4k%mj0mrKOlkj7L1rK2j3K5
$$ plain form
1799.7 15 20 24 49 28 14 1 2 -29 -46 -65 -78 -96 -112 -117 -103 -100 -67 -84 -64 -36 1 -14 -11 -1 4 -10 -29 -37 -62 -99 -118 -133 -152 -137 -154
1788.6 -154 -138 -127 -118 -110 -88 -56 -41 -17 -13 8 10 -9 -36 -51 -46 -82 -102 -112 -118 -116 -118 -130 -114 -111 -114 -100 -99 -90 -85 -71 -71 -73 -71 -80 -77 -73 -75 -51 -73 -57 -28
1775.7 -28 -39 -25 -15 -30 2 -9 13 0 -8 16 0 -2 -5 -4 13 3 24 43 37 74 65 92 94 85 96 65 92 83 71 78 60 66 46 72 73 61 58 60
1763.6 60 80 65 82 78 72 53 55 -4 0 -20 -40 -53 -62 -87 -59 -61 -76 -67 -40 -32 -37 -29 -4 -2 -41 -51 -66 -76 -96 -107 -117 -145 -133 -141 -152 -139 -101 -90
1751.6 -90 -69 -73 -63 -54 -36 -54 -51 -60 -59 -61 -70 -87 -91 -100 -89 -80 -61 -49 -29 7 22 12 41 55 43 29 29 31 22 -3 -16 -48 -47 -64 -50 -46 -44 -22 -31 30
1739 30 56 84 92 88 92 72 99 63 52 36 -8 16 -3 -1 -18 -4 -3 18 39 57 65 80 103 95 98 84 81 50 26 10 -19 -32 -25 -58 -47 -36 -30 -18 11
1726.6 11 16 37 59 48 80 61 17 42 19 -3 -23 -31 -67 -81 -82 -98 -97 -101 -81 -59 -48 -27 -11 -16 18 7 -5 -1 -12 -12 -22 -21 -56 -41 -49 -43 -53
1714.9 -53 -43 -41 -12 -4 -4 24 19 22 25 32 21 26 -2 -9 5 4 -21 -8 -9 0 9 -17 17 -4 9 5 14 0 -2 -2 -6 -16 -20 -29 -27 -21 -24 -26 -43 -12 -21 1 -12 13
1701A3k4J6%j7J5ql3J5jJ9j2K8j6J4K0JK0K1RM0Jj0LPpnk5kj2J5J6k7Ok0PJKK7qJ5
1688.4A04K4jj4Jl3pKQj6Nj8KJ2l1K7k1rJNk0j3j6j9j2j8j6k2mpj9NK3k8L2KK1JkK7
1676d4J2j1L3K4k5K1Jj4qOj8K4k0J0k0j2j0J3j4k2K5nJ0QkJ3TMJ4J6Tj0JPJ6kKj7k7
1663.7Hjk9kk1k7J9j7j2K5nkJ9rkK4j2j1K9Lj0ToNOK5k7rJ0J4J9OjTmj6J5K5Lk5j6
1651b0M4j0j5K6MK0LmOJ2NK2Moqj4Rj4j2j6j8k4Qjrk0PnJ0J1QJ1RK1j9M4Jk3%mpk0
1637.8A6k2l5l2Qm7J2l4k3K5j7j3J3J2L1J7K2RO0L3P2M5%K4J7K8J7J6j3Qk9oK1j0P
1627B32JTK7kL9J5L0j%j2j0LnrpLK3M0Q4J32J30J94K32L01M32M26L83L89M75O75O05
1617.2D826Q41Q46N48P09K352L215K236K125K291J69p97J75m49k018m885r14j489l76
$$ plain form
1701 13 -11 5 5 -12 3 -5 -38 -23 -24 -5 -17 11 -5 9 29 30 50 71 80 120 121 111 114 121 114 109 84 82 70 85 101 74 80 60 67 68 70 97 89 104
1688.4 104 128 127 113 114 81 74 76 84 68 73 55 57 69 38 65 44 35 36 41 21 8 -8 -27 -39 -57 -73 -95 -99 -106 -125 -120 -97 -125 -93 -91 -70 -69 -71 -44
1676 -44 -32 -43 -10 14 -11 10 11 -3 -11 -5 -23 1 -19 -9 -29 -41 -51 -38 -52 -74 -49 -54 -44 -36 -38 -25 -12 -8 6 22 38 28 29 36 52 50 52 35 8
1663.7 8 7 -22 -24 -45 -72 -53 -70 -82 -57 -62 -64 -45 -54 -56 -32 -44 -55 -26 -23 -33 -43 -49 -44 -38 -13 -40 -49 -39 -25 -6 0 -1 -2 -6 -22 -7 18 21 -4 -20
1651 -20 24 14 -1 25 29 49 52 48 54 66 71 93 97 91 83 69 78 64 52 36 18 -6 2 1 -8 -28 -21 -26 -16 -5 3 14 23 44 25 69 70 47 47 43 36 16
1637.8 16 -6 -41 -73 -65 -112 -100 -134 -157 -132 -149 -162 -149 -137 -106 -89 -67 -58 2 35 107 152 152 176 193 221 238 254 241 249 220 214 235 225 232
1627 232 233 234 261 259 298 313 343 342 342 330 320 323 318 309 302 305 328 368 452 584 714 908 1140 1441 1873 2299 2682 3071 3546 4221 4826
1617.2 4826 5667 6513 7061 7770 10122 13337 15573 17698 19989 20158 19361 19536 19087 17069 12184 11270 9781 9405
1611.5I405p79k554j65J71J83N52J225J127J429J391P34J64K795M667K613O10Q6m076
1605.8A9578l561rM88k85m310m452l383q34m37l12k13k23k01j83j67j83j85j82j14
1599.8H32j08n7Tm5j2k1k3qK2K0mJ3kk2J7l6nk8lnoj2K2j4K0rRJ1Ll3j5l5o7m5o6l9
1588.4A92n8l8p2j4m7pJ8KJ7K5K2K4J8J0M4K4RTNk9j9j3k0J4kl7pj2k1J2KK7j9oJl5
1577A9J2pj8J3qokRJ1lK8nJ1J6j5L9j1Jj4kj2Mlk3Mk9pj5K4l3pqL1l2ojRJ2PJ9k0K8
1563.8A0JkJ5K6mK1kj8K3Mnk2j3k0k9l1L7k8L7l1K0kL7L%J5K1j4TK4JqOj8k8nk5j3
1551.7c1jrMl6K0J1OK7pJ7RmrK6%k1lnj4nJ6k5J8j2j7K1NMK6J4lK6pRNj0J8j5oj5L
1538.8C0k2Qj5j2Kj5K3L4j5K4jJ1N7j5J7K1NJ9Nj1j8l0k1n9k3j8j2j3jRkL5qL0J9K2
$$ plain form
1611.5 9405 8626 6072 5907 6078 6261 6813 8038 9165 10594 11985 12719 12883 15678 20345 22958 23568 23654 19578
1605.8 19578 16017 16008 16496 16211 11901 7449 4066 3232 2795 2483 2270 2047 1846 1663 1496 1313 1128 946 832
1599.8 832 724 667 610 565 553 532 509 501 523 543 539 552 550 528 545 509 504 476 473 468 462 450 472 458 478 469 478 489 492 459 444 409 342 297 231 192
1588.4 192 134 96 24 10 -37 -44 -26 -24 -7 18 40 64 82 92 136 160 169 178 183 154 135 122 102 116 114 77 70 58 37 49 51 78 59 53 54 19
1577 19 31 24 6 19 11 5 3 12 23 20 48 43 54 70 55 94 83 84 70 68 56 60 57 34 38 9 2 -13 11 -22 -29 -37 -6 -38 -44 -45 -36 -24 -17 2 -18 10
1563.8 10 11 9 24 50 46 67 65 47 70 74 69 47 34 14 -15 -46 -9 -37 0 -31 -11 -13 24 27 27 42 63 49 35 59 60 52 58 40 12 7 -18 -31
1551.7 -31 -32 -41 -37 -73 -53 -42 -36 -9 -16 1 10 6 -3 23 23 2 -1 -6 -20 -25 -9 -34 -16 -28 -45 -24 -19 -15 11 25 22 48 41 50 55 45 63 48 42 27 30
1538.8 30 8 16 1 -11 -9 -24 -1 33 18 42 41 52 109 94 111 132 137 156 161 150 132 102 81 22 -1 -19 -31 -44 -45 -36 -38 -3 -11 19 38 60
1527.4F0M9lL8K9J6J0J8rJ7k2pj0Tj5j7Rl3J3J4L8K6L6M3J6L6N0L8N9N5M1O3P1M5Q7
1516.6H51N8R5P6Q0P7Q9J43J35P7J89K30K52J84J36J84O9mQ9P6Ok67o3J36J15Q8K7
1508.4C128J26J93K48J87J90K15K95L73M03M85N15M36M00L49J79k7l89j114r00n94
1502.1D698j21qQ0Q6J11p9J45K25K07M09N78O62M43L17L05l19p7Q2J0m04j375o88k00
1494.8E087j24k45n48j39R8K75K65L04L34L90M51M20M71N51Q21Q55J083J434P22O24
1488.5A3129Q99O54r7r78o78j954j763n57j79m84n91n1J47K96N22P95O73N99P37R96
1482.2A2115J368J197R53J10m96j18J57j94j785k510k001j795q12m73m80m71l06j3
1476.5D446K0J3Q7J49M16M15J41Q6q1J52J57M4m06j156n92l01k23m63p09n10k66j28
$$ plain form
1527.4 60 109 106 144 173 189 199 217 208 225 203 196 186 176 161 144 153 120 133 147 185 211 247 290 306 342 392 430 489 544 585 648 719 764 851
1516.6 851 909 1004 1080 1160 1237 1326 1469 1604 1681 1870 2100 2352 2536 2672 2856 2925 2921 3010 3086 3092 2825 2762 2898 3013 3101 3128
1508.4 3128 3254 3447 3695 3882 4072 4287 4582 4955 5358 5843 6358 6794 7194 7543 7722 7695 7306 6192 5292 4698
1502.1 4698 4577 4569 4649 4735 4846 4767 4912 5137 5344 5753 6331 6993 7436 7753 8058 7739 7662 7744 7754 7350 5975 5287 5087
1494.8 5087 4963 4718 4170 4031 4129 4404 4669 4973 5307 5697 6148 6568 7039 7590 8411 9266 10349 11783 12505 13129
1488.5 13129 14028 14682 14585 13607 12929 10975 9212 8655 8476 7992 7401 7350 7497 7793 8315 9110 9783 10382 11119 12115
1482.2 12115 13483 14680 15633 15743 15247 15129 15286 15092 13307 10797 8796 7001 6189 5716 5236 4765 4459 4446
1476.5 4446 4466 4479 4566 4715 5131 5546 5687 5773 5692 5844 6001 6045 5639 4483 3891 3590 3367 2904 2195 1685 1419 1291
1469.5A291j35p2n8o5q7l4k7o4Ll6n1k1l4n8j4l6m2l8m7j7m4om3j4K1J1rJ3K0nMkP
1459.1C11%K2M9K8O6TK12J888r4k89J903o90j902j334j54kl7k0J2oPlj9lOj0L5J0j3
1449.9C9K8K4J4jlNljj4j6l7k1l8Kpk0k8oRKJ1K1M1J9K3M5RMJ0rTj4k6Tqk5k1qk7j1
1437.2g3pkrK3NmK7J5jK8j4L1KrJ6K1%P%jQpOKkk7K9kJk3j0J3k0mk2L6j4jJ5J2O%K6
1423.6G7O%J1J7lJ5rj9J2j7lJj5qn%KpkMj5%NJj4mRJ4l0J4TKLk2K3KJ2J0K9j8J8J7
1410.4A27j7MJ0k2Kj2pNk8j1j4J9j7%PNTJ4J1J2J5pK3jOj2QjK3j6Kj2onk3j6k0mTK
1397.7D5qj6J2%J9rJ3J0j7K3j7kK3k9J2rj7k6J8m7MJqR%jJ6K2j8J8kNKj0K5j3j6lM
1385.4A3k8LnNpoJ0ojkL8O%TJo%Jpj8Pj8j0pNJ1k%J6rmTQj1Pjk1RTOj5j8KRQJ6J9r
$$ plain form
1469.5 1291 1156 1084 1026 961 874 840 813 749 752 716 665 644 610 552 538 502 460 422 375 358 314 308 265 251 272 283 274 287 307 302 306 304 311
1459.1 311 311 333 382 410 476 542 754 2642 2548 2259 4162 3472 1570 236 82 80 43 23 35 29 36 33 14 11 17 7 42 52 39
1449.9 39 67 91 105 104 101 106 103 102 88 72 35 14 -24 -22 -29 -49 -77 -83 -74 -72 -61 -40 1 20 43 88 97 101 111 102 93 79 53 27 19 -6 -27 -35 -62 -73
1437.2 -73 -80 -82 -91 -68 -63 -67 -40 -25 -26 2 -12 19 21 12 28 49 49 56 56 55 63 56 62 64 62 35 64 62 63 40 30 43 23 19 -3 33 19 18 33 45 51 51 77
1423.6 77 83 83 94 111 108 123 114 95 107 90 87 88 73 65 60 60 62 55 53 57 42 42 47 48 34 30 39 53 23 37 51 53 56 34 57 59 71 81 110 92 110 127
1410.4 127 110 114 124 102 104 92 85 90 62 51 37 56 39 39 46 51 56 70 81 93 108 101 124 123 129 117 125 124 147 131 133 121 115 110 87 71 51 47 43 45
1397.7 45 37 21 33 33 52 43 56 66 49 72 55 53 76 47 59 50 33 7 25 -22 -18 -17 -25 -16 -16 -17 -1 21 3 21 19 24 26 16 41 28 12 9 13
1385.4 13 -15 -12 -17 -12 -19 -25 -15 -21 -22 -24 14 20 20 20 21 15 15 16 9 -9 -2 -20 -30 -37 -32 -21 -23 -23 -7 -16 -20 -24 -16 -27 -20 -21 -42 -33 -24 -18 -33 -51 -49 -40 -32 -16 3 -6
1370.2fJ4j2K6QNmrlJl9Jk0%j7J0jMPNK0RPQK0K7lQJ2j3Nk7lk9k3l7nl4Ok5j0K0Nj2
1356.6a04K8lL2J5J8qJ5J0loO%j8mj0j3LnRTK1j4l0RJ1J6k0QPlOJ6q%LJ0K5J0J9J2
1343.9F9M5kK9kj2J2j9j8j6Km7k2j6Nk2k9K0l1O3J3j8M1K6J9J3moj0kk9k6Jj2m1j4
1332.9d0k7m0J7POj4K6J8oL1LMTnj1k4jMnkk0JK5l1L4K2j0K7L0mPQrQj1J4m0L0l9J2
1320.2aj1pJ8J0OTL0kK0Tk1RJ9kj5Pj0l2J4j3mJ8k2NRoRNJ4kk0j2j0Rj7j1l8j3J8l5
1307.6e8L%K9qjK9J3LJ9jRj0J5j4l0jJ2m9%m3Lj7k4oJ0j5K8J7PJ1K3mJJ9j0M1nmLj1
1294.9a6J3mpmk0j2rjoj0rk4J6l0LpmJ4J1nJ5K0J1QJ6K2lJ6NKkjpk8ol5j4k9j2j6l
1281.9a52K0l4J6RJ8K1j5K9L4OJ5MPQj6rjJ1j3pk8jj0J5qJ7k7J5J4J1mL5k3LJ2Jrj1
$$ plain form
1370.2 -6 8 -4 22 30 35 31 22 19 20 -19 -18 -38 -38 -55 -45 -46 -42 -35 -30 -10 -1 6 14 34 61 58 66 78 65 70 43 40 11 -12 -49 -54 -88 -82 -107 -117 -97 -92 -104
1356.6 -104 -76 -79 -47 -32 -14 -22 -7 3 0 -6 0 0 -18 -22 -32 -45 -42 -47 -38 -29 -8 -22 -52 -43 -32 -16 -36 -28 -21 -24 -18 -2 -10 -10 -7 3 28 38 57 69
1343.9 69 114 112 141 139 127 139 120 102 86 88 41 19 3 8 -14 -43 -23 -54 9 22 4 45 71 90 103 99 93 83 81 52 26 27 15 -26 -40
1332.9 -40 -67 -107 -90 -83 -77 -91 -65 -47 -53 -22 -19 -15 -11 -16 -27 -51 -52 -48 -53 -55 -75 -74 -49 -80 -46 -24 -34 -7 23 19 26 34 25 33 22 36 -4 26 -13 -1
1320.2 -1 -12 -19 -1 9 15 21 51 49 69 89 68 77 96 94 79 86 76 44 58 45 41 59 37 42 51 45 54 59 73 71 51 39 29 38 21 10 -28 -41 -23 -58
1307.6 -58 -55 -55 -26 -34 -35 -6 7 10 29 28 37 27 42 28 -2 -3 9 -40 -40 -83 -80 -97 -121 -127 -117 -132 -104 -87 -80 -69 -46 -50 -49 -30 -40 1 -4 -8 -5 -16
1294.9 -16 -3 -7 -14 -18 -38 -50 -59 -60 -66 -76 -85 -109 -93 -123 -120 -127 -131 -117 -106 -111 -96 -76 -65 -57 -41 -19 -22 -6 -1 1 -1 -2 -9 -37 -43 -78 -92 -121 -133 -149 -152
1281.9 -152 -132 -166 -150 -141 -123 -102 -117 -88 -54 -48 -33 -29 -22 -14 -30 -39 -40 -29 -42 -49 -77 -78 -88 -73 -81 -64 -91 -76 -62 -51 -55 -20 -43 -40 -28 -27 -36 -47
1269.9d7kRJ3jj8K2oj2%L0J5j5rJ0PMLnqmJ6k3j4J4j0kQ%mJ7kPRK2j5%lK6k2j4ROk7
1256.3a6PKpMk9Rj4Mj5J3lJ0j5K3Oj5J0J4J9lKj1j2Oj6j1J5k9j0Lj6oj2OJ1oj0j3L9
1244f6rPJK8pKjJJ1OP%mk4Mk0pL1k0J6J7mJ0RPJ9J1j1Rj0J5j9Lj3%Jk6L5Kl0J9J0J6
1230.4B6KjJ1jLJ0J4j9j5mj1pk4J1k0k2K8j5OK6rTkPOk6NkJ4l8LTK2k6J2j0K6KNlK4
1217.4BOMK1k1lLk3lj4k1j0Nk4%nK6pN3mL1j8N8j6J5k1L3j9k4k3j8n5K0j0k1Pj0KK5
1205.4e9j5M3J9RL4J0NlOj7j2Nl5Pj7j2j7k0KnpQM0QJ2M5mK9j7L3k1J4j7RMj7j6jK
1193.1C2j9ql6J3k5L7qJ4k3K3rK8J5MmJ0j0PpPmk8lTm3j9k8lk5J5k1mJ5mK5JMNK9o
1180.4e6J8J0j4q%j2l1%j6j9j7j8kQkK0j2K9LK4J6K9pK2k0OJ8qNk0J2Tl1J5j9kjk1
$$ plain form
1269.9 -47 -49 -40 -27 -28 -46 -24 -30 -42 -42 -12 3 -12 -21 -11 -4 0 3 -2 -10 -14 2 -21 -35 -21 -31 -33 -25 -25 -29 -12 -14 -7 2 24 9 9 6 32 10 -4 5 11 -16
1256.3 -16 -9 -7 -14 -10 -39 -30 -44 -40 -55 -42 -45 -35 -50 -27 -21 -36 -26 -12 7 4 6 -5 -17 -11 -27 -38 -23 -52 -62 -59 -75 -81 -93 -87 -76 -82 -92 -105 -66
1244 -66 -75 -68 -67 -39 -46 -44 -45 -44 -33 -27 -20 -20 -24 -48 -44 -64 -71 -40 -60 -44 -27 -31 -21 -12 -5 14 25 14 23 13 28 9 12 -1 -1 0 -26 9 11 -19 0 10 26
1230.4 26 28 27 38 37 40 50 64 45 30 26 15 8 -16 -5 -25 -47 -19 -34 -28 -2 -11 -20 -22 -15 -9 -35 -30 -32 -18 -56 -53 -50 -28 -54 -42 -52 -26 -24 -19 -22 2
1217.4 2 8 12 33 12 9 12 -11 -14 -28 -49 -59 -54 -78 -78 -83 -57 -64 -11 -15 16 -2 56 40 55 34 67 48 24 1 -17 -72 -52 -62 -83 -76 -86 -84 -59
1205.4 -59 -74 -31 -12 -3 31 41 46 43 49 32 20 25 -10 -3 -20 -32 -49 -69 -67 -72 -79 -71 -31 -23 -11 34 30 59 42 75 54 68 51 60 64 47 31 30 32
1193.1 32 13 5 -31 -18 -43 -6 -14 0 -23 0 -9 19 34 38 34 44 34 41 34 41 37 9 6 3 -40 -59 -87 -90 -115 -100 -121 -125 -110 -114 -89 -88 -84 -79 -50 -56
1180.4 -56 -38 -28 -42 -50 -50 -62 -93 -93 -109 -128 -145 -163 -165 -157 -159 -139 -151 -122 -119 -95 -79 -50 -57 -35 -55 -49 -31 -39 -34 -54 -42 -30 -61 -46 -65 -67 -68 -89
1168.4h9JkqJ1PrK5j9jJ5KNTJ1J0L5oL0k3J2PJ2j6nl9Kk3nMj6k7j9O%J4MJ8K1LK1L3
1155.4GJ0kNQJ0j8j5L0m4Kk2j8k4OTj3J0lJ1K9J4jj0N6n2K7M0j0J8k7J3Jj4J4j8pj3
1143.7FJ6qk6J4jRJ5m0L8j1L0qJ5MM2Njk3J4nTk6K8k6k9j4K00j64k3k9Prj0J6j3PJ5
1132A0JJ9j1J3k8L1k4K7k9Lj6J6j4Jl4%lTNj5J0pQJ9j4QRKK1K6l7K1nk0J9jkj4JoK8
1119.1A5j3kj0L1k4K7qOJ3j9L4l2K9OPoNk1npJ3jrNj5J5kj0J8pOK7pj2K3k6NoK4k2
1106.4D5NmkRj0rk2j0J3QknJ1j3qL4k8J7k0K4moKTmJ9njlrQnJ6k4Jl%lJ1Nk0Oj0oN
1092.2EnRKj6L2NLJ5j1J4pjK7j7L4l9kK1l3%j3Nn4MQJ0mj2J1j5J4J2oK4j1qRJ1KJj2
1079.2A2LRj6Kk3J9Lj1j%j0J4nkJ6Oj2Mpj2J1j5QKk5Pj3J1J5qoK1K9nJ6J4J8K2mK2
$$ plain form
1168.4 -89 -88 -90 -98 -87 -80 -89 -64 -83 -84 -69 -67 -62 -57 -46 -36 -1 -7 23 0 12 19 31 15 10 -29 -27 -50 -55 -51 -67 -94 -113 -107 -107 -93 -89 -71 -50 -47 -26 7
1155.4 7 17 15 20 28 38 20 5 35 -9 -7 -29 -47 -71 -65 -59 -72 -62 -65 -54 -25 -11 -12 -22 34 -18 9 49 39 57 30 43 44 30 44 26 19 6
1143.7 6 22 14 -12 2 1 10 25 -15 23 12 42 34 49 53 95 100 99 76 90 85 80 54 82 56 27 13 213 49 26 -3 4 -5 -15 1 -12 -5 10
1132 10 11 30 19 32 4 35 11 38 9 12 -4 12 -2 -1 -35 -35 -38 -41 -36 -51 -41 -48 -40 -21 -35 -27 -18 -16 5 31 -6 15 10 -10 9 8 6 -8 -7 -13 15
1119.1 15 2 0 -10 21 -3 24 16 22 35 16 50 18 47 53 60 54 59 38 33 26 39 38 29 34 19 34 32 22 40 33 39 66 59 47 70 44 49 43 67 45
1106.4 45 50 46 44 53 43 34 12 2 15 23 21 16 27 14 6 40 12 29 9 33 29 23 25 27 23 42 37 36 33 24 32 27 43 19 20 17 17 14 25 30 10 16 6 0 5
1092.2 5 0 9 11 -5 27 32 35 50 39 53 46 45 72 55 89 50 48 69 36 36 23 28 -26 -22 -14 -4 -8 -20 -9 -24 -10 2 -4 20 9 1 10 21 23 24 12
1079.2 12 15 24 8 10 -13 6 9 -2 -3 -3 -13 1 -4 -6 10 16 4 8 1 -11 0 -15 -7 -5 -30 -23 -36 -25 -10 -18 -24 -3 26 21 37 51 69 91 87 109
1066.6A09Pj9%J0k9Mqk4Tk9Nl1j6j0Lmj8L2J0J1RK2J7j6N3k0KMJJ1j8qj5qk4rj7k8
1054.5f5J5k4J1j0lkolMJ3j8oJ7JTPJ0K7J3K6j7mJ3M6%k5J6lj6k1j9k8Lk5j5k2pk3
1042.5a39j0j1nJ4nJ4TlK3K8QJ4mK2J9J5pRJ4k8J5nqpl1j7j0m4nn4%Ll7J5K5kO2OK7
1030.2h5N2K5M7L6L2MJ1j5K6m3j2k7j5qn8Nk6K1KmK6K5L7QJ3J4kJ2j3%j8j7j2k0Kj4
1018.8IJ3j8M5K1NL1L2K2L0lQl0k2j0j5m3k0k9k0m2rj2jJ3L3K3J4L1K3L0OJ9Opj8O
1007.4A21k7k0j1j8jj9Jl0J3pJ6L7pk4j0Rlj2k0l3j2Kk8m%MJ0LM2j9M5J9TJ5K9j1J3
995.7H2j1k6pm2k8qm0ml5kqK3lJ6PkN5LJ7K4JK1J8pRj2rj6Nk9J4lj4LmKj8QPOmM7l5
982.1AmK8J0k5PK1j0j6J2J4j8L0l4L2J1TJ3k0K2%j0K0kk5J3k3j5qnjj7M%rj9J7LL3
$$ plain form
1066.6 109 116 97 97 107 78 82 74 50 26 -3 2 -29 -45 -55 -52 -56 -74 -42 -32 -21 -12 10 27 11 64 44 46 50 51 62 44 36 21 13 -11 -20 -37 -65
1054.5 -65 -50 -74 -63 -73 -76 -78 -84 -87 -83 -70 -88 -94 -77 -76 -75 -68 -58 -31 -18 8 -9 -13 0 46 46 21 37 34 18 -3 -22 -50 -47 -72 -87 -109 -116 -139
1042.5 -139 -149 -160 -165 -151 -156 -142 -128 -131 -108 -80 -72 -58 -62 -40 -21 -6 -13 -4 10 -18 -3 -8 -16 -23 -54 -71 -81 -125 -130 -184 -184 -181 -218 -203 -178 -180 -118 -112 -85
1030.2 -85 -33 -8 39 75 107 111 122 107 133 90 78 51 36 28 -30 -25 -51 -30 -28 -32 -6 19 56 64 77 91 89 101 88 88 70 53 41 21 23 9
1018.8 9 22 4 49 70 75 106 138 160 190 187 195 165 143 133 118 75 55 26 6 -36 -45 -57 -58 -45 -12 11 25 56 79 109 115 134 140 133 115 121
1007.4 121 94 74 63 45 44 25 26 -4 9 2 18 55 48 24 14 23 20 8 -12 -45 -57 -55 -83 -87 -87 -83 -73 -70 -28 -47 -2 17 36 51 80 69 82
995.7 82 71 45 38 -4 -32 -40 -80 -84 -119 -121 -129 -106 -109 -93 -86 -88 -33 -30 -13 11 12 33 51 44 53 41 32 16 21 -8 6 3 -11 -8 -12 -10 -28 -20 -13 -7 -11 36 1
982.1 1 -3 25 35 10 17 38 28 12 24 38 20 50 16 48 59 70 83 63 85 85 75 95 93 68 81 58 43 35 30 29 12 16 16 7 -12 5 8 41
970.1D1j3QkJ4j7J5J6j4j5k9K5k7J0j5j9k0QkJ0k4J5JJ3NRpk3K6J2j0rKJ1pj3j7J7
958.4b5qOqK4j1K7K5j3%J0K2k4J5k4PKOmKnknTj6K3J1j4J7nOJ7K1j3Lj1m2KpnkJ7M
945.1A8k0K2l8L1k2Mj7J3K3kJ4j2mJ8j0j6j3rJ0rnK6KJ4j5J3J2onRmk5K8j9jk1J1O
933.1Ak6K2L2rK2J3Pj7LJPj6Kj4l8J8j6l6J0qj1J2K5k0L1J7%J8pK9qj5j4Ook9J3l1
921.1c2j5rkmpK3OK6J3kL6J4TLk6qNj4rljj1qrJK0lK6MJ0OL8J8NJ2lKk6j7j3l2k4N
907.5Ij7k1kQl0K0L0j0K4L2K4JK3JJ1J2m2J2m0Pk4MK4l8L2k2pljNOJJ2J5j1NjMJ8p
894.8F4J3TL6L4O6L0N9K2K0M4M1NL3K4J9J5N5P7K1N1K3M7P5O2J16K08K50K61K38K25
885.3B247K35K42K73K53M75R55P42N32N33L64K61k2j097j811n87j61J5J83N23N55N73
$$ plain form
970.1 41 28 36 34 48 31 46 62 48 33 4 29 2 12 -3 -22 -42 -34 -36 -26 -50 -35 -34 -21 -16 -7 -14 -37 -11 1 -9 -18 -16 -5 -12 -25 -42 -25
958.4 -25 -33 -27 -35 -11 -22 5 30 17 17 27 49 25 40 16 23 25 31 27 29 24 22 17 12 -4 19 30 16 33 28 34 51 72 59 62 51 9 11 4 -1 -3 14 18
945.1 18 -2 20 -18 13 -9 -5 -22 -9 14 12 26 14 10 28 18 2 -11 -20 -10 -19 -24 2 4 18 3 16 28 22 17 26 22 -3 25 6 5 -16 -5 1
933.1 1 -25 -3 29 20 42 55 62 45 48 49 56 40 42 28 -10 8 -8 -44 -34 -42 -53 -41 -16 -36 -5 12 12 30 23 52 44 29 15 21 15 -14 -1 -32
921.1 -32 -47 -56 -58 -62 -69 -46 -40 -14 -1 -3 33 47 61 64 38 30 35 21 12 9 8 -3 -11 -20 -19 1 -2 24 28 38 44 82 100 105 117 114 116 90 73 60 28 4 9
907.5 9 -8 -29 -31 -23 -53 -33 -3 -13 11 43 67 68 91 92 103 115 73 85 45 52 28 32 56 18 50 28 21 18 17 22 28 29 41 56 45 50 49 53 71 64
894.8 64 77 90 126 160 226 256 315 337 357 401 442 447 480 504 523 538 593 670 691 742 765 812 887 949 1065 1273 1523 1784 2022 2247
885.3 2247 2482 2724 2997 3250 3725 4680 5422 5954 6487 6851 7112 7090 5993 4182 3595 3434 3449 3632 4155 4710 5283
878.7E283N32M32N58N12N52P84J942K915J366J614R66N89K16j136o028m043j307n19
873E228k18N6M62M20M94L34M10M13L84M29J045K669K223J179J332N79K93k81l024o880
866.7G547k415r65m56l13q3K7N3N7PN9MJ5J12N01Q85L81M34K30J07k7l95j992j529
859.4B244n34k55j69j39o4o8p3q9p8q0p8o2p1l6l0m4J0j0k4KonK3j3Lj8k7k1j6o4m5
849.6A63k4J0j7Oj0J9K4NLJ1J6k4J7Oj0LJ8k6k5j7ol4rj6kQ%K6lTLj0j1k2Ol3L0k2
837.6E0L1j3k5K3kKj0kK5j9Lqj4k5nTj9ol2rJJ1jM3k3K8J0j1J2j2J9mpK0n4J5j4Kj9
825.2d4J7j8ROQJ2K4qJ8Nj2K2k5J7j0Qj0k8lQokJJ6mJ4j1K7pj3PJ0n1L6km3MK3j4l
812.6b2%OqJ5lj6M4pkJ1QoqJNj7j6J4j8j9NrJ5JmJ0M0k2K1QMRlK2JPNrJ7rm0k5j5l
$$ plain form
878.7 5283 5815 6247 6805 7317 7869 8653 10595 13510 14876 16490 17456 18045 18261 17125 11097 7054 5747 5228
873 5228 5010 5066 5528 5948 6442 6776 7186 7599 7983 8412 9457 12126 14349 15528 16860 17439 17732 17451 14427 7547
866.7 7547 5132 4167 3711 3398 3315 3342 3395 3452 3459 3518 3522 3537 3649 4150 5035 5416 5850 6080 6187 6160 5765 3773 2244
859.4 2244 1710 1455 1286 1147 1083 1015 942 853 775 695 617 555 484 448 418 374 384 374 350 352 346 341 364 351 354 336 309 288 272 208 163
849.6 163 139 149 132 138 128 147 171 176 179 190 206 182 199 205 195 198 216 190 165 148 142 108 99 83 81 89 89 115 112 109 112 102 91 69 75 42 72 50
837.6 50 81 68 43 66 64 66 56 54 79 60 63 55 41 16 11 6 -13 -19 -51 -60 -59 -48 -49 -6 -29 -1 9 -2 10 -2 17 13 6 26 -28 -13 -27 -25 -44
825.2 -44 -27 -45 -36 -30 -22 -10 14 6 24 29 17 39 14 31 21 29 19 -9 -12 -4 -10 -12 -11 5 1 15 4 31 24 11 18 28 -23 13 11 -32 -28 -5 -19 -22
812.6 -22 -22 -16 -24 -9 -12 -28 16 9 7 18 26 20 12 13 18 1 -15 -1 -19 -38 -33 -42 -27 -26 -30 -20 20 -2 19 27 31 40 37 59 60 67 72 63 80 71 31 6 -9 -12
798.7a2mJ5qOK6NqJ7lOlK0J5Jk1kPk2j1l1jl0J8j%KRoJ5J6Joj2K2j0Mj2%K2l5mknp
784.7b9kJ7kJ9K5k7L3QqKPjRoj0Mkk0J5kM0L7K1J7M9pL2K4jj8r6p0j2l0k0J1j9nk6
772.4d3j6KJ1Jk6kJOJ0TLj2qQMj4J5nLJ4kK3RoRj2J0%j8%j2Nl0Qmj2LK0jJJ8QK7RK8
758.2D3J6rqJ2pj4Rjk0ljk2QJK9PK4J5J9K7K1m2QJ0J1l3ok1j4k5lk2JK3lJ6mM7K1L2
745.5A42OlK7J0j5%m0j1rj8j2m6j1nj6J0pK0j7K2J2j3KK1%j3Jk8mnkk3oK1k2j0K1l
733.5b4J0Kqj6Nnj0j1j8opj5Nk9J1%K4KTK6rjK8j7K4%mj6Qk3%J7J2KOJ4J1NJ3LORj7
719.9IJ8qJ6j4k7J6j5Tj1Qj9PJKJ1J3qJ2J9J3nK3kL1l9J3J4j2k3J6m9j0rmk5%Ql6J
707.6h0Mj1JK2MJ8J5j1K7J0J2J1lK3rOPj8J1J5k5nK3k0l%k0J8J7j3qL3kNrmMJjLJ0
$$ plain form
798.7 -12 -16 -1 -9 -3 23 28 20 37 34 40 37 57 72 73 52 50 57 35 24 -7 -8 -38 -20 -21 -21 -19 -10 -16 -1 15 16 10 -2 20 10 14 2 2 24 -11 -15 -17 -22 -29
784.7 -29 -31 -14 -16 3 28 1 34 42 34 36 43 42 51 45 35 39 37 17 32 30 70 107 128 145 194 187 219 243 242 224 128 58 46 16 -4 7 -12 -17 -43
772.4 -43 -59 -57 -46 -45 -71 -73 -72 -66 -56 -46 -43 -55 -63 -55 -51 -65 -50 -55 -52 -38 -40 -17 -8 -14 -5 -17 -7 -7 -25 -25 -37 -32 -62 -54 -58 -70 -67 -47 -48 -47 -29 -21 6 15 43
758.2 43 59 50 42 54 47 33 42 41 21 18 17 -5 3 4 33 40 64 79 98 125 146 104 112 122 133 100 94 73 59 34 31 9 10 33 30 46 42 89 110 142
745.5 142 148 145 172 182 167 167 127 116 107 89 77 31 20 15 -1 9 2 22 5 27 39 26 28 49 49 36 37 9 5 0 -2 -25 -31 -10 -32 -42 -21 -24
733.5 -24 -14 -12 -20 -36 -31 -36 -46 -57 -75 -81 -88 -103 -98 -127 -116 -116 -92 -90 -88 -62 -71 -72 -44 -61 -37 -37 -41 -57 -49 -72 -72 -55 -43 -41 -35 -21 -10 -5 8 11 17 26 9
719.9 9 27 19 35 21 -6 10 -5 -20 -31 -23 -42 -35 -34 -32 -21 -8 -16 -4 15 28 23 46 44 75 36 49 63 51 28 44 -5 -15 -24 -28 -53 -53 -45 -81 -80
707.6 -80 -76 -87 -86 -64 -60 -42 -27 -38 -11 -1 11 22 19 42 33 39 46 28 39 54 29 24 47 27 24 24 4 22 39 26 18 51 49 54 45 41 45 46 45 48 58
694.6E8%J5jj7L6k0j0K5k1rJ6j0k9J6m4k2l5Rj8%mj6Pjj2J2j2MJL6JoNLl3J8KK1j8
682.3e3K0lRk4Q%j3MJLNPJj1J1K1k9K2K9k2L0J3lJ3J9k5QMj0J0nmok6KLk5J2oj2lJ
669b4L0LRPj2Nj0J8j4qkl2j8JnlKk4mL2qrK8J7%K2np%Rk5Nj1Pj3k0N%jK0J9j1rK2K3
654.8IoTMJ4%j5j6Mk3Rj1JK5oQTKL9pK9k1oK0j2J3Mj3k5K2j1j6nkOj3N%mJ3QK8k4M0
641.2F9k5kPK7j1L0j6lQj3J9j8JJ3j3jk1QJ1j3nk6NJ7j3j8J2jOMJ2K1j5j1K9LNk1r
628.8E2j3Kk9J2kqTLkJ5j1J0NJ5Tm3K0J6lk1J3k5k0olOJ7qpL0rJ1K7j3J5onOj3Mk2
615.8A7mNj8k2j2K4qJ7JkJ5K4J6k0j7LK3k1J0j9%k3l6J3j2lj4K0l6K4mL5J2JL6J8L
604.1D6JNnK3j9l6k8Kk3%mLj3rJ9oQPJ8%PK2OpK2kJ2j9QrmJJ0Ok5J4j7k4J5k5LQk2
$$ plain form
694.6 58 58 73 72 55 91 71 61 86 65 56 72 62 33 49 5 -17 -52 -43 -61 -61 -65 -81 -74 -75 -87 -75 -87 -83 -82 -46 -45 -51 -46 -43 -76 -58 -56 -35 -53
682.3 -53 -33 -36 -27 -51 -43 -43 -56 -52 -51 -48 -43 -36 -35 -46 -35 -14 -43 -21 8 -14 16 29 26 39 58 33 41 45 35 45 40 36 30 4 6 9 -16 -4 -10 -22 -25 -24
669 -24 6 9 18 25 13 18 8 26 12 4 2 -30 -48 -47 -52 -55 -53 -77 -81 -49 -57 -66 -38 -21 -21 1 -4 -11 -11 -2 -27 -22 -33 -26 -39 -59 -54 -54 -55 -35 -16 -27 -36 -14 9
654.8 9 3 -3 1 15 15 0 -16 -12 -35 -26 -37 -36 -11 -17 -9 -1 1 40 33 62 41 35 55 43 56 60 47 22 44 33 17 12 10 16 3 8 8 4 17 25 53 29 69
641.2 69 44 42 49 76 65 95 79 76 84 71 90 72 73 86 73 72 51 59 70 57 52 26 31 48 35 17 29 28 34 38 50 71 56 45 74 77 82 61 52
628.8 52 39 41 12 24 22 14 6 9 7 22 11 21 26 41 56 13 33 49 46 25 38 13 -7 -13 -16 -10 7 -1 -8 22 13 24 51 38 53 47 42 48 35 39 17
615.8 17 13 18 0 -22 -34 -10 -18 -1 0 -2 13 37 53 33 16 19 42 21 31 12 12 -11 -47 -34 -46 -49 -63 -43 -79 -55 -59 -24 -12 -11 25 43 46
604.1 46 47 52 47 70 51 15 -13 -11 -34 -34 -38 -35 -48 -57 -38 -44 -36 -29 -11 -11 -4 18 24 17 39 37 49 30 38 29 25 26 36 42 17 31 14 -10 5 -20 -17 -9 -31
590.5c1Qj4J4k4K9j0J2qL%L2j6JRKkQJ2k1%oj1Rj2MJ3j8J9j4j8K1pTj4kj5K2j3J5K
577.9b8JJ7L3j2K7K0J5K8PKTnj1Ok1k9l6%k9Ll3K9k7nJ5KJ4K8K1ML6J0J5%rJ7j6lk5
565.6F3%l1k3k8j5Oj3j9RrJ3rJ2NJ3J1RJ1PnrK2j3k0J5Nk2K2%Rj5j2J2ONkrnJ0qoJ5
552.3Gj8Jjo%Jj1J4nK0nK1TmJ5rJ6Qj2J4lj1j8k5j0oj6pkNk0K7J5PQL9njPKK1j5Qj2
538.4E5qKm5J9k1ok4Jl1J5K4K8J8l9O7mK6kJ4k7J2j5Jk2jj3l4J2k0Pk4mk%J8J6LPj
526BKK2j6Oj7J5%j1j6kj8K7j0j4J4Jn0J7j1RJ1k1Nj1LjLmK7kk2J5K6JOM0j4lNmKj0
512.7Bk0l%l2Pqk2J5j8pJ9K5J2kORJ3J4kTJ5mpMl9Oj2mk1Jj1qRj1LpJ9K7LJ4kPK6%
498.8A4oJ6%Nk5K9j3pk1j0J6k1J3j5J3oLJ5J3j4L1RKOL9l0J8qPj9J8k5mlk2j2mkj9
$$ plain form
590.5 -31 -23 -37 -23 -47 -18 -28 -16 -24 -21 -21 11 -5 -4 5 7 5 13 25 4 4 -2 -13 -4 -16 -12 1 -17 2 -12 -30 -9 -16 -23 -37 -39 -54 -32 -45 -30 -28
577.9 -28 -27 -10 23 11 38 58 73 101 108 110 112 107 96 102 81 52 16 16 -13 -10 -43 -14 -41 -46 -31 -29 -15 13 34 38 74 84 99 99 90 107 91 88 63
565.6 63 63 32 9 -19 -34 -28 -41 -60 -51 -60 -47 -56 -44 -39 -26 -15 -6 5 12 7 -2 20 7 -13 2 7 -15 7 7 16 1 -11 1 7 12 10 1 -4 6 -2 -8 7
552.3 7 -11 -10 -11 -17 -17 -16 -27 -13 -18 2 -3 18 39 35 50 41 57 65 53 67 64 53 35 10 0 -6 -22 -29 -31 -26 -46 -19 -4 3 11 50 45 44 51 53 74 59 67 55
538.4 55 47 49 4 23 2 -4 -28 -27 -58 -43 -19 9 27 -12 55 51 77 75 89 62 74 59 60 38 37 24 -10 2 -18 -11 -35 -39 -41 -41 -23 -7 -4 3 2
526 2 4 26 10 16 -1 14 14 3 -13 -15 -33 -6 -16 -30 -16 -15 -65 -48 -59 -50 -39 -60 -55 -66 -63 -64 -61 -65 -38 -40 -62 -47 -21 -20 -14 26 12 9 14 10 12 2
512.7 2 -18 -21 -21 -53 -46 -54 -76 -61 -79 -86 -67 -42 -30 -32 -26 -17 -4 10 8 6 21 17 10 14 -25 -19 -31 -35 -56 -55 -66 -74 -65 -76 -73 -80 -61 -34 -31 -17 -19 -12 14 14
498.8 14 8 24 24 29 4 33 20 13 -8 -18 -2 -23 -10 -25 -12 -18 -15 0 13 -1 30 39 41 47 86 56 74 66 73 54 72 47 43 40 18 6 2 0 -19
486.5a9k1K0pK3j0l6N2k1J9krJoK6j5k6Jj1J2k2J2oj9pJ3K3j7pJ2%LRJ1mj7M1j3J3
474.5dk4J7KnJ6LK2k3J0K1j2J0J5qj9J6j3pRNrj5J4J0MK2Rj9K3nK2JPk6Pj1j3pk0j6
461.8Inkj6KpkJ1J4J5PNK5J3nK4j8j0j6oK5l8J1k5pJ3k5%pJ7mRK2L0PL9M6K0N2J0J4
449.2B47M6RJ9j5K6K2plROlpj2k0n0Jm4mol7Lj4K8k2K1J3K4M2KJ3K3pK3k0j5k0mk6
437.1B41k2k0l4lj5qnlJ0OJ1j0J9J5J1RMK8LMrJ4m7%qk7j7Rm8j1nj1j8Mj9%pJ9K7k1
424.5F6K3JLKJ1Ok3Rk0Kok1k9j1LQo5L3%QK0j6L2PKO1k0nJ8rNk5ormKj1J3k0K8%K4
411.2H7K7TNK5j4K1oJ0j9kj2j7l3rj5jTk%mM6K5K7MM5QOJ1JqoTpm1nm5j6j5KJ4l2k1
397.9E4PK2J3pJ8K7l0J7J9JNMJ5k4Lnjj1mk2lj5j8k3j1j6rRj7orJ0J2TmQM3J9rL3K0
$$ plain form
486.5 -19 -40 -20 -27 -4 -14 -50 2 -19 0 -2 -11 -10 -16 10 -5 -31 -30 -41 -29 -51 -39 -45 -64 -71 -58 -35 -52 -59 -47 -47 -44 -35 -24 -28 -45 -4 -17 -4
474.5 -4 -28 -11 -9 -14 2 5 27 4 14 35 23 33 48 40 21 37 24 17 26 31 22 7 21 31 35 57 66 47 70 65 87 88 95 69 76 65 52 45 25 9
461.8 9 4 2 -14 -12 -19 -21 -10 4 19 26 31 56 69 64 88 70 60 44 38 63 25 36 11 4 17 -8 -8 -15 2 -2 7 29 59 66 105 151 171 223 233 247
449.2 247 293 302 321 306 332 354 347 344 353 359 356 349 337 317 267 268 224 220 214 177 180 166 194 172 193 206 230 272 274 287 310 303 326 306 291 271 267 241
437.1 241 219 199 165 162 147 139 134 131 141 147 158 148 167 182 193 202 206 234 237 241 232 246 199 199 191 164 147 156 108 97 92 81 63 67 48 48 41 60 87 66
424.5 66 89 90 93 95 106 112 89 98 78 80 74 53 24 13 16 24 -41 -8 -8 0 20 4 36 43 45 106 86 81 99 90 95 70 64 55 51 53 42 55 35 63 63 87
411.2 87 114 141 146 171 157 178 172 182 163 161 149 132 99 90 75 74 73 71 71 67 113 138 165 169 214 222 228 239 240 232 226 220 213 172 167 122 106 91 93 107 75 54
397.9 54 61 83 96 89 107 134 104 121 140 141 146 150 165 141 144 139 138 127 123 101 98 83 65 42 31 15 6 15 -2 -8 -17 -7 5 17 13 21 64 83 74 107 127
385A27kTPJj9k1l5Ml2J5l6L3j0k2L7k3J3MK2LrJ1K3jQj4J7J2Rk0OJ9lj6LJ5j2k3J8
372.6A07lk7j4Kk2j9k0K5j7J0J7Qj2J9J1Pj9KTQk4j3lk8j5pJ0PqrL1j7PK3QL6Mj4J5
360.3F8j2J1j9k8j3j9k0Rj4j0J4NJ8J4L5OJ6K3K9nK8K0K1l9Rk2j3nJ3k3Lk0Rj7%TP
348.6G9K5j6L2j9J9MK8nMl7M9mL6qJ8POj0j3j7l8pj5k7MkjRl5KK3k8M4K4M0L2J9J2
336.6B34%K7j4n0l2m7pl0J%J0j7OoK8QK2RK5M7K3NK2k4Rj7l5o7j2k8j5k9jkj2K0No
324.6E0K3K8L0J5K8L9OJ9m0K2k0qj1n1nn1j3j9k3qj7OK3J2K3J1K1K9L5L0J9Opj3kl2
313.2A55J0k3j7k0Nj5J5j7qL0K7J4J8L8J7J2J5J7k1jnoRk9K1j6l1Mnj5j3J1kK0oL3
301.8B21qJ9QJ1J5MmK9K4O0J6O4kJ2Jj9k4knK0k7K0q%M9j2N1L8J9M2P6N9J01R8Q8J18
$$ plain form
385 127 125 123 130 131 112 91 56 60 28 43 7 40 30 8 45 22 35 39 61 64 55 66 89 88 96 82 99 111 120 100 106 125 122 106 109 124 112 89 107
372.6 107 104 77 63 65 43 24 4 29 12 22 39 47 35 54 65 72 53 55 57 65 41 28 25 -3 -18 -25 -15 -8 -16 -25 6 -11 -4 19 27 63 67 53 68
360.3 68 56 67 48 20 7 -12 -32 -23 -37 -47 -33 -28 -10 4 39 45 61 84 113 108 136 156 177 138 147 125 112 107 120 97 100 80 89 72 72 72 79
348.6 79 104 88 120 101 120 124 152 147 151 114 163 159 195 187 205 212 218 208 195 178 140 133 118 91 95 93 92 101 66 68 91 63 107 131 171 203 222 234
336.6 234 234 261 247 197 165 118 111 81 82 82 92 75 81 75 103 111 133 142 167 214 237 242 264 240 249 232 197 130 118 90 75 46 45 43 31 51 56 50
324.6 50 73 101 131 146 174 213 219 238 198 220 200 192 181 130 125 74 61 42 19 11 -6 0 23 35 58 69 90 119 154 184 203 209 202 189 187 155
313.2 155 165 142 125 105 110 95 110 93 85 115 142 156 174 212 229 241 256 273 252 251 246 240 249 220 241 225 194 198 193 178 165 176 174 194 188 221
301.8 221 213 232 240 251 266 270 266 295 319 379 395 459 457 469 470 451 427 425 420 440 413 433 425 425 474 462 513 551 570 612 688 747 848 946 1034 1152
290.4A152R4O5N7Q8J14J68K03J70J34J44J09J62J81K24K53M04N99N52N98N16M82O31
283.4G100N36M91N56Q76J986K677J286J610J230N65L78j95k493n842k091m97M03O52
277.7I228P31Q68O20O90Q62O54O49R69K052M827L479J790K777J132N56J16j761j0377
272A9862q637k871j091l33j64J65J52O0J58J71J20J83M44J438K193R08R75Q98K63M2
265.7A4936l31k277n950k638j025m73l33k27j30Tj78j33j16j51j12j13r0p4p1k6m2
259.1C16qjk4K8L2j7kNk8m5k3m4o5k6n3rpl2J9LROL5J0MJ4L7l%nj2k7j8o8m8p2k4j2
247.1a55j1Jj3K4jJ4j2K0pM1kK7pK0J3K5l6qPm1%rJ6jk5jJ4j8J1j0j7pljLj4mJ8j1
234.7a60nj0J7qK3Nn2L3J1l4Oj8K4Lj0J2qj1J9lROj5MRk6J4k2kjL2k3lJ1RJ7qK0pL0
$$ plain form
290.4 1152 1246 1311 1368 1456 1570 1738 1941 2111 2245 2389 2498 2660 2841 3065 3318 3722 4321 4873 5471 5987 6469 7100
283.4 7100 7636 8127 8683 9559 11545 14222 15508 17118 18348 18913 19291 19096 16603 10761 8670 8173 8576 9228
277.7 9228 9959 10827 11447 12137 12999 13653 14302 15271 17323 22150 25629 27419 30196 31328 31884 32000 30239 19862
272 19862 11225 8354 7263 6930 6766 6931 7083 7143 7301 7472 7592 7775 8219 9657 11850 12758 13733 14631 14894 14936
265.7 14936 14605 12328 6378 3740 2715 2242 1909 1682 1552 1422 1244 1111 995 844 732 619 529 455 384 358 316
259.1 316 308 307 283 311 343 326 324 329 301 256 233 189 124 98 45 36 29 -3 16 19 28 34 69 79 83 97 134 131 131 126 114 87 69 1 -47 -119 -143 -155
247.1 -155 -166 -165 -178 -154 -155 -141 -153 -133 -140 -99 -101 -74 -81 -61 -48 -23 -59 -67 -60 -101 -101 -110 -94 -95 -120 -121 -107 -125 -114 -124 -141 -148 -151 -152 -149 -163 -167 -149 -160
234.7 -160 -165 -175 -158 -166 -143 -138 -190 -157 -146 -180 -174 -192 -168 -165 -175 -163 -171 -182 -163 -166 -157 -151 -166 -162 -153 -179 -165 -187 -189 -190 -158 -181 -184 -173 -164 -147 -155 -135 -142 -112
222.1a12J1jJJ6L%J5j3j2K2l8L0NK5j8K1J2K1J0j2Jl3qjJ8j1TJ1%k9J9RJ8Nj2L9J4
210.4A5OK9%Jnj6p3m4k2jj7K2j1nK0mRJ8k2L7J3J4TKopl%j1o8J4j7Pl7RK0k5K0J3k4
197.7a35J2J9l2K8j5L3j6j1J6j8OK4j7K9qTlj1rJ3l2Mj0k0J7k5NJ0mJ6TJ0J4kJ9OTK1
185.7e2MoOLoj4%Nj0k3j%J1J4k2K8kL3lmJ8j5OJ0Pkmj8NJ3qj7kqJ7l4L2rj1k8J8j1
172.4h0k2mrRMkJ5pJ1j5L2j7Mj0j3Lqol0J4j8rK4j2QM9MN0MK4J1L6jNMJ6k5n6J0j0
159.8a7j3kk9NKK2K4pL0K4J4OK5pK2nrj1k4rMj1Tj8Qj7M5k4L5NJmJ6k6j8l0qm5j2k0
147.1h9k0pTkL4MJ9O5%J6N5Pqlj2rk7l5n9K1n5k9j8k6QPJL1L3mJ6OL5K8k2K8l6nl2
134.8i1nl6m4pl7j1j2J2MK9l2L9LL2J5qK0olK3j0j4j1Tl8lqNJ2l4rJ4J9pK0OJ2N3j4
$$ plain form
222.1 -112 -101 -102 -101 -85 -82 -82 -67 -80 -92 -70 -108 -78 -73 -48 -66 -45 -33 -12 -2 -14 -13 -46 -54 -55 -37 -48 -59 -48 -48 -77 -58 -49 -31 -26 -38 1 15
210.4 15 21 50 50 51 46 30 -43 -87 -109 -110 -127 -105 -116 -121 -101 -105 -96 -78 -100 -63 -50 -36 -22 -20 -26 -33 -36 -36 -47 -115 -101 -118 -111 -148 -139 -119 -144 -124 -111 -135
197.7 -135 -123 -104 -136 -108 -123 -90 -106 -117 -101 -119 -113 -89 -106 -77 -85 -93 -96 -107 -116 -103 -135 -131 -141 -161 -144 -169 -164 -154 -158 -142 -126 -116 -102 -104 -85 -79 -73 -52
185.7 -52 -48 -54 -48 -45 -51 -65 -65 -60 -70 -93 -94 -94 -83 -69 -91 -63 -65 -32 -35 -39 -21 -36 -30 -20 -13 -15 -19 -37 -32 -19 -27 -44 -46 -54 -37 -71 -39 -48 -59 -87 -69 -80
172.4 -80 -102 -106 -115 -106 -102 -104 -89 -96 -85 -100 -68 -85 -81 -91 -104 -101 -109 -115 -145 -131 -149 -158 -134 -146 -138 -89 -85 -35 -31 -7 4 40 39 44 48 64 39 -17 -7 -17
159.8 -17 -30 -32 -61 -56 -54 -32 -8 -15 15 39 53 59 84 77 99 94 85 74 50 41 45 34 23 5 13 -4 41 17 52 57 58 54 70 44 26 -4 -12 -57 -69 -89
147.1 -89 -109 -116 -123 -125 -91 -87 -68 -3 -3 13 68 75 67 64 52 43 16 -19 -78 -57 -112 -141 -159 -185 -177 -170 -169 -138 -105 -109 -93 -87 -52 -24 -46 -18 -54 -59 -91
134.8 -91 -96 -132 -176 -183 -220 -231 -243 -231 -227 -198 -230 -191 -188 -156 -141 -149 -129 -135 -138 -115 -125 -139 -150 -161 -199 -202 -210 -205 -193 -227 -236 -222 -203 -210 -190 -184 -172 -119 -133
122.4a33M8NmL4J4LL6%j5TK4j2JloOk4Nj7TRj3J0Pj7PK7K0j8K3RJ7L6jJ0k3L5kqpl1
109.5B0mk6Lm5rj5j6RQj4OK7MQlK4K5j6Qk1K9j5ork2Rj2j5j3K2J5j5K5lJ7olJ5j8K4
96.8hmk2k7Ll2j0oJJ0j2j1K3K1L2KLRj3K0Lok2J7l1pLj8j9j2J2K5kj2L3LMK0K3j2k3
84.2d2L2j9Jj5qj9k6j5J2jj2J3J4J3J8K2%J7qpL2Qrk9pm7J1k6l1Qj0Rj4jM2k5QJ3L3
71.8f5J1lTOKnj5L7k6j3jk6J1j3PnJ7lrK9j2J3J0j3ML4m9J1J0jQK%L1j0RKK1Lpj5J4
58.5bj1j8Opj6Oj5%oK6j5%jL2j3nK2j5j3K0okoqJnj2rL3kqjlOLJ0%J4K4k8qRJ3k1O
44.3b5j1k7K2KJ1oJ8j6K8j1nK1j2J3j5J3J0L0k9Opkj9L1KJ0j9Ln%j3kjQJ5k5J2qJ8
32A5njM1J0j9kJ1l6J7k6k1rKj3Qj5L1m9L9j0K1J7L2J9kj2QRj3k1oJj6PJ0k3j0J0j8
$$ plain form
122.4 -133 -85 -80 -84 -50 -36 -33 3 3 -12 -27 -3 -15 -14 -17 -23 -17 -41 -36 -53 -70 -61 -74 -64 -57 -74 -67 -40 -20 -38 -15 -6 11 47 46 56 33 68 66 58 51 20
109.5 20 16 -10 -7 -52 -61 -76 -92 -83 -75 -89 -83 -56 -52 -44 -47 -23 2 -14 -6 -27 2 -13 -19 -28 -50 -41 -53 -68 -81 -59 -44 -59 -34 -37 -20 -26 -29 -14 -32 -8
96.8 -8 -12 -34 -61 -58 -90 -100 -106 -105 -95 -107 -118 -95 -74 -42 -40 -37 -28 -41 -21 -18 -24 -46 -29 -60 -67 -64 -82 -101 -113 -101 -76 -78 -90 -57 -54 -50 -30 -7 -19 -42
84.2 -42 -10 -29 -28 -43 -51 -70 -96 -111 -99 -100 -112 -99 -85 -72 -54 -32 -32 -15 -23 -30 2 10 1 -28 -35 -82 -71 -97 -128 -120 -130 -121 -135 -136 -94 -119 -111 -98 -65
71.8 -65 -54 -57 -60 -54 -52 -57 -72 -35 -61 -74 -75 -101 -90 -103 -96 -101 -84 -87 -96 -67 -79 -66 -56 -69 -65 -31 -80 -69 -59 -60 -52 -50 -50 -19 -29 -20 -18 3 6 -1 -16 -2
58.5 -2 -13 -31 -25 -32 -48 -42 -57 -57 -63 -37 -52 -52 -53 -21 -34 -39 -17 -32 -45 -25 -31 -33 -39 -47 -46 -51 -63 -72 -39 -41 -49 -50 -53 -47 -44 -34 -34 -20 4 -24 -32 -23 -10 -31 -25
44.3 -25 -36 -63 -41 -39 -28 -34 -16 -32 -4 -15 -20 1 -11 2 -13 0 10 40 11 17 10 8 -11 20 22 32 13 16 11 11 -2 -4 -5 3 18 -7 5 -3 15
32 15 10 9 50 60 41 39 50 14 31 5 -16 -25 -23 -36 -28 -43 -12 -61 -22 -32 -11 6 38 57 55 43 51 60 47 26 20 21 5 12 22 -1 -11 -1 -19
19.6a9lK5NPJ5OPj3K1J0k1j1RMj1K1K0MnK6NjOnk0Lj4k0l4j9Pm5Rk1QJ8NRK1O0L8N3
6.4A60N0L5N0M0O3J00J40N1K8J20K12kj21k6R1O27R32O50J076J94j61j288l012r5l2
-1.5a18k2mL4M6ORJ1n9n3J3QJ4L5j3J0rj2Rrj8k0j0j6k2omK8RL5K2M8MM3L1QL2K0L
-13.6H3j2J1n4k9o2k5j8m8mm0%j7L4K0mL5M3KM0L4%K5k8Jqk8J2m5k4KJ3nlJ2JL6jm
-25.6e5M1jL6%TJ1rkl6k6j3kl7K0Nk1j2K4K7pK5J7J6K1lL3o%j6Njk6Ok2j0m5mk0k8
-37.9a15J6oJ3j0k8K9kJ0K3j0MPj0N2j3PJ4K%J1j8K9pj4rOk4kqj4N%j8J2k8LK3nJ1
-50.3f4J2%jlK6QPnJ1jk7L0lqj5K4k3OJ0k1j6k3MrK1J3ljqK2lj3mJ3JLj9J0k9L0k3
-63.2g1J2j4KNJ1TLNJ0kpK1j3Qkj4%oL0l2K1j7lmJ9MOK0M0j5KL8oOj6Kj2kNj2%Jk6
$$ plain form
19.6 -19 -22 3 8 15 30 36 43 30 51 61 40 29 38 42 31 52 72 76 71 97 102 101 107 102 82 85 71 51 17 -2 5 -40 -31 -52 -44 -26 -21 -12 9 69 107 160
6.4 160 210 245 295 335 398 498 638 689 717 837 1049 1047 926 900 991 1618 2550 3200 4276 4470 4309 3021 9 -86 -118
-1.5 -118 -140 -144 -110 -64 -58 -49 -38 -97 -150 -137 -129 -115 -80 -93 -83 -92 -104 -95 -104 -122 -142 -152 -168 -190 -196 -200 -172 -163 -128 -106 -58 -54 -11 20 28 60 80 83
-13.6 83 71 82 28 -1 -63 -88 -106 -154 -158 -198 -198 -215 -181 -161 -165 -130 -87 -85 -45 -11 -11 14 -14 -13 -21 -49 -37 -82 -106 -104 -91 -96 -99 -87 -86 -50 -51 -55
-25.6 -55 -14 -15 21 21 21 32 23 21 -15 -41 -54 -56 -93 -73 -68 -89 -101 -77 -50 -57 -32 -15 1 22 19 52 46 46 30 35 34 8 14 -8 -18 -63 -67 -87 -115
-37.9 -115 -99 -105 -92 -102 -130 -101 -103 -93 -70 -80 -76 -69 -79 -27 -40 -33 -19 -17 -17 -6 -24 5 -2 -16 -25 -19 -43 -45 -53 -67 -62 -62 -80 -68 -96 -93 -70 -75 -64
-50.3 -64 -52 -52 -53 -56 -30 -22 -15 -20 -9 -10 -37 -7 -10 -18 -33 -9 -32 -26 -16 -37 -53 -76 -72 -81 -60 -47 -50 -51 -59 -37 -40 -53 -57 -44 -43 -40 -59 -49 -78 -48 -71
-63.2 -71 -59 -73 -71 -66 -55 -44 -41 -36 -26 -28 -35 -14 -27 -19 -21 -35 -35 -41 -11 -43 -22 -39 -42 -46 -27 -23 -17 3 43 28 30 68 62 68 52 54 42 40 45 33 33 34 8
-76.8HJ5J2j1%TK8NJ3j8K4j4RL5j3k7K5jl7K0j4J5k6%ql2K7j1rJ5J6j7J3NO%TnrJ2
-89.2E1Qj9knNk5j3j4OTk5j7PjLJ6k7J2K8mQTJ6KrjK4l1j5Pj7j0TJ2
$$ plain form
-76.8 8 23 35 24 24 24 52 57 70 52 76 62 71 106 93 66 91 90 53 73 59 74 48 48 40 8 35 24 15 30 46 29 42 47 53 53 53 48 39 51
-89.2 51 59 40 38 33 38 13 0 -14 -8 -2 -27 -44 -37 -38 -35 -19 -46 -34 -6 -10 -2 6 22 24 15 14 38 7 -8 -1 -18 -28 -38 -26
-99.9b6
##END=$$ End of the data block
##TITLE=Ethyl benzoate C-NMR $$ Begin of the data block
##JCAMP-DX=5.00 $$
##DATA TYPE=NMR SPECTRUM
##DATA CLASS=XYDATA
##DATE=01/02/2002 18:10:55 
##BLOCK_ID=3
##ORIGIN=Department of Chemistry, UWI, JAMAICA
##OWNER=Prof. Robert Lancashire
##.OBSERVE FREQUENCY=50.323
##.ACQUISITION TIME=0.855
##.ZERO FILL=0
##.SHIFT REFERENCE=INTERNAL,  ,11874, 0.0043
##.OBSERVE NUCLEUS=^13C
##.ACQUISITION MODE=SEQUENTIAL
##SPECTROMETER/DATA SYSTEM=??
##SOLVENT NAME=
##$MODELS=
<Models>
<ModelData id="etbenzoateC" type="MOL">
ethyl benzoate
RLACD/Labs0214020804

 21 21  0  0  0  0  0  0  0  0  1 V2000
    5.5964   -5.6617    0.7538 C   0  0  0  0  0  0  0  0  0  0  0  0
    4.5155   -5.0656    0.1244 C   0  0  0  0  0  0  0  0  0  0  0  0
    3.3196   -5.7551   -0.0000 C   0  0  0  0  0  0  0  0  0  0  0  0
    3.2052   -7.0407    0.5051 C   0  0  0  0  0  0  0  0  0  0  0  0
    4.2864   -7.6367    1.1346 C   0  0  0  0  0  0  0  0  0  0  0  0
    5.4821   -6.9471    1.2591 C   0  0  0  0  0  0  0  0  0  0  0  0
    6.8644   -4.9316    0.8853 C   0  0  0  0  0  0  0  0  0  0  0  0
    6.8865   -3.8491    1.4258 O   0  0  0  0  0  0  0  0  0  0  0  0
    8.0135   -5.4740    0.4016 O   0  0  0  0  0  0  0  0  0  0  0  0
    9.2433   -4.7814    0.5545 C   0  0  0  0  0  0  0  0  0  0  0  0
   10.3841   -5.6445    0.0123 C   0  0  0  0  0  0  0  0  0  0  0  0
    4.5986   -4.1381   -0.2400 H   0  0  0  0  0  0  0  0  0  0  0  0
    2.5392   -5.3252   -0.4541 H   0  0  0  0  0  0  0  0  0  0  0  0
    2.3424   -7.5383    0.4153 H   0  0  0  0  0  0  0  0  0  0  0  0
    4.2038   -8.5642    1.4991 H   0  0  0  0  0  0  0  0  0  0  0  0
    6.2623   -7.3769    1.7134 H   0  0  0  0  0  0  0  0  0  0  0  0
    9.3705   -4.5906    1.5278 H   0  0  0  0  0  0  0  0  0  0  0  0
    9.1763   -3.9198    0.0514 H   0  0  0  0  0  0  0  0  0  0  0  0
   10.8990   -6.0340    0.7761 H   0  0  0  0  0  0  0  0  0  0  0  0
   10.9923   -5.0801   -0.5461 H   0  0  0  0  0  0  0  0  0  0  0  0
   10.0064   -6.3832   -0.5461 H   0  0  0  0  0  0  0  0  0  0  0  0
  1  2  1  0  0  0  0
  2  3  2  0  0  0  0
  3  4  1  0  0  0  0
  4  5  2  0  0  0  0
  5  6  1  0  0  0  0
  6  1  2  0  0  0  0
  7  1  1  0  0  0  0
  8  7  2  0  0  0  0
  9  7  1  0  0  0  0
 10  9  1  0  0  0  0
 10 11  1  0  0  0  0
 12  2  1  0  0  0  0
 13  3  1  0  0  0  0
 14  4  1  0  0  0  0
 15  5  1  0  0  0  0
 16  6  1  0  0  0  0
 17 10  1  0  0  0  0
 18 10  1  0  0  0  0
 19 11  1  0  0  0  0
 20 11  1  0  0  0  0
 21 11  1  0  0  0  0
M  END
</ModelData>
</Models>
##$PEAKS=
<Peaks type="13CNMR" xUnits="ppm" yUnits="arbitrary units" >
<PeakData id="1" title="C 11" model="etbenzoateC" atoms="11" xMax="13" xMin="15" />
<PeakData id="2" title="C 10" model="etbenzoateC" atoms="10" xMax="62" xMin="60" />
<PeakData id="3" title="C 4" model="etbenzoateC" atoms="4" xMax="132" xMin="130" />
<PeakData id="4" title="C 2" model="etbenzoateC" atoms="2" xMax="133.5" xMin="131.5" />
<PeakData id="5" title="C 7" model="etbenzoateC" atoms="7" xMax="136" xMin="134" />
<PeakData id="6" title="C 1" model="etbenzoateC" atoms="1" xMax="139" xMin="137" />
<PeakData id="7" title="C 3" model="etbenzoateC" atoms="3" xMax="190" xMin="188" />
<PeakData id="8" title="C 6" model="etbenzoateC" atoms="6" xMax="128" xMin="126" />
<PeakData id="9" title="C 7" model="etbenzoateC" atoms="7" xMax="167" xMin="165" />
</Peaks>
##NPOINTS=11874
##FIRSTX=10064.94726562
##LASTX=0.21533203
##MAXX=10064.94726562
##MINX=0.21533203
##MAXY=1818.5555200000000
##MINY=-23.7548800000000
##XFACTOR=1.0000000000
##YFACTOR=0.056829858398437
##FIRSTY=-2.5005137500000
##DELTAX=-0.84769917
##XUNITS=HZ
##YUNITS=ARBITRARY UNITS
##XYDATA=(X++(Y..Y))
10064.9d4n3J91k66K36k01K11J63m17J94N9k0J14k17Q0p1m2J87N5j60l5J72q4k04K26
10044.6G4L3k2j42M3j47R3J4J3j45K93j70N4j71J86j11R4p4J24k81K44M1n5r2n9J21
10023.4d2q4R9O3q7K8M7j61j0j4J33J73j71q9J31Q4j68J12m0K5j21J8J39k7q2Q6j02
10001.4f0l4J55j57O7J84r6k44J66J05k24J58J5j41O1J83l6j8k0L3j32Kj18J68K0k5
9980.2A2J68o2l2N5j23j18J50Kl2j79nK46q6k0J39k08J92%j29mj7J72n9j0n2r7J40
9957.3D3q4l8J84qm3j47LN4K6J38l04K88q3r7k9J2K17o9j36J48j04m5L2J77k09O6R9
9934.4I1Kk53Q0J05M3k5q5Q6j95J22J41l3k02P4q4J29k4k8q8L8LN0J55p5k35J10m1
9911.5a39P1J47j83J4J63o5j15jj10L75r4j56j7L5J15j7j01q3K21j87R6Q4j41M8J04
$$ plain form
10064.9 -44 -97 94 -172 64 -137 74 237 -180 14 73 53 167 -50 30 -41 -83 104 159 -1 -36 136 52 -152 74
10044.6 74 107 85 -57 -14 -161 -68 -54 -41 -186 107 -63 -9 -180 6 -105 -11 -85 39 -242 2 43 -12 -104 -163 -42
10023.4 -42 -126 -27 36 -51 -23 24 -137 -147 -161 -28 145 -26 -115 16 100 -68 44 4 29 -92 -74 65 38 -44 42 -60
10001.4 -60 -94 61 -96 -29 155 59 -185 -19 86 -138 20 35 -106 -45 138 102 84 64 97 -35 -33 -151 17 37 12
9980.2 12 180 118 86 141 18 -100 50 52 20 -159 -164 82 -4 -24 115 -93 99 99 -30 -34 -51 121 62 52 0 -97 43
9957.3 43 -41 -79 105 97 54 -93 -90 -36 -10 128 -176 112 29 -68 -97 -85 132 63 -73 75 -29 -74 -42 135 -74 -8 91
9934.4 91 93 -160 -80 25 68 43 -42 44 -151 -29 112 79 -123 -49 -133 -4 -28 -56 -144 -106 -103 -53 102 27 -208 -98 -139
9911.5 -139 -68 79 -104 -90 73 8 -107 -108 -218 157 63 -93 -110 -75 40 23 -78 -161 60 -127 -31 53 -88 -40 64
9890.3F4k6Ql02M35k69K06p8o1k8O6j25Q4N1n9j26R1J23j02R7k26J60o9J1J12j49J28
9868.3A6k15K83j51j4m1J24M2kR6j35m7J45k19J96k29J31Q3j4n1m7n1J97j57no5K04
9846.3G4o5j31j6N4R7qM8j49J22O0j30RN3o9m2M5RM5L9j97K41j17J56k38J03M1j00
9823.4f6J16j6j01M1R0K7j79M9O5k02K36o5p2Q6N4k5L3k7j08L7k3p6J38m3K7l9ML4
9799.6ek2P6J3j43r2K55m2k80K03K4N8J3J30l28J6J65r3k2K6P4j42J77k29J68j9L8
9777.6A9J4km4Q0q1L3Np8qR3O4N2j33j18K9J60N6Oj55r7NL9j37J60j13J32j44J11p6
9753a28J90L4l31K2K77j57OJ00J25l8k49J23j11K52k58N6P5j9Q8k16J65j4j82R9R8
9731.8GJ5k4r7J20no8P8kJ22k02J42k14L04l3p8j17K0J03j11j98K49J24l10J31J50
$$ plain form
9890.3 64 38 46 -256 179 -90 116 38 -23 -51 15 -110 -26 25 -34 -160 -69 54 -48 49 -177 -17 -86 -75 37 -112 16
9868.3 16 -199 84 -67 -81 -122 2 44 42 138 3 -44 101 -118 78 -151 -20 63 49 -2 -49 -100 97 -60 -65 -130 74
9846.3 74 9 -122 -138 -84 13 5 53 -96 26 86 -44 -35 18 -51 -93 -48 -39 6 45 -152 89 -28 128 -110 -7 34 -66
9823.4 -66 50 34 -67 -26 64 91 -88 -39 26 -176 60 -5 -77 9 63 38 71 44 -64 -27 -50 -126 12 -31 -4 -43 -39 -5
9799.6 -5 -27 49 62 -81 -173 82 40 -240 -37 -13 45 58 188 -140 -124 41 -52 -74 -48 26 -116 61 -168 0 -19 19
9777.6 19 33 31 -13 67 -14 19 24 -54 -62 31 95 147 14 -104 -75 85 141 147 -8 -105 -100 -61 -198 -38 -151 -19 -163 -52 -128
9753 -128 62 96 -235 -213 64 -93 -87 13 138 100 -149 -26 -137 115 -143 -87 -12 -31 57 -159 6 -8 -190 -91 7
9731.8 7 22 -2 -99 21 16 -52 26 24 146 -56 86 -128 176 143 65 -52 -32 71 -40 -238 11 135 -175 -44 106
9710.6A06l46J69JJ75q7P4j88J48q5M1K1O2p7j9l2k4J18m9J11j57N5m3O9RJ0O9k77
9687.7a46K64r4k34J81L6r6J20r9R1L5k59K16j12Q1L5j04L9P3K8m6J14j55k9l6QR1
9665.7BJ17j97kK12l2j30N7o0O2J62n3l1j98rK57j02j21R4J62l24P0Q7O8j91N9Q1J8
9642.8E8j59K23j50J50j39J35j39l2o1K60j19p9J11P1k20M7Q3K0l44N50k26O0j5j10
9622.5b5M1j03m7J63l6LJ0n0p8K25q2j40K93k00J4L3j92O4J95n1j4Lr0Q5J13j77J89
9599.6A46j73K41j40k3j13p6k0L06k79K5j5J16J7n6J30k4j34Q6J37k06J44j55J16N0
9579.2A00j80K33j71j20k8M4Q3oj79L05k81K68k48L63k15J00L2j47J89l5k24Q1K8J75
9558.9A67q6j45J18M4J43k97J40j31J20Jn4q6K03r7k0OP4k34K04r7M4k29K78k4Lj78
$$ plain form
9710.6 106 -240 -71 -70 105 18 92 -96 52 -33 8 29 91 14 -5 -37 -61 57 8 119 -38 17 -26 43 52 62 131 -146
9687.7 -146 118 24 -210 -29 7 -89 31 -68 23 58 -201 15 -97 -16 19 -85 -46 27 55 9 123 -32 -61 -97 -89 2
9665.7 2 119 -78 -80 132 100 -30 27 -33 29 191 138 107 -91 -100 157 55 -66 28 190 -134 -64 23 91 -100 -41 40 58
9642.8 58 -101 122 -28 122 -17 118 -21 -53 -114 146 27 -52 59 130 -90 -43 40 60 -284 266 40 100 85 -25
9622.5 -25 16 -87 -134 29 -7 -4 6 -44 -122 103 21 -119 174 -26 -12 21 -171 -107 88 37 23 26 -64 21 134 -43 146
9599.6 146 -27 214 74 51 -62 -138 -158 148 -131 -106 -121 -5 12 -44 86 62 -72 14 151 -55 89 -66 50 100
9579.2 100 -80 153 -18 -138 -166 -122 -39 -45 -224 81 -200 68 -180 183 -32 68 100 -47 142 107 -117 -36 -8 167
9558.9 167 81 -64 54 98 241 -56 84 -47 73 74 20 -66 137 40 20 26 100 -134 70 -27 17 -212 66 42 45 -133
9536.9a33K33q9p5n1R8M2K3M6k21K69p0o7n4Nj6m9N3R5m2J8K4Q3l00K06j16J28j03
9514f3L5M5P6j67J39n6j6K3k0N7Ln2q7N3j09J34K0N9oj01N9o8J87j30k3J27k01J64
9490.2H2n4J42l19J65q3j16Q2J04l9R2K1O2q8j21K7L7q3L9j80K52P7j18k03K89j53
9469h6P8MJ82k01K61k38R6q7j33J68J43m2j77J15j81qQ6j29N1p9K81m1k51L23j92L4
9447b3L9P1k75J09J21j3j11J6k0Q3j84K31p6j40J38N3K1OO1k01L5J2m7J13J02j07r0
9424.1g6J45j3k68K34Pl6r6L8k4K9j50J56j8r8J51N8m7R3k54J00j42L12j39Q1m7j31
9402.1a35M0J18o3Q7p8m7n9J06J40l46J61K4Ok3J76j93J34k78J79J08j07r9P0J40k52
9380.9a91J66J4RL1j23K85j99OmK36l31J57l09J85J06j25m0O8J1P7k26K73j94J85n4
$$ plain form
9536.9 -133 100 11 -64 -115 -17 25 48 94 -127 142 72 5 -49 -44 -60 -109 -56 39 -3 15 39 122 -178 28 -88 40 -63
9514 -63 -28 17 93 -74 65 9 -7 16 -4 53 56 4 -83 -30 -139 -5 15 74 68 -33 26 -42 145 15 -8 119 -82 82
9490.2 82 28 170 -149 16 -67 -183 -101 3 -36 56 77 139 51 -70 -43 -6 -89 -50 -230 22 99 -19 -222 67 -86
9469 -86 -8 -4 178 -23 238 0 96 9 -124 44 187 145 -32 83 -98 -106 -20 -149 -98 -177 104 63 -188 135 -57 -23
9447 -23 16 87 -188 -79 42 29 -82 -66 -86 -3 -187 44 -32 -172 -34 19 40 46 107 -94 -59 -47 -94 19 121 14 -76
9424.1 -76 69 56 -212 22 29 -7 -103 -65 -89 -60 -210 -54 -72 -170 -19 39 -8 85 -169 -69 -211 101 -38 43 -4 -135
9402.1 -135 -95 23 -40 47 -31 -78 -137 -31 109 -237 -76 -52 -46 -69 107 -86 48 -230 -51 57 -50 -149 -79 61 -191
9380.9 -191 -25 -11 -2 29 -94 191 -8 -2 -6 230 -101 56 -253 -68 38 -87 -127 -59 -48 29 -197 76 -118 67 13
9359.7A3Q8k10Rq7K28J5o8M3ll08L34k11L33k77k6r1J92lqP8j57J48q5J37J4j39j7
9336.8e8rK33l13j1L18k04P4n1J56j97J01j29K18k12qKJQn2J38R1j09o1J34j00l7L6
9313.9d1J68j20R8j4j55J26m6j01mJ98j73P2j0j54L35k52J33k15J18KJ75j55r1j64
9293.6b70J44j1O4J46O1k47J12Lj54J82j78J48j20J2K04k20K16o3j37K15k17O2J49
9274.1A01k27K08j67O4J58M2k18L1j68O7j52K68M0j71j18M56k01J37k28J2J20l9m0
9254.6b5j7L6q1r5J92m2J59j27j22L5Q8p0N4J04k26N8P4O3j66N5J7J71k69J74Q1l34
9232.5b13L14n1m6p1K5K9J86o7k15J64j36Q3J7J22J13l27n7J24L7k0k9n4J4P7j66K38
9210.5I1p1J03j18j52K57k12o8K00j32K95j83j21J02J97j38j14M8J75k02o5j5n7J73
$$ plain form
9359.7 13 101 -109 -100 -187 41 56 -12 31 28 -280 54 -157 176 -101 -127 -218 -26 -29 -37 41 -116 32 -53 84 98 -41 -58
9336.8 -58 -67 166 -147 -158 160 -44 30 -21 135 -62 39 -90 128 -84 -92 -90 -89 -81 -133 5 96 -13 -74 60 -40 -77 -41
9313.9 -41 127 7 105 91 -64 62 16 -85 -89 109 -64 8 -2 -156 179 -73 60 -155 -37 -35 140 -15 -106 -270
9293.6 -270 -126 -137 -73 73 134 -113 -1 2 -152 30 -148 0 -120 -108 96 -124 92 29 -108 107 -110 -48 101
9274.1 101 -126 82 -85 -21 137 179 -39 -8 -176 -109 -261 7 47 -124 -242 214 13 150 -78 -66 54 15 -25
9254.6 -25 -42 -6 -87 -182 10 -32 127 0 -122 -87 1 -69 -15 89 -137 -79 -5 58 -108 -53 -36 135 -134 40 121 -213
9232.5 -213 101 50 4 -67 -42 -13 173 106 -109 55 -81 2 19 141 254 -73 -130 -6 31 11 -18 -72 -58 19 -147 91
9210.5 91 20 123 5 -147 110 -102 -170 30 -102 193 10 -111 -9 188 50 -64 -16 159 -43 -108 -123 -180 -7
9191gj74K48k28J97l2mO4q0l1J29j15L6q0P1m4j5K3j35J22Kj60K79j00m7mN6K2R5L4
9166.4A22r4j62K9mQ7K38j01l3k14P3p3K20k2m0p3J9N9q3M0J00j29m6M5j16K42J3M9
9143.5A46k24J9J86j47j37l5K72l06L53j45K7r3O4N5j30J59j24Q0M7j09q5L3J09m6
9123.2c1m4k2Qk4L2Q9j46J46p5n6K64j68M6J16ll2J89k31j4j36J30Nj31O8m5l6L7l
9099.5f7P7L7M0k5N4k21N0J39j47j53K34m1m3l5R7r5j2p2Q1N9O2m8J97k5r5j86J66
9076.6B8k00J28M9r9J89N4k41L0J18j15L7r7j4P8o1K18k39K63j3n6p0Rp1pN6L7j57
9053.7a46J69M0j6J6k2o2k4J59j71j34M7K18j9l5M3J36l65J49J11L4K0j61J82k56J1
9032.5g6R1r8K08kj48R0j1k0Q2j08RK6M5l50K11n9K29r6Rrp5rJ22P1k42n4L57p7j71
$$ plain form
9191 -7 -181 67 -161 36 4 0 64 -16 -47 82 -33 3 -77 -6 -50 -65 -42 -177 -55 -53 -213 66 -34 -81 -85 -29 -7 88 122
9166.4 122 28 -134 -105 -109 -22 216 115 82 -132 -59 -132 88 66 26 -47 -28 31 -52 -12 88 -41 -87 -42 -158 84 97 146
9143.5 146 -78 -59 127 -20 -157 -192 80 -226 127 -18 9 -84 -20 35 -95 64 -60 20 67 -42 -127 -94 15 -31
9123.2 -31 -75 -97 -89 -113 -81 8 -138 8 -67 -123 141 -27 19 135 132 100 289 58 44 -92 38 43 -88 -20 -65 -101 -64 -67
9099.5 -67 10 47 87 62 116 -105 -55 84 -63 -216 18 -23 -66 -101 -4 -99 -111 -183 -102 -43 19 -29 168 143 48 -138 28
9076.6 28 -172 -44 5 -94 95 149 -92 -62 56 -59 -22 -119 -133 -55 -116 102 -137 126 113 57 -13 -4 -75 -82 -26 11 -146
9053.7 -146 23 63 47 63 41 -21 -45 114 -57 -191 -144 74 55 20 63 199 -166 -17 94 128 148 -13 169 -87 -76
9032.5 -76 15 -83 125 123 -25 65 54 34 116 8 17 43 88 -262 -51 -110 119 23 32 23 -52 -61 61 132 -110 -164 193 116 -55
9007.9e5R5k07K22l04J84p9J64j35J12j83J56Q6oQ3j62K9N5q3q7K79k92J30j88J48
8987.6c8J47r4Q1n4j40J83k16O2k1P1R8%q8K5J3j37M3j0J02o8j5o3K10L1k47J15K6
8964.7A6j30j78K75q8J14j50OJ99Q0j90L6QQ4j92J76j47k2O8j72J66O4O8j03L4J0L9
8942.7G1j53J63j88J08j59rK17j8p2j94J77J7k0Q6k7M9j26l3N9n6j5K62q6j00j2P7
8920.6A8J37k51J75k53J33p9kN8N2N7k08L75r7j12MM4N5q5j3L4J4J2j8M3q0j0j92J63
8896.9b6J13k11K92l24J89r9K36j16j52rJ06mo1pL3P8k3j90K52j75J86j82J09J9k5
8875.7IO4j07p9O6k9K3J34k02P6Jm5k01L49m3j84L52k84N3O4j17J44j74N4K22k13J70
8853.6A03k0r1k3K43l02l6J53R6j86J63j26R8k51nm0J48N7j7J76j56N0k1j25M2pp9
$$ plain form
9007.9 -55 40 -167 55 -249 -65 -144 20 -115 -3 -186 -30 56 50 133 -29 0 55 -28 -115 164 -128 2 -186 -38
8987.6 -38 109 15 96 42 -98 85 -131 -69 -90 -19 79 79 -9 16 29 -108 -65 -75 27 -41 -56 -119 91 122 -125 -10 16
8964.7 16 -114 -292 -17 -105 9 -141 -135 64 144 -46 -10 -2 82 -110 66 -81 -103 -35 -207 -41 23 91 -12 22 32 71
8942.7 71 -82 81 -107 1 -158 -167 50 32 -40 -234 -57 -40 -60 26 -1 48 -78 -111 -52 -108 -123 139 53 -47 -59 18
8920.6 18 155 -96 79 -174 -41 -120 -122 -64 -12 45 -163 212 115 3 7 51 106 21 8 42 56 68 50 93 13 3 -189 -26
8896.9 -26 87 -124 168 -156 33 -66 170 54 -98 -107 -1 -5 -66 -73 -40 38 15 -175 77 -98 88 -94 15 34 9
8875.7 9 73 -34 -113 -47 -76 -53 81 -121 -45 -44 -89 -290 59 16 -168 184 -100 -47 17 -100 44 -130 -76 146 -67 103
8853.6 103 83 -8 -31 212 -90 -126 27 123 -63 100 -26 72 -179 -184 -224 -76 -19 -36 140 -16 34 13 -112 -70 -77 -156
8831.6a56K21l1m3N3k3n7r2n4K76l22J36J03N7m3j47K41j21l7j48r1K05J57j16J68
8811.3A36j74P7k00J11P1k64J60N7L1j1j10R1J64o0q4m1l7L0Q7m7J4j40J17M7J4jl47
8788.4c09M54j19q0Q3k07J45R0r0O4J0j52O8r8J24rJ19rj14L9n9K5k1J08N4j03n1K01
8765.5A63j35o6N8j12J88j45J10j4r6N8O8j92N0K19k94L2J21L0k01O5L6m2K06k23J18
8744.3Bk55K52J15p0O8k19K76k28Q7Q8j25J9M8l0l7J07j56J56j35j2K2l7Q3o4J33j07
8722.3a9qJ47j21l9j11K17N8p0k13J71j21J46N8J6m4l4j1o8Q6j12l0JO5k04J97j9J85
8699.4A23j31j23L01k13N1mR5r5M4rj07P2n3J2j34N5J49K4N6k77J38pQn6l7J70p3O3
8675.6D2K08l35K5pQJ73p5l47K51L0o5n4q2K45o5L5k9k8J81o6k4j42J95J07k09l0q
$$ plain form
8831.6 -156 65 34 -9 44 21 -36 -128 -182 94 -228 -92 11 68 25 -122 119 -2 -39 -187 -278 -73 84 -32 136
8811.3 136 -38 39 -161 -50 21 -243 -83 -26 5 -6 -116 -25 139 79 -5 -46 -83 -53 34 -13 1 -139 -22 25 39 38 -309
8788.4 -309 145 26 -54 29 -178 -33 57 -33 31 41 -111 -43 -141 -17 -26 93 84 -30 9 -50 -25 -46 62 116 13 -38 163
8765.5 163 28 -38 20 -92 96 -49 61 47 -49 9 77 -115 -65 154 -140 -108 13 43 -158 -93 -57 -99 107 -116 2
8744.3 2 -253 -1 114 44 112 -107 169 -59 28 116 -9 10 58 28 -9 98 -58 98 -37 -49 -27 -64 19 -45 88 -19
8722.3 -19 -27 120 -1 -40 -151 66 124 54 -159 12 -109 37 95 111 67 33 22 -46 40 -72 -102 -101 -36 -240 -43 -62 123
8699.4 123 -8 -131 170 -43 8 4 99 4 48 39 -68 4 -49 -37 -171 -116 33 57 113 -164 -26 -33 -25 -81 -118 52 -21 42
8675.6 42 250 -85 -60 -67 -59 114 39 -308 -57 -27 -92 -146 -228 17 -48 -13 -42 -70 111 45 21 -121 74 181 -28 -58 -66
8652.8f6JJ61l13K27q2K10j16oo6l1o7J71n8J45k15L0L7J08J20j38j13l7K06j27n2
8631.6g1j08K82n4q3L4Q9k61J46l5O2n4J35k19J98j06J1J18j47J01m9n0k5J39k41K42
8610.4E4j27K76j85m7J49j53k0r3M5J00J31j64J1k0J18k45K65j02L2p8J34j45J7J16
8590F9j76K2J4K13j38J03k91K9J29q9K40j27r7K26m2j18j5J33p1k16J98O0l9r2M6R3
8568F4J23l09l2J27J25j25N8j39K38j32j1p2O4jM6J71k87P5J07k16J76L1j12p6J27
8546.8B0P2j06J0J15j33j7L1m9p4J32j32K26p1m6K9j21J29j24Q7J08j58J64K4k48L39
8525.6B07k77K24j81O6j76JK04j54Q5M1L9k09J73k0o1O0j59K38o4Q3j18p8L5m0J90
8504.4A09rj11o7J63k19K11O2k59J54o4QL8M3j72P7q2K34l9j56O1M9p8M1J3m3j03L71
$$ plain form
8652.8 -66 -65 96 -217 10 -72 138 22 16 -50 -81 -148 23 -35 110 -105 -75 -38 70 190 52 -61 -98 108 -19 -71
8631.6 -71 -179 103 49 -34 0 89 -172 -26 -61 1 -53 82 -137 61 -45 -34 84 -63 38 -11 -61 -86 53 -188 54
8610.4 54 -73 203 18 -29 120 -33 -53 -146 -101 -1 130 -34 -23 -43 75 -170 95 -7 25 -53 81 -64 -47 69
8590 69 -107 -85 -71 142 4 107 -184 -155 -26 -115 125 -2 -99 127 85 -33 -48 85 14 -202 -4 56 17 -75 -29 64
8568 64 187 -122 -154 -27 98 -27 31 -108 130 -2 -13 -85 -21 -22 24 195 -92 -17 90 -126 50 81 -31 -107 20
8546.8 20 92 -14 -4 111 -22 -39 -8 -57 -131 1 -131 95 24 -22 7 -114 15 -109 -22 86 -72 92 116 -132 207
8525.6 207 -70 154 -27 39 -137 -136 68 -86 -1 40 79 -130 43 23 -38 22 -137 101 37 120 2 -76 -41 -81 109
8504.4 109 100 -11 -78 85 -134 77 139 -120 34 -30 -22 16 59 -113 -36 -118 116 77 -79 -18 31 -47 -6 7 -36 -139 232
8481.5B32j34j89RJ04j40K10l4Mj08l6o7J68k0N8j86J29j30J26L4j05n4K9L7N5L3l
8459.5B2P5p8M2j35R2k9Jo4N0j8K0R7Jj36J67k33R7J04j57J93j31%p3J34l3n3j3o0
8435.8a18K0R0j24j00L96j80%O8j92K83j39%o1J05p6m2PJ96j19r9q4J29M3J9pm3NJ01
8412G8O0l40J06J77l6L3j15k7P6J96l22L09k14J8n1K58j51j37M0J03j44l9KJ27N2q5
8390b6K1l8OM8P1k43J51r5PK33O91p68l5L00j50MJ06J27L51Q87L48P84q35j064n09
8368.8C72m37PJ21j74J19L8k68J97j12M2K18k44p3N9J43J4l2q5RLp5K67j77j94K98
8347.6C6o0Q0o4Ok9J79k45J71j14O3O8q6K0J25r8j05J15r6l2K32l01N3K3K96k96p1
8325.6a30J17M6K5k13J19J41j68K81l15K07j50p3J52j18J35J08j57j11K35q9j95J14
$$ plain form
8481.5 232 98 -91 -82 22 -118 92 58 62 -46 -82 -149 19 -1 57 -129 0 -130 -4 30 -75 -129 -100 -63 -8 25 22
8459.5 22 97 19 61 -74 18 -11 -10 -74 -24 -42 -22 75 76 -60 107 -126 -29 75 -82 111 -20 -20 -93 41 8 -45 -58 -118
8435.8 -118 -98 -8 -132 -232 164 -16 -16 52 -140 143 4 4 -57 48 -28 -70 -63 133 14 -85 -169 -40 3 22 15 -28 -23 78
8412 78 138 -202 -96 81 45 78 -37 -64 12 208 -114 195 -19 -1 -52 206 55 -82 -42 61 -83 -122 -120 7 59 -26
8390 -26 -5 -43 -37 11 82 -161 -10 -105 -98 135 826 58 23 323 173 177 283 410 761 1648 1996 2780 1945 881 372
8368.8 372 -65 -58 63 -111 8 46 -222 -25 -137 -95 123 -121 -194 -135 8 22 -10 -95 -86 -83 -158 109 -68 -262 36
8347.6 36 -24 56 -8 -2 -31 148 -97 74 -40 23 91 5 25 150 52 -53 62 -34 -66 166 -135 -82 -59 237 -59 -130
8325.6 -130 -13 33 58 -155 -36 105 -63 218 -97 110 -40 -113 39 -79 56 164 7 -104 131 42 -153 -39
8306.9c9J9q7J6N5k3J84m7k05P1K8J15j93J46m5k3J46j5j09j51R8Q4l9k2L3p0N6m6
8284f3j09K63m0p0J4R1l35L44j38n3R9n7L9o9J54k27K44j30pO5qK1j03j5J6k18K45
8261.1d7n1O1j10K34j41k4J71K8j39j17O5J67L2j40l4J0K2J32j65M8j13J53J33k19
8240.8d4J33m7j47J3j10J35P3J47k19J40l5kj30P0q6K40j75N4J03k75J51l6n2J00N7
8219.6E8l2p4J35l5k2r5J50j41j6j37L45j17J62l11J63P9o6j13R3k09K70k84M5O5K1
8198.4f6RP4jj02p1J10J94l40K61N1j67L7J73l10K84k03O3o0K69l25j5J46j4j32J41
8177.2FJ2k9ol6Q7Kj16J16j77R5K0J61kK0k24p9K18Np5TK77j25j38J9R9o5J66k60P6
8152.6b8J06j21J16k02J24l7L3r4OJ30j7M5k26J97j88J07P2j49nP1J36k99J10K8M6
$$ plain form
8306.9 -39 -20 -107 -91 -36 -59 125 78 -127 -56 -28 87 -106 40 -5 -28 118 103 -6 -157 -59 25 -14 -36 -3 -73 -17 -63
8284 -63 -172 91 51 -19 -5 86 -249 95 -43 -96 3 -54 -15 -84 70 -157 87 -43 -50 15 7 28 -75 -90 -74 -292 -47
8261.1 -47 -98 -37 -147 87 -54 -78 93 121 -18 -135 -70 97 129 -11 -45 -35 -13 119 -46 2 -111 42 175 -44
8240.8 -44 89 42 -105 -92 -202 -67 6 153 -66 74 39 37 -93 -23 -109 131 -44 10 113 -162 -11 -47 -99 1 58
8219.6 58 26 -48 87 52 30 -65 85 -56 -72 -209 136 19 181 -130 33 112 46 -67 26 -183 87 -197 -152 -87 -66
8198.4 -66 -57 17 16 -86 -157 -47 147 -193 68 119 -48 -11 162 -148 136 -67 -4 -64 205 -120 -135 11 -3 -135 6
8177.2 6 18 -11 -17 -53 34 36 -80 36 -141 -46 -26 135 133 153 -71 -150 68 73 -2 -77 200 75 -63 -44 55 -10 156 -104 -28
8152.6 -28 78 -43 73 -129 -5 -42 -9 -103 -97 33 16 61 -165 32 -156 -49 23 -126 -131 -60 76 -223 -113 -85 -39
8131.4c9N0q9M9l0L2Q1k4m3M1J3L0P3k55J13j39J76l0l3O0k98K46lJ2l0J28J32j66
8108.6E7j16LJ25j80J68o2P1m0j3j25J92P6j91J59j77P5r3r6J83j91n5L01j85J22p0
8087.4f2N1j3j17K00M2l6K1j62Lo4J66L3n5p4Q0j99K09K6p0n8J0K5j46J79qP2O6j04
8063.6A5n2j6j79J29J30Q4j35K3P4j22j64J84M8j56L6J29l5r0LM0j9j15J51l0O3Nj43
8040.7a42L05j14m1O8k62J94j58J75j96Q7J25n9J29k54K14J36k60j06k4J48Q5J3j94
8021.2a31R5J32l41M63j93jk09J74Q0l4K6l8j6Jj1J07j96J38K3j17J36n6k7K6p2P8
7999.2C7L6j38L6N5M0j31k17L02nJ0l4m5k2J49k9M8o1K8j25K4RP6l8R9j09N1j01Q9
7975.5C4P9j80p9K25k08J91j28K6K2Oj00J84j80OP0n4k2R6n8j7J00j09J10q1p3o1J59
$$ plain form
8131.4 -39 11 -78 -29 -59 -27 54 30 -13 28 41 71 144 -111 2 -137 39 9 -24 36 -262 -16 -19 -7 -37 91 223 57
8108.6 57 -59 -56 69 -111 57 -5 66 26 13 -112 80 156 -35 124 -53 22 -71 -167 16 -175 -230 71 -114 8 -62
8087.4 -62 -11 -24 -141 59 101 65 86 -76 -73 -137 29 62 7 -67 13 -186 23 49 -21 -79 -69 -44 -190 -11 -19 53 119 15
8063.6 15 -37 -53 -232 -103 27 111 -24 -1 73 -49 -213 -29 19 -137 -101 28 -7 -97 -94 -54 -73 -188 -37 -67 -4 1 -142
8040.7 -142 163 49 8 76 -186 8 -150 25 -171 -84 41 -18 111 -143 71 207 -53 -159 -183 -35 50 63 -131
8021.2 -131 -36 96 -245 218 25 24 -185 -11 69 35 61 23 7 8 -3 104 -92 46 69 -48 88 32 5 31 -41 37
7999.2 37 73 -65 -29 26 66 -65 -282 20 15 25 -9 -54 -76 73 44 92 31 59 -66 -42 -33 43 5 104 -5 46 -55 34
7975.5 34 113 -67 -146 79 -129 62 -66 -40 -18 -12 -112 72 -108 -102 -32 -86 -108 -12 -70 -87 13 -96 14 -67 -140 -201 -42
7952.6d2J43j60No2J05j7m0J92k00J9j58K06qk1L8P7m6k12J57j1ON8J05k25R6j69J75
7929.7A1j41J40j20J53r9J57j40J02k2rM9kK8j11M7N2k04J45j4j3J13j50l8R1j23J40
7907.7D2J61j28o8j16R1j18J54j23J01j02K77j08Jj50R3rJ32j84L0M8J8L2k27L32p4
7886.5A05k27K2J65j63O6r0N2o3J9J74j5j17m4R6O7j1j32L44j42L5j02q0l6Q9m5M5
7864.4A2K6k30J78j2q2K50K2r8l5k19K75k8q5l7K9k02L93r4J9k1Q5k05Q0P2k11P2K7
7841.5a9N8j35P4J35q1k74K41j06J18L6%p3J02K5j86J72j30J10j27r0J91KJ48l27P5
7820.4f1k40J49J42Tj07n3j0k3K11j40O5j00J7mj7mQ3j20O1n0R2o7Ql1J69j74j35K27
7796.6C0K9R5j80o5P2J20k8j32k3P0k5j6j38L11k31K18j07K3j9J68j56q3n1K99l29
$$ plain form
7952.6 -42 101 -59 -54 -116 -11 -28 -68 124 -76 -57 -215 -9 -17 -38 0 77 31 -181 -24 -35 -29 29 134 -91 5 -164 11
7929.7 11 -130 10 -110 43 -56 101 -39 63 41 32 81 79 107 -4 43 95 -109 36 22 9 122 -28 -66 25 -98 42
7907.7 42 203 75 7 -109 -18 -136 18 -105 -4 -106 171 63 64 -86 7 -2 130 -54 -24 24 42 74 -153 179 105
7886.5 105 -122 -100 65 -98 -32 -122 -70 -133 -114 60 45 -72 -116 -20 47 36 -96 248 106 141 39 -41 -77 12 -33 12
7864.4 12 38 -192 -14 -26 -108 142 164 66 31 -188 87 59 -26 -63 -34 -236 157 63 82 61 146 -59 21 93 -118 -46 -19
7841.5 -19 39 -96 -22 113 32 -242 -1 -107 11 47 47 -26 76 101 -85 87 -43 67 -60 -150 41 43 191 -136 -61
7820.4 -61 -301 -152 -10 132 25 -28 -38 -61 150 10 75 -25 -8 -12 -29 -33 50 -70 -9 -59 33 -34 -26 -57 112 -62 -197 30
7796.6 30 59 154 -26 -91 -19 101 73 -59 -82 -12 -37 -53 -191 120 -111 107 0 23 4 172 16 -67 -118 181 -148
7775.4a48J81j02m0k3J22J0M9j54K32j18j2%j26J34L0l2j00J19j9j78J89n3j11Q0J82
7754.2A12j34m3o2K15j51P9j44K53j07j3nL5L4j08J46m9j25K12k17P1k0K6L5j02O5
7733CL5j10j3J61L4r2Lj51K46k49R0l8l0J12j18M14k17o3j08R6P1k76M22k73q7J14
7711b4J00m9p7J09j04j00K47k25K04j71p7J7J65j89P7J32l7qJ41j43jJ8O8r3P4%o4
7688.1a0l5l3J66o3P8Q8j86j10L8J40k35J84J70k52J56k05J41q2J24J7q6m7Q5j83J63
7666.9B3m3J11j73J88l71J19J12P8J11j36Mj63J17K46j55j92K22j36j44L32j21l2l3
7647.4c6o9J1J6K02j61K4r8QJ17N3j03R3j26J90k01M1L7o7K38j62r2J58m4J19p9j53
7625.4h4j61M74k81K2M6o7m2J17j26Q9J2L8M6k75K48j35Q1j35K22j23K4L2L9l22L20
$$ plain form
7775.4 -148 33 -69 -109 -132 -10 0 49 -105 127 9 -3 -3 -129 5 35 3 -97 22 3 -175 14 -39 -150 -70 112
7754.2 112 -22 -65 -127 88 -63 16 -128 125 18 5 0 35 69 -39 107 58 -67 145 -72 -1 -21 5 40 -62 3
7733 3 38 -72 -85 76 110 18 21 -130 116 -133 -43 -81 -111 1 -117 297 80 17 -91 5 76 -200 222 -51 -138 -24
7711 -24 76 27 -50 59 -45 -145 102 -123 81 -90 -167 -150 15 -174 -97 35 -2 -10 131 -12 -13 5 73 -20 54 54 -10
7688.1 -10 -45 -78 88 25 103 191 5 -105 -67 73 -162 22 192 -60 96 -109 32 -50 74 91 5 -42 43 -140 23
7666.9 23 -20 91 -82 106 -265 -146 -34 44 155 19 23 -140 -23 223 68 -124 98 -38 -182 150 29 -3 -36
7647.4 -36 -105 -94 -78 124 -37 -13 -111 -103 14 67 -36 57 -69 121 -80 -39 -2 -69 169 7 -85 73 29 148 69 -84
7625.4 -84 -245 229 -52 -30 16 -51 -93 24 -102 -13 -1 37 83 -192 56 -79 2 -133 89 -34 -10 22 61 -261 59
7604.2E9j54J9J28k85mJ88R1n7m2K48q6j67J48M6k74OK39q1q0J81j5l65K74j54K77
7583A40j78J93j19l4P3j39P2r8L8LK07j17m7J47j69j14Q0P9n9R3j53l5o5K18M1K7j94
7560.1a10M7K8L4o2K00o9l02Q7MJ47j37J87j58R7J8j42L6J31K7q4K3n4J32j50j35J98
7538.1gj18J27j08m7K01j4k04K90r9k8jj13J1J29jp6J37j02R6L8k19K15o9j01L7n7
7516h3m8J17pL3P5l0o0n5J46m3o5l6O7j45J07Mm9J94l0j33LJ36N6j85j12J04K5Tn1
7491.5d0N1P1q3j43J59o0N8P5p2O0k4j05j4J06j32J02j10J15p1K27j41J3J35r6j95
7470.3a14J54n9O5o9J28j1j99J80j23l6J36n2Q3j18J03q2L2j8km7O3J3j12J9n0L9j4
7447.4i1J40l5j19j21R3K46J1j38p%jJ8j29Q8O7r7J91j72J16J5k2p9J61O3j97M4k2
$$ plain form
7604.2 59 -95 -76 52 -233 -237 -49 42 -15 -57 191 105 -62 86 132 -142 -136 103 22 -58 123 108 -257 17 -137 140
7583 140 -38 155 36 2 75 -64 8 -90 -52 -49 158 41 -6 141 -28 -142 -62 17 -42 51 -102 -137 -202 16 57 84 -110
7560.1 -110 -63 -35 -1 -63 137 68 -234 -147 -143 4 -133 54 -104 -7 11 -131 -95 36 63 -21 2 -52 80 -70 -205 -7
7538.1 -7 -125 2 -106 -153 48 34 -170 120 21 -7 -8 -121 -110 19 18 -58 79 -23 73 111 -108 107 38 -63 -26 -83
7516 -83 -131 -14 -21 12 87 57 -3 -58 88 45 -20 -56 11 -134 -27 -23 -72 122 92 -41 -38 98 154 -31 -143 -39 -14 11 -40
7491.5 -40 11 82 -1 -144 15 -45 13 88 16 76 52 -53 -67 39 -93 9 -101 14 -57 170 29 42 177 81 -114
7470.3 -114 40 -19 46 -23 105 94 -105 75 -48 -84 52 0 83 -35 68 -14 18 0 -2 -49 14 27 -85 -66 -116 -77 -91
7447.4 -91 49 14 -105 -226 -133 113 124 -14 -21 -21 -22 -4 -133 -45 22 -75 116 -56 60 75 53 -26 135 198 1 45 23
7424.5B3J4j57n1J97j39J07M6j77Q9O6l6n0o2J39k2K6J1n5o2J11r9J41J2J48l07J39
7402.5E2k1j93J06J4p2J42Q5Mj1j25j9J56j68m4K17q2m4JK3j2j02KPk3K22l8j8k27
7378.7a68K12j07Q1k12K08P4p1M4j34J77K4l9j30k5J96p6j84K30Kj81N0M3N8j59K5
7357.5f2J33J5q3l1P4o4MJ1j09R5p7J50j20N0r7K30k88J51N0j72L22j57j13K22k28
7336.3i4J51j78Q9r3R9p4J91l00K71k5q6K6P0j83J32L8M4j31N4r9j0o4kK45j6j7j11
7313.5g3J81j08j65J71N2Rj11J87k05J1J00L9k7j9r5J36k01J23o2j5j00J73m2j65J56
7292.3e0J18k8L6q8n6j36K96j19N9N1k09J5J75k09J82m9J8m4j69J42Q1j97K14P2O3
7271.1A68j52oQ7k15J63o6L3k28M08k53qmN9K7Q7j43p3J88oL%j19Q6j6L1j32K25r2
$$ plain form
7424.5 23 37 -120 -171 26 -113 -6 40 -137 -48 18 -18 -68 -130 9 -13 13 24 -31 -93 18 -81 60 72 220 -87 52
7402.5 52 31 -162 -56 -42 -114 28 113 117 106 -19 -38 118 -50 -94 123 41 -3 -2 21 9 -93 -91 -84 -107 115 77 59 -168
7378.7 -168 44 -63 18 -194 14 88 17 61 -73 104 128 89 -41 -66 130 54 -130 100 102 -79 -29 14 72 -87 -62
7357.5 -62 71 86 3 -28 46 -18 -14 -3 -112 -17 -94 56 -64 -14 -111 119 -169 -18 32 -140 182 25 -88 134 -94
7336.3 -94 57 -121 -32 -125 -26 -100 91 -209 62 37 -49 -23 47 -136 -4 34 78 -53 1 -98 -108 -172 -174 71 55 38 -73
7313.5 -73 108 0 -165 6 58 67 -44 143 -62 -51 49 88 61 42 -53 83 -118 5 -57 -72 -172 1 -41 -206 -50
7292.3 -50 68 40 76 -12 -68 -204 92 -27 32 83 -126 -111 64 -145 37 -12 6 -38 -207 -65 16 -181 33 105 168
7271.1 168 16 10 97 -118 45 -21 12 -216 192 -61 -69 -73 -14 13 100 -43 -116 72 66 69 69 -50 36 20 51 -81 144 52
7247.3E2J44l76J84o2O5l0J34j34J24M7j12j36O5J01L4j30LK3l0O8r9J8J52k79J92
7226.1A8q6jJ22j31K7K9k4m5O7q8K07j89N2L9m4l2J25j20J10jJ45k77J35O1J7r2n0
7203.3b6R7j30j1pJ40ojn1k09J76J61k02R8l3j16R2L5J05j52l7l5J70P2j56K3k5j15
7180.4a43N1L9Pk6J9J41j18k4M0r3K48l72K44K8m1q9j89N5K54J41k03N8j6r8%N9OK27
7156.6B05j03k5j02q8O6o7O7K7K34k40J00Rl7m4j22J77p7M9j4L8k1l6o4J3J18k2r5
7133.8e4J04j88K15j44p7J38R3k71L53k25J31k19J60j15J65q3l1j27J89Nj4K1o1o9
7113.4a04qn7O7R8O4n7j0j4J39j59q6L28k40QJ54k3j84O8k26K27j00J96J10k61j06
7092.2a76J69j01J64qj23J56m2J3l5%L1j23J24n2o9Lr8J30pn9K10j09n4J43r9O0k08
$$ plain form
7247.3 52 196 -180 4 -58 7 -23 111 -23 101 148 36 -100 -35 66 100 -30 -27 -4 -34 34 -65 -47 105 -174 18
7226.1 18 -68 -69 53 -78 -51 -22 -46 -91 -24 -112 95 -94 -42 -3 -47 -79 46 -74 36 35 180 -97 38 99 116 24 -26
7203.3 -26 71 -59 -70 -77 63 57 56 5 -204 -28 133 -69 29 -4 -120 -28 7 112 -40 -77 -112 58 130 -26 -3 -28 -143
7180.4 -143 -92 -53 -46 -72 -53 88 -30 -54 -14 -107 141 -231 13 41 0 -89 -278 -223 31 172 -31 27 11 -87 -87 -28 -22 205
7156.6 205 102 77 -25 -113 -47 -114 -47 -20 214 -26 74 83 46 2 -120 57 -20 29 15 53 32 -4 -68 -55 63 41 -54
7133.8 -54 50 -138 77 -67 -144 -6 87 -184 169 -56 75 -144 16 -99 66 -17 -48 -175 14 19 5 26 -35 -104
7113.4 -104 -112 -169 -102 -4 60 3 -7 -21 118 -41 -127 201 -39 -31 123 100 -84 -16 -242 -15 -115 81 191 -70 -176
7092.2 -176 -7 -108 56 48 -75 81 39 52 17 17 48 -75 49 -3 -72 -69 -167 -37 -44 -103 107 -2 -56 87 -12 48 -160
7069.3a60K12J0m3j79Q8RO0L6KOm1J39j61O6j96K1J33m8J04k29O1J15J12k46M8pJ66
7046.4G8j69K08k32M9J11Po6N4j3n7O1P9q3p1P3J46k82J5K32p0o4l3j13J36L7J8O5
7023.6A16j98P2J55o6J50j50j98p9N2%J12m0P5kr3Q6r3M7K11j41j9Qj72N4J17J33j44
7000.7gM1k19j11K85p0L3Q5q0r1N7O7r4N0J28o5J8p6QK13j62R7k31K28j82KK58j88
6977.8fRL5n0r0Q3Q1M8J1k53J27o3J85n7n2q3N8M8r3Jj6J91j57J26j97J48r6k8J03
6954A3j99L27m6k02R2L0K3j07M4J64j7j21R7o0p2n8M1J62j08K15j45j08J21j53J42
6932.9G5j12j77J87K20k21J57m2j62m9M8no6L1N5O9O7j5j00Qk1P5kP6kj03j8Jl7l6
6908.3i9K05O0j17n3pO7K0L4M0j39n4m6j6R9J20k29K08K5o8j18M8J29RJ1j76K4L9J6
$$ plain form
7069.3 -160 52 62 19 -160 -72 -63 -3 33 35 41 0 139 -22 44 -152 -131 2 -46 58 -171 -110 5 117 -129 -81 -88 78
7046.4 78 -91 117 -115 -66 45 52 -14 40 27 -30 31 110 27 -44 29 175 -107 -92 140 70 6 -27 -140 -4 33 51 116
7023.6 116 -82 -10 145 79 229 79 -119 -198 -146 -146 -34 -74 1 -1 -94 -8 -101 -54 157 16 -3 5 -167 -113 4 137 -7
7000.7 -7 34 -185 -296 -11 -81 -48 37 -43 -134 -77 -10 -104 -54 74 9 27 -49 -41 172 10 107 -124 104 -78 -76 182 -6
6977.8 -6 3 38 -12 -102 -19 62 110 121 -132 -5 -68 117 60 8 -75 -17 31 -62 -61 -77 114 -43 83 -114 34 -62 -90 13
6954 13 -186 141 95 -107 -15 15 38 -69 -25 139 122 1 98 38 -34 -92 -51 111 3 218 73 -35 86 -67 75
6932.9 75 -37 -214 -27 193 -28 129 87 -75 -124 -76 -81 -147 -116 -61 8 75 60 -40 -32 -53 22 20 96 94 -9 -27 -26 -63 -99
6908.3 -99 106 166 49 -4 -11 56 76 110 150 11 -43 -89 -105 -6 114 -115 93 118 50 -68 -20 109 118 129 -47 -23 16 32
6884.5C2k04K26n1j23k0J81j14J79kr3j21J56o0j5m8J80j36k4R6j60J40j6r9K26j65
6863.3c5p9O1l3J5L0O6j57L6N1J49m8M4p8o6J27j25P7j63L4J60n9kk9p0L3J90J1r5
6839.6D5n1k0J97j40l5l9q9K07p4j27Q1J30j84J10J92j14J6j96oJ98j38R0j46R3r3
6818.4i3J22j92J80k8k5P2p8n4rN8J09q0K5j67J03K8q5J79j93J59K8r5m3J29N4J09
6796.4B13j54J66l06J20k2Q8p1N1n1j24l9J76o7q1K45l10K96n1m3L1J1j44N0M0M5j15
6774.3d6k22L00r8M4J15r7K2j46J12J23L0l37J03J37l8j11K15rk4R3l42N5KL9J40j77
6752.3a17Q5n7J43M9j44M2m4J22j08pM1j38J3K4J09K22j99j50J93l6P0j59Jj43K02
6731.1A4qr0R0R1j02l07L03J4J6n0P8j51J63n6j84O2J80k23Q9j15J78l5J32m0K4l1
$$ plain form
6884.5 32 -172 54 3 -120 -140 41 -73 106 104 11 -110 46 -14 -29 -77 103 -33 -57 39 -121 19 3 -96 130 -35
6863.3 -35 -114 -53 -86 -71 -41 25 -132 -96 -45 104 56 100 22 -44 83 -42 35 -128 -94 66 7 5 -24 -94 -61 129 140 45
6839.6 45 -6 -26 171 31 -4 -43 -132 75 1 -126 -45 85 -99 11 203 89 105 -91 -97 101 -37 53 -93 0 -93
6818.4 -93 29 -163 17 -11 -36 36 -42 -96 -105 -47 62 -18 7 -160 -57 -29 -114 65 -128 31 59 -36 -79 50 104 213
6796.4 213 59 225 -81 39 17 105 34 85 34 -90 -129 47 -20 -101 144 -166 130 79 36 67 78 -66 -16 24 69 -46
6774.3 -46 -268 32 -66 -22 93 -4 18 -128 -16 107 137 -200 -97 40 2 -109 106 97 73 166 -176 -121 -119 -80 60 -117
6752.3 -117 -32 -89 54 103 -41 1 -43 79 -29 -36 5 -133 -120 -96 13 235 36 -114 79 43 113 -46 -45 -188 14
6731.1 14 6 -84 6 97 -5 -312 -9 5 21 -29 49 -102 61 5 -179 -117 63 -160 -71 -186 -8 -43 89 49 73 42
6709.1D2J1j6l0rm3J24j73J65l4r2j5j4J34Mp8J11k38J33J60J87m06jN1oM4j51K39
6686.2I9j54J45j96J0J32k1L0r5J54R5m7O8O02K625M352P133j1051l547k60M6q3j60
6667.5a23N4J56J26l18J22j30K38k14K5J38j27o1J70K9j87J08lJ49k79k9J05l0J02
6648B1J61O3j58M8j68Jj2R0k2%j40J19k8K8j19J9K3J16J09j64N5j31J60j62QO5l5j18
6624.3a71P0N7N5j51K1J24N9p0R9r5n0O4k2M4j75K61j30O2M1k07Q3n3qJ61p0p4J31
6601.4E6J0j22J8L8M3j18J99l3p4P2j58Q9j60J48j08l1M9K8N8KQ3q7r2J33l5j19J7
6578.5i4J2J8j3J3Q8k7M7j83j7J35nN0N5k05M5J56j43o0m3J19j2j1k77K61M037k254
6556.5A692j358n1q0j39j02J14l8j89J53M6J13j18LJ21j64K1N1P8q2Q8L6j94k0M0K1
$$ plain form
6709.1 42 53 37 7 -2 -45 79 -94 71 37 -55 -70 -84 50 54 -24 87 -151 -18 142 329 -77 -78 -27 -33 11 -140 99
6686.2 99 -55 90 -106 -96 36 15 45 -50 104 199 152 220 822 3447 7799 14932 3881 334 74 120 37 -123
6667.5 -123 -69 87 213 -105 17 -113 125 -89 -64 74 -53 -114 56 85 -102 6 3 152 -127 -156 -51 -81 21
6648 21 182 245 87 135 -33 -32 -44 46 24 24 -116 3 -25 3 -116 -97 -74 42 151 -13 42 -89 71 -91 -83 -18 -53 -171
6624.3 -171 -101 -44 11 -140 -119 5 64 -6 93 -2 -52 12 -10 34 -141 120 -10 52 93 -114 -31 -84 -92 69 -1 -75 56
6601.4 56 66 -56 -38 0 43 -75 124 91 17 89 -69 20 -140 8 -100 -131 -82 -54 4 6 89 2 -90 43 8 -111 -94
6578.5 -94 -82 -64 -77 -64 24 -3 44 -139 -156 -21 -26 24 79 -126 -81 75 -68 -128 -171 -52 -64 -75 -352 -91 3946 1692
6556.5 1692 334 283 203 64 -38 76 38 -151 2 48 161 43 46 167 3 24 75 153 71 159 195 1 -19 21 42
6535.3D2N0oj84J91k05K65k6j41Q2J6j76K83o7K51m6k29j39K8J34L4Lr4MpJ25J63j38
6512.4B13Q6K79K253P045K2124k6510n054m10j03L31k32l16J97K68k73r3J05J79K4
6496.3A13J1j37J21k53L2J92J62m5j29j88J03L8j2j00J53K8j85J17p4P6n2j30j5J12
6476f2K2j4J34k05J11PJ63k57R8J39j40k2n0K83M7j13k10mJ36o1j37O2j36M4K29J1
6453.9G5j89K0J86r4K13R10N022J3785J932j9616j318k82k56K0k35N6j56jj9J60o1
6436.1A52j18Ok2L6N8k54R9J25O6J06m8j55o1M8n6J41j4k68J80j6j1J2q1L0J04j1j04
6413.2e6K23j76L6j3J18pp3J8K8J7k05R6O9r0O4q9N3J32j34PL8j44j3K11p9J07n2j1
6389.5G5j01L4J1p1j05K41j32j10R6K18k42j5L2O3R8j02Np0K03n5k05J68j08J56j76
$$ plain form
6535.3 42 92 86 -98 93 -112 153 127 -14 68 84 -92 191 124 375 329 100 -39 -11 123 157 160 66 70 63 188 351 213
6512.4 213 299 578 2831 9876 32000 5490 436 26 -77 254 22 -294 -97 171 -102 -195 -90 89 113
6496.3 113 124 -13 108 -145 -113 79 241 196 67 -121 -18 20 8 -92 61 89 -96 21 -53 23 -29 -159 -174 -62
6476 -62 -40 -54 80 -125 -14 -7 156 -101 -3 136 -4 -26 -76 207 254 141 -69 -73 63 2 -135 -73 -209 -165 64 75
6453.9 75 -114 -94 92 -2 211 1121 6143 19928 21860 2244 926 644 388 408 173 229 73 72 53 213 152
6436.1 152 34 40 18 54 112 -142 -43 82 148 254 206 51 -10 38 -18 123 109 -159 21 5 -6 6 -75 -45 59 48 -56
6413.2 -56 167 -9 27 14 132 125 52 70 98 115 -90 6 75 -15 49 -40 13 145 11 18 56 -88 -101 110 31 138 86 75
6389.5 75 -26 8 19 -52 -157 84 -48 -158 -62 156 -86 -101 -69 -6 92 -10 -5 -75 128 73 -132 36 -72 84 -92
6368.3i2K8J14l01L12l8p7M1n0P2m8J48q7m0M2q6J11m3p4J59p6j19j7K37k71R6Q1k0
6345.4BK4j7oJ04j55q7K09k24L25l26J77j43J9J03m1K9nn2J45Q0k6j64RLM8j24O3j22
6321.7a52J50q6j18K10Rn7L4j10R7m7P9n4j3N6M9m8J18j69Q2lN5j17n5k0J77q7L9J0
6298B9Rlj86J59j00J45j56N9JR2o1r8R0K1l7k0J48m1j06no2J14OL3J00j47N2j07J5
6273.4e6m2J45k14J84l5j18J73Lp7k3r0K87j42m5L3Q2j31N8o6L5M8J21j19j75K26Q
6251.3G0k82J86J24N5q5q1O5m8m3m5j05K28o1k0n5J33J2k31J33K6N3k25J62O1K1r9
6229.3e1J38p3M7j05l9J14M8j87J45m0j69Q7l2OJ16m5R9o6k2J28k30Q5L6M5m3jp4k9
6205.6a12L10j54j19J46j21R5r5Q3J5pj29J29K0L3k08J76p8K06l07K64l07K18j70L13
$$ plain form
6368.3 -92 -64 50 -251 61 23 -54 -13 -63 9 -39 109 22 -18 24 -62 49 6 -68 91 15 -104 -121 116 -155 -59 22 2
6345.4 2 26 9 3 107 -48 -135 74 -150 175 -151 26 -117 -98 5 -36 -7 -12 -64 81 161 135 -29 -20 -17 31 -93 -30 -152
6321.7 -152 -2 -88 -206 4 13 -44 -10 -120 -23 -70 9 -45 -58 -2 47 -1 117 -52 30 27 82 -35 -90 -110 67 -20 19 29
6298 29 38 35 -151 8 -92 53 -103 -44 -43 49 -12 -110 -20 1 -36 -56 92 51 -55 -60 -122 -8 -2 31 131 -16 36 -71 -56
6273.4 -56 -98 47 -167 17 -18 -136 37 40 -37 -60 -150 137 -5 -50 -17 65 -66 -8 -74 -39 9 130 11 -164 62 70
6251.3 70 -212 -26 98 153 68 -13 52 4 -39 -84 -189 39 -22 -42 -97 36 48 -183 -50 -24 29 -196 -34 27 48 -51
6229.3 -51 87 14 61 -44 -83 31 79 -108 37 -3 -172 -85 -117 -111 5 -40 59 -7 -29 99 -131 -46 -10 35 -8 -9 -83 -112
6205.6 -112 198 44 -75 71 -50 45 -50 33 48 41 -88 41 61 94 -114 62 -16 190 -117 147 -160 58 -112 201
6185.2B01j12j87K05k27K22j65J20q5k2K2m4J68j51J14o4L4P8j71O7L2k9j05P5p1j7
6164a12J23K4m9j09K3J27j8j2P5l9To1J32o9n5L8j31K88j00m7O1l1r2M4Ln9K3l0P5
6139.5a7L9P2p0J5p1o7L0p4K35j43M0o6J36k39J58pL1O4j01m2O2j69K15K8q4J9k3R2
6115.7F3p6N2K9k2j33J61k2j31m5Q1O9j25J38k12J66J1K5q4J38l0k2r9J20m0o5k3J16
6092.8D0N6n9j21R8P4k99K90o1j30m1K29mj97Q8j28L55k02n5J47j51J26j04r8R1q5
6071.6a41L5m1k9M13k69M0l2j40K18o9K4p7K1N7j40R1k8j14J89Q0N6k75J27j13J58
6050.4D1j55Q1K6j93K03n9K2P2l7n8kN4k07J54R9P3j1J3q9M8q1Q9j04M9m4o1k5P0Tj5
6025B3j84Q9j63M26l38O5K00k52P1P5m5N1J22j00j25M5n2R8R5k19J17n3J6j7J35k04
$$ plain form
6185.2 201 89 -98 107 -120 102 -63 57 -28 -50 -28 -72 96 -55 59 -5 29 107 -64 3 35 6 -99 -24 -95 -112
6164 -112 11 35 -14 -123 -100 27 9 -3 72 33 -6 -67 65 -4 -59 -21 -152 136 36 -11 50 19 -73 -29 -26 -85 -62 -92 -17
6139.5 -17 22 94 24 39 -32 -99 -69 -143 92 -51 -11 -77 59 -180 -22 -29 2 66 -35 -77 -15 -184 31 59 -25 -6 -29 63
6115.7 63 -13 39 68 46 -87 74 52 -79 -124 -43 26 -99 39 -173 -7 4 29 -55 83 53 31 -68 52 12 -53 -76 40
6092.8 40 96 37 -84 14 88 -211 79 18 -112 -153 76 72 -125 -37 -165 190 -12 -67 80 -71 55 -49 -147 -56 -141
6071.6 -141 -106 -147 -176 237 -32 8 -24 -164 54 -15 9 -68 -47 10 -130 -39 -67 -181 8 88 144 -131 -4 -117 41
6050.4 41 -114 -33 -7 -200 3 -56 -34 38 1 -57 -59 -5 -212 -58 41 114 103 116 27 75 -6 83 -21 28 -16 -77 -102 -32 38 23
6025 23 -161 -72 -235 191 -147 -82 118 -134 -63 12 -33 18 140 40 -85 -40 -92 6 101 -118 -1 -54 -38 -55 80 -124
6003a24J70R7k11J44j95l0J67N7l67K56p4Q1j4KJ40l7q9O3K9j59J10M8L1o4k0QN9L0
5979.2A08j69J12m4o4J1k1m8K73l19R5K11r5L1j44n8J45K14k14j9k37K59j28J37o5
5958.9b9oJ38o7j11PO3l7J68r8Jj03J66j40o5j6J65o0j96PK85j16j01J65r9j14J10
5936.9h3k8Q0K8k1q0J25j08n4M6O0rK15j33n8k2P3J87j94l4P2K1N4p7m3j47K97r1p8
5913.1bo8J23j37p2P9K57k66L3K24k03J02p2M5q5P6j6j58K26p5mj43K14n7j7j18J14
5891.1@Q1j75K08k08NK58p6l05L07j23k5p9J88j58K26k04M6j56L00q2k26P7J43O1J02
5869.9A85k55N2j10J04r0M8L7l0J91k41K1o0J28n5R9j06J45k56J61M1J05P1r8j81J55
5848.7F1j30J66j73N8J60q0k4r0J46O8j31j16J0J61q6J7o4K52l45J09J40j10p6k1J12
$$ plain form
6003 -124 46 143 -68 76 -119 -149 18 75 -292 -36 -110 -29 -43 -41 99 62 -27 36 65 -94 16 64 95 31 11 19 78 108
5979.2 108 -61 51 7 -57 -46 -67 -115 158 -161 -66 145 50 81 -63 -121 24 238 24 5 -232 27 -101 36 -29
5958.9 -29 -35 103 36 -75 -68 -5 -42 126 28 29 -74 92 -48 -113 -129 36 -24 -220 -213 72 -44 -145 20 -79 -193 -83
5936.9 -83 -111 -31 -3 -24 -104 21 -87 -141 -95 -35 -44 171 38 -20 -42 31 218 24 -10 62 83 137 60 17 -130 167 76 -2
5913.1 -2 -70 53 -84 -156 -77 180 -86 -53 171 -32 70 -2 43 -42 34 18 -140 86 11 7 -136 78 21 4 -114 0
5891.1 0 81 -94 114 -94 -89 169 93 -212 95 -28 -53 -132 56 -102 124 -80 -34 -190 110 28 -198 -121 22 83 185
5869.9 185 -70 -18 -128 -24 -114 -66 -29 -59 132 -109 -88 -148 -20 -75 24 -82 63 -193 -32 9 114 185 87 -94 61
5848.7 61 -69 97 -76 -18 142 62 38 -52 94 162 31 -85 -75 86 0 17 -47 205 -140 -31 109 -1 -77 -98 14
5827.5A4O0k12K36j44Q6l3j4k3J47j51mJ65k16J54O5k00J17r5M3k1p4J60j07J12J3
5806.3G8p9n5k0J80j45L9J42j59J04n8J7j25m6m5M8J71LK5k26Q9j62J19P8M9M1j14
5784.3e1n2Lj40K76Nl5M9m8J56j4p3m9j0p9j6k7J27Ok3l7j4J21p1j74K71j75Q5J07
5760.5A18k11R1j34J00K9lp9N4J76j09Q3j41M3Q6n6j10K25j90n3j74M09k79J27P3q7
5739.4a2O7m8l6J01j15R9j5M8j52l7J07o5K77p8m5r8k08K90R4k18J6o6J02j28R5kP3
5716.5D6j65R4J30m5j52J40j64J39j23J3J11j49K54k5k31R8L9p0J40o5l3j1M3Q6l7
5695.3F3O4q1k0P4L9q3N2j00j99K45K4r1Oo9L3M3LJ76j95k1K7j51J99M0j49R7j21P9
5671.5a6J65j90J4n0J20j69K26j74R0J7lL7j44n7J38J72r7q1oJ17j18J12j65J06pk28
$$ plain form
5827.5 14 74 -138 98 -46 40 7 -7 -30 117 -34 -38 127 -89 65 130 -70 47 -48 -5 -26 -100 60 -47 65 78
5806.3 78 -1 -56 -76 104 -41 -2 140 -19 85 27 44 -81 -127 -172 -124 47 50 75 -151 -62 -224 -105 -27 22 63 -51
5784.3 -51 -103 -100 -240 36 41 6 55 7 163 149 76 27 17 -62 -78 -105 22 28 5 -32 -46 75 4 -170 101 -74 11 118
5760.5 118 -93 -2 -136 -36 -7 -10 -89 -35 141 32 115 -26 17 103 47 -63 162 -28 -81 -255 154 -125 2 75 -12
5739.4 -12 55 7 -29 72 -43 56 41 89 -63 -100 7 -58 219 141 96 -2 -210 80 174 -44 -28 -94 8 -120 -25 -27 46
5716.5 46 -119 -25 105 60 -92 48 -116 23 -100 -87 24 -125 129 104 -127 -29 10 -60 80 15 -18 -29 14 100 63
5695.3 63 127 46 26 100 139 56 108 8 -191 54 78 -13 -7 -76 -43 0 3 179 -16 -37 -10 -161 38 78 -71 26 -95 -16
5671.5 -16 149 -41 -27 -77 43 -126 100 -74 16 33 30 67 -77 -134 4 176 79 -2 -8 109 -9 103 -62 44 37 -191
5649.5a91L38j52P5j92J43l9K0M5l71M22k39Q2J99q6q0QP7K1k14K14r7J80n0k00L1
5628.3e6N3o1m6O2p8J41j3J65r8j15R5J88k74L2J49j93m0O6K15o0k15R1L3p7l4K30
5606.3A60J6j17l38J77Q9R6j70J16K4m8j96K16j04O7mj17J16L3n3J42j49r4J06J63
5585.9A31k29o6K55l73L42O1q1q7n1L8J00qK3k48L31k16J52j7j43p1N2Q4n1J3j09P
5563.9a61J59m0j9j18K41m6M0j05L6Tj59J08N6j3P0q2k4kl8M7l4J9j20O7R2j04n4L40
5540.2A92k67J55j96K7qJ23k7l1K3m3J19k71K48j8M8k44J66J1m6n6J83j57Q8j5L7j25
5518.1h4j3J83n9m6m0K34j95L7L3j45L5m7K10o6j19P7r7J52m3J30j36l3PM1j63P8N5
5495.2a4r2m2K20K5o4j17J63K1j12RJ02m2pj80J41R8p6j47J11l7n4J73k98J40N9O3
$$ plain form
5649.5 -191 147 -5 70 -122 21 -18 2 47 -324 98 -141 -59 140 54 -26 -18 59 80 -134 80 -17 163 113 -87 -56
5628.3 -56 -3 -64 -110 -48 -126 15 2 167 69 -46 49 237 -37 -5 144 -49 -89 -23 192 132 -83 8 41 -36 -70 160
5606.3 160 176 59 -279 -102 -13 83 -87 29 53 5 -191 25 -79 -12 -16 -133 -17 16 -37 105 -44 -138 -32 131
5585.9 131 -98 -164 91 -282 60 121 40 -47 -98 -60 40 32 55 -193 138 -78 74 57 -86 -157 -105 -21 -72 -59 -168 -161
5563.9 -161 -2 -42 -61 -179 62 16 56 -49 -13 23 -136 -28 28 15 85 3 -21 -23 -61 -14 -48 -29 -149 -82 10 -94 -148 192
5540.2 192 -75 80 -116 -89 -97 26 -1 -32 -9 -52 67 -204 44 26 74 -170 -4 7 -39 -95 88 -69 19 4 41 -84
5518.1 -84 -97 86 27 -19 -59 175 -20 17 50 -95 -60 -107 103 37 -82 -5 -102 50 7 137 1 -32 -25 16 -147 -69 -14
5495.2 -14 -106 -148 72 97 33 -84 79 100 -12 -3 99 57 50 -130 11 109 33 -114 -3 -40 -94 79 -219 -79 -20 43
5473.2D3j02K5J48k04J55j19O8k25L41j88J61j47j3J06p4m9l8N7K3J6L9P4%q7%Q9j50
5450.3e1p0R4r9P9j14J39O0q2r5J58P6j37N7O4k08J92N6l06K26k1o1J18r6n0J21j32
5428.3h2J1mJ22r6O0o0M1K5l5L0p2L2l8M2M8j2k1P0j9L6Q4p3o2m3J5l6R1n1j83J69
5402.8a1p2J35oj9k11K32O4j69K0O6n3J39j40N5R3p9o7n7J57j11J13J14k61N9l3j35
5380.8a77R4k1RJ79l7m7L3j17P4l25L75J8k01K1J40N4O6n7j46K58k13L5m2K9n1J54
5358.8A05l01J93M0r8K69k24n0J12q2r3K26k00R7p1P7O9m2K1N4k7p1p6o3P6J10j08
5336.7e7L4K07k35r8J49j65J58O0Q6j91J75m6pj77J02n3N5n3K19j74m2J04k8r9o6Q2
5314.7f0P3JR9j73L0J48j14Q0m9j93J98j97J22P6k3k0o5j1p2O8K5q0J99l2L9j14K49
$$ plain form
5473.2 43 -59 -34 114 -90 65 -54 14 -211 130 -58 103 -44 -57 49 -25 -74 -112 -55 -32 -16 23 97 97 10 10 99 -51
5450.3 -51 -121 -27 -126 -47 -161 -22 38 -44 -139 19 95 -42 15 79 -129 63 119 -187 39 18 -43 75 -21 -71 50 -82
5428.3 -82 -71 -75 47 -49 11 -49 -8 17 -18 12 -60 -28 -66 -24 24 12 -9 61 42 78 162 89 27 -16 -1 -37 54 3 -180 -11
5402.8 -11 -83 52 46 27 -184 48 112 -57 -37 29 -24 115 -25 30 123 44 -23 -80 77 -34 79 193 -68 -9 -42 -177
5380.8 -177 -83 -104 -95 84 47 0 33 -84 -10 -335 40 58 -143 -122 18 72 138 81 -65 193 -20 15 -27 2 -49 105
5358.8 105 -196 -3 37 -61 208 -16 -66 46 -36 -129 97 -103 -6 -77 0 69 27 48 102 75 4 -72 -135 -59 51 -57
5336.7 -57 -23 184 -51 -149 0 -165 -7 53 139 -52 123 77 70 -107 -5 -58 -3 -56 163 -11 -53 51 23 -76 -142 -60
5314.7 -60 13 14 113 -60 -30 118 4 84 35 -158 40 -157 -35 41 18 -2 -67 -78 -150 -82 -57 -137 62 30 69 -45 204
5291.8B04k00oJ01k53N9M4K7M6L5j49K02j07J12k31R2J27k22J4m4K25kj31K16m2k05
5270.6h8Nm3J28j93K53J1N3j88R4j11J65m8k0qR0nMrk36L28k51l7J15M6o6l5K3N5j82
5246a50J23O1N5k9K9j7k14k9J70J33j25k0j95K44Pn3lL3J5Jm4j2J07m1m5M2O3m2j73
5221.4a09K23n0r9L9j58J01P2K6j31M4L8N5j32J19n0L3J6k6j22J54j07J10j02KJ80
5200.2A26j42q5j5K36j98J57j5j17n5K25l17K06r7J65L3j27J87q8K0l1mJ9j24l0R9
5179.1B8l7m8m1J08q7J92Oj67q6K32j46M7J01j48P0j72J50q9P1jN6Lj15M9K48j79n9
5156.2a4j2LM5j78P1K9L9q8K56j31L9q5J08j75l3K6J19m9m8Q6r6J01j16l4Q9n8P1N3
5132.4A8J1j17K19j4L3j41n6k5j3J74j47J18j77R2j5Q9l2j31J13R6k3j84J43j39j49
$$ plain form
5291.8 204 4 -2 99 -154 -95 -51 -24 22 57 -92 110 3 115 -116 -24 103 -119 -105 -149 76 74 -57 159 117 -88
5270.6 -88 -83 -126 2 -191 62 73 126 -62 32 -79 86 38 18 10 100 95 99 90 -146 182 -69 -106 9 55 -11 -46 -23 32 -150
5246 -150 -27 34 89 60 89 72 -142 -171 -1 132 7 -13 -208 36 43 -10 -13 20 35 36 -8 -20 87 46 1 43 106 64 -109
5221.4 -109 114 64 -35 4 -154 -53 19 45 -86 -42 -4 51 -81 38 -12 21 37 11 -111 43 -64 46 -56 -54 126
5200.2 126 -16 -101 -116 120 -78 79 64 -53 -108 117 -200 6 -91 74 107 -20 167 79 99 68 64 83 -41 -71 28
5179.1 28 -9 -57 -98 10 -77 115 121 -46 -132 100 -46 1 102 -46 24 -148 2 -87 -16 -17 39 42 -73 -24 224 45 -14
5156.2 -14 -26 -23 22 -156 -85 -56 -17 -105 151 20 59 -26 82 -93 -126 -100 19 -30 -78 8 -88 13 -103 -137 -48 -106 -35 18
5132.4 18 29 -88 131 117 150 9 -47 -72 -85 89 -58 60 -117 -25 -40 49 17 -114 -1 95 72 -112 31 -108 -257
5111.2b57J97R5N0q1o7k7K5P6N6n5mO3n3L9k34J39J12m9l3j5R3p1J0J75k56Pl9K09
5087.5A05k71J12m3k2J86P3j43r4R8j57K21m8K4kjJ06j37m2j2kR1k17J27J23N2j58
5065.5c1P4j07J66p8l8J14j78J14J12k55P2J18r4m5J33m5N1l9m1j68J38J52j63m3N6
5044.3b5L2p3OP4r5R2kj37L1J14j35K5n0jpJ66O6j18J92j71k7l2L8j1J33j05Q9jJ15
5019.7A83j59o0mO1J51j8q3j11p8J81M0j97P9KM6j81M0J84j29J9j21J60k1N7r5K1m
4996.8c7J8K1O1j61K84p2j25J14k25J20j74J73LP9q8R0p2l9n5Q5m7MM0j1O5j8J7o8
4973.1a8J75k24L2J84j21j80J92l1P2m2j0k5j5j09P4oJ09o8l1O5J39o4n1j9j81O6Q5
4950.2bm7J70n1j68R5j09J10j38J97o7K66k65o9J5J7J08p2Q6nm1M0k12J30m6m1o2J88
$$ plain form
5111.2 -257 -60 35 85 4 -63 -90 -65 11 67 12 8 71 18 57 -177 -38 74 25 -8 -23 70 -1 9 184 -72 -65 -104 105
5087.5 105 -166 -54 -97 -119 67 140 -3 -97 1 -156 65 17 41 39 38 144 7 -35 -47 -49 42 -175 -48 75 127 -31
5065.5 -31 43 -64 102 24 -14 100 -78 36 148 -107 -35 83 -11 -56 77 32 83 44 3 -165 -27 125 -38 -81 -25
5044.3 -25 7 -66 -60 14 -81 11 9 -128 -97 17 -118 -93 -143 -144 -151 15 81 -37 155 -16 -43 -75 -37 -48 85 -20 69 68 183
5019.7 183 24 -36 -40 21 172 154 71 -40 -118 63 103 -94 -15 -13 33 -148 -108 76 -53 -34 -155 5 -16 41 -54 -33 -37
4996.8 -37 -19 2 63 -98 186 114 -11 103 -122 -2 -176 -3 0 79 -9 81 9 -30 -85 0 -47 -43 -3 -14 51 33 50 -18
4973.1 -18 157 -67 -35 149 28 -152 40 9 81 39 29 4 -11 -120 -46 -52 57 -11 -42 23 162 98 47 28 -153 -87 -2
4950.2 -2 -49 121 70 -98 -3 -112 -2 -140 57 -10 256 -9 -78 -63 -46 62 -10 76 71 30 70 -142 -12 -58 -99 -161 27
4927.3B7J1r0J10k43K04%Qj27Q8J14j81RJ67o6P7k16LJ07j81J66J3k31J33O9M2j7N7
4904.4E3M6o9j16J16o1J00k41R2J20n8pj11R2j25J40K9R7k7j7O0j15m3R5j58J09j48
4882.4a47J10Q5o4J43j69o9L4J68l7q4ON2j58J38j12J16n5J53j19J12j4p1Q4j11J77
4861.2A68j79m3J83l03O5P5m8m6Q7M9J6m3J5k1r7K11k32K57p6n9LM0J29l48J88Rj4
4838.3a4j7M7P5J9P1k47q6P4Q2j05n9m5K47m5P7k22J93J7k4J61j96o9j3RJ70j8n3p8
4814.6d9O2O0J4K5r1j86J43O7J9q7Q1Q4Jj30o1j01J82k00J83j33J92J8j88K7M0J17
4792.5H9O3j32K1j60K22Nl37K20M7Jl0Oj61j4L25l02J48Q1j59K6R7l0l1J99k84J81
4770.5I1m8k2j46J16m5J00Mj05P4j19j8N3o1J29o6J02J34k51P5mq5J19j3Ro6r0J10
$$ plain form
4927.3 27 38 -52 58 -185 19 19 27 -100 -12 102 -79 -70 97 31 108 -108 -105 2 -179 -13 0 -231 -98 -29 13 -4 53
4904.4 53 99 30 -86 30 -31 69 -172 -80 40 -18 -25 -136 -44 -169 -29 0 97 70 53 113 -2 -45 50 -108 1 -147
4882.4 -147 -37 48 -16 127 -42 -111 -77 91 54 -30 -24 28 -130 8 -104 12 -43 110 -9 103 89 18 102 -9 168
4861.2 168 -11 -54 129 -174 -109 -34 -82 -128 -41 8 24 -19 -4 -25 -122 89 -143 114 38 -21 -18 22 151 -197 -9 0 -14
4838.3 -14 -31 16 91 110 181 -66 -152 -78 4 -101 -160 -205 42 -3 74 -148 45 62 38 199 3 -66 -79 -70 100 82 29 -49
4814.6 -49 13 73 87 112 21 -165 -22 45 64 -23 58 142 143 13 -48 -149 33 -167 16 -117 75 93 -95 -68 -28 89
4792.5 89 152 20 41 -119 103 108 -229 -9 38 39 9 15 -146 -160 165 -137 11 92 -67 -41 56 26 -5 194 -90 91
4770.5 91 43 21 -125 -9 -54 46 50 -55 19 -100 -118 -65 -126 3 -63 39 173 -78 -3 -7 -92 27 14 23 -43 -133 -23
4747.6b3L3M5j69J49j01J33j1rk4j6lj9j56J86J70k71J91K2p9j56K61j93J04j73J44
4726.4C5j02m7Q5J05j09p2J45j04N5o1J89Ml7k6mj14R8j46J71k12J28K2k06K18j5j4
4704.4a4l3KP9N5O8k30L12k19Lj36N1l3J3R0M8j66KK85l10J25R2r6J83j42Q8j14rL2
4680.6B6l7q2J88K6j53N7J6j96P6K3k3Q5m7Q4O0j64J02o2jM3L2j47J07j65L30j91R9
4657.7H6n8N7j50J03k02Q7k4RN6j38L12p6r0K7k9M0q0O1O3j20o4N6J23j33l2J6N5o0
4634a05K07k26j4m8K43m1m3O6n1J14p9j21J04k4ojM0L0j49N5L7J20j41L9j05m3K11
4611.1F9L6j89J04J49k27L8Rm5J23j08m8K31k73J50j10K6J93l00J58k1J31j77K79k02
4590.8dP8r0P4o5jL2m2o5KM1N9M9J58m56J62J56k27J04k8J56nj40J35q2Q3Oj00P0j49
$$ plain form
4747.6 -23 10 55 -114 35 -66 67 56 47 23 7 4 -15 -171 15 185 -86 105 127 48 -108 153 -40 64 -109 35
4726.4 35 -67 -114 -29 76 -33 -105 40 -64 -9 -70 119 123 86 60 56 -58 40 -106 65 -147 -19 3 -203 15 0 -14
4704.4 -14 -47 -45 34 89 157 -73 239 20 23 -113 -62 -95 -82 8 56 -110 -108 177 -133 -8 84 -12 171 29 117 3 -6 26
4680.6 26 -11 -93 95 121 -32 25 41 -155 -79 -56 -79 6 -41 43 103 -61 41 -21 -22 21 53 -94 13 -152 178 -13 86
4657.7 86 28 85 -65 38 -164 -77 -101 -92 -36 -174 138 62 -28 -1 -30 10 -70 -9 54 -66 -130 -74 49 -84 -116 -100 -45 -105
4634 -105 102 -124 -138 -186 57 16 -27 39 -12 102 23 -98 6 -18 -24 -25 15 45 -104 -49 -12 108 -33 6 -99 -142 69
4611.1 69 105 -84 20 169 -58 -20 -11 -56 67 -41 -89 142 -131 19 -91 -65 128 -172 -14 -35 96 -81 198 -4
4590.8 -4 74 -16 58 -7 -8 24 -18 -83 -81 -40 19 68 226 -230 -68 88 -139 -35 -63 93 88 -52 83 1 84 90 -10 60 -89
4566.2h9J37j24J03M3j74k5K07j11JJ74j31O2L6l19J87lK88k75%J20q0n8J8K32l71
4545a52J30M0J35j86j24rJ05K2J08l8M5n5J62q6j81No8K66j79N0p1K10j53J46j21Q6
4523H7k37K51j56Q3k25J71J23p4j7n7J4N6MR8k48J26m3J17j46n7J05j1n9J68j2r1m9
4500.1g9J8N0k3M1R4n9j44R5k27Q3M2O1l5M3j4L5j3K63m08K21q8M5j09Q0J01j38l1
4477.2i6K42k04J55j22J43j50K0Q9l6q0MJ8K77l22J15o2Lj06J09N4pj87J23j05K38
4456A13q5J17k04K5J89l37J70O4L4j12N2m9M2q5J67k36J36o3MM4P6p2M2j00j2O2q9
4433.1a07Q3q5J21l4n3O7R2j41r8Q7J03l5q0m3P9M5J18j91M8%O5j30O6j7N2O0k49J04
4409.4g3l3J20r3L0N7J13k42J29K16j33j27J33j06j14N6J2j96K47m7K7k1O0Q4o1M2
$$ plain form
4566.2 -89 48 -76 27 70 -104 -129 78 -33 -32 142 11 73 109 -210 -23 -26 262 -13 -13 107 27 -31 -13 219 -152
4545 -152 -22 18 153 -33 -157 -166 -61 -39 69 31 76 21 183 97 -84 -79 -147 119 -60 -10 -81 129 -24 122 1 87
4523 87 -150 101 -55 28 -197 -26 97 23 6 -51 -37 19 23 121 -127 -1 -44 73 -73 -130 -25 -36 -95 73 61 -30 -79
4500.1 -79 -61 -11 -34 7 101 42 -102 -7 -234 -151 -109 -48 -83 -40 -54 -19 -32 231 -177 44 -44 1 -108 -28 73 -65 -96
4477.2 -96 146 -58 97 -25 118 -32 -12 77 41 -39 -35 -17 260 -62 53 -9 -6 -112 -3 51 44 -143 -20 -125 113
4456 113 28 145 -59 -34 155 -182 -12 52 86 -26 26 -23 19 -66 101 -135 1 -62 -58 -14 62 -10 32 -68 -80 -18 -107
4433.1 -107 -24 -109 12 -22 -75 -8 84 -57 -155 -68 35 0 -80 -123 -44 1 119 -72 -24 -24 41 -89 -23 -40 12 72 -177 -73
4409.4 -73 -106 14 -79 -49 8 121 -121 8 224 91 -36 97 -9 -123 -67 -55 -251 -4 -51 -24 -45 15 99 38 80
4388.2H0l6j7J32lj39P5j26K05j88N8j11l1J88p2n6J23j16q8J83q7P5O2r8j02M5j4
4366.2e8j0qJ5l2J7K41p9j31k8q8J05Q3m9L7q0JM0J29j15j39J24j32J01m1Q7j18K00
4343.3G2oj54J44%ok11K33j87P9k21J21K20k73J71o4p7K49j56K6J50O9j15r8P4kL0
4321.2F8m4M0R1m7k40K08j63R0J38j30j8Q9k30J74k3p6M3l2m9q9L06k17J99p9M1L1
4299.2H1j90N1n3K5J40K2j31K15j83R5r9M8o3pL8m5o4J88j47mJ67p8j13J73j15O9j9
4276.3Ap1J68j61p3J53k2K3j63P9j63L77j70m7Q3k4j7JM3j13r8R7O2o8L5J11o8j45
4253.4a70P6L5N4P4j16N6R2Kq0j18K89j57kj21J14K4n2j62J69Q5j48K90j63o5r0J42
4231.4E8o2O1j62K38j18N1J9p5k2m1R4j31j2K27k32mK22k24Q8p2P1N3j10%R4m5J14
$$ plain form
4388.2 80 44 27 159 156 17 92 -34 171 -17 41 -70 -101 87 15 -41 82 -34 -122 61 -26 49 111 13 -89 -44 -58
4366.2 -58 -68 -76 -61 -93 -76 165 86 -45 -73 -161 -56 27 -22 15 -65 -64 -24 105 -10 -149 -25 -157 -56 -97 -10 -128 72
4343.3 72 66 -88 56 56 50 -161 72 -115 -36 -257 -136 84 -189 -18 -82 -159 90 -66 -40 110 179 64 -34 40 38 68
4321.2 68 24 64 155 108 -132 76 -87 3 141 11 -7 82 -148 26 3 -73 -30 -62 -111 -200 106 -111 88 9 50 81
4299.2 81 -109 -58 -111 -86 54 76 -55 160 -23 72 -27 21 -42 -49 -11 -56 -120 68 -79 -83 84 6 -107 66 -49 20 1
4276.3 1 -70 98 -63 -136 17 -5 18 -145 -66 -229 148 -22 -69 14 -10 -27 -26 17 -96 -194 -97 -35 -103 -68 43 -25 -170
4253.4 -170 -94 -59 -5 69 -47 9 101 103 23 -95 194 37 35 -86 28 52 0 -162 7 92 -56 234 71 6 -84 58
4231.4 58 -4 57 -105 133 15 66 85 10 -12 -53 41 -90 -102 125 -107 -111 111 -113 -25 -97 -26 27 -83 -83 11 -34 80
4208.5H0j72M9j00P3j23J34n4K10j02KL6j35P5Q2q7p4PJ64r4j1N8jj38L6K25k13J14
4185.6D1n1J16j01qJ46j26P1M8k07J58j22j46K13n7on2m3O2K0m2J92q9p1K6J19j71
4163.6h0J07L3r4L0K5rn1J52j64J01j99J32j4j30K49k66K12K1q1j4R3k04J83j14L5
4142.4d7J57m0p3n9oJ08l4j88J85j98J10o0J78K4R3j67l0l5K44j32k5j42M9R4P2j13
4120.3c5P1j95K10Q5j44j30J88j01j50J81J3k6J63j24J5N3r0M1r8P3P4m4j68K19j73
4099.1i2J1K33p1j15L8lL5J9o2Jj46J41M5l2j79K55j25N7J00k6j75J05p9J8K0k4J34
4076.3H3N5k39J09o7L0m3J51m1P1r6J27j38jJ20k17J50j15o%klQ5p0P2j68J19P6j92
4052.5a50J43Qj1j01J54q1J29Q3k67P1j56J40r1J18j07J07K62m5k33J16j48j21J09
$$ plain form
4208.5 80 -92 -43 -143 -70 -193 -59 -113 97 -5 -3 33 -102 -27 55 -32 -106 -99 65 -29 -40 18 17 -121 -85 140 -73 41
4185.6 41 -10 106 5 -3 143 17 88 136 -71 87 -35 -181 32 -25 -31 -83 -126 -64 -44 -86 106 17 -54 -28 91 -80
4163.6 -80 27 60 -34 -4 21 12 -39 113 -51 50 -149 -17 -31 -161 88 -178 34 55 -26 -40 53 -151 32 -82 -47
4142.4 -47 110 70 -3 -62 -68 40 6 -182 3 -195 -85 -145 33 57 150 -17 -47 -82 162 30 5 -137 -88 6 78 -35
4120.3 -35 36 -159 51 136 -8 -138 50 -51 -201 -20 -7 -33 130 6 21 74 -16 25 -73 0 74 30 -138 81 -92
4099.1 -92 -81 152 81 -34 4 1 36 55 -7 -6 -152 -11 34 2 -177 78 -47 10 110 84 -91 14 -65 -47 -27 -51 83
4076.3 83 138 -101 8 -59 -29 -72 79 38 109 13 140 2 1 121 -96 54 -61 -67 -67 -69 -72 13 -57 15 -153 -34 42 -150
4052.5 -150 -7 1 -10 -111 43 -38 91 174 -93 -22 -178 -38 -129 -11 -118 -11 251 206 -27 89 -59 -180 -71
4033g1M2k7N7O3j15j5Q6J03j60J01n4j13O2%lJ66j85N0M9J47j32m4J71j97N0q2M0j06
4009.3a17J60J7j34j8K4K5Q9j53J98nk7Q3j01j32K04j92N6N9N7j42J63j31M5KN2k44
3987.3a62J41l7J36j00q8l9J23l4J59m9o3p0N0Ql2J08n0j73K94j96J32J40l05K5J75
3966.1I3j68j03J61kPO5n7k6n3RL4m4J48q5o7J66j98J18j32J68p4m1J97j06j25o1K82
3943.2A06K2q4j16J53r9M5k6ll7R7M0j78Q4K7K4m9P8j15J51j48L5j21J23K08j19j57
3921.1e9J72K33k94Qjj77J42J13k29J73K9J03J88J75J20k59O9J0j04P8m9l36jj94m5
3899.9a35J5K54p3J32k01N6K7j39R1RpJ56l4L3j25Q9j18K02Rr9p6N3M3l3OR3L98Q9
3876.2G15k54o5Q4J82j70mk61j70q7N5R3j02J60j98R7L6q8kq3N6K9N5n5j54L13j15
$$ plain form
4033 -71 -29 -56 1 64 -51 -66 20 123 -37 64 10 -103 -41 -41 -44 122 -63 -13 36 183 51 7 178 -19 31 -51 -11 -117
4009.3 -117 43 60 -74 -92 -68 -43 46 -107 91 86 59 142 41 -91 113 -79 -23 36 93 -49 114 -17 28 30 82 -162
3987.3 -162 -21 -58 78 -22 -110 -149 -26 -60 99 50 -13 -83 -33 -25 -57 51 1 -172 122 -74 58 198 -107 -82 93
3966.1 93 -75 -178 -17 -19 -12 53 -4 -30 -83 -74 -40 -84 64 -21 -88 78 -120 -2 -134 34 -40 -81 116 10 -115 -176 106
3943.2 106 128 44 -72 81 -18 27 1 -2 -39 58 98 -80 4 31 55 6 84 -31 120 -28 7 -114 9 217 98 -59
3921.1 -59 113 346 52 60 59 -118 24 137 -92 81 110 213 401 576 696 437 506 516 412 490 441 105 104 -90 -135
3899.9 -135 -120 134 61 193 -8 48 75 -64 27 36 29 185 151 184 59 148 30 232 241 142 66 119 162 129 135 228 626 715
3876.2 715 461 396 480 662 492 488 227 57 -30 25 118 16 176 -22 75 111 23 21 -62 -6 23 78 23 -131 182 67
3854.2F7n6K4J2k14J32J08J4j08J88J74K26J16k47M2r5M8m4j8l47nJ54l28o3K74O6
3833A20j06K4j2L7p4no5j5J14J7k2j36J46J9j08J69j10q6n0Q7p1J34j39P5R9J4Q3j63
3809.2b4J51j0j61oR6j07J13k1n3k4K01n3j6L1j01J8q3j94J63p3K16l9j33Q5n5J17
3787.2C8k8p7P0p2K06j92m2K59k77K67kJ1k93O3Q3J87j61q7MO2J06j53lJ6RQ1m7j36
3763.5a08J28j8R4j70O6%o1k8J34r9n1J91j8k58K21m7N0k8n4J92k72J1K41k99J56J75
3741.4A48k3j17k9L2j48J04K9J8M9k7j51K83k99j5J03N0l5j7Lm5J50q6p1J68rj65J08
3718.5Hj37nR3K4m0p8RM3J88j66M7K2O0m0j59J99jN2Nj74J05j06m7J93j47p6R1m6K09
3694A26q1j07o7K09L7j59r3K71p4j19R2l8j01J30l8M4k34K16N8k18K36n5j15J54P3
$$ plain form
3854.2 67 11 35 47 -167 -35 73 87 -21 167 341 567 683 436 478 383 431 387 369 22 17 171 -157 -220 54 120
3833 120 14 38 26 63 -11 -16 -81 -96 18 35 13 -123 23 42 -66 103 -7 -93 -143 -56 -127 7 -132 -57 42 56 139 -24
3809.2 -24 127 117 -44 -50 46 -61 52 31 -22 -46 155 102 86 117 16 34 -49 -243 -80 -153 63 24 -109 -24 -79 38
3787.2 38 10 -67 3 -69 137 -55 -97 162 -115 152 150 161 -132 -69 14 201 40 -47 -43 19 125 -28 -31 -15 -6 75 28 -108
3763.5 -108 20 2 96 -74 -8 -8 -69 -97 37 -62 -113 78 60 -198 23 -24 26 -2 -56 136 -136 -125 116 -183 -27 148
3741.4 148 125 8 -21 11 -137 -33 -4 14 63 36 -115 168 -131 -146 -43 7 -28 -45 -42 -87 63 -23 -94 74 65 -100 8
3718.5 8 -129 -134 -41 -17 -57 -135 -126 -83 105 -61 -14 8 68 28 -131 68 67 119 124 -50 55 -51 -98 95 -52 -128 -37 -83 126
3694 126 45 -62 -129 80 117 -42 -135 136 62 -57 35 -3 -104 26 -12 32 -202 14 72 -146 90 35 -80 74 147
3672.8A47j30l2R8k95J33k6P0j27L04l6q2k0m8O7K7r3K9j09l1J60N4No2J67k13K4P4
3649.9E5j32kQ5J8o5J39j26j1L9R5j00rO8r6J30q5j4J04n9j40Q6K2j21J09J94j33j31
3627h0k0Pm0K58j08K3J33j90r6K47p1j55P1J58j86K8R4j54P4K7k0P9n9n5L5nk68K43
3603.3c0N7Tj77P0MK23l12K19j9p9k5J70l51J72K9J8J2k5l4L1o4R8j72K33p0M1j48
3580.4g2N6j36J57N3j09K57j4q5J6k49R7K7P2l7Oj05l2K19j96K4Lp9J1L9J08j8Ol9
3556.6b0Lj96K84j33J5N7j15J06M9j03O6M7p1j6j3j40J69N9j21M7R4n6K0j78J65j1
3534.6Hk4m6J40j41J2M9k3J12K6J7l76K00LJ08k8m8J06l1j25M5K23k96N5lK7K1m6r4
3510.9a29P8o7K12j19j3J3K3K9q5L2n0Q0o1J5q1m9KJ22j01J26j13R4K7Jk6n5L2K9L8
$$ plain form
3672.8 147 17 -15 83 -212 -79 -105 -35 -162 142 106 24 4 -44 23 50 -43 -14 -123 -154 6 60 65 3 170 -43 -19 55
3649.9 55 -77 -79 6 24 -41 98 -28 -39 0 95 -5 -14 54 -42 88 3 -11 93 34 -106 -20 2 -119 -10 184 51 -80
3627 -80 -100 -93 -133 125 17 40 173 -17 -113 134 63 -92 -21 137 -49 -21 73 -81 -7 20 0 79 20 -35 0 -5 -273 -30
3603.3 -30 27 84 -93 -23 -19 204 -108 111 92 13 -12 158 -193 -21 8 26 38 13 -21 10 -54 44 -128 105 35 76 -72
3580.4 -72 -16 -152 5 58 -51 206 192 107 123 -126 -29 -2 70 33 39 -66 -98 121 -75 -51 -48 -127 -116 -77 31 13 19 -20
3556.6 -20 -17 -213 71 -62 -47 10 -105 1 50 -53 13 60 -11 -27 -40 -180 -11 48 -73 -26 68 12 32 -146 19 8
3534.6 8 -16 -62 78 -63 -51 -2 -25 87 113 130 -246 -46 -43 65 37 -11 95 64 -61 -16 207 -89 -34 -37 -10 11 -35 -129
3510.9 -129 -51 -118 94 -25 -38 -25 -2 27 -58 -26 -76 4 -57 -42 -123 -172 -170 -48 -149 -23 -136 -42 -15 -14 -40 -95 -63 -34 4
3486.3Dm9p9J88l3m8j60L19k03N8m9J5m6j18M39k55J12j01Q3k06KR1j07J63j94R4J8
3464.2f2o8J75j01j47K61rK2J49q1j51L4J09l04R5q8K30j38P7M3k20L26o4j16J44M5
3443.1A61k02p9J83k6j65K08j50k8K25j15p5Q8o5M1j07k7L1J65j62l0P3M7rQ5k70J50
3421e3MOJ36j83J1J90p1n8n0j7L1o1J28j50K25p3j4p5K13k7j09Q7MM7r5M1k24Q1K1
3396.4c5P0j02L1NLO6j04J08j83J01P8q4K7Mp3P4J04o0J41k40k6K18j72j05K40k80
3374.4a94J22L09k49j3M4J9Q9n2k71J75R9k43J56J2QO3j39P5J0L2j51J95j65J1j5K22
3352.4A49Ol14J89nmj02K57k30N5q1J02j1Q5l0k09R0J24j24J63k17J56j08J71k84P4
3331.2i8J45k20K22k35K03%p1q4j34K11p6J82k5k31K41Q7j7k5j7j13O9N5J02k52P3
$$ plain form
3486.3 4 -45 -124 64 31 -17 -177 142 -61 -3 -52 -37 -83 -201 238 -17 95 -6 77 -129 -127 -36 -143 20 -174 -80 -62
3464.2 -62 -130 45 -56 -203 58 49 71 220 139 -12 22 131 -173 -78 -166 64 -74 3 46 -174 152 88 -28 116 161
3443.1 161 -41 -120 63 37 -128 80 -70 -98 127 12 -63 25 -40 1 -106 -133 -102 63 -99 -129 -56 -9 -18 67 -203 -53
3421 -53 -49 -43 93 -90 -79 111 40 -18 -68 -85 -54 -115 13 -137 88 15 1 -74 139 112 3 90 94 141 46 87 -137 -56 -35
3396.4 -35 35 -67 -36 -31 -28 38 -66 42 -141 -40 38 -46 -19 -15 -88 -14 90 30 171 -69 -95 123 -49 -154 86 -194
3374.4 -194 -72 237 -12 -25 19 38 127 75 -196 -21 78 -165 -9 3 11 74 -65 10 20 52 -99 96 -69 -58 -73 149
3352.4 149 155 -159 30 25 21 -81 176 -54 1 -80 22 11 96 66 -143 -53 71 -53 110 -107 49 -59 112 -172 -98
3331.2 -98 47 -173 49 -186 17 17 -54 -138 -272 -61 -137 45 20 -211 30 117 100 75 58 -55 14 69 171 -81 -8
3310hj35K40j86j16L78j50k6qN0jo6M4j38J20k7qK2mjJ41n4n0k6k3P9p3Q3ro3l8n1
3283.7a04K0O5L5nl3J20j06m9J86j07n5k8q6k6J51N7j43J4O9o9oK46j43m3N4L6k69
3260.8b19J84K0O6q9j99K04q0TM59j32k70O4L1J25j51J07j60J47p7N6q8J72j62J59
3240.5H7j22M7N0j81J33j37M0J35j76J08J26k20K37k89j72M49j14oJ1o7N4l3rJ68j57
3219.3c8N4l3Q6k45K21N1m2o5l6J34j10K5j17NK55K6k57K96j40l5k4Qn9N0j10j2J04
3196.4hJ70j70n6P5p4J59j61L2j74K17k9R0j49Q7J20K7o1k60J74M1N4j35k0L3O0j38
3174.3i6j15K78j14MK6P8k9k19k2J21P2p3J01j12qP6R1j04J03N5l17P8N8J38M3j82
3152.3f9K45j45l1j36K98k92l3J61j87L8J32P3J5j13J36R6k93N9N2J03J05j17j56J31
$$ plain form
3310 -8 -143 97 -89 -205 173 23 -3 -11 39 38 -28 16 -122 -2 -29 -37 -15 -19 -20 121 67 17 -9 -32 47 -26 57 48 -15 -53 -104
3283.7 -104 -84 -19 16 11 -22 98 -8 -57 129 22 -33 -61 -147 -173 -22 35 -108 -94 -25 -94 -100 146 3 -40 14 50 -219
3260.8 -219 -35 -15 51 -38 -237 -33 -113 -193 266 134 -136 -72 -41 84 -67 40 -120 27 -50 6 -82 90 -72 87
3240.5 87 -35 12 62 -119 14 -123 -83 52 -124 -16 110 -110 127 -162 -334 115 1 -5 6 -61 -7 -40 -49 119 -38
3219.3 -38 16 -17 69 -176 45 96 54 -11 -47 87 -23 2 -115 -110 145 171 -86 210 70 35 11 19 -40 10 -100 -112 -8
3196.4 -8 162 -8 -64 11 -63 96 -65 -33 -207 10 -19 71 -78 9 129 156 95 -165 9 50 104 -31 -51 -18 42 -96
3174.3 -96 -211 67 -47 -43 -17 61 32 -187 -209 -88 -16 -89 12 -100 -108 -32 59 -45 58 113 -204 -126 -68 70 113 -69
3152.3 -69 176 31 0 -136 162 -130 -163 -2 -189 -151 -19 54 69 -44 92 188 -105 -46 6 109 214 97 -59 72
3132G2j38lrN0jJ26J8l38R1J60rJ0j27J62p1j03J44n5o4n5K60r5o9J71j29J47p8k25
3108.2a58l7M02qj71j08J22k9L6K30l62L3j12J90M4O2n0j61J50J0OK9l3j40J67l30
3087b18K29j79J67l1K4O5j15j79P9J73O8K8n3o9O5K0k5N5L1j67MJ87k14J94j32O0j4
3064.2E3K18j18J93O3P6N05Q54J352J716K301j011m451j220n60j01J07N2p6n4N4k09
3046.4b56K06j31K18j48pjj4K40k13N9N1j46J14P4k7p9J20j99M9J13j66J6P3p9N4P2
3024.3gmn0k6K3j15J63J54q6r6J15r9q1N4K2l6n4J17p6R6l2p5R4TJ4o6j25Q5M4j88
2999.7a41Q4m3J53N0k49J16jL2j03J54q1m1J3m7mP4J65j62n8L33l45J38j0J3Q2j84
2977.7f2K69k95p8K44j29L7q0J78k03M8K03j67J66o3m9R5l03J74n8l0J60M2j56l2J26
$$ plain form
3132 72 -66 -69 -78 -28 -29 97 115 -223 -132 28 19 29 -98 64 -7 -110 34 -21 -85 -140 120 25 -44 127 -2 145 67 -158
3108.2 -158 -195 207 199 28 -80 42 13 49 279 -83 -50 -162 28 72 134 84 -77 73 83 89 118 85 -55 112 -218
3087 -218 11 -168 -1 -32 -8 57 -58 -237 -158 15 83 111 58 -11 54 74 49 104 135 -32 -28 159 -55 139 7 67 53
3064.2 53 271 153 346 409 485 990 1844 3196 4912 7213 6202 1751 531 -29 -130 -23 29 -47 -101 -47 -256
3046.4 -256 -50 -181 37 -111 -118 -119 -133 107 -106 -47 4 -142 -28 46 19 -60 60 -139 -90 23 -143 -127 -54 -133 -79 -7
3024.3 -7 -11 -61 -87 -64 -179 -16 138 52 -44 71 -28 -109 -55 -33 -69 -123 -6 -82 14 -18 -93 1 95 109 43 -82 3 47 -141
2999.7 -141 -57 -100 53 103 -146 -30 -31 1 -102 52 -29 -70 -57 -104 -108 -34 131 -31 -89 244 -101 37 27 40 122 -62
2977.7 -62 207 -88 -166 78 -51 -14 -94 84 -119 -71 132 -35 131 68 19 114 -189 -15 -73 -103 57 99 -57 -89 37
2956.5C7o2j8r6J72j40J93o6N5j02J6O2o0J8n6kK83j75j92J49k24L06j43J3J57j66
2935.3d1J91j77j10K03QP5l22J93m7J13m9L4k07K71j68L9r6l2J95j93J35n7j16K20
2915F2j14L3k0JM6q0J52j94O0J03q5p3j10L07j87J70o5k12L68j07j58r3J98J2k3L7
2892.9B8m6J95q5J8j47j14K62j22M8n8J09k5p6j35L71k36oj18J30O7j01k71L12J57
2872.6A57l98K46J76j84J99l17J64N7j56j83L17P5m9J7j21%Nq8j2J06N1k6p8J03j74
2851.4a13K54o3J77k25j19oJ83J2r5j23j2J47p7L65l48qJ76l6j42J1J30j65j11K37
2831D9l0N3K4oj14p2P4J47j03K3L4P9k26J16M9k44J35R9j58K09o4pj4n3n6p2n2K13
2807.3C3J0pj65N3m6N5KJ23M7j04n3j5O9N9K26k74J3j20J37k00K19q2o5R4j12L1P1
$$ plain form
2956.5 37 -25 -43 -139 33 -107 86 20 75 -27 -11 51 -9 9 -47 -49 234 59 -133 16 -208 98 -45 -32 125 -41
2935.3 -41 150 -27 -137 66 74 149 -173 20 -27 86 37 71 -136 135 -33 6 -90 -122 73 -120 15 -42 -158 62
2915 62 -52 -19 -39 -38 8 -72 80 -114 -54 49 -36 -109 -219 88 -99 71 6 -206 162 55 -103 -196 2 14 -9 28
2892.9 28 -18 177 92 110 -37 -151 111 -11 37 -21 88 63 -13 -148 223 -13 -19 -137 -7 60 -41 -312 0 157
2872.6 157 -241 5 181 -3 196 -121 43 100 -56 -239 78 153 104 121 0 0 5 -83 -95 11 62 36 -42 61 -113
2851.4 -113 141 78 255 30 -89 -95 88 100 5 -118 -130 17 -60 305 -43 -51 125 89 -53 -42 88 -77 -188 49
2831 49 19 72 96 90 -24 -96 -22 125 22 45 79 158 -68 48 97 -147 -12 87 -71 138 74 67 53 0 -56 -128 -180 33
2807.3 33 43 36 -129 -76 -122 -67 -65 58 105 1 -52 -67 2 61 287 13 26 -94 43 -157 62 -20 -85 9 -103 -72 -1
2784.4aj24J83P0q9n7J4k0J66k50J39J33j31j49K98j99L2k3M1l0j90J59L5k08K78j76
2763.2i9M8J4L1n9J26n1j13P4P0J34l2k65M6l7J46j13j03J08R9nm3n2j7M2O5l2Q8R1
2739.5A61p0Tj26Q0M3J8j00k4J81J52m20P7J87k05J58K6n1j9j82J09o8k2O6n7J21p0
2717.5a05M4J8n9J62j07J14P9k93K3K25k40n3J64n6K07k24J83n2l1n8PJ11k35J2K59
2696.3I5l34K92j52M7k6P5q5Q2j15J75%Ko9K9J7j37J38j38R4pL1J98k61jJ14RMM6j14
2671.7Ij7j44K3n3J89L4r7o9J00r7M3r8R6N4J83j66Q1o4N2r6P0m0R7k0k23J06O6P7
2648I6j23J07k77j0K04k9rR0n7K15k90n9J99j08p7J46m8j22J85p0P0Pk7m7p2J88j41
2625.1e9nJ37k02p3R7J29j21L5M4J7j08OJ08J35O4n20L42J70k21K21l53O5q4N7L05
$$ plain form
2784.4 -1 -125 58 128 39 -18 -4 -24 142 -108 31 164 33 -116 182 -17 15 -8 33 3 -187 -28 7 -201 77 -99
2763.2 -99 -51 -37 -6 -65 61 10 -103 -29 41 175 143 -122 -76 -113 33 -80 -183 -75 24 19 -24 -76 -93 -51 14 -18 70 161
2739.5 161 91 21 -105 -25 18 36 -64 -88 93 245 -175 -98 89 -116 42 68 17 -2 -184 -75 -143 -165 -99 -156 -35 -105
2717.5 -105 -61 -43 -102 60 -47 67 146 -147 -124 101 -139 -192 -28 -84 123 -101 82 30 -1 -59 -52 59 -176 -164 95
2696.3 95 -239 53 -99 -52 -78 -3 -88 -6 -121 54 54 56 -13 16 33 -104 34 -104 -10 -17 14 212 -49 -50 64 73 77 123 9
2671.7 9 -8 -152 -129 -182 7 41 -56 -125 -25 -122 -79 -177 -81 -27 156 -10 71 7 59 -37 33 -7 90 70 -153 -47 19 96
2648 96 -27 80 -197 -207 -3 -32 -41 49 -8 207 -83 -142 57 -51 -128 18 -30 -152 33 -37 33 40 13 -34 -106 82 -59
2625.1 -59 -64 73 -129 -202 -105 24 -97 -62 -18 -1 -109 -103 5 140 204 -316 26 196 -25 196 -157 -92 -176 -119 186
2603.9A86l26K34j00k3N1j38J14Oj15O1J45j13j2N5j3Q0n5j0M6Q6k20J06j24J9M7q4
2581.8i7J1R4L0j33J10j38K02q5N0j78L14q7Rl13L38j09j78K6J26l5Q0l3O5p6k30L44
2559.8A07j81P3N9r7Q3m3j07L0M3j24o6K26r1qM0r3J5L53k07j08K00k76J58J08j69
2538.6g5m9k5J18Q4p6O4J32r7k50J50J12lj45J0M9j1k06J84j04J4L9q6j7J87l4n7l8
2515.7a30L5lR4j38j4K58j57K48k38J89r2q1p8J24M7j34J26j37J88j13o0N3M4j08J28
2494.5E1o9J24J54k69j91K55o0MO7o0R7k72O4K0J1Q0nk51R7J99j23J10nn7O8j78J08
2471.6c1M5J0J03k44Q0K4P8O2j33P0j05j96J45K6P8j17J72p8j00K09Jl7j99K72l5l79
2449.6b79L60n9l5K0j24P1L6j70M3J34L9o0o5J52k28J84j62J8J35pL2j35N5l4j8K5
$$ plain form
2603.9 186 -140 94 -6 -29 22 -116 -2 4 -111 -50 95 -18 -30 25 12 92 37 27 73 159 -61 45 -79 -60 -13 -97
2581.8 -97 -86 8 38 -95 15 -123 79 -6 44 -134 180 93 102 -211 127 18 -160 -134 -8 -43 37 4 69 -7 -237 107
2559.8 107 -74 -1 58 -39 44 1 -106 -76 -33 -157 -223 3 -88 -96 -56 -149 -134 219 12 -96 104 -172 -14 94 -75
2538.6 -75 -124 -149 -31 53 -23 41 173 76 -174 -24 88 85 -60 -50 -1 -12 -218 -34 -138 -124 -85 -171 -188 -1 -35 -92 -130
2515.7 -130 -95 -98 -4 -142 -156 102 -55 193 -45 144 52 -29 -107 17 64 -70 56 -81 107 -6 -66 -13 31 -77 51
2494.5 51 -18 106 260 -9 -200 55 -5 -1 66 6 103 -169 -105 -85 -74 6 1 -250 -153 46 -77 33 28 -29 39 -139 -31
2471.6 -31 14 24 127 -117 -37 -13 65 127 -6 64 -41 -237 -92 -66 12 -105 67 -11 -111 98 99 62 -137 135 100 -279
2449.6 -279 81 22 -13 7 -117 -46 -10 -180 -137 -3 36 -24 -89 63 -165 19 -143 -125 10 3 35 -100 -45 -79 -97 -72
2427.6g2P0j3m0M3Lm4j4O5Q1qj61J74op9j9j3j01J51j60L49k49J7J85l2k32J1J13k8
2403.8io4R3Ql1J0j40K9N2j0KJ00k22Q6J2j67K90M4j6n3J24p4K1j21m3Q5l8j07J05
2380.1c4n0L01l34J93k23K0J53pl3J26l45K38j79K9K1N0L6j44K96k14J55j1j19K5N8
2358.9HrTL6K7J2l4Q2j54o6j6J87j78J10L09l91P0o4j8K54j49j37J45K8J48j43j44
2336.9i6J46j71J45m2j7J97k15K31r3k1j2J10j99k8p6O3Q6j21J56Q7p5l5q6j17J91
2315.7Hj32J41kQ2L6n0k06J7K3PJ4OJ71l52L21j4Q6o2j65J00j57K29k20P3Q5K9j23
2292.8e5L4J02k34K19q6J8Q5k4n7j28J46J10j97Q0n7R7kJ20j11j53J79p2J82j63q5
2271.6e2N1J57k09M9J37j23O4j00O8o6j18K40j69j17K35o7j1P5j87p0N0J47j26J09
$$ plain form
2427.6 -72 -2 -15 -55 -12 -9 -53 -67 -2 79 71 -90 84 78 -1 -20 -33 -134 17 -143 206 -43 -26 159 127 -105 -94 19 -9
2403.8 -9 -73 20 28 -3 7 -133 -104 -52 -62 -60 40 -182 -96 -84 -251 39 83 67 14 138 64 85 -36 -79 6 -32 -139 -34
2380.1 -34 -84 217 -117 76 -147 -127 26 19 -14 112 -233 5 -174 -145 -124 -74 -38 -182 114 -100 55 44 -75 -50 8
2358.9 8 -1 -10 26 53 65 31 113 -41 -107 -123 64 -114 -4 305 -86 -16 -80 -98 156 7 -130 15 43 191 48 -96
2336.9 -96 50 -121 24 -18 -35 162 -53 178 85 64 52 162 -37 -65 -141 -78 8 -113 43 130 55 20 -66 -183 8
2315.7 8 -124 17 15 97 133 83 -123 -106 -83 -76 -62 -56 115 -237 84 70 156 94 -71 29 -128 101 -119 -46 39 68 -55
2292.8 -55 -21 81 -153 66 -20 -2 83 59 2 -126 20 130 -67 13 -44 53 51 171 60 -93 86 14 196 33 -52
2271.6 -52 -1 156 -53 -4 133 10 74 -26 42 -24 -142 98 -71 -188 47 -20 -31 44 -143 -213 -163 -16 -142 -33
2251.3c3nO7K8MJ1N0o7J92l74n9J77J16j17j68K94r3j64K14k5j36K22r5p8j11K59j76
2229.2f7J86j36o1J62j99K69m1k91M6R5M3o7RJ06j7k3j44J81L0q5j49J41L7J82j66
2208D1q6J31L2Rj03op2k5J4J61J2n4r1K02r3q5N5j14J89k63N8L0q2J02J9j45J15J8
2184.3c1m4J55K7l2q5O7k9q6L9N1j93J90j24j7P1l8q3K69k07o6N3J72P8j71K3L6j80
2161.4a55K71k60L17n2j37J1M6k4J8O3k16J8pQ5r3J16q4L7R5m6J08q0J93m82K00J7
2139.4d1N0m4j17K21Pj71K32l05J14m3k05J09P1J4O0k7J72j18J30l0l12J78j3L9J03
2118.2G4L4k49l4J43or8J07P8O3k50J90RP0k1k48J21n7K89k03K23j46j51kO3N0j9k8
2095.3Bk1l9k9m1J18J17M1k18Q0j67J87J09j48K6P6r7o7J07K8K9k7n3o9J3n5J31m7
$$ plain form
2251.3 -33 -38 29 57 61 72 122 55 247 -127 -186 -9 107 -10 -178 116 23 -141 73 48 -88 134 39 -39 -150 109 -67
2229.2 -67 119 -17 -78 84 -115 154 113 -178 -132 -37 6 -61 -52 54 37 14 -130 51 81 -4 -153 -12 25 207 41
2208 41 -45 86 118 127 24 18 -54 -79 -65 96 108 54 -37 165 72 -13 42 -72 117 -146 -88 -58 -140 -38 -19 -164 -49 -31
2184.3 -31 -75 80 107 75 -10 57 28 -58 -19 32 -161 29 -95 -112 -41 -79 -162 107 -100 -166 -113 59 137 -34 -11 25 -155
2161.4 -155 116 -144 173 121 -16 -5 41 17 35 98 -118 -100 -107 -22 -115 1 -83 -46 49 3 111 31 224 -258 -58 -41
2139.4 -41 9 -35 -152 69 76 -95 137 -168 -54 -97 -302 -193 -122 -108 -48 -75 97 -21 109 79 -233 -55 -68 -29 74
2118.2 74 108 -141 -175 -32 -38 -136 -29 49 112 -138 52 61 131 110 -138 -17 -74 215 12 235 89 -62 -64 -1 49 30 2
2095.3 2 -19 -58 -87 -128 -10 107 148 -70 10 -157 30 139 -9 17 93 -4 -71 36 64 93 66 13 -56 -43 -98 33 -14
2072.4a4P4R1j17j55K3K15j17M8m2J5o3OJ07K4J10k53l9K29j43j21J60k0QJ01j81J93
2050.4A39k5j10q1R0Q0j16L6N3j46J21p4J43j82J63q6o2J4o7J2M4J97j66p9JN4J40
2028.3I3k9n7o2J34j48N9K9J0J8j42J41J5o4o9J53j44j38K04k2l9NJ50j93l7J22r9
2006.3a10jo7J62j8OR1j78J65k5j12K31k23J41k8P2j76Pr7L30k00j34K06j81J18p4
1985.1i5j28L89l43M8J42J51j81j34J37j31PO1J90j36L6p3J70j93L0J6O0J84l11J53
1964.7D9Q8j0j47pj86L31k90J88O3j58Q0K2k8Q0j47O1m7rO3j2O5j6q6R3pq1l0K50k46
1940.2g4J35j87J55j3n7TJ03Q3k03k9J35O6l19L88k16R7j30J11n6J62J00j92M3j39
1919.8i4L3j6J60k15L13j28j42P8P3n2K0P1j60LJ70j77J37J6q6K6q1O3j24k8J72j38
$$ plain form
2072.4 -14 60 151 34 -121 -98 117 0 48 6 21 -42 -36 71 95 205 -48 -87 142 -1 -122 38 18 26 127 -54 139
2050.4 139 114 4 -77 13 93 -23 13 66 -80 41 -33 110 -72 91 5 -57 -43 -110 -98 -54 143 -23 -102 -101 -47 93
2028.3 93 64 7 -55 79 -69 -10 19 29 47 -95 46 61 -3 -72 81 -63 -201 3 -19 -58 -53 97 -96 -133 -11 -110
2006.3 -110 -111 -178 -16 -34 -28 63 -115 50 25 -87 144 -79 62 34 106 -70 -63 -160 170 -30 -164 42 -139 -21 -95
1985.1 -95 -223 166 -177 -129 13 164 -17 -151 -14 -145 -138 -77 113 -23 13 -60 110 -83 -53 -37 23 207 -104 49
1964.7 49 137 127 -20 -27 -213 118 -172 16 79 -79 1 23 -5 75 -72 -11 -58 -67 -4 -16 49 33 -53 40 33 -48 -78 172 -74
1940.2 -74 61 -126 29 16 -41 -98 5 88 -115 -144 -9 57 -262 126 -90 7 -123 -12 -68 94 194 2 45 -94
1919.8 -94 -61 -77 83 -132 181 53 -89 -11 62 10 30 101 -59 -56 114 -63 74 90 4 30 -51 12 -112 -140 32 -106
1897.8a06J06K7K4N5k68p5K28J14n7oj6n5L5O8j66mQ7nJ6k3p4K24n4j1l7k3j41P6j38
1873.2a99JK26n3k9q3L06k66R9q2J29m7O2l0oN0m3l0j7Q8k54K66P3n9j45J41j87pQ1
1849.5a5k0Qo3L1J43j67m0K27j80j06J38K22j74j08J15j74P1Q3J85j15j48J8J65j01
1829.1ej4R2k92K91j03J20l5mq9J22k36K36k14j25K77J8M0l5m3J40j12l9l6O9q8L7
1807.1b8kl6m4K05j3j34Q7j21J51m0j50K97j20q3O4o1N1l7J0J8r4P9K0j8K2P0j86j25
1783.3b18K1K95k8k14K06j29J04o8J01k34J83J46j74n1P3j00K71k49LN1l5o1N7j05
1763a55J88Q2k54K10j8j90J46k8n8R3M6J18l62J84j63M4J74j14J46o2r6kJ11j7K20
1741.8B43m76R4n0J34P0J13l43J89%K72k21p2k4P8M0k66K43J13k67R8J28Rk35M1J08
$$ plain form
1897.8 -106 0 27 51 106 -162 -237 -9 105 48 42 26 -29 6 74 -92 -96 -9 -14 2 -21 -95 129 75 64 27 4 -137 -61 -199
1873.2 -199 -198 28 -25 -54 -137 169 -97 2 -80 49 2 64 34 28 78 35 5 -12 76 -178 88 161 102 -43 98 -89 -96 -15
1849.5 -15 -35 -27 -90 -59 84 -83 -123 104 -76 -182 -44 178 4 -104 11 -163 -92 -9 176 61 -87 -69 96 -5
1829.1 -5 -19 73 -219 72 -31 89 54 50 -39 83 -153 83 -131 -256 21 39 79 44 1 141 29 -10 -46 23 -65 -28
1807.1 -28 -30 -66 -110 95 82 -52 35 -86 65 25 -125 172 52 -31 33 -28 23 -14 -4 14 -80 -1 19 1 23 93 -93 -218
1783.3 -218 -197 98 70 -144 62 -67 37 -31 70 -164 19 165 -9 -60 13 -87 184 -65 -62 -11 -46 -107 -50 -155
1763 -155 33 115 -139 71 53 -137 9 -19 -77 16 62 180 -182 2 -161 -117 57 -57 89 27 -69 -71 40 23 243
1741.8 243 -233 -139 -189 -55 15 128 -215 -26 -26 246 25 -47 -71 7 47 -219 24 137 -130 -32 96 105 -130 -89 19
1720.6A9j61R1j38J51O4n3Q6j6q5K52k97J81p1J7k1R5j86q4K34J5j92J09N0j86p7J22
1698.6h1K70j36o4q1K37o7n4q9q3J70o6O9Q4j72K27j01q2m5j6Q6O1l1l2j2O8L2L4j38
1674.8a2m5nJ45p3j09k9J68j63J37j52K44j20pR6n4m8O2N2ok51J64r4P1l8J02m4K34
1652B25l78L39l83R9J33K8l3j67oJ49q2O5j11j55J42J37n4q9J5J59j58P5o8K37j66
1630.8d7J48j20j62J65Q9L8j52n5K29pl09K01j72J17N3m4k83L92j16j20K50m5k22K12
1610.4D0J4m0L5k8j73L05j89M8q5K18p3N2k70K21k6j77J29m8R6j03K08j61Ln3Q2j24
1588.4i9k5j2J02N8j45l1J47J85j23j11K6l1J5l1K08k0j66J87r3r1JJ24p2j43J03l7
1566.3g4M3QN9r6K1j98K44J54n8n1n7j23K15j34K13k57P4J65j71j94R2K2qK63k22J86
$$ plain form
1720.6 19 -142 -51 -189 -38 26 -27 59 43 -42 210 -87 94 23 40 19 114 -72 -156 78 93 -99 10 60 -126 -203 -81
1698.6 -81 189 53 -11 -92 145 78 24 -65 -148 22 -44 25 109 -63 164 63 -19 -64 -80 6 67 36 4 -8 60 92 126 -12
1674.8 -12 -57 -62 83 10 -99 -128 40 -123 14 -138 106 -14 -21 75 21 -27 35 87 81 -170 -6 -100 -29 -67 35 -9 225
1652 225 -153 186 -197 -98 35 63 30 -137 -143 6 -76 -11 -122 -277 -135 2 -52 -141 -126 33 -125 -50 -118 119 -47
1630.8 -47 101 -19 -181 -16 73 111 -41 -96 133 126 -183 18 -154 -37 16 -28 -311 81 -35 -155 95 50 -172 40
1610.4 40 54 14 49 21 -152 153 -36 12 -73 145 72 124 -146 75 49 -128 1 -47 49 -54 154 -7 -4 -57 25 -99
1588.4 -99 -124 -136 -34 24 -121 -152 -5 180 57 -54 -28 -59 -44 -75 133 113 -53 134 41 -50 -49 75 3 -140 -37 -74
1566.3 -74 -31 -23 36 -60 -39 -237 7 161 103 52 -5 -128 87 -47 166 -91 -17 148 -23 -217 -125 -103 -111 152 -70 116
1544.3A16q6Lj16L9K5J82k85J59P9n0lJ8k01Q4J16j1l2Tn1J86j02M7k99K47p1k4Q5
1521.4B3q1K78k41r0J88j5N8m9j23J41q0n6rQ3p0q8nJ92l8j49lJ51L6j24J76k69QQ1
1497.7g5P5Jj8p3p0L11j47k97J38k7M3J80J74l64K57j48L0J46j10j00J93O7j48P5o3
1476.5E0j70Q9L7j32O2J92p4j79j19J70M0m7K65k34J48k88L11j12P8j21k20M26j98
1457b6k5j09K45PJ2j36K94k95P9J04j05l5m0k43J03K33l3j66J67J52j08r9j64K28k27
1435.8a87K96j92L4K07j59P0q2L7j00j8J95K8j67J17p4j85Q0L21J2k96K39k06n2K08
1415.5A26l08M8J25P5O4m9pj47J74k1n2J3K7m1O6m7o8Kj9j33K91k25J32%n5n8l7O1
1391.7f3L10k51j04K0J46l90K98J22j57K89j34j50PN2mq0J50j00k7K34m3p8P8j25J17
$$ plain form
1544.3 116 30 33 -83 -44 -19 163 -122 37 116 66 63 81 -120 -36 80 69 37 5 -46 140 38 85 -214 33 -38 -62 23
1521.4 23 -58 220 -21 -111 77 62 120 71 -52 89 9 -47 -56 27 -43 -131 -136 56 18 -131 -134 17 53 -71 105 -164 -156 -75
1497.7 -75 0 1 -17 -90 -160 151 4 -293 -155 -182 -139 41 215 -149 108 -40 -10 136 26 -74 119 186 38 113 50
1476.5 50 -120 -31 6 -126 -64 128 54 -125 -244 -74 -34 -81 184 -50 98 -190 121 9 87 -34 -254 172 -26
1457 -26 -51 -160 85 92 104 -32 262 -33 46 150 45 10 -30 -273 -170 63 30 -136 31 183 75 -24 -188 40 -187
1435.8 -187 109 -83 -49 158 -1 69 -13 24 -76 -94 101 129 -38 79 5 -180 -100 221 233 -63 176 -30 -82 126
1415.5 126 -182 -134 -9 66 130 81 74 -73 101 80 28 41 68 27 93 46 -22 -20 -39 -172 119 -106 26 26 -29 -87 -124 -63
1391.7 -63 247 -4 -108 -88 58 -332 -34 88 -69 220 86 -64 -57 -5 -9 -89 61 -39 -66 168 125 47 125 0 117
1370.5A17j54j1n7K40q3n6j09k6K62j49k9J27nk51K13m2N4j35j42K99k0r7J94m5k27
1349.3a32L64j15J68l22J6Rj03J5jJ05lJ41k08j38L98l46J41j27L32k42N2q2J07M5
1329G4j6o5j43K0J20j25J14m9n4L16j49R0k00j48K75o0Rj3J94j55j85L8O5R6k1l7j55
1306.1a64K20K5k24J54K22l19O8j05J52j14pJ68L7j47j11R5N2k0j70N2K35j60L9p3
1285.8i5N7K51j53j03j08J14j83K87j58K5R2j58K16j25N2j74K24j71M3j3O4N2j14P3
1265.4eM3P8m7l10J67R9j38J63p9o8j7K87j45j12J05j55M5QJ18j09l4J04l0L6p6n9
1243.4a31J1J21l4J21n4j62N5J27k35R8JJ56k00O9OP6Oq6J04rj31M5r9mJ50M8j25J04
1219.7B8K4J07j52j63J04q8J59j27K6J0j07K57j23j49J08K73j31j47RJ17j43J39K8
$$ plain form
1370.5 117 -37 -48 -105 135 52 -4 -113 -139 123 -26 -55 72 67 -184 29 -13 41 -94 -236 63 43 -54 140 95 -132
1349.3 -132 232 117 285 -37 -21 -12 -115 -100 -101 4 1 142 -66 -204 194 -152 -11 -138 194 -48 4 -78 29 74
1329 74 58 -7 -150 -130 -10 -135 -21 -70 -124 192 43 133 -67 -215 60 0 9 -4 190 35 -150 -112 -47 49 28 -9 -164
1306.1 -164 56 81 -143 11 233 -86 -18 -123 29 -85 -92 76 113 -34 -145 -50 2 -18 -188 -136 99 -61 -22 -95
1285.8 -95 -38 213 60 -43 -151 -37 -220 67 -91 -66 26 -132 84 -41 11 -163 61 -110 -67 -80 -16 36 -78 -5
1265.4 -5 38 116 69 -241 -74 25 -113 50 -29 -97 -114 173 28 -84 21 -134 -89 -81 37 -72 -106 -2 -32 4 -72 -131
1243.4 -131 -120 1 -33 88 34 -128 -73 54 -181 -83 -82 74 -126 -57 -51 25 31 -55 49 40 -91 -46 -145 -149 1 49 -76 28
1219.7 28 52 159 7 -156 -52 -140 19 -108 -82 -72 -179 78 -45 -194 -86 187 56 -91 -82 35 -108 31 59
1200.2E9j33j81L34o3o9J15k00J01J72l7Q4j31J63j52J5m8O1j06j7k40L32ok12K37
1179.8G8k1P6j62K2nn1r3J18J7N0J51m3k02p5K25r7K3q8J79r7k89L75M5k16J34p3k2
1156.9d1mm7NJ05J8j94R0J32p4M4j25J01J14j02j42j50L58j80O6K28k05q4L6J31r5
1135.7a5l8J76j24N8Pk2j9j50K18j52J56k99K39o6l6J60j31J67j79j28M27l40J26J37
$$ plain form
1200.2 59 -74 -255 79 16 -53 62 -138 -37 135 98 182 51 214 62 77 29 90 -16 -33 -273 59 53 -159 78
1179.8 78 57 133 -29 -7 -12 -63 -156 -38 -21 29 180 137 -65 -140 85 -12 11 -77 102 5 -284 91 136 -80 54 -19 -41
1156.9 -41 -45 -92 -87 18 36 -158 -68 64 -10 34 -91 10 124 22 -120 -270 88 -92 -26 202 -3 -87 -51 80 -15
1135.7 -15 -53 123 -1 57 64 42 23 -127 91 -61 95 -204 35 -31 -67 93 -38 129 -50 -178 249 -91 35 172
$$ [...]
0.7A15
##END=$$ End of the data block
##END=$$ End of Block File