##TITLE= Compound file, contains several data records
##JCAMP-DX= 5.0
##DATA TYPE= LINK
##BLOCKS=5
##ORIGIN= Department of Chemistry, UWI, JAMAICA
##OWNER= public domain
##TITLE=n-hexane $$ Begin of the data block
##JCAMP-DX=5.00 $$ ACD/DocManager Library v 5.00
##SPECTROMETER/DATA SYSTEM=PERKIN-ELMER 1000 FT-IR
##DATA TYPE=INFRARED SPECTRUM
##DATA CLASS=XYDATA
##BLOCK_ID=1
##ORIGIN=Dept of Chemistry, UWI, JAMAICA
##OWNER=public domain
##DATE=99/10/22
##TIME=13:54:00
##SPECTROMETER/DATA SYSTEM=PERKIN-ELMER 1000 FT-IR
##$MODELS=
<Models>
 <ModelData id="n-hexane" type="MOL">
n-hexane
RLDSViewer          3D                             0

 20 19  0  0  0  0  0  0  0  0999 V2000
   -2.8192   -1.4061    0.0062 C   0  0  0  0  0  0  0  0  0  1
   -1.3122   -1.4061    0.0062 C   0  0  0  0  0  0  0  0  0  2
   -0.7570    0.0025    0.0062 C   0  0  0  0  0  0  0  0  0  3
    0.7563   -0.0014    0.0235 C   0  0  0  0  0  0  0  0  0  4
    1.3126    1.4062   -0.0079 C   0  0  0  0  0  0  0  0  0  5
    2.8193    1.4050   -0.0323 C   0  0  0  0  0  0  0  0  0  6
   -3.2136   -0.8946    0.9175 H   0  0  0  0  0  0  0  0  0  7
   -3.2071   -2.4531   -0.0065 H   0  0  0  0  0  0  0  0  0  8
   -3.2141   -0.8724   -0.8922 H   0  0  0  0  0  0  0  0  0  9
   -0.9344   -1.9561   -0.8960 H   0  0  0  0  0  0  0  0  0 10
   -0.9351   -1.9559    0.9090 H   0  0  0  0  0  0  0  0  0 11
   -1.1421    0.5575    0.9020 H   0  0  0  0  0  0  0  0  0 12
   -1.1217    0.5493   -0.9031 H   0  0  0  0  0  0  0  0  0 13
    1.1203   -0.5289    0.9445 H   0  0  0  0  0  0  0  0  0 14
    1.1413   -0.5765   -0.8595 H   0  0  0  0  0  0  0  0  0 15
    0.9215    1.9422   -0.9131 H   0  0  0  0  0  0  0  0  0 16
    0.9508    1.9707    0.8918 H   0  0  0  0  0  0  0  0  0 17
    3.2278    0.8721    0.8601 H   0  0  0  0  0  0  0  0  0 18
    3.2090    2.4515   -0.0271 H   0  0  0  0  0  0  0  0  0 19
    3.1984    0.8923   -0.9493 H   0  0  0  0  0  0  0  0  0 20
  1  7  1  0  0  0
  1  2  1  0  0  0
  1  9  1  0  0  0
  1  8  1  0  0  0
  2  3  1  0  0  0
  2 11  1  0  0  0
  2 10  1  0  0  0
  3 12  1  0  0  0
  3  4  1  0  0  0
  3 13  1  0  0  0
  4 14  1  0  0  0
  4  5  1  0  0  0
  4 15  1  0  0  0
  5  6  1  0  0  0
  5 16  1  0  0  0
  5 17  1  0  0  0
  6 20  1  0  0  0
  6 19  1  0  0  0
  6 18  1  0  0  0
M  END
 </ModelData>
 <ModelData id="1" type="XYZVIB" vibrationScale="0.1" baseModel="n-hexane">
20
1  Energy: -962.48043  Freq: 52.54658
C    -2.819200   -1.406100    0.006200   -0.003060    0.006320    0.182520
C    -1.312200   -1.406100    0.006200   -0.002940   -0.002860   -0.057000
C    -0.757000    0.002500    0.006200    0.002940   -0.005040   -0.132020
C     0.756300   -0.001400    0.023500    0.002940   -0.006700   -0.148460
C     1.312600    1.406200   -0.007900   -0.001660   -0.002340   -0.064100
C     2.819300    1.405000   -0.032300    0.002180    0.009160    0.189380
H    -3.213600   -0.894600    0.917500    0.143680   -0.009080    0.254080
$$ [...]
C    -1.312200   -1.406100    0.006200   -0.000060    0.000040    0.000020
C    -0.757000    0.002500    0.006200    0.000000   -0.000160    0.000040
C     0.756300   -0.001400    0.023500   -0.000240   -0.001820    0.000060
C     1.312600    1.406200   -0.007900    0.014340   -0.007440   -0.000100
C     2.819300    1.405000   -0.032300    0.072200    0.000080   -0.000820
H    -3.213600   -0.894600    0.917500    0.001880   -0.002640   -0.004760
H    -3.207100   -2.453100   -0.006500    0.001780    0.005340    0.000080
H    -3.214100   -0.872400   -0.892200    0.001940   -0.002860    0.004800
H    -0.934400   -1.956100   -0.896000    0.000260   -0.000320   -0.000540
H    -0.935100   -1.955900    0.909000    0.000120   -0.000100    0.000260
H    -1.142100    0.557500    0.902000   -0.000360    0.000180    0.000480
H    -1.121700    0.549300   -0.903100   -0.000560    0.000400   -0.000980
H     1.120300   -0.528900    0.944500   -0.001340    0.003620   -0.005820
H     1.141300   -0.576500   -0.859500   -0.001360    0.003880    0.005400
H     0.921500    1.942200   -0.913100   -0.039080    0.051760   -0.093400
H     0.950800    1.970700    0.891800   -0.036080    0.054600    0.092920
H     3.227800    0.872100    0.860100   -0.332440    0.471060   -0.791500
H     3.209000    2.451500   -0.027100   -0.313340   -0.924380   -0.004860
H     3.198400    0.892300   -0.949300   -0.304060    0.450460    0.807340
</ModelData>
</Models>
##$PEAKS=
<Peaks type="IR" xUnits="1/cm" yUnits="TRANSMITTANCE" >
<PeakData id="1" title="asymmetric stretch of CH3 group (~2962 cm-1)" peakShape="broad" model="1.46" xMax="2977" xMin="2937"  yMax="1" yMin="0" />
<PeakData id="2" title="asymmetric stretch of CH2 group (~2925 cm-1)" peakShape="broad" model="1.43" xMax="2945" xMin="2905"  yMax="1" yMin="0" />
<PeakData id="3" title="symmetric stretch of CH3 group (~2875 cm-1)" peakShape="broad" model="1.53" xMax="2885" xMin="2865"  yMax="1" yMin="0" />
<PeakData id="4" title="symmetric stretch of CH2 group (~2860 cm-1)" peakShape="broad" model="1.51" xMax="2870" xMin="2850"  yMax="1" yMin="0" />
<PeakData id="5" title="asymmetric bend of CH3 group (~1468 cm-1)" peakShape="broad" model="1.38" xMax="1490" xMin="1460"  yMax="1" yMin="0" />
<PeakData id="6" title="scissors of CH2 group (~1460 cm-1)" peakShape="broad" model="1.36" xMax="1470" xMin="1430"  yMax="1" yMin="0" />
<PeakData id="7" title="symmetric bend CH3 group (~1379 cm-1)" peakShape="broad" model="1.32" xMax="1390" xMin="1370"  yMax="1" yMin="0" />
<PeakData id="8" title="concerted rocking mode of CH2 groups (~720 cm-1)" peakShape="broad" model="1.10" xMax="735" xMin="715"  yMax="1" yMin="0" />
</Peaks>
##DELTAX=   .5000000
##XUNITS= 1/CM
##YUNITS= TRANSMITTANCE
##NPOINTS=6701
##FIRSTX=650.00000000
##LASTX=4000.00000000
##MAXX=4000.00000000
##MINX=650.00000000
##MAXY=0.97456133
##MINY=0.03096159
##XFACTOR=1.0000000000
##YFACTOR=0.0000304550
##FIRSTY=0.57423180
##XYDATA=(X++(Y..Y))
$$ [...]
H     2.248300   -0.096700    0.318300   -0.035240    0.000460    0.012760
H     1.157800    0.334800    1.692600    0.002020   -0.012020   -0.029540
H    -1.603400    1.298400    0.183900    0.566840   -0.512020   -0.737900
H    -1.186100    1.182800   -1.571400    0.227440   -0.542240    1.269660
H    -2.543600   -0.767200   -0.592300    0.250220    0.011800    0.001600
17
5  Energy: -1227.29289  Freq: 3076.35538
C    -0.902100   -1.468900    0.640800    0.000220    0.000760    0.000620
C     0.610500   -1.468900    0.640800   -0.010020   -0.001700   -0.010520
C     1.171800   -0.069000    0.640800   -0.100640   -0.025020   -0.040940
C     0.452200    0.946300   -0.203200   -0.007480    0.006680   -0.007200
C    -0.989700    0.725400   -0.564900   -0.000200    0.001620   -0.000720
C    -1.422900   -0.723900   -0.568500   -0.000720   -0.000400   -0.000700
H    -1.052000   -1.224400   -1.501700   -0.005100    0.006120    0.011440
O     1.035900    1.975600   -0.566700   -0.000820   -0.001080    0.000320
H    -1.279900   -2.524200    0.627200    0.004760    0.010400    0.000300
H    -1.283700   -0.987800    1.579400    0.005440   -0.007780   -0.014420
H     0.979300   -2.022900   -0.263400   -0.002200    0.002980   -0.005880
H     0.990900   -2.016900    1.542600    0.050060   -0.078140    0.124440
H     2.248300   -0.096700    0.318300    1.397300   -0.057740   -0.453260
H     1.157800    0.334800    1.692600   -0.060460    0.383100    1.023240
H    -1.603400    1.298400    0.183900    0.014740   -0.012140   -0.017900
H    -1.186100    1.182800   -1.571400    0.008180   -0.014920    0.035840
H    -2.543600   -0.767200   -0.592300    0.016580    0.000460   -0.000060
17
6  Energy: -1227.29289  Freq: 3035.21205
C    -0.902100   -1.468900    0.640800    0.000120   -0.077440   -0.047200
C     0.610500   -1.468900    0.640800   -0.003160    0.000400   -0.050920
C     1.171800   -0.069000    0.640800    0.009140   -0.001860   -0.011040
C     0.452200    0.946300   -0.203200    0.000300   -0.000380   -0.000980
C    -0.989700    0.725400   -0.564900    0.005820    0.000260   -0.019740
C    -1.422900   -0.723900   -0.568500    0.051120   -0.015260   -0.026400
H    -1.052000   -1.224400   -1.501700   -0.110520    0.178860    0.340780
O     1.035900    1.975600   -0.566700   -0.000120   -0.000240    0.000000
H    -1.279900   -2.524200    0.627200    0.266200    0.700420   -0.015960
H    -1.283700   -0.987800    1.579400   -0.248860    0.268880    0.585040
H     0.979300   -2.022900   -0.263400   -0.128480    0.184300    0.272320
H     0.990900   -2.016900    1.542600    0.155500   -0.226360    0.345840
H     2.248300   -0.096700    0.318300   -0.113660    0.001580    0.029560
H     1.157800    0.334800    1.692600    0.004760    0.038140    0.091300
H    -1.603400    1.298400    0.183900   -0.082260    0.082320    0.093360
H    -1.186100    1.182800   -1.571400    0.033580   -0.070820    0.145200
H    -2.543600   -0.767200   -0.592300   -0.529220   -0.030340   -0.025040
17
7  Energy: -1227.29289  Freq: 3025.84328
C    -0.902100   -1.468900    0.640800   -0.001300   -0.017880   -0.014160
C     0.610500   -1.468900    0.640800    0.000980   -0.001560   -0.065420
C     1.171800   -0.069000    0.640800    0.013720   -0.004840   -0.018800
C     0.452200    0.946300   -0.203200    0.000320   -0.000240    0.000960
C    -0.989700    0.725400   -0.564900   -0.012140    0.003520    0.041980
C    -1.422900   -0.723900   -0.568500   -0.066760    0.020400    0.042700
H    -1.052000   -1.224400   -1.501700    0.197040   -0.305560   -0.561700
O     1.035900    1.975600   -0.566700    0.000220    0.000100    0.000080
H    -1.279900   -2.524200    0.627200    0.057660    0.152260   -0.005720
H    -1.283700   -0.987800    1.579400   -0.078760    0.084860    0.170440
H     0.979300   -2.022900   -0.263400   -0.183300    0.274760    0.414020
H     0.990900   -2.016900    1.542600    0.184840   -0.267500    0.402980
H     2.248300   -0.096700    0.318300   -0.180760    0.001900    0.046200
H     1.157800    0.334800    1.692600    0.006540    0.067820    0.167900
H    -1.603400    1.298400    0.183900    0.194700   -0.188500   -0.222200
H    -1.186100    1.182800   -1.571400   -0.069600    0.146960   -0.297820
H    -2.543600   -0.767200   -0.592300    0.644620    0.038600    0.036640
17
8  Energy: -1227.29289  Freq: 3018.67174
C    -0.902100   -1.468900    0.640800   -0.003300    0.056660    0.039480
C     0.610500   -1.468900    0.640800    0.002560   -0.003520   -0.070760
C     1.171800   -0.069000    0.640800    0.020260   -0.009220   -0.028980
C     0.452200    0.946300   -0.203200    0.001220   -0.000160   -0.001940
C    -0.989700    0.725400   -0.564900    0.008320   -0.003820   -0.029520
C    -1.422900   -0.723900   -0.568500    0.023920   -0.007940   -0.016680
H    -1.052000   -1.224400   -1.501700   -0.086620    0.133100    0.239100
O     1.035900    1.975600   -0.566700   -0.000180   -0.000480    0.000020
H    -1.279900   -2.524200    0.627200   -0.173320   -0.447740    0.015880
H    -1.283700   -0.987800    1.579400    0.231360   -0.267000   -0.557840
H     0.979300   -2.022900   -0.263400   -0.217280    0.333680    0.506380
H     0.990900   -2.016900    1.542600    0.181580   -0.262740    0.390080
H     2.248300   -0.096700    0.318300   -0.269840    0.002840    0.068540
H     1.157800    0.334800    1.692600    0.008400    0.107940    0.273460
H    -1.603400    1.298400    0.183900   -0.146600    0.139040    0.167760
H    -1.186100    1.182800   -1.571400    0.047540   -0.099860    0.201620
H    -2.543600   -0.767200   -0.592300   -0.203900   -0.013020   -0.013640
17
9  Energy: -1227.29289  Freq: 3005.18825
C    -0.902100   -1.468900    0.640800    0.000680   -0.013080   -0.009360
C     0.610500   -1.468900    0.640800    0.000120    0.000520    0.005240
C     1.171800   -0.069000    0.640800   -0.000780    0.000400    0.001460
C     0.452200    0.946300   -0.203200    0.003820    0.001380   -0.003600
C    -0.989700    0.725400   -0.564900    0.033280   -0.016400   -0.109960
C    -1.422900   -0.723900   -0.568500   -0.047000    0.016760    0.031720
H    -1.052000   -1.224400   -1.501700    0.176880   -0.254520   -0.486300
O     1.035900    1.975600   -0.566700   -0.000880   -0.001280    0.000120
H    -1.279900   -2.524200    0.627200    0.033940    0.086860   -0.004420
H    -1.283700   -0.987800    1.579400   -0.064640    0.074420    0.150740
H     0.979300   -2.022900   -0.263400    0.019560   -0.029960   -0.045820
H     0.990900   -2.016900    1.542600   -0.010560    0.015180   -0.021620
H     2.248300   -0.096700    0.318300    0.014040    0.000000   -0.003620
H     1.157800    0.334800    1.692600   -0.000540   -0.005220   -0.013760
H    -1.603400    1.298400    0.183900   -0.622680    0.576220    0.713700
H    -1.186100    1.182800   -1.571400    0.167280   -0.343600    0.688760
H    -2.543600   -0.767200   -0.592300    0.418360    0.025300    0.027020
17
10  Energy: -1227.29289  Freq: 2995.12937
C    -0.902100   -1.468900    0.640800    0.000220   -0.007660   -0.005300
C     0.610500   -1.468900    0.640800   -0.001160    0.003180    0.048820
C     1.171800   -0.069000    0.640800    0.065820   -0.034280   -0.103640
C     0.452200    0.946300   -0.203200    0.001940    0.001900   -0.005200
C    -0.989700    0.725400   -0.564900   -0.000840    0.000380    0.002240
C    -1.422900   -0.723900   -0.568500   -0.000740    0.000460    0.000300
H    -1.052000   -1.224400   -1.501700    0.004000   -0.006280   -0.011500
O     1.035900    1.975600   -0.566700   -0.000400   -0.001480    0.000340
H    -1.279900   -2.524200    0.627200    0.019220    0.048260   -0.002380
H    -1.283700   -0.987800    1.579400   -0.037140    0.045100    0.094100
H     0.979300   -2.022900   -0.263400    0.174180   -0.248840   -0.394640
H     0.990900   -2.016900    1.542600   -0.124860    0.176520   -0.263520
H     2.248300   -0.096700    0.318300   -0.835400    0.011180    0.204400
H     1.157800    0.334800    1.692600    0.018260    0.431460    1.146820
H    -1.603400    1.298400    0.183900    0.013760   -0.012500   -0.015440
H    -1.186100    1.182800   -1.571400   -0.003680    0.007960   -0.015720
H    -2.543600   -0.767200   -0.592300    0.000520    0.000160    0.000460
17
11  Energy: -1227.29289  Freq: 2042.8317
C    -0.902100   -1.468900    0.640800    0.000180   -0.000460   -0.000660
C     0.610500   -1.468900    0.640800   -0.001600    0.012580   -0.005160
C     1.171800   -0.069000    0.640800   -0.005940    0.034560   -0.024340
C     0.452200    0.946300   -0.203200   -0.349880   -0.611240    0.214760
C    -0.989700    0.725400   -0.564900    0.040900    0.017540    0.001020
C    -1.422900   -0.723900   -0.568500    0.011600    0.010000    0.002280
H    -1.052000   -1.224400   -1.501700   -0.005200   -0.004180    0.002660
O     1.035900    1.975600   -0.566700    0.236060    0.415760   -0.147200
H    -1.279900   -2.524200    0.627200    0.000000    0.001860    0.002200
H    -1.283700   -0.987800    1.579400    0.001420    0.004040    0.000000
H     0.979300   -2.022900   -0.263400   -0.002320   -0.004380    0.005480
H     0.990900   -2.016900    1.542600   -0.007900    0.008180   -0.015960
H     2.248300   -0.096700    0.318300    0.009700   -0.099280    0.031160
H     1.157800    0.334800    1.692600   -0.039040   -0.016420    0.039080
H    -1.603400    1.298400    0.183900   -0.016480   -0.020820    0.048280
H    -1.186100    1.182800   -1.571400   -0.077320   -0.067100   -0.016600
H    -2.543600   -0.767200   -0.592300    0.021660   -0.002100    0.001040
17
12  Energy: -1227.29289  Freq: 1447.02589
C    -0.902100   -1.468900    0.640800    0.036880   -0.041860    0.038860
C     0.610500   -1.468900    0.640800    0.038520    0.163920   -0.028400
C     1.171800   -0.069000    0.640800    0.033100   -0.328640    0.123640
C     0.452200    0.946300   -0.203200   -0.226760    0.094940   -0.127580
C    -0.989700    0.725400   -0.564900    0.183820    0.074940    0.053440
C    -1.422900   -0.723900   -0.568500   -0.051680   -0.001680   -0.041780
H    -1.052000   -1.224400   -1.501700    0.034300   -0.102440    0.056200
O     1.035900    1.975600   -0.566700    0.003280    0.017240   -0.009680
H    -1.279900   -2.524200    0.627200   -0.270000    0.082620   -0.092940
H    -1.283700   -0.987800    1.579400   -0.081240    0.039720   -0.052500
H     0.979300   -2.022900   -0.263400    0.016980   -0.044140    0.067260
H     0.990900   -2.016900    1.542600    0.055020    0.111100   -0.022660
H     2.248300   -0.096700    0.318300    0.016320    0.269500    0.041900
H     1.157800    0.334800    1.692600    0.089260    0.254940   -0.102080
H    -1.603400    1.298400    0.183900   -0.059440   -0.080500   -0.004300
H    -1.186100    1.182800   -1.571400    0.004500   -0.104320   -0.019220
H    -2.543600   -0.767200   -0.592300   -0.023120   -0.242680    0.065260
17
13  Energy: -1227.29289  Freq: 1431.75638
C    -0.902100   -1.468900    0.640800    0.125240    0.070100   -0.022320
C     0.610500   -1.468900    0.640800   -0.232180   -0.152080   -0.001800
C     1.171800   -0.069000    0.640800    0.091300    0.089800    0.013500
C     0.452200    0.946300   -0.203200   -0.075220    0.005520   -0.043440
C    -0.989700    0.725400   -0.564900    0.126380    0.157700    0.008760
C    -1.422900   -0.723900   -0.568500   -0.042200   -0.175920    0.065700
H    -1.052000   -1.224400   -1.501700   -0.021640    0.188340   -0.116880
O     1.035900    1.975600   -0.566700   -0.015620   -0.025900    0.011940
H    -1.279900   -2.524200    0.627200   -0.020280    0.077740   -0.049560
H    -1.283700   -0.987800    1.579400   -0.134060   -0.116040   -0.011700
H     0.979300   -2.022900   -0.263400    0.358020    0.210380    0.014760
H     0.990900   -2.016900    1.542600    0.384660    0.241920   -0.022060
H     2.248300   -0.096700    0.318300    0.040060    0.030840   -0.040400
H     1.157800    0.334800    1.692600   -0.083760   -0.052100    0.041260
H    -1.603400    1.298400    0.183900   -0.112960   -0.167120    0.047700
H    -1.186100    1.182800   -1.571400   -0.054320   -0.111480   -0.065640
H    -2.543600   -0.767200   -0.592300   -0.028180    0.166360   -0.230100
17
14  Energy: -1227.29289  Freq: 1425.4223
C    -0.902100   -1.468900    0.640800   -0.040100   -0.045500    0.066740
C     0.610500   -1.468900    0.640800    0.084580   -0.052500    0.004400
C     1.171800   -0.069000    0.640800    0.008880    0.116320   -0.025680
C     0.452200    0.946300   -0.203200   -0.038080   -0.001780   -0.022360
C    -0.989700    0.725400   -0.564900    0.124280    0.099100    0.032420
C    -1.422900   -0.723900   -0.568500   -0.068520    0.018140   -0.095960
H    -1.052000   -1.224400   -1.501700    0.271960   -0.114640    0.138960
O     1.035900    1.975600   -0.566700   -0.019200   -0.033360    0.013900
H    -1.279900   -2.524200    0.627200    0.112460   -0.078200   -0.254240
H    -1.283700   -0.987800    1.579400    0.100500    0.238800   -0.053460
H     0.979300   -2.022900   -0.263400   -0.225960    0.119000   -0.197440
H     0.990900   -2.016900    1.542600   -0.305380    0.060220    0.212360
H     2.248300   -0.096700    0.318300    0.007580   -0.382200    0.036660
H     1.157800    0.334800    1.692600   -0.059500   -0.244720    0.100060
H    -1.603400    1.298400    0.183900   -0.179080   -0.198100    0.005660
H    -1.186100    1.182800   -1.571400   -0.218700   -0.306200   -0.088420
H    -2.543600   -0.767200   -0.592300   -0.045940   -0.158300    0.361280
17
15  Energy: -1227.29289  Freq: 1421.61784
C    -0.902100   -1.468900    0.640800   -0.244420    0.107740   -0.158060
C     0.610500   -1.468900    0.640800    0.161700   -0.002340    0.029740
C     1.171800   -0.069000    0.640800    0.005020   -0.020220    0.018160
C     0.452200    0.946300   -0.203200   -0.077480    0.024480   -0.043980
C    -0.989700    0.725400   -0.564900    0.055040    0.061020   -0.004900
C    -1.422900   -0.723900   -0.568500    0.074120   -0.154200    0.144600
H    -1.052000   -1.224400   -1.501700   -0.242880    0.153500   -0.166540
O     1.035900    1.975600   -0.566700   -0.004260   -0.005580    0.002260
H    -1.279900   -2.524200    0.627200    0.241540   -0.077280    0.133480
H    -1.283700   -0.987800    1.579400    0.321520   -0.144800    0.204280
H     0.979300   -2.022900   -0.263400   -0.180000    0.102640   -0.151200
H     0.990900   -2.016900    1.542600    0.073160    0.150660    0.121120
H     2.248300   -0.096700    0.318300   -0.002980   -0.291480    0.018460
H     1.157800    0.334800    1.692600   -0.041080   -0.135300    0.053820
H    -1.603400    1.298400    0.183900    0.034020    0.038680   -0.002140
H    -1.186100    1.182800   -1.571400    0.124020    0.194580    0.049940
H    -2.543600   -0.767200   -0.592300    0.050500   -0.098980   -0.125000
17
16  Energy: -1227.29289  Freq: 1411.14653
C    -0.902100   -1.468900    0.640800   -0.053580   -0.043240    0.069280
C     0.610500   -1.468900    0.640800   -0.024460    0.063660   -0.003320
C     1.171800   -0.069000    0.640800   -0.002660    0.026020   -0.011840
C     0.452200    0.946300   -0.203200    0.010920   -0.008600    0.006240
C    -0.989700    0.725400   -0.564900    0.014900    0.048540   -0.007480
C    -1.422900   -0.723900   -0.568500    0.026020   -0.016800    0.046940
H    -1.052000   -1.224400   -1.501700   -0.401880    0.012560   -0.149780
O     1.035900    1.975600   -0.566700   -0.007800   -0.009820    0.003340
H    -1.279900   -2.524200    0.627200    0.243500   -0.112060   -0.620160
H    -1.283700   -0.987800    1.579400    0.282740    0.601460   -0.152360
H     0.979300   -2.022900   -0.263400    0.224400   -0.360020    0.336760
H     0.990900   -2.016900    1.542600    0.137120   -0.402580   -0.328360
H     2.248300   -0.096700    0.318300   -0.000800   -0.043860   -0.002660
H     1.157800    0.334800    1.692600   -0.023620   -0.025860    0.011320
H    -1.603400    1.298400    0.183900   -0.015500   -0.085260    0.062820
H    -1.186100    1.182800   -1.571400   -0.004160   -0.073340   -0.049720
H    -2.543600   -0.767200   -0.592300    0.025700   -0.184240   -0.350240
17
17  Energy: -1227.29289  Freq: 1410.22937
C    -0.902100   -1.468900    0.640800    0.003860    0.021300   -0.020360
C     0.610500   -1.468900    0.640800    0.068400    0.110940    0.004340
C     1.171800   -0.069000    0.640800   -0.067040   -0.014920   -0.030440
C     0.452200    0.946300   -0.203200    0.074700   -0.031700    0.041680
C    -0.989700    0.725400   -0.564900   -0.014080    0.102180   -0.027740
C    -1.422900   -0.723900   -0.568500   -0.052180   -0.188340    0.009780
H    -1.052000   -1.224400   -1.501700    0.518680    0.333940   -0.008020
O     1.035900    1.975600   -0.566700   -0.011080   -0.000860   -0.002800
H    -1.279900   -2.524200    0.627200   -0.304920    0.122520   -0.073380
H    -1.283700   -0.987800    1.579400   -0.081640   -0.103660    0.013600
H     0.979300   -2.022900   -0.263400   -0.059920   -0.336540    0.202540
H     0.990900   -2.016900    1.542600   -0.055460   -0.373480   -0.223720
H     2.248300   -0.096700    0.318300   -0.011780    0.029740    0.074900
H     1.157800    0.334800    1.692600    0.105200    0.018400   -0.020260
H    -1.603400    1.298400    0.183900   -0.029020   -0.126600    0.098420
H    -1.186100    1.182800   -1.571400   -0.006200   -0.095440   -0.089380
H    -2.543600   -0.767200   -0.592300   -0.062320    0.551200    0.340500
17
18  Energy: -1227.29289  Freq: 1399.27588
C    -0.902100   -1.468900    0.640800    0.034540    0.007280   -0.043920
C     0.610500   -1.468900    0.640800    0.026760    0.052280    0.010780
C     1.171800   -0.069000    0.640800   -0.017680    0.078560   -0.034200
C     0.452200    0.946300   -0.203200   -0.009020   -0.007440   -0.005940
C    -0.989700    0.725400   -0.564900    0.078180    0.042220    0.020320
C    -1.422900   -0.723900   -0.568500    0.001880    0.059840   -0.000300
H    -1.052000   -1.224400   -1.501700   -0.311780   -0.197720   -0.005220
O     1.035900    1.975600   -0.566700   -0.014720   -0.025640    0.010220
H    -1.279900   -2.524200    0.627200   -0.287400    0.098120    0.518480
H    -1.283700   -0.987800    1.579400   -0.250800   -0.466860    0.111180
H     0.979300   -2.022900   -0.263400    0.018340   -0.322360    0.217220
H     0.990900   -2.016900    1.542600   -0.010560   -0.395840   -0.234240
H     2.248300   -0.096700    0.318300    0.011560   -0.251540    0.088140
H     1.157800    0.334800    1.692600    0.012920   -0.182520    0.068340
H    -1.603400    1.298400    0.183900   -0.142360   -0.106600   -0.040820
H    -1.186100    1.182800   -1.571400   -0.188960   -0.154840   -0.021120
H    -2.543600   -0.767200   -0.592300    0.016600   -0.386340   -0.229400
17
19  Energy: -1227.29289  Freq: 1394.69677
C    -0.902100   -1.468900    0.640800   -0.090180    0.028600   -0.048900
C     0.610500   -1.468900    0.640800   -0.071700   -0.006720    0.013760
C     1.171800   -0.069000    0.640800    0.056340    0.020960    0.022880
C     0.452200    0.946300   -0.203200   -0.053460    0.020700   -0.029640
C    -0.989700    0.725400   -0.564900    0.026800   -0.066980    0.024200
C    -1.422900   -0.723900   -0.568500   -0.004600    0.046480   -0.061140
H    -1.052000   -1.224400   -1.501700    0.432460   -0.092240    0.203100
O     1.035900    1.975600   -0.566700    0.006440   -0.001500    0.002840
H    -1.279900   -2.524200    0.627200    0.315580   -0.117440    0.160480
H    -1.283700   -0.987800    1.579400    0.235800   -0.056040    0.125780
H     0.979300   -2.022900   -0.263400    0.371520   -0.205300    0.296960
H     0.990900   -2.016900    1.542600    0.449860   -0.202140   -0.308520
H     2.248300   -0.096700    0.318300   -0.008780   -0.087160   -0.122000
H     1.157800    0.334800    1.692600   -0.168860   -0.038200    0.027820
H    -1.603400    1.298400    0.183900   -0.026220    0.159820   -0.168480
H    -1.186100    1.182800   -1.571400   -0.068600    0.151620    0.119020
H    -2.543600   -0.767200   -0.592300   -0.004460   -0.002180    0.560160
17
20  Energy: -1227.29289  Freq: 1374.76349
C    -0.902100   -1.468900    0.640800    0.033360    0.002200    0.016360
C     0.610500   -1.468900    0.640800    0.000280   -0.007020    0.001160
C     1.171800   -0.069000    0.640800   -0.050920    0.021200   -0.045580
C     0.452200    0.946300   -0.203200   -0.007960   -0.003140   -0.000080
C    -0.989700    0.725400   -0.564900    0.100240   -0.066960    0.022020
C    -1.422900   -0.723900   -0.568500   -0.017300   -0.050900    0.024560
H    -1.052000   -1.224400   -1.501700    0.007480    0.089140   -0.044980
O     1.035900    1.975600   -0.566700   -0.002280   -0.006780    0.002100
H    -1.279900   -2.524200    0.627200   -0.063320    0.038140   -0.187400
H    -1.283700   -0.987800    1.579400   -0.042520    0.109660   -0.073740
H     0.979300   -2.022900   -0.263400   -0.066360   -0.001320   -0.030080
H     0.990900   -2.016900    1.542600   -0.097940   -0.035120    0.021840
H     2.248300   -0.096700    0.318300    0.101060    0.065440    0.399840
H     1.157800    0.334800    1.692600    0.399660   -0.047400    0.006100
H    -1.603400    1.298400    0.183900   -0.311520    0.474700   -0.671240
H    -1.186100    1.182800   -1.571400   -0.564760    0.602600    0.416320
H    -2.543600   -0.767200   -0.592300   -0.013320    0.058460   -0.089800
17
21  Energy: -1227.29289  Freq: 1371.1108
C    -0.902100   -1.468900    0.640800   -0.054080    0.024980   -0.035200
C     0.610500   -1.468900    0.640800   -0.040220   -0.047620    0.015340
C     1.171800   -0.069000    0.640800   -0.081920   -0.019160   -0.065520
C     0.452200    0.946300   -0.203200    0.022820   -0.011960    0.014080
C    -0.989700    0.725400   -0.564900    0.001640    0.045420    0.002460
C    -1.422900   -0.723900   -0.568500    0.008340    0.035320   -0.019660
H    -1.052000   -1.224400   -1.501700    0.013440   -0.120180    0.066900
O     1.035900    1.975600   -0.566700   -0.005640   -0.002060   -0.001000
H    -1.279900   -2.524200    0.627200    0.279420   -0.097180    0.118720
H    -1.283700   -0.987800    1.579400    0.195260   -0.042120    0.099220
H     0.979300   -2.022900   -0.263400    0.096500    0.071460   -0.004740
H     0.990900   -2.016900    1.542600    0.170660    0.051780   -0.021020
H     2.248300   -0.096700    0.318300    0.198260    0.435780    0.705160
H     1.157800    0.334800    1.692600    0.791980    0.113940   -0.063960
H    -1.603400    1.298400    0.183900    0.000040   -0.228980    0.190640
H    -1.186100    1.182800   -1.571400    0.041860   -0.309080   -0.151780
H    -2.543600   -0.767200   -0.592300    0.011080   -0.164340    0.131540
17
22  Energy: -1227.29289  Freq: 1340.07578
C    -0.902100   -1.468900    0.640800    0.053440   -0.017560    0.031280
C     0.610500   -1.468900    0.640800   -0.001220   -0.004320    0.000160
C     1.171800   -0.069000    0.640800    0.020860    0.063740   -0.020920
C     0.452200    0.946300   -0.203200   -0.159820    0.060400   -0.088880
C    -0.989700    0.725400   -0.564900   -0.042960   -0.071920    0.007680
C    -1.422900   -0.723900   -0.568500    0.005200    0.002920    0.003840
H    -1.052000   -1.224400   -1.501700    0.087240    0.070380    0.002300
O     1.035900    1.975600   -0.566700    0.014620   -0.004680    0.007440
H    -1.279900   -2.524200    0.627200   -0.123140    0.047220   -0.079960
H    -1.283700   -0.987800    1.579400   -0.173520    0.067940   -0.104640
H     0.979300   -2.022900   -0.263400    0.018040   -0.078820    0.050480
H     0.990900   -2.016900    1.542600   -0.078260   -0.134600   -0.040760
H     2.248300   -0.096700    0.318300    0.152280   -0.460240    0.493260
H     1.157800    0.334800    1.692600    0.299860   -0.385440    0.151560
H    -1.603400    1.298400    0.183900    0.411680    0.141680    0.224160
H    -1.186100    1.182800   -1.571400    0.655520    0.212620   -0.011080
H    -2.543600   -0.767200   -0.592300    0.001600    0.197540   -0.007200
17
23  Energy: -1227.29289  Freq: 1255.47509
C    -0.902100   -1.468900    0.640800   -0.083040    0.021040    0.135340
C     0.610500   -1.468900    0.640800    0.075040    0.016300   -0.028900
C     1.171800   -0.069000    0.640800   -0.022080   -0.059820   -0.031700
C     0.452200    0.946300   -0.203200    0.016780    0.008080    0.020260
C    -0.989700    0.725400   -0.564900   -0.011260   -0.049460   -0.019580
C    -1.422900   -0.723900   -0.568500    0.005220    0.035340   -0.060580
H    -1.052000   -1.224400   -1.501700   -0.121800    0.577020   -0.388120
O     1.035900    1.975600   -0.566700    0.001660    0.003600   -0.004460
H    -1.279900   -2.524200    0.627200   -0.072140    0.025660    0.020900
H    -1.283700   -0.987800    1.579400   -0.257540   -0.148860    0.132460
H     0.979300   -2.022900   -0.263400    0.840580    0.433140    0.041180
H     0.990900   -2.016900    1.542600    0.106500    0.106460    0.022660
H     2.248300   -0.096700    0.318300    0.021700   -0.295940    0.103920
H     1.157800    0.334800    1.692600    0.002660   -0.189400    0.023440
H    -1.603400    1.298400    0.183900   -0.079680   -0.104020   -0.032720
H    -1.186100    1.182800   -1.571400   -0.228500   -0.189820   -0.044720
H    -2.543600   -0.767200   -0.592300   -0.007460    0.068280    0.014940
17
24  Energy: -1227.29289  Freq: 1246.89607
C    -0.902100   -1.468900    0.640800    0.048960   -0.019800    0.067820
C     0.610500   -1.468900    0.640800   -0.054360   -0.003240    0.012100
C     1.171800   -0.069000    0.640800    0.033640    0.012820    0.025000
C     0.452200    0.946300   -0.203200   -0.060660    0.024740   -0.027620
C    -0.989700    0.725400   -0.564900    0.027700   -0.043140    0.003420
C    -1.422900   -0.723900   -0.568500   -0.005060    0.025820   -0.084260
H    -1.052000   -1.224400   -1.501700   -0.090520    0.566980   -0.402240
O     1.035900    1.975600   -0.566700    0.005140   -0.002700    0.002400
H    -1.279900   -2.524200    0.627200    0.332360   -0.123500    0.206020
H    -1.283700   -0.987800    1.579400    0.596000   -0.282340    0.419920
H     0.979300   -2.022900   -0.263400   -0.397560   -0.228400    0.011200
H     0.990900   -2.016900    1.542600   -0.317200   -0.180600    0.025000
H     2.248300   -0.096700    0.318300    0.016260    0.088160    0.003100
H     1.157800    0.334800    1.692600   -0.009740    0.113580   -0.019940
H    -1.603400    1.298400    0.183900   -0.014880   -0.043140   -0.025000
H    -1.186100    1.182800   -1.571400   -0.071280   -0.128700   -0.031360
H    -2.543600   -0.767200   -0.592300   -0.008720    0.294320   -0.182540
17
25  Energy: -1227.29289  Freq: 1226.9259
C    -0.902100   -1.468900    0.640800   -0.057940    0.033240    0.054820
C     0.610500   -1.468900    0.640800    0.061840   -0.134720   -0.122720
C     1.171800   -0.069000    0.640800    0.022140    0.072680    0.058600
C     0.452200    0.946300   -0.203200   -0.041480    0.024620    0.037460
C    -0.989700    0.725400   -0.564900    0.028580    0.001500   -0.015300
C    -1.422900   -0.723900   -0.568500    0.002700   -0.017040    0.001600
H    -1.052000   -1.224400   -1.501700   -0.017720    0.154780   -0.092000
O     1.035900    1.975600   -0.566700    0.000240   -0.011340    0.000540
H    -1.279900   -2.524200    0.627200    0.143080   -0.051380    0.040360
H    -1.283700   -0.987800    1.579400   -0.525040   -0.020040   -0.128460
H     0.979300   -2.022900   -0.263400    0.027400   -0.417720    0.066640
H     0.990900   -2.016900    1.542600   -0.147540   -0.061260    0.010880
H     2.248300   -0.096700    0.318300    0.008760   -0.140700    0.034080
H     1.157800    0.334800    1.692600    0.102940    0.980900   -0.301560
H    -1.603400    1.298400    0.183900    0.179020    0.084500    0.053400
H    -1.186100    1.182800   -1.571400    0.032160    0.052440    0.009400
H    -2.543600   -0.767200   -0.592300    0.004480   -0.166440    0.126320
17
26  Energy: -1227.29289  Freq: 1223.55102
C    -0.902100   -1.468900    0.640800    0.008480   -0.014660   -0.070820
C     0.610500   -1.468900    0.640800    0.010440   -0.001980   -0.005640
C     1.171800   -0.069000    0.640800    0.001840   -0.002740    0.035600
C     0.452200    0.946300   -0.203200   -0.007740   -0.002800   -0.050800
C    -0.989700    0.725400   -0.564900    0.027560   -0.102740   -0.045920
C    -1.422900   -0.723900   -0.568500   -0.014240    0.125740    0.148380
H    -1.052000   -1.224400   -1.501700    0.264660    0.457000    0.052800
O     1.035900    1.975600   -0.566700    0.006540    0.006080    0.003120
H    -1.279900   -2.524200    0.627200    0.183100   -0.068040    0.164400
H    -1.283700   -0.987800    1.579400   -0.280780    0.286320   -0.323500
H     0.979300   -2.022900   -0.263400   -0.194100   -0.156060    0.001240
H     0.990900   -2.016900    1.542600    0.136020    0.071840   -0.014580
H     2.248300   -0.096700    0.318300   -0.008640   -0.056060    0.003000
H     1.157800    0.334800    1.692600    0.065680   -0.061140    0.051320
H    -1.603400    1.298400    0.183900   -0.614820   -0.777740   -0.032500
H    -1.186100    1.182800   -1.571400    0.040100    0.044500    0.017220
H    -2.543600   -0.767200   -0.592300   -0.008940    0.152880   -0.097300
17
27  Energy: -1227.29289  Freq: 1178.20605
C    -0.902100   -1.468900    0.640800   -0.031400    0.001160    0.042680
C     0.610500   -1.468900    0.640800   -0.007640   -0.030000    0.005360
C     1.171800   -0.069000    0.640800    0.000140    0.042720   -0.020780
C     0.452200    0.946300   -0.203200    0.013660   -0.034600   -0.054980
C    -0.989700    0.725400   -0.564900    0.036980    0.019360    0.004640
C    -1.422900   -0.723900   -0.568500   -0.007400   -0.025440    0.007660
H    -1.052000   -1.224400   -1.501700    0.002300    0.239340   -0.122740
O     1.035900    1.975600   -0.566700    0.001460    0.007300    0.004360
H    -1.279900   -2.524200    0.627200   -0.045840   -0.000400    0.012720
H    -1.283700   -0.987800    1.579400   -0.103160   -0.070100    0.048460
H     0.979300   -2.022900   -0.263400    0.198620    0.141020   -0.005600
H     0.990900   -2.016900    1.542600   -0.465520   -0.329080    0.010060
H     2.248300   -0.096700    0.318300   -0.051520    0.671820   -0.258220
H     1.157800    0.334800    1.692600   -0.004760   -0.210680    0.069260
H    -1.603400    1.298400    0.183900   -0.136220   -0.145960   -0.019300
H    -1.186100    1.182800   -1.571400    0.521420    0.416200    0.086740
H    -2.543600   -0.767200   -0.592300    0.009560   -0.508700    0.293040
17
28  Energy: -1227.29289  Freq: 1150.19022
C    -0.902100   -1.468900    0.640800   -0.036860    0.008500    0.063120
C     0.610500   -1.468900    0.640800    0.031900   -0.030020   -0.063540
C     1.171800   -0.069000    0.640800   -0.018580    0.058980    0.107020
C     0.452200    0.946300   -0.203200    0.057320   -0.051500   -0.091220
C    -0.989700    0.725400   -0.564900   -0.053900    0.002120    0.060880
C    -1.422900   -0.723900   -0.568500    0.015440   -0.006140   -0.081100
H    -1.052000   -1.224400   -1.501700   -0.174020    0.041200   -0.164300
O     1.035900    1.975600   -0.566700    0.007200    0.022980    0.008720
H    -1.279900   -2.524200    0.627200   -0.351260    0.123280   -0.256560
H    -1.283700   -0.987800    1.579400    0.034040   -0.164140    0.159180
H     0.979300   -2.022900   -0.263400   -0.255540   -0.440580    0.097220
H     0.990900   -2.016900    1.542600    0.532440    0.481000    0.047740
H     2.248300   -0.096700    0.318300   -0.070720    0.065760   -0.123340
H     1.157800    0.334800    1.692600    0.286760   -0.178960    0.180540
H    -1.603400    1.298400    0.183900   -0.261840   -0.009280   -0.131220
H    -1.186100    1.182800   -1.571400    0.198000    0.002180   -0.002880
H    -2.543600   -0.767200   -0.592300    0.003400   -0.069960    0.113120
17
29  Energy: -1227.29289  Freq: 1148.87555
C    -0.902100   -1.468900    0.640800    0.023200   -0.009760   -0.048320
C     0.610500   -1.468900    0.640800   -0.048880    0.020040    0.046880
C     1.171800   -0.069000    0.640800    0.019920    0.018480   -0.056380
C     0.452200    0.946300   -0.203200   -0.006340    0.026800    0.093580
C    -0.989700    0.725400   -0.564900    0.030740   -0.068600   -0.074700
C    -1.422900   -0.723900   -0.568500   -0.020680    0.025080    0.042720
H    -1.052000   -1.224400   -1.501700    0.128280    0.453020   -0.148100
O     1.035900    1.975600   -0.566700   -0.000660   -0.019320   -0.004520
H    -1.279900   -2.524200    0.627200   -0.533900    0.195020   -0.268880
H    -1.283700   -0.987800    1.579400    0.300080    0.007840    0.071520
H     0.979300   -2.022900   -0.263400   -0.238800    0.033600   -0.051480
H     0.990900   -2.016900    1.542600    0.265020    0.134140   -0.027440
H     2.248300   -0.096700    0.318300    0.066060   -0.122820    0.142940
H     1.157800    0.334800    1.692600   -0.133700    0.161320   -0.095260
H    -1.603400    1.298400    0.183900    0.263300   -0.062560    0.134280
H    -1.186100    1.182800   -1.571400   -0.088580    0.022460    0.003860
H    -2.543600   -0.767200   -0.592300    0.006940   -0.658700    0.265320
17
30  Energy: -1227.29289  Freq: 1103.86306
C    -0.902100   -1.468900    0.640800   -0.047640    0.013260   -0.025880
C     0.610500   -1.468900    0.640800    0.032140   -0.034180    0.020720
C     1.171800   -0.069000    0.640800    0.041980    0.023420    0.007720
C     0.452200    0.946300   -0.203200   -0.047820    0.020680   -0.009540
C    -0.989700    0.725400   -0.564900    0.020500   -0.045120    0.006340
C    -1.422900   -0.723900   -0.568500    0.031280    0.010800    0.020360
H    -1.052000   -1.224400   -1.501700    0.007300    0.253260   -0.124740
O     1.035900    1.975600   -0.566700    0.004860   -0.006980    0.002800
H    -1.279900   -2.524200    0.627200    0.051320   -0.022240    0.042580
H    -1.283700   -0.987800    1.579400   -0.428980    0.157060   -0.254860
H     0.979300   -2.022900   -0.263400   -0.227240   -0.169400    0.002240
H     0.990900   -2.016900    1.542600    0.096740   -0.044620   -0.023420
H     2.248300   -0.096700    0.318300    0.008800    0.600480   -0.135820
H     1.157800    0.334800    1.692600    0.010600   -0.448240    0.183600
H    -1.603400    1.298400    0.183900    0.460120    0.349680    0.077240
H    -1.186100    1.182800   -1.571400   -0.441160   -0.466960   -0.097960
H    -2.543600   -0.767200   -0.592300    0.022800    0.034620    0.051660
17
31  Energy: -1227.29289  Freq: 1072.49379
C    -0.902100   -1.468900    0.640800    0.078800   -0.021340    0.039460
C     0.610500   -1.468900    0.640800   -0.040480    0.073700   -0.035980
C     1.171800   -0.069000    0.640800   -0.082600   -0.061280    0.012200
C     0.452200    0.946300   -0.203200    0.065620   -0.022520    0.040700
C    -0.989700    0.725400   -0.564900    0.007120    0.087700   -0.055100
C    -1.422900   -0.723900   -0.568500   -0.061960   -0.040280   -0.025600
H    -1.052000   -1.224400   -1.501700    0.048660    0.224080   -0.117320
O     1.035900    1.975600   -0.566700   -0.016600    0.006240   -0.009960
H    -1.279900   -2.524200    0.627200    0.628400   -0.224320    0.357340
H    -1.283700   -0.987800    1.579400   -0.206400    0.071800   -0.123540
H     0.979300   -2.022900   -0.263400   -0.170820   -0.157600    0.045460
H     0.990900   -2.016900    1.542600    0.165620    0.306080    0.044860
H     2.248300   -0.096700    0.318300   -0.085560   -0.267020   -0.020340
H     1.157800    0.334800    1.692600    0.019780   -0.270980    0.098640
H    -1.603400    1.298400    0.183900    0.226640    0.176860    0.051240
H    -1.186100    1.182800   -1.571400    0.065420    0.268040    0.030560
H    -2.543600   -0.767200   -0.592300   -0.029220   -0.416400    0.080760
17
32  Energy: -1227.29289  Freq: 1026.90455
C    -0.902100   -1.468900    0.640800    0.073640    0.128620   -0.061620
C     0.610500   -1.468900    0.640800   -0.124900    0.052080   -0.096440
C     1.171800   -0.069000    0.640800   -0.014080   -0.043300    0.069540
C     0.452200    0.946300   -0.203200    0.021920   -0.000820   -0.054360
C    -0.989700    0.725400   -0.564900   -0.070040   -0.042700    0.042680
C    -1.422900   -0.723900   -0.568500    0.155000   -0.034640    0.073100
H    -1.052000   -1.224400   -1.501700   -0.089020    0.006300   -0.043500
O     1.035900    1.975600   -0.566700    0.010260    0.022740    0.001120
H    -1.279900   -2.524200    0.627200    0.133940    0.081640   -0.269840
H    -1.283700   -0.987800    1.579400   -0.015180   -0.048120   -0.000080
H     0.979300   -2.022900   -0.263400    0.057940   -0.060440    0.051940
H     0.990900   -2.016900    1.542600   -0.597840   -0.013520    0.089280
H     2.248300   -0.096700    0.318300   -0.033340   -0.331160    0.029740
H     1.157800    0.334800    1.692600    0.124100   -0.105080    0.079420
H    -1.603400    1.298400    0.183900   -0.134340    0.015260   -0.072640
H    -1.186100    1.182800   -1.571400   -0.234840   -0.363960   -0.072820
H    -2.543600   -0.767200   -0.592300    0.130720   -0.248040    0.513940
17
33  Energy: -1227.29289  Freq: 981.65152
C    -0.902100   -1.468900    0.640800    0.079640    0.188980   -0.022420
C     0.610500   -1.468900    0.640800    0.054900   -0.032160    0.062640
C     1.171800   -0.069000    0.640800   -0.188260   -0.014360   -0.032160
C     0.452200    0.946300   -0.203200    0.011120   -0.010060   -0.017540
C    -0.989700    0.725400   -0.564900    0.091980   -0.120660    0.119240
C    -1.422900   -0.723900   -0.568500   -0.101660    0.018100   -0.011380
H    -1.052000   -1.224400   -1.501700    0.174800    0.045500    0.059800
O     1.035900    1.975600   -0.566700    0.000480    0.004100    0.001040
H    -1.279900   -2.524200    0.627200    0.293240    0.092140   -0.441460
H    -1.283700   -0.987800    1.579400   -0.080320   -0.175420    0.074500
H     0.979300   -2.022900   -0.263400   -0.043740    0.101020   -0.078260
H     0.990900   -2.016900    1.542600    0.174440   -0.182280   -0.096620
H     2.248300   -0.096700    0.318300   -0.249280   -0.076620   -0.300000
H     1.157800    0.334800    1.692600    0.009760    0.083900   -0.072500
H    -1.603400    1.298400    0.183900    0.117760    0.080460   -0.021380
H    -1.186100    1.182800   -1.571400    0.291720   -0.274500   -0.011420
H    -2.543600   -0.767200   -0.592300   -0.072920   -0.115180   -0.301420
17
34  Energy: -1227.29289  Freq: 941.58092
C    -0.902100   -1.468900    0.640800   -0.014800    0.005020    0.002660
C     0.610500   -1.468900    0.640800    0.017600   -0.007840   -0.120520
C     1.171800   -0.069000    0.640800   -0.029080    0.032460    0.083420
C     0.452200    0.946300   -0.203200   -0.002440    0.001640    0.012360
C    -0.989700    0.725400   -0.564900    0.040320   -0.029100   -0.102320
C    -1.422900   -0.723900   -0.568500   -0.075700    0.030620    0.074960
H    -1.052000   -1.224400   -1.501700    0.342920   -0.106100    0.281720
O     1.035900    1.975600   -0.566700   -0.004780   -0.003560   -0.002340
H    -1.279900   -2.524200    0.627200   -0.101700    0.036420   -0.076400
H    -1.283700   -0.987800    1.579400    0.321640   -0.143060    0.213240
H     0.979300   -2.022900   -0.263400    0.370960   -0.213520    0.187480
H     0.990900   -2.016900    1.542600   -0.302780    0.215600    0.179840
H     2.248300   -0.096700    0.318300   -0.097520    0.086340   -0.202280
H     1.157800    0.334800    1.692600    0.275860   -0.197860    0.153960
H    -1.603400    1.298400    0.183900    0.330060   -0.085900    0.216880
H    -1.186100    1.182800   -1.571400   -0.256340    0.113060    0.041540
H    -2.543600   -0.767200   -0.592300   -0.043280   -0.039320   -0.369680
17
35  Energy: -1227.29289  Freq: 921.03511
C    -0.902100   -1.468900    0.640800    0.003320    0.117200    0.067280
C     0.610500   -1.468900    0.640800    0.030280   -0.062580    0.035800
C     1.171800   -0.069000    0.640800    0.112940   -0.074240   -0.006780
C     0.452200    0.946300   -0.203200   -0.001640    0.091620    0.059360
C    -0.989700    0.725400   -0.564900   -0.080600   -0.003160   -0.098080
C    -1.422900   -0.723900   -0.568500   -0.061500   -0.027440   -0.031020
H    -1.052000   -1.224400   -1.501700   -0.038560   -0.240020    0.093720
O     1.035900    1.975600   -0.566700    0.040320    0.053100   -0.035500
H    -1.279900   -2.524200    0.627200    0.254380    0.000140   -0.425600
H    -1.283700   -0.987800    1.579400   -0.262580   -0.375100    0.171760
H     0.979300   -2.022900   -0.263400   -0.220240   -0.179620    0.003480
H     0.990900   -2.016900    1.542600    0.034780   -0.151220   -0.022240
H     2.248300   -0.096700    0.318300    0.173720    0.083760    0.262940
H     1.157800    0.334800    1.692600   -0.204360   -0.259160    0.072840
H    -1.603400    1.298400    0.183900   -0.154680   -0.307160    0.088560
H    -1.186100    1.182800   -1.571400   -0.198120    0.214220    0.046000
H    -2.543600   -0.767200   -0.592300   -0.057860   -0.122080   -0.044320
17
36  Energy: -1227.29289  Freq: 898.48675
C    -0.902100   -1.468900    0.640800    0.007560   -0.052040   -0.050720
C     0.610500   -1.468900    0.640800    0.027280   -0.086780    0.078820
C     1.171800   -0.069000    0.640800    0.063820   -0.019380    0.127800
C     0.452200    0.946300   -0.203200    0.069420    0.035100   -0.101440
C    -0.989700    0.725400   -0.564900   -0.129460    0.041780    0.011980
C    -1.422900   -0.723900   -0.568500   -0.132100   -0.034020    0.005760
H    -1.052000   -1.224400   -1.501700    0.202680    0.202000   -0.006080
O     1.035900    1.975600   -0.566700    0.050620    0.105060   -0.019480
H    -1.279900   -2.524200    0.627200   -0.099760   -0.007900    0.166800
H    -1.283700   -0.987800    1.579400    0.134220    0.156000   -0.090260
H     0.979300   -2.022900   -0.263400    0.073640    0.198200   -0.089640
H     0.990900   -2.016900    1.542600   -0.025720   -0.388060   -0.099340
H     2.248300   -0.096700    0.318300    0.016400   -0.231980   -0.027160
H     1.157800    0.334800    1.692600    0.302860    0.093400    0.059840
H    -1.603400    1.298400    0.183900   -0.069040    0.258860   -0.139520
H    -1.186100    1.182800   -1.571400   -0.129080   -0.193300   -0.098280
H    -2.543600   -0.767200   -0.592300   -0.095680   -0.380420   -0.227440
17
37  Energy: -1227.29289  Freq: 792.10656
C    -0.902100   -1.468900    0.640800    0.040180   -0.008940    0.022740
C     0.610500   -1.468900    0.640800    0.001380   -0.055140    0.083960
C     1.171800   -0.069000    0.640800   -0.094700   -0.000940    0.092700
C     0.452200    0.946300   -0.203200   -0.031680    0.008200   -0.027660
C    -0.989700    0.725400   -0.564900    0.031620    0.024920   -0.122060
C    -1.422900   -0.723900   -0.568500    0.085860    0.024820   -0.027980
H    -1.052000   -1.224400   -1.501700   -0.284800   -0.108980   -0.081760
O     1.035900    1.975600   -0.566700   -0.016600    0.006520   -0.007120
H    -1.279900   -2.524200    0.627200   -0.039400    0.019260   -0.053040
H    -1.283700   -0.987800    1.579400   -0.020900   -0.011140   -0.002500
H     0.979300   -2.022900   -0.263400   -0.122360    0.265260   -0.187600
H     0.990900   -2.016900    1.542600    0.193600   -0.334800   -0.191140
H     2.248300   -0.096700    0.318300   -0.220040   -0.156800   -0.390820
H     1.157800    0.334800    1.692600    0.425060    0.033980    0.054080
H    -1.603400    1.298400    0.183900    0.205660   -0.249720    0.274060
H    -1.186100    1.182800   -1.571400   -0.316800    0.323600    0.106260
H    -2.543600   -0.767200   -0.592300    0.054340    0.199940    0.327040
17
38  Energy: -1227.29289  Freq: 653.15736
C    -0.902100   -1.468900    0.640800    0.031680   -0.009620   -0.054000
C     0.610500   -1.468900    0.640800    0.015020   -0.109200   -0.006120
C     1.171800   -0.069000    0.640800   -0.095480   -0.018140   -0.019840
C     0.452200    0.946300   -0.203200   -0.008040    0.185820    0.129660
C    -0.989700    0.725400   -0.564900    0.044580   -0.063040    0.048680
C    -1.422900   -0.723900   -0.568500   -0.044100   -0.080240   -0.048000
H    -1.052000   -1.224400   -1.501700   -0.369660   -0.113480   -0.138620
O     1.035900    1.975600   -0.566700    0.072780    0.081740   -0.080280
H    -1.279900   -2.524200    0.627200   -0.177140    0.073520    0.334980
H    -1.283700   -0.987800    1.579400    0.228580    0.375380   -0.145860
H     0.979300   -2.022900   -0.263400    0.181620   -0.291840    0.194440
H     0.990900   -2.016900    1.542600   -0.111660    0.097960    0.184860
H     2.248300   -0.096700    0.318300   -0.114560    0.011240   -0.091140
H     1.157800    0.334800    1.692600   -0.040500   -0.189740    0.047400
H    -1.603400    1.298400    0.183900   -0.110140   -0.174540    0.010520
H    -1.186100    1.182800   -1.571400    0.096800   -0.055220    0.041040
H    -2.543600   -0.767200   -0.592300   -0.067140    0.094180    0.236380
17
39  Energy: -1227.29289  Freq: 516.75334
C    -0.902100   -1.468900    0.640800    0.021740   -0.000800    0.004080
C     0.610500   -1.468900    0.640800    0.020640   -0.182340    0.035840
C     1.171800   -0.069000    0.640800   -0.022680   -0.119540    0.039740
C     0.452200    0.946300   -0.203200    0.068360   -0.034260    0.019640
C    -0.989700    0.725400   -0.564900    0.079580    0.097340   -0.013060
C    -1.422900   -0.723900   -0.568500    0.108200    0.133320    0.047260
H    -1.052000   -1.224400   -1.501700    0.162080    0.156080    0.048120
O     1.035900    1.975600   -0.566700   -0.223160    0.082680   -0.116120
H    -1.279900   -2.524200    0.627200   -0.149340    0.061740   -0.088280
H    -1.283700   -0.987800    1.579400    0.093140   -0.017640    0.042600
H     0.979300   -2.022900   -0.263400    0.046960   -0.249600    0.098120
H     0.990900   -2.016900    1.542600   -0.044960   -0.137320    0.090900
H     2.248300   -0.096700    0.318300    0.034700   -0.085940    0.264700
H     1.157800    0.334800    1.692600   -0.280300   -0.166420    0.061540
H    -1.603400    1.298400    0.183900    0.056560    0.258360   -0.163720
H    -1.186100    1.182800   -1.571400    0.227640    0.009140   -0.091860
H    -2.543600   -0.767200   -0.592300    0.108860    0.125520   -0.009660
17
40  Energy: -1227.29289  Freq: 488.23695
C    -0.902100   -1.468900    0.640800   -0.078960   -0.103600    0.058040
C     0.610500   -1.468900    0.640800   -0.080860    0.034940   -0.048200
C     1.171800   -0.069000    0.640800    0.007000    0.014600    0.005780
C     0.452200    0.946300   -0.203200   -0.027540    0.118040    0.161180
C    -0.989700    0.725400   -0.564900    0.030560    0.006320    0.004280
C    -1.422900   -0.723900   -0.568500    0.080360   -0.016540    0.048420
H    -1.052000   -1.224400   -1.501700    0.281340   -0.005580    0.110520
O     1.035900    1.975600   -0.566700    0.022360    0.003000   -0.094760
H    -1.279900   -2.524200    0.627200    0.017720   -0.139280   -0.131760
H    -1.283700   -0.987800    1.579400   -0.172800   -0.289920    0.101420
H     0.979300   -2.022900   -0.263400   -0.198600    0.177840   -0.196700
H     0.990900   -2.016900    1.542600    0.070760   -0.095180   -0.197020
H     2.248300   -0.096700    0.318300   -0.084760   -0.098080   -0.325580
H     1.157800    0.334800    1.692600    0.389100   -0.105060    0.044080
H    -1.603400    1.298400    0.183900   -0.203760    0.130900   -0.299720
H    -1.186100    1.182800   -1.571400    0.282960   -0.210740   -0.156000
H    -2.543600   -0.767200   -0.592300    0.090360   -0.053460   -0.179900
17
41  Energy: -1227.29289  Freq: 453.63431
C    -0.902100   -1.468900    0.640800   -0.080080    0.044400   -0.055140
C     0.610500   -1.468900    0.640800   -0.067380    0.106060   -0.024820
C     1.171800   -0.069000    0.640800    0.173900    0.021120    0.108880
C     0.452200    0.946300   -0.203200    0.136560   -0.060140    0.063520
C    -0.989700    0.725400   -0.564900    0.136820   -0.136060    0.067320
C    -1.422900   -0.723900   -0.568500   -0.111460   -0.045220   -0.080400
H    -1.052000   -1.224400   -1.501700   -0.289220   -0.103600   -0.110220
O     1.035900    1.975600   -0.566700   -0.141000    0.050460   -0.068800
H    -1.279900   -2.524200    0.627200    0.000640    0.014700    0.023180
H    -1.283700   -0.987800    1.579400   -0.132180    0.088780   -0.097480
H     0.979300   -2.022900   -0.263400   -0.107360    0.205400   -0.109380
H     0.990900   -2.016900    1.542600   -0.121420   -0.054240   -0.100200
H     2.248300   -0.096700    0.318300    0.156660   -0.109160    0.069780
H     1.157800    0.334800    1.692600    0.267560    0.002700    0.108860
H    -1.603400    1.298400    0.183900    0.218640   -0.196360    0.195180
H    -1.186100    1.182800   -1.571400    0.123120    0.034720    0.147220
H    -2.543600   -0.767200   -0.592300   -0.122920    0.148180    0.019720
17
42  Energy: -1227.29289  Freq: 425.64227
C    -0.902100   -1.468900    0.640800   -0.099640   -0.117980    0.093640
C     0.610500   -1.468900    0.640800   -0.099260   -0.010380   -0.030760
C     1.171800   -0.069000    0.640800   -0.102600    0.009420   -0.066800
C     0.452200    0.946300   -0.203200    0.122700    0.062260   -0.179000
C    -0.989700    0.725400   -0.564900    0.095540   -0.064080    0.049940
C    -1.422900   -0.723900   -0.568500    0.055360   -0.068620    0.056960
H    -1.052000   -1.224400   -1.501700    0.143620   -0.098800    0.105560
O     1.035900    1.975600   -0.566700    0.051640    0.175900    0.020820
H    -1.279900   -2.524200    0.627200   -0.063660   -0.128600    0.029340
H    -1.283700   -0.987800    1.579400   -0.133080   -0.182540    0.105120
H     0.979300   -2.022900   -0.263400   -0.175580    0.018020   -0.082120
H     0.990900   -2.016900    1.542600    0.040480    0.006040   -0.081180
H     2.248300   -0.096700    0.318300   -0.019260   -0.052900    0.236120
H     1.157800    0.334800    1.692600   -0.393060    0.069740   -0.084220
H    -1.603400    1.298400    0.183900    0.264120   -0.168440    0.281500
H    -1.186100    1.182800   -1.571400   -0.207700    0.005240    0.146940
H    -2.543600   -0.767200   -0.592300    0.056940   -0.002920   -0.081480
17
43  Energy: -1227.29289  Freq: 282.73527
C    -0.902100   -1.468900    0.640800   -0.010920    0.147580    0.101760
C     0.610500   -1.468900    0.640800   -0.004880   -0.027380   -0.117700
C     1.171800   -0.069000    0.640800   -0.017220   -0.019520    0.032880
C     0.452200    0.946300   -0.203200   -0.024480   -0.013020    0.031900
C    -0.989700    0.725400   -0.564900   -0.034980   -0.011240    0.040400
C    -1.422900   -0.723900   -0.568500    0.100200   -0.053600   -0.078800
H    -1.052000   -1.224400   -1.501700    0.393400   -0.041160    0.032480
O     1.035900    1.975600   -0.566700   -0.015860   -0.034560   -0.006520
H    -1.279900   -2.524200    0.627200   -0.191800    0.216120    0.440760
H    -1.283700   -0.987800    1.579400    0.170740    0.493620   -0.002180
H     0.979300   -2.022900   -0.263400   -0.183700    0.119940   -0.279420
H     0.990900   -2.016900    1.542600    0.113760   -0.201100   -0.279940
H     2.248300   -0.096700    0.318300    0.005080    0.045280    0.112680
H     1.157800    0.334800    1.692600   -0.125420   -0.098540    0.060380
H    -1.603400    1.298400    0.183900   -0.048900   -0.148620    0.132240
H    -1.186100    1.182800   -1.571400   -0.090740    0.092280    0.102300
H    -2.543600   -0.767200   -0.592300    0.117360   -0.200800   -0.340100
17
44  Energy: -1227.29289  Freq: 132.41997
C    -0.902100   -1.468900    0.640800    0.037940    0.002980    0.042000
C     0.610500   -1.468900    0.640800    0.038840   -0.000460   -0.139180
C     1.171800   -0.069000    0.640800   -0.050340    0.031520    0.097620
C     0.452200    0.946300   -0.203200    0.011400   -0.006840    0.001800
C    -0.989700    0.725400   -0.564900    0.048260   -0.037700   -0.135100
C    -1.422900   -0.723900   -0.568500   -0.093680    0.001920    0.098700
H    -1.052000   -1.224400   -1.501700   -0.332300   -0.117400    0.066280
O     1.035900    1.975600   -0.566700    0.021320    0.000820    0.038440
H    -1.279900   -2.524200    0.627200    0.023580    0.007920    0.085040
H    -1.283700   -0.987800    1.579400    0.157080    0.007200    0.088080
H     0.979300   -2.022900   -0.263400   -0.051560    0.208700   -0.302360
H     0.990900   -2.016900    1.542600    0.161260   -0.176440   -0.299680
H     2.248300   -0.096700    0.318300    0.019060    0.146460    0.325600
H     1.157800    0.334800    1.692600   -0.319920   -0.045360    0.122760
H    -1.603400    1.298400    0.183900   -0.011440    0.172380   -0.343360
H    -1.186100    1.182800   -1.571400    0.210540   -0.236820   -0.259440
H    -2.543600   -0.767200   -0.592300   -0.104400    0.122560    0.313940
17
45  Energy: -1227.29289  Freq: 19.85131
C    -0.902100   -1.468900    0.640800   -0.029360    0.082060    0.090320
C     0.610500   -1.468900    0.640800   -0.030680   -0.027540    0.034600
C     1.171800   -0.069000    0.640800    0.086580   -0.074920   -0.164860
C     0.452200    0.946300   -0.203200    0.003700   -0.009720   -0.017140
C    -0.989700    0.725400   -0.564900    0.043220   -0.052700   -0.148560
C    -1.422900   -0.723900   -0.568500   -0.004600   -0.037020    0.007420
H    -1.052000   -1.224400   -1.501700   -0.020300   -0.154620    0.064140
O     1.035900    1.975600   -0.566700   -0.069960    0.107100    0.187400
H    -1.279900   -2.524200    0.627200   -0.106920    0.107920    0.240120
H    -1.283700   -0.987800    1.579400    0.035460    0.232760    0.039040
H     0.979300   -2.022900   -0.263400   -0.110220   -0.173220    0.090660
H     0.990900   -2.016900    1.542600   -0.037820    0.053660    0.087320
H     2.248300   -0.096700    0.318300    0.006920   -0.183540   -0.425000
H     1.157800    0.334800    1.692600    0.388720   -0.036980   -0.174180
H    -1.603400    1.298400    0.183900   -0.033360    0.074480   -0.307300
H    -1.186100    1.182800   -1.571400    0.173680   -0.189620   -0.237160
H    -2.543600   -0.767200   -0.592300   -0.006040   -0.002920    0.009240
</ModelData>
</Models>
IRLinks(1712, 1, 30, 11,"Carbonyl stretching band (~1712 cm-1)");

##$PEAKS=
<Peaks type="IR" xUnits="1/cm" yUnits="TRANSMITTANCE" >
<PeakData id="1" title="Carbonyl stretching band (~1712 cm-1)" peakShape="broad" model="4.11" xMax="1742" xMin="1682"  yMax="1" yMin="0" />
</Peaks>
##XUNITS= 1/CM
##YUNITS= TRANSMITTANCE
##XFACTOR= 3.511E-3
##YFACTOR= 8.41105954E-7
##FIRSTX= 594
##FIRSTY= 0.13355965
##LASTX= 4105
##NPOINTS= 3512
##XYDATA= (X++(Y..Y))
169183A58791N323M454P532P242M925M998O192N540N360P025Q510O989N830O265B51313
173740B56926O844P966N867N359O337Q148Q437N686K969O265P061P207O445O084C54699
178297C60601M563N432M852L658M852O699L694K281K137N43J485N79j992j448C94460
182854C88267o518q220o120o265p930j0972r162o446l838n07M019P315J0646J4884C78200
187411C99167K2922K2271K2741K3248K0931J7708J6332K2415L8385N1820l368F50661
191114F58772J0864J0429J2964J1117R271R016Q583Q908Q256Q402Q872P858N794G83777
195386G90838Q402Q111P061L839K752M382M056L693O011L368K644O228N649J087H60583
199943H65037M165J774K716M852M346K643K318K462L658L223N79K90J484J739I01104
$$ plain form
169183 158791 164114 168568 176100 183342 188267 193265 199457 204997 210357 217382 225892 232881 238711 244976 251313
173740 256926 263770 271736 277603 282962 289299 297447 305884 311570 314539 320804 327865 335072 341517 347601 354699
178297 360601 365164 370596 375448 379106 383958 390657 394351 396632 398769 399312 400797 401376 399384 397936 394460
182854 388267 381749 373529 367409 361144 353214 342242 333080 326634 322796 322289 326308 333623 344269 359153 378200
187411 399167 422089 444360 467101 490349 511280 528988 545320 567735 606120 657940 654572 650661
191114 658772 669636 680065 693029 704146 713417 722433 731016 739924 748180 756582 765454 773312 779106 783777
195386 790838 799240 807351 814412 818251 821003 825385 829441 833134 839145 842513 845157 851385 857034 858121 860583
199943 865037 869202 870976 873692 878544 882890 885533 887851 890313 893971 897194 897773 898063 899547 901286 901104
204500H99982k54P25l730m563k462k137m056n250o229m925o156r162r922r668H19917
209057H02318j9338k1003k4262k8173l0962l3641l9724m1138m1318m2151l9217D06844
212760C78381j9156j1008l223N359J1624J5644K1075K5421K7739K9114L0962L6502E87108
216747F24154L5994L6104L5814L3677K8717K6326K4153K2090K0713J8070J6694I38657
220450I50570R669J0393R560J2095Q075O555P314P279P279O409L766M418L477A050552
224722A053811O88K934M128N07J412K281j08K53L62P25J593K53j014p24J087K534A072823
229849A071519j738R78j521r06J232j521j702p24k572l802n43J702Q69J376o52A059460
234691A060692J919j195j268l331m780m128n287p931r994j2493j7962k5022l1505I06138
$$ plain form
204500 899982 899728 900453 896723 892160 889698 887561 883505 878255 872026 867101 860945 851783 841861 832193 819917
209057 802318 782980 761977 737715 709542 678580 644939 605215 564077 522759 480608 441391 406844
212760 378381 359225 348217 344994 350353 361977 377621 398696 424117 451856 480970 511932 548434 587108
216747 624154 660148 696252 732066 765743 794460 820786 844939 867029 887742 905812 922506 938657
220450 950570 960239 970632 980192 992287 1000362 1006917 1014231 1021510 1028789 1035198 1038964 1043382 1046859 1050552
224722 1053811 1054499 1057433 1061561 1062068 1063480 1065761 1065653 1065906 1066268 1066993 1068586 1068839 1067825 1067101 1068188 1070722 1072823
229849 1071519 1069781 1070759 1069238 1068332 1069564 1068043 1066341 1065617 1063045 1059243 1058700 1060402 1061271 1062647 1061995 1059460
234691 1060692 1062611 1061416 1060148 1056817 1052037 1047909 1042622 1034691 1024697 1012204 994242 969220 937715 906138
238963H85533N686L0852L6104K7014J6984R306K716k064m345p351j0140j3217I61760
242951I43292k2488k7739l6646m7692n9243p1736q1768p8725o3082m0521j4630D07605
246653D36466M9031O4240P0433O6124N4753M2440L2265K4407J7817J2457P785H81840
250356H81333m817q872j3615j7310k2307k7992l3315l9290m1391m1064l7118k9332E44306
254343E31052r198n794k897P97L042L476K173m998j4521k2053k6833k9079k6652C79649
258616C70234J231J5209L2953N1711O5146P0251O6993N7614M8198M1282L4184H82238
262318I04653J8613J5934J3941J1625J0392P750N758N069M310L403M636M888L513A016477
266591A016766J521K100J702N07n43j340j774j955k861l042k825j629q33o16J376A007170
$$ plain form
238963 885533 891219 922071 958175 985189 1002173 1011479 1014195 1012131 1007786 1000435 990295 977078 961760
242951 943292 920804 893065 856419 808727 749484 677748 595980 517255 454173 413652 399022 407605
246653 436466 485497 549737 620170 686294 741047 783487 815752 840159 857976 870433 878218 881840
250356 881333 876516 867644 854029 836719 814412 786420 753105 713815 672424 631360 594242 564910 544306
254343 531052 521854 516060 513163 513960 517002 520478 522651 517653 503132 481079 454246 425167 398515 379649
258616 370234 371465 386674 419627 471338 536484 606735 673728 731342 779540 820822 855006 882238
262318 904653 923266 939200 953141 964766 975158 982908 988666 993735 998045 1001448 1006084 1010972 1014485 1016477
266591 1016766 1018287 1020387 1022089 1022596 1022053 1020713 1018939 1016984 1014123 1011081 1008256 1006627 1005794 1005178 1006554 1007170
271433A007242J268Q33P60J159p97k498l803m743n468o120n577l332k752k172I70958
275990I66938m852m853l585j267m35n43l26k716n902q945j0574j4340j8069k0026H46859
280547H17853l4511m0630m7184m9756m2440k1004J3508M6713O2104N7433M4468H38131
284250H59533J0393M635J919n43l694p278j0647j3181j7418k2922k7232l2627G00887
288237F52761n3956n6745n6889m9430l0816p387J7671M3455O3516P0650O6087G13380
291940G54554L2047K3647J5933J1262P677M310J267j738l404n251p061q365j1154G99131
296212G80844k2235k5529l0418l6249m1644m4360m4867m2223l5379k4625j4267D13543
299915D15861J0067J5680J9953K3031K2886K0061J7563J6260J4557J2059J1189F10538
$$ plain form
271433 1007242 1008510 1009343 1010103 1011262 1010465 1007967 1004164 999421 993953 987833 982256 978924 976172 974000 970958
275990 966938 962086 957233 953648 952381 951946 951403 951077 948361 942459 933514 922940 908600 890531 870505 846859
280547 817853 783342 742712 695528 645772 603332 582328 595836 642549 704653 762086 806554 838131
284250 859533 869926 874561 876480 875937 872243 864965 854318 841137 823719 800797 773565 740938 700887
288237 652761 598805 542060 485171 435741 404925 397538 415209 458664 522180 592830 658917 713380
291940 754554 786601 810248 826181 837443 845120 849430 850697 848959 845555 840304 833243 824878 813724 799131
296212 780844 758609 733080 702662 666413 624769 580409 535542 493319 457940 433315 419048 413543
299915 415861 425928 441608 461561 484592 507478 527539 545102 561362 575919 587978 599167 610538
303617F20822Q293N431J123l911q111q293k716J1226K5457L3460L3641K9151K3140G85950
307889G98588R958P243M635M309K571o52j702j955k752m346o083o953q401j0140G72913
312447G59696j4594j4919j6585j9048k0424k2705k6435k8897l1179l2591l4582D63227
316149D31831k8174k4226j8649j3435j0465q256o374l947o52K608N649P894R017C53504
320422C67699J7997K1039K3502K4987K5746K7667K8390K7739K6760K5602K5313F65580
324124F87380K0315J8432J6549J5318J4050J2674J1878J0321Q509Q583P568O229H42477
328112H46786L947K933J884K607L042L223K824J847J919J014J267J775R78j81H77422
332669H79775L115K535J557R77k89n43j413k860l079k462j919k209j883j738k246H64675
$$ plain form
303617 620822 629115 634546 635669 631758 623647 615354 612638 623864 649321 682781 716422 745573 768713 785950
307889 798588 808546 815789 820424 824733 827304 826652 824950 822995 820243 815897 809814 802861 794460 784320 772913
312447 759696 745102 730183 713598 694550 674126 651421 624986 596089 564910 532319 497737 463227
316149 431831 403657 379431 360782 347347 336882 328626 322252 318305 317653 320261 325910 333804 342821 353504
320422 367699 385696 406735 430237 455224 480970 508637 537027 564766 591526 617128 642441 665580
324124 687380 707695 726127 742676 757994 772044 784718 796596 806917 815426 824009 831577 837806 842477
328112 846786 850733 853666 855550 858157 861199 864422 867246 869093 871012 872026 873293 875068 876046 875865 877422
332669 879775 882890 885425 886982 887959 887670 887127 885714 882854 879775 877313 875394 873185 871302 869564 867318 864675
337511H61633l440m382n649o120p206q474r560r994j1262j3362j4268j5752j8432G14105
341783F94043k2270k4480k5312k6037k5891k5385k4335k3103k2669k2995k3284D05432
345486C84936j7201j3797j0501q691p931o916n360l259p24K390N214O700P278C39598
349758C47601Q655R668J1009J1624J1769J2493J2964J3616J4050J4992J6368J6549E17979
353745E33587J3435J2094J1371J0067R922R922R307R777J0103R886R162P025M056F60619
358018F57179q546j3616j9192k4878k7123k5892j7997m961J1370K6073L6031L9182F63661
362005F94550K5023J8540J4521J1806Q509N070L114K209P97m34j847l839m164G69111
366277G62448q474j0574j2239j4377j6114j7925j9917k2053k5421k7340k8861E28952
$$ plain form
337511 861633 858193 853811 848162 842042 834836 826362 816802 806808 795546 782184 767916 752164 733732 714105
341783 694043 671773 647293 621981 595944 570053 544668 520333 497230 474561 451566 428282 405432
345486 384936 367735 353938 343437 334746 326815 319899 314539 311280 310556 312946 318160 324860 332138 339598
349758 347601 356256 365924 376933 388557 400326 412819 425783 439399 453449 468441 484809 501358 517979
353745 533587 547022 559116 570487 580554 590476 600398 609705 619482 629585 639471 648633 655658 659714 660619
358018 657179 648633 635017 615825 590947 563824 537932 519935 514974 526344 552417 588448 627630 663661
362005 694550 719573 738113 752634 764440 772949 778019 781133 783342 784139 783705 781858 778019 773855 769111
366277 762448 753974 743400 731161 716784 700670 682745 662828 640775 615354 588014 559153 528952
369980D98787k8644k7521k5457k1692j8432j4919j1769r560p641o482n142k064C20913
373968C24425N287N939O518P061Q619R741J1045J2565J3327J3760J4232J2782D55586
377955D63408M092J08m019q800j3833j8541k2234k1763j7636j2095m671J412N432C57849
382227C63245K53m889o626m853q33M201R379J6621K6508L5524M0956M3092M0956E99565
386500F30853K7231K3104J9953J8033J5644J2204P640P460Q184P460P387O084G94894
390487G97900M671O301L476k17j122J44J014K18n80r78j339k535l911m708l440G90476
395329G77766j3725j0900j0429j2167j1552j1298j5933j6441j4014j0465j3580F19917
399032F08184j1697j2239j0393j4449j7961j6585j8541j8903j9663j9953k0677D08148
$$ plain form
369980 498787 470143 442622 417165 395473 377041 362122 350353 340793 333152 326670 321528 319464 320913
373968 324425 329712 335651 342169 349230 357849 367590 378635 391200 404527 418287 432519 445301 455586
377955 463408 467500 467608 463589 454789 440956 422415 400181 378418 360782 348687 344016 345428 350860 357849
382227 363245 363498 358609 351983 347130 346297 350498 359877 376498 403006 438530 479486 522578 563534 599565
386500 630853 658084 681188 701141 719174 734818 747022 754662 762122 770306 777766 785153 791237 794894
390487 797900 802571 808872 812348 812131 811009 811153 812167 812385 811805 810827 809488 806953 803042 798334 794894 790476
395329 777766 764041 753141 742712 730545 718993 707695 691762 675321 661307 650842 637262 619917
399032 608184 596487 584248 573855 559406 541445 524860 506319 487416 467753 447800 427123 408148
402734C91563j4159j1009r017j919m889j4122j775J485K462J45r05J050J81M71C41626
407291C41119n07L875M381O301J1262J3399J122J521M635p24n359q619j0248j0284C42133
411848C34383m454p894n830M71L911M707O374R161J3109J6803O554M309N179J919C90476
416406C89788L114R524J0936J5572K4877K9187L0201L1614L3025L6031K7340K0171F83614
420393G09252J7165J4811J6874J6731J4303J1842R487Q872Q148J0936J0248M744H59207
424381H65906m454n142j267K53N468M889k499L259K282k90M454N649O917J1696I16748
428938I41409P640m526J050J956M707Q945M273N323J0103J2131J0538m708L26A012312
433210A023647k716p895k209M853p3j774m34l694k100L295P641J1225l6q292j847A023719
$$ plain form
402734 391563 377404 366395 357378 355459 350570 336448 334673 336158 338620 338765 337860 338910 339091 339562 341626
407291 341119 340612 344487 348868 355169 366431 379830 380952 382473 387108 386384 381025 372406 362158 351874 342133
411848 334383 329929 322035 316205 316676 320587 325294 331668 340829 353938 370741 377295 381604 386783 388702 390476
416406 389788 392902 402426 413362 428934 453811 482998 513199 544813 577838 613869 641209 661380 683614
420393 709252 726417 741228 758102 774833 789136 800978 810465 819337 827485 838421 848669 853413 859207
424381 865906 861452 856310 855043 855296 860764 865653 863154 866413 868695 868405 872859 878508 885425 897121 916748
428938 941409 949049 944523 945573 947529 952236 961181 965454 970777 980880 993011 1003549 998841 999167 1012312
433210 1023647 1020931 1013036 1010827 1015680 1015607 1013833 1013399 1009705 1007605 1010900 1018541 1029766 1029730 1021438 1019591 1023719
438052A037624J8432j376n975k462o917m70J376m309k680K535P496M852k318L7A052327
442609A060909j811J557J6622K5747P713j6875k2379o482K17N034L440l042j267A074851
446881A085606l549j1624m310j665j45N794M454j3652j2095q727p822q365r922A002173
451154I88738j5463j6621j4811j0719m417K53K680L259L838M201K028L6j195k209I37534
455711I35723k136l658m490n106o228n975n831o482p025q980q727q293q800q654H42549
460268H43962j7853j8396j1081j2022j1769q908j1226k6000k3104j8215j7200F43274
463970F17128j9699j6730j3254o808N396O627r524j050P24K100K680J449J629E72624
468243E76498Q546M201J847J050j992M382J2602K0315O409j4231p098l512l295F00145
$$ plain form
438052 1037624 1056056 1054680 1048705 1046243 1039326 1038856 1040232 1035923 1033243 1035778 1043274 1048126 1045808 1045845 1052327
442609 1060909 1059098 1060655 1077277 1103024 1110737 1093862 1071483 1065001 1065218 1070252 1073692 1070650 1069383 1074851
446881 1085606 1082057 1070433 1066123 1064458 1064313 1070107 1074561 1060909 1048814 1040087 1032265 1023900 1013978 1002173
451154 988738 973275 956654 941843 931124 926707 926960 929640 932899 936737 940938 942966 943002 941807 939598 937534
455711 935723 933587 929929 925439 920333 914105 908130 902299 895817 888792 879812 871085 862792 853992 845338 842549
460268 843962 826109 807713 796632 784610 772841 763933 752707 726707 703603 685388 668188 643274
463970 617128 597429 580699 567445 560637 566033 572660 563136 562086 562810 564910 567590 569039 570668 572624
468243 576498 585044 589245 591092 592142 590150 594532 607134 627449 633858 619627 612529 609017 605722 600145
472515E92685j0212r705j0537k4588k3321j7889j8866j5753q039j4630j7780o337D03838
476502C97139J738n359j5426L6K281K354P24r05M671Q474j811k4950p713K17n359C48398
481344C41010p496n214n468k90K716k4117j4594k390L042j2421m1463n504l839B16223
485617B07496n758p966k970j81k173k643o52J267K535J09N323R922M020N287J0682B36321
490459B47293J1117R452J0900J0465R415R451J0176N468L983R886J2457n79p858C47203
494731C53902O880Q438N79K064Q691N866K535M092M382K607J811l99O301O048D16440
499288D27195J1407J1769J1842N794L621M454M816M744n070p170l657m056m71D72171
503560D82347J4303K4118L3170L3460K7558K6362K9042K7666K2778K1365K1184G84175
$$ plain form
472515 592685 582473 572768 562231 537643 514322 496433 477567 461814 453775 439145 421365 415028 403838
476502 397139 398877 393518 378092 378128 380409 382763 383487 382582 387253 395727 393916 368966 361253 361470 356111 348398
481344 341010 333514 328300 322832 322542 325258 301141 286547 284157 287199 274778 233315 227811 223972 216223
485617 207496 201738 193772 190802 190621 188448 185805 185153 186420 188955 189064 194387 204309 208329 213616 224298 236321
490459 247293 258410 267862 278762 289227 298642 308093 318269 323737 327720 337606 350063 349484 341626 347203
494731 353902 360782 369220 369799 371863 380554 386420 388955 393047 397429 400036 401847 401448 407749 413797 416440
499288 427195 438602 450371 462213 468007 471628 476082 480898 485642 480572 473402 469745 465689 465218 472171
503560 482347 496650 520768 553938 587398 614956 641318 670360 698026 720804 742169 763353 784175
507263G99131J0683J1406J2602R415M092L187K680K679K789J376k173j3761j4774H18034
511535H02861j8613j7382j7636k3356k1221k0532j9881j4014q944l875J630P568F59678
515523F77494J9482K0279K1438K1293K1039K0423K0134J7563J4703J4738J3724H93971
519225I04581J1805J0791L911L404P677J2059Q510Q69M599Q111Q510Q293R198A010139
523498A015970P242Q112P821Q981J1443J0357p24L6M635K716j81p3l98n79j087A072207
528340A069346k860k499l694n540o373p134r017j0103j0067r995q474o699m635I77041
532612I69256l513J268M128O228P460P894Q583Q401O989O663P242P931Q727Q981A064422
537169A071555P496P822Q800L476k17J448K064K535J666l62l26l98l7L26%l26A105378
$$ plain form
507263 799131 809814 821220 833822 843237 847329 850516 853196 855875 858664 860040 857867 844106 829332 818034
511535 802861 784248 766866 749230 725874 704653 684121 664240 650226 641282 637407 639037 646605 659678
515523 677494 696976 717255 738693 759986 781025 801448 821582 839145 853848 868586 882310 893971
519225 904581 916386 927177 931088 934492 942169 954228 962738 963607 968206 976317 984827 993120 1002318 1010139
523498 1015970 1023212 1031324 1039145 1048126 1059569 1069926 1069202 1069238 1073873 1076589 1076408 1076335 1075937 1075358 1074271 1072207
528340 1069346 1066486 1063987 1060293 1054753 1048380 1041246 1032229 1022126 1012059 1002064 993590 986891 982256 977041
532612 969256 965743 967011 971139 977367 984827 992721 1001304 1009705 1016694 1023357 1030599 1038530 1047257 1056238 1064422
537169 1071555 1079051 1086873 1095673 1099149 1098932 1100380 1102444 1104979 1106645 1106283 1105957 1105559 1105522 1105848 1105848 1105522 1105378
542296A104762p97o15J08l98J09O15M71P2J087J774K173L042M273L730j159r06A118993
547422A122108J484l078l223j448j847k100j702k463l657l658l114l331m708n975A077349
551979A071085p352o699m092k643o048n395j594j44M70J847K861K209K281L006A052653
556537A055586K064J086J268O15k17j09%p60j050j159j123q33k136m816m056l513A036719
561663A032844k100p60L62J231L006N794O554O337P424P894P568P569P858P170A104726
566220A109107L622L222L404J883j267j014j050r42j050P3m71p97j883k679k499A105776
571062A103676k934k643r05j82k89m71J45R41P97J267J485J304O52P96J920J991A110013
576189A113272K498K318K969K789K535J448R42J412P97K53R78J448J521K245J847A139888
$$ plain form
542296 1104762 1103965 1103350 1103458 1103060 1103169 1103784 1104255 1104327 1105414 1107188 1109361 1112403 1116676 1120406 1119247 1118341 1118993
547422 1122108 1123592 1120514 1117291 1115843 1113996 1111896 1110194 1107731 1104074 1100416 1097302 1093971 1089263 1083288 1077349
551979 1071085 1063733 1057034 1052942 1050299 1044251 1038856 1037262 1037118 1037588 1039435 1042296 1044505 1046786 1049792 1052653
556537 1055586 1057650 1058736 1060004 1060619 1060402 1060293 1060293 1059533 1058483 1057324 1056201 1055368 1053232 1048416 1044360 1040847 1036719
561663 1032844 1030744 1029984 1030346 1031577 1034583 1040377 1046931 1053268 1060692 1068586 1076154 1083723 1091581 1098751 1104726
566220 1109107 1112729 1115951 1119355 1121238 1119971 1118957 1117907 1116965 1115915 1115988 1115517 1114720 1112837 1110158 1107659 1105776
571062 1103676 1100742 1098099 1097194 1097012 1096723 1096252 1096397 1097338 1098135 1099402 1100887 1102191 1102843 1103639 1105559 1107550 1110013
576189 1113272 1115770 1118088 1121057 1123846 1126381 1127829 1128771 1130183 1130980 1131233 1132211 1133659 1135180 1137425 1139272 1139888
581031A140105l98j268k209k571l042l041m310n106o264p170q039q329j0212j0864A056310
585588A044469j1769j1190r922p931n938k970L26L730O156P279R053J0103J0176A050842
589860A059388P424O735N649M780M201K571O88M34K18j449k752k680l078l440A075358
594418A072135l658k209n07r77p25O52J123J050K607K644L005L658L766L730L404A093500
599259A096976K716K354K318J991O52J09O52O15r41j232p2P2m34l26j45r41j268A101684
604671A099584k209k970m164m165l729l006k100j376o88N07J846K861L151L910A092305
609228A096469L151L005L078K753J919R78Q32J630M71%R77M35j81m35m70o88j340A110592
614640A108347l259m056l730l585m816n903o264o917p532p967q510q256p822p568A015318
$$ plain form
581031 1140105 1139707 1138439 1136230 1133659 1130617 1127576 1123266 1118160 1111896 1104726 1096687 1088358 1078146 1067282 1056310
585588 1044469 1032700 1021510 1011588 1003657 997719 994749 995075 998805 1004961 1012240 1021293 1031396 1041572 1050842
589860 1059388 1066812 1073547 1079196 1083976 1088177 1090748 1091436 1091870 1092088 1090639 1087887 1085207 1082129 1078689 1075358
594418 1072135 1068477 1066268 1065761 1064784 1064059 1064711 1065834 1066884 1069491 1072135 1075140 1078798 1082564 1086294 1089698 1093500
599259 1096976 1099692 1102046 1104364 1106355 1107007 1107116 1107768 1108383 1107442 1106210 1106138 1106210 1105776 1105450 1105305 1104364 1103096 1101684
604671 1099584 1097375 1094405 1090241 1086076 1082347 1079341 1077241 1075865 1075177 1075684 1077530 1080391 1083542 1087452 1092305
609228 1096469 1099620 1102625 1105703 1108456 1110375 1111353 1112185 1113815 1114286 1114286 1115263 1115698 1115517 1115082 1114612 1113924 1112584 1110592
614640 1108347 1105088 1101032 1097302 1093717 1088901 1082998 1076734 1069817 1062285 1054318 1045808 1037552 1029730 1022162 1015318
619197A009995k861L26L657O229P713O953O192N577N287M743M491L476L875L585A072497
623754A075358K752J593P24M71k17p61r77q33r06j339j087N80Q32l62K90J267A078218
628881A078363p2N43L6J376J883K101K027K535J485L26J014J448P3p3L26M71L98A094659
634292A095745Q33m71o88N43O52L26M35j09j09R78R42J339R42N07Q33Q33P24P24A107007
639989A109832J846J340J014L62p96j521j413o51K53Q33J050J557J811J45J81A115879
644831A114974j087j267k390l042j883l98J45N07Q69J050J485K027J232Q32J087A114105
649672A113054j303j087j520l006l187k317j087j738k788o52J086J775J448P97A101865
654230A105631L440J304K173K752K752K100J738J811J883N79J883J811R05K318A133804
$$ plain form
619197 1009995 1007134 1007460 1011117 1017346 1025059 1032012 1038204 1043781 1049068 1053811 1058302 1061778 1065653 1069238 1072497
623754 1075358 1078110 1079703 1080427 1080898 1080681 1079920 1078943 1078110 1077204 1075865 1074778 1075358 1076190 1075828 1076118 1077385 1078218
628881 1078363 1078291 1078834 1078870 1080246 1082129 1084230 1086257 1088792 1090277 1090603 1091617 1093065 1093138 1093065 1093391 1093862 1094260 1094659
634292 1095745 1096578 1096107 1095419 1095962 1096614 1096940 1097375 1097266 1097157 1098135 1099077 1100416 1101358 1101865 1102698 1103531 1104255 1104979 1107007
639989 1109832 1111678 1113018 1114032 1114394 1113598 1112077 1110664 1110013 1110266 1111099 1112149 1113706 1115517 1115662 1115843 1115879
644831 1114974 1113887 1112620 1110230 1107188 1105305 1104907 1105052 1105559 1106428 1107478 1108963 1110990 1112222 1113054 1114141 1114105
649672 1113054 1111751 1110664 1109144 1106138 1102951 1100634 1099547 1097809 1095021 1094369 1095455 1097230 1098678 1099475 1101865
654230 1105631 1109071 1110375 1112548 1115300 1118052 1120152 1121890 1123701 1125584 1126163 1128046 1129857 1130762 1133080 1133804
658787A134746j051J45p96J593p60n80j521j122l694l802p351o265l332j484k608A103060
663629A105667L26J268J702j014k18J847O52K209N758O192O627O518M563K571A145573
668186A144161p098r632l658Q257J0501N649K571L477J45j594p96j630p97R42A149520
672743A148217R41J376J847J159J593K137J521j594k861k462j811m055m744n577A129278
677300A123737n178m454l947l730k028n07j81R05K137J738J014J231J774J630A114720
681857A115336L26P96O88J09L98J09k17k90j195j738j774j014k209k680k318j702A100851
686984A098714k390l331l259l513l114j485j448j159K17N80j45m71O16K172K173A086076
691826A089263M309L404L259L441J774L62k53j81k18j448j376k54%j412k064j666A096143
$$ plain form
658787 1134746 1133695 1133840 1133044 1134637 1133877 1133297 1131776 1130654 1126960 1123158 1115807 1109542 1106210 1104726 1102118 1103060
663629 1105667 1105993 1107261 1108963 1107949 1107731 1109578 1110230 1112439 1118197 1124389 1131016 1137534 1142097 1144668 1145573
668186 1144161 1137063 1127431 1123773 1132030 1142531 1148180 1150751 1154228 1154373 1152779 1151983 1150353 1149556 1150498 1149520
672743 1148217 1149158 1150534 1152381 1153540 1155133 1157270 1158791 1157197 1154336 1151874 1150063 1146008 1141264 1135687 1129278
677300 1123737 1118559 1114105 1110158 1106428 1104400 1103893 1103712 1104617 1106754 1108492 1109506 1110737 1112511 1114141 1114720
681857 1115336 1115662 1116458 1117146 1117255 1117653 1117762 1117545 1117255 1116060 1114322 1112548 1111534 1109325 1106645 1104327 1102625 1100851
686984 1098714 1096324 1092993 1089734 1086221 1083107 1081622 1080174 1079015 1079232 1079812 1079667 1079196 1079812 1081984 1084157 1086076
691826 1089263 1093572 1096976 1100235 1103676 1105450 1105812 1105559 1105378 1105160 1103712 1102336 1102082 1102082 1100670 1098606 1096940 1096143
696952A094152k173j666m71o15n07j09L62p60l6j45j847j666o15j594j991j195A078399
702079A078544N43N44K716M055L549L151L404L476K969K028J847K535J014K89A111027
706636A112584J593L26M35J883J629L98M71R06P60J123J303M71j014j81J955Q33A124570
711763A123846k54p60r78j014r78q69j340j520j340j992k535j883k390k897l440A095817
716605A092703m019n251n070l838l259l585k644j847j665j702j014n80p24j81A057288
721162A057324M34M71J268K89j45J340J123P97J629J376J123K136K282J376J810A077241
726004A078798J81O52K17m35m34j159k571k173k354l693l875k281k209l151l585A049212
730846A046243j992n07r77p3J485L26k90N07J449J086N07O88J340l6k90%K90k18A049249
$$ plain form
696952 1094152 1091979 1090313 1089842 1089227 1088720 1088611 1088973 1088213 1088177 1088032 1086185 1084519 1083904 1082310 1080319 1079124 1078399
702079 1078544 1079087 1079631 1082347 1086402 1089951 1093102 1096506 1099982 1102951 1104979 1106826 1109361 1110375 1110664 1111027
706636 1112584 1114177 1114503 1114938 1116821 1118450 1118848 1119319 1120225 1120985 1122108 1123411 1123882 1122868 1122687 1124642 1125475 1124570
711763 1123846 1123592 1122832 1121854 1120840 1119862 1118993 1117653 1116133 1114793 1112801 1110266 1108383 1105993 1103096 1099656 1095817
716605 1092703 1088684 1083433 1078363 1074525 1071266 1067681 1065037 1063190 1061525 1059823 1058809 1058229 1057505 1057324 1057288
721162 1057324 1057758 1058229 1059497 1059786 1059641 1060981 1062104 1062901 1064530 1065906 1067029 1069165 1071447 1072823 1074633 1077241
726004 1078798 1078979 1079631 1079848 1079413 1078979 1077820 1075249 1073076 1070722 1067029 1063154 1060873 1058664 1055513 1051928 1049212
730846 1046243 1044251 1043744 1042767 1042694 1044179 1044505 1044215 1044722 1046171 1047257 1047764 1048452 1049792 1049756 1049466 1049466 1049756 1049538 1049249
736542A048814K90J412J014R41J558J44N07p2k281l006k028k209m925n757n143A023429
741384A017056p242p352o771o446m925l259j992j014O16K318K281K861L259L585I98189
745941A003621M599M635N070M490L404L477L585K317R06K89J09n43j992k752l839A022596
750783A017635p387q474q039r161r995j0791j0140r451q727p605n721m889l766I10520
755056I08492j195l26K90P2j050k028l802o482p967j0067j3724j6767j8070j8685G91200
759613G76390j0502o373j702J448K173K462K680M165P025J0610J3905J7527J9663H59388
763885H78508J8541J7237J5245J3362J2819J0393P134O337N867M526M092M708A003114
767872A006047K680K970L910K789K173K027R42J086J594J303J738J014j014o15A029296
$$ plain form
736542 1048814 1049104 1050516 1051530 1052471 1054029 1054173 1054680 1054608 1052327 1049321 1047293 1045084 1040159 1034402 1029259 1023429
741384 1017056 1009814 1002462 995691 989245 984320 981061 979069 978055 978671 980989 983270 986131 989390 992975 998189
745941 1003621 1008220 1012855 1017925 1022415 1025819 1029296 1032881 1035198 1036104 1036393 1036502 1035959 1033967 1031215 1027376 1022596
750783 1017635 1010248 1001774 993735 984574 974579 963788 953648 944197 935470 927865 922144 917255 913489 910520
755056 908492 907297 906971 907261 907333 906283 904255 900453 893971 886004 875937 862213 845446 827376 808691 791200
759613 776390 765888 759515 757813 759261 761434 763896 766576 770741 777766 788376 802281 819808 839471 859388
763885 878508 897049 914286 929531 942893 955712 966105 973239 979576 985443 989969 994061 998769 1003114
767872 1006047 1008727 1011697 1015607 1018396 1020569 1022596 1023538 1024624 1026218 1027521 1029259 1030273 1029259 1028644 1029296
772430A029151o52k17J81l26J09L98L62%L98J81p60j738j413j593j955k752k825A013869
777841A011733j738l99l6n79J08P97j45n79p97j123p96j268j955j883j919j702I94785
782968I90838l911m743n613o265p025q003q908q510q184p568o374m707l766k463I03458
787525I02444j774k825k064k317l042l983m418l803m526n722n721n613m418m382H43672
792082H39870n215p170p496p387q727j0285j0465j0755j2095j3290j3833j3217G08347
796069F98968o084l512j485P24M35%q33j919m491n649p061q872q619r089r958F22705
800911F12421j1117j1443j2132j3543j4340j3942j3072j2674j2276j1118r523D68695
804614D61742n975n142l440k861k861j702j521k136l187l983m527n359o265o772C98081
$$ plain form
772430 1029151 1028499 1028282 1028463 1028137 1028246 1028644 1029006 1029006 1029404 1029585 1028825 1027087 1025674 1024081 1022126 1019374 1016549 1013869
777841 1011733 1009995 1009596 1009560 1008981 1009089 1009886 1009741 1009162 1008365 1007242 1006446 1005178 1003223 1001340 999421 997719 994785
782968 990838 986927 982184 976571 970306 963281 955278 946370 937860 929676 922108 915734 911027 907261 904798 903458
787525 902444 900670 897845 895781 893464 890422 886439 882021 878218 873692 867970 862249 856636 852218 847836 843672
792082 839870 834655 827485 819989 812602 803875 793590 783125 772370 760275 746985 733152 719935 708347
796069 698968 692884 689372 687887 688611 689046 689046 688213 686294 681803 676154 669093 660221 651602 642513 632555 622705
800911 612421 601304 589861 577729 564186 549846 535904 522832 510158 497882 486764 477241 468695
804614 461742 455767 450625 447185 444324 441463 439761 438240 436104 432917 428934 424407 419048 412783 406011 398081
809171C89390p822p822q582q257o988n975n577n504m925m563m128l802m165l585C04327
813728C00851l223k462j811j412o88p3N80J340J774K209K535K969L295K970L259C15445
818570C17653J449J774J920J810J521J376J630J557N07N79M35M34l6m34l26o16C30726
823697C30473o16o16k89q69j521j268j050o88r05j775j267o88p24q69j449j231C13779
828824C12584j775j846j594j303k354k897k173k462l223l259k970l150k933k246B75792
833381B72642l477l042j738k028k426k390k064j304r77l26p3l62K18J81Q69J883B57360
838508B58555J376K101L114K172J340J485J774K499J992P96J195J702K246J846B85750
843065B87851K752L440L513K679L078L549L187L259L476L223L332L947M164M454C40902
$$ plain form
809171 389390 381568 373746 365164 356907 349919 343944 338367 332863 327938 323375 319247 315445 311280 307695 304327
813728 300851 297628 295166 293355 291943 291255 291182 291762 293102 294876 297085 299620 302589 305884 308854 312113 315445
818570 317653 319102 320876 322796 324606 326127 327503 329133 330690 331197 331776 332211 332645 332609 332175 331849 331233 330726
823697 330473 329857 329241 328952 328083 326562 325294 324244 323556 322651 320876 319609 318921 318197 317328 315879 314648 313779
828824 312584 310809 308963 307369 306066 303712 300815 298642 296180 292957 289698 286728 283578 280645 278399 275792
833381 272642 269165 266123 264385 262357 259931 257541 255477 254173 253196 252870 252797 252435 252653 252834 253703 255586 257360
838508 258555 259931 262032 265146 267318 268658 270143 271917 274416 276408 277204 278399 280101 282347 284193 285750
843065 287851 290603 294043 297556 300235 303313 306862 310049 313308 316784 320007 323339 327286 331450 335904 340902
847622C45139M526N975P677Q510Q437Q546R705J0864J0936J1878J3652J3290J2819D84809
851894D98678J4630J3724J2711J2421J2312J3797J3724J0683J0248J1153J0719F45120
855597F54355Q328Q474Q220P894P315P062Q075O554M853N866N106L621M310M381G48579
860154G53467M780M527L875M816N214L803M816M671M744O591O192N468N866N867H30346
864711H35307M490M128M527N214L585L332K680M34J920J846M35P60J195J666K426H75358
869553H75502K861L477J339L549M020K462K571K970L367M744M563L476N758O880I31957
874110I33913K933L259L187L983L766J702K825M418L548J413K534K680J45J630I76390
878667I77693q69J340J883K137L259J702p3k17R41J558J484P3Q69K462J738L63I96162
$$ plain form
847622 345139 349665 355640 363317 371827 380264 388810 398515 409379 420315 432193 445845 459135 471954 484809
851894 498678 513308 527032 539743 552164 564476 578273 591997 602680 612928 624081 634800 645120
855597 654355 662683 671157 679377 687271 694586 701648 709723 716277 721130 726996 732102 735723 740033 744414 748579
860154 753467 758247 762774 766649 771465 776679 780482 785298 789969 794713 801304 807496 812964 818830 824697 830346
864711 835307 839797 843925 848452 853666 857251 860583 863263 863697 865617 867463 867898 868658 869853 871519 873945 875358
869553 875502 878363 881840 883179 886728 890748 893210 895781 898751 902118 906862 911425 914901 920659 927539 931957
874110 933913 936846 940105 943292 947275 951041 952743 955568 959986 963534 964947 967481 970161 970306 971936 976390
878667 977693 976824 978164 980047 982184 985443 987145 987072 986855 987796 989354 990838 990911 991780 994242 995980 996343 996162
883794I95944P3N43P60L26J340J883o52j557O16Q69Q69J521J122M71p60J45J376A005033
889205A004020m35K90j123n07R42J303K90L62J376J304j81o52R41J014O88J195A012747
894332A013942n07p25K18Q69J159J339J195Q33M71O88J557L404J702j086k17K53A026725
899459A027702l26K90O52O52L26L6J81O88O52N07K17n07L62K90L62Q69J09K89A034619
905155A035416N79P60J087J45k18M35J593N80n80p2R78o16j050j81K53j45j738A036067
910567A036176j81n07p60k90j376j413p96n07o88k028j485k17r42j557o15o16A021039
915694A020206p60r78j376j376m34k54j81J45p24r78r78j086m71P2r77j304%J231A010284
921390A008474j992q33P24%p96L98N79r77j81J991J087k90O16N43k54q69Q33J304A010827
$$ plain form
883794 995944 996017 996560 997320 997646 998986 1000869 1000217 998660 999276 1000145 1001014 1002535 1003657 1004128 1003368 1003513 1004889 1005033
889205 1004020 1003585 1003875 1002752 1002245 1003187 1004490 1004780 1005142 1006518 1007822 1007641 1006989 1007930 1008944 1009632 1010827 1012747
894332 1013942 1013435 1012710 1012928 1013797 1014956 1016295 1017490 1018323 1018794 1019482 1021039 1024443 1026145 1025059 1024842 1025095 1026725
899459 1027702 1027376 1027666 1028318 1028970 1029296 1029332 1029513 1030201 1030853 1031360 1031577 1031070 1031432 1031722 1032084 1032953 1033062 1033351 1034619
905155 1035416 1035995 1036755 1037842 1037987 1037769 1038204 1039797 1040377 1039797 1039725 1040703 1040087 1039037 1038856 1039109 1038964 1037226 1036067
910567 1036176 1035995 1035488 1034728 1034438 1033062 1031649 1030853 1030346 1029658 1027630 1026145 1025928 1024986 1023429 1022814 1022198 1021039
915694 1020206 1019446 1018468 1017092 1015716 1015282 1015028 1014847 1014992 1014268 1013290 1012312 1011226 1010755 1010827 1009850 1008546 1008546 1009777 1010284
921390 1008474 1006482 1005649 1006373 1006373 1005577 1005975 1006554 1005577 1005396 1007387 1008474 1008184 1008800 1009343 1009089 1008220 1009053 1010357 1010827
927086A011660J449M71L6O88J557%p61p2J485J847Q69P2J45P2O52J738J304n07A022198
932783A022995N79O88N80j45m35Q33J086K54o16m70p25M35J629K18r06j08J014A025856
938194A024697m71o52l98l26%m71r78n79n07J45J122j81j665p61Q33j050j630A015861
943606A014231j303r42j122j449j448j123j521o88p24j919j811j195j376j992I94061
948163I92866k136j956o88j702j774p61j448j775j013l99k498l296p24n79l549I65635
953005I64693j557k426j919j195p61j340k100j811k100j666o15k064k354j413I38910
957562I36049l512l404l042k607l187l621l549k861l947n540m237m165n250n975H74959
962119H68405o808o736p604q691q256p641q908q909q654r452j1225j0611q799G46152
$$ plain form
927086 1011660 1013109 1013580 1013616 1014304 1015861 1015861 1015100 1015028 1016513 1018360 1019229 1019301 1019446 1019518 1020170 1021908 1023212 1022705 1022198
932783 1022995 1023574 1024262 1024842 1024697 1024262 1025095 1026181 1026435 1025819 1025349 1024624 1025059 1026688 1026906 1026000 1025892 1026906 1025856
938194 1024697 1024226 1023574 1023176 1022850 1022850 1022379 1021401 1020822 1020315 1020460 1021582 1021401 1019736 1018975 1019808 1018758 1017128 1015861
943606 1014231 1012928 1011986 1010864 1009415 1007967 1006844 1005323 1004635 1003911 1001992 1000181 998986 997610 995618 994061
948163 992866 990730 988774 988086 986384 984610 983849 982401 980626 979613 979214 976716 973420 972696 972117 968568 965635
953005 964693 963136 960710 958791 957596 956835 955495 953395 951584 949484 947818 947203 945139 942785 941372 938910
957562 936049 932537 929133 926091 923484 920297 916676 913127 910266 906319 900779 896542 892377 887127 881152 874959
962119 868405 861597 854861 847257 838566 830310 822669 813761 804852 796198 786746 775521 764910 756111 746152
966391G34347j2927j1769j0973j2131j1841j0284r162p315n649n867n069k680F27630
970379F27304J014L187L802M599O047O663P351P714Q292Q401Q728J0248Q980O772G26779
974936G34601O916P424O916N722N902N468N034N033L658K788M020L911J955K463H05323
979493H06627K90K426K535L26P24J122Q33J81n07p2p24p61q69j195j412j449j376H05142
984905H03332p25j122k716j919j123k318l512k209n43j702k354l006l367k318G72117
989462G70125k173k245k788k644j303o16k426l984l476k535j412j014j304k788G35325
994019G32826q33k752m055j666r05k427k317k245k934k390j231p24j666l295k245F99439
998861F98316o15k065l041j159L6n79r06j774j919r78o52J340J702R41O52K90F90277
$$ plain form
966391 734347 721420 709651 698678 686547 674706 664422 655260 647945 642296 636429 631360 628680 627630
970379 627304 628318 631505 635307 639906 645953 652616 659967 667681 675973 684374 693102 703350 712330 719102 726779
974936 734601 741517 748941 755857 761579 767481 772949 777983 783016 786674 789462 793482 797393 799348 801811 805323
979493 806627 806917 809343 811878 812204 812928 814050 814883 815064 814557 814485 813761 813000 812131 810936 809524 808075 806699 805142
984905 803332 802607 801485 798769 796850 795727 793409 789897 787688 787145 785443 783089 780083 776716 774398 772117
989462 770125 767952 765707 762919 760275 758972 758356 755930 751946 748470 745935 744523 743509 742205 739417 735325
994019 732826 731993 729241 725186 723520 722615 720188 717871 715626 712692 710302 709071 708347 706681 703386 701141 699439
998861 698316 697701 695636 692595 691436 691472 690893 689987 688213 686294 685316 684664 686004 687706 688647 689299 689589 690277
1003987F90603j45P61J303k53l26J919J231%R42J991J811K54J81M34J268J629J050G06355
1009399G08709K281J594p61k172J08K064K245J087j81J45P96l62p2K317J956j413G18016
1014526G18523J08J376L332K643j412n070l114J231J09j883j376j594j195o51j087G06573
1019368G02517m816p859j1044j0321k17J1841J2856O844K571j050r06J920K788G05884
1023640G04617k209j738N07O88P60L99j087j303r78p97N80P2o699j0212j123Q402F98932
1028767G03096n43l6p97K028M273R42k427k969L694N359K861K860K499M708R886G45283
1033609G44668n142J484M998L512K282M055M165N106N069M020N214M418L658M056G96125
1038166H04635J1805J0067O736M852M092k53k354L006P785P569M816K824L404N287H80282
$$ plain form
1003987 690603 690458 691219 692522 692269 691943 693862 695093 695093 696035 698026 699837 700091 700272 700706 701974 703603 704653 706355
1009399 708709 710990 712584 711823 709651 709759 711823 714068 715155 714974 715119 715915 715553 715481 717798 719754 718341 718016
1014526 718523 718631 720007 723339 725982 724570 719500 716386 717617 717726 715843 714467 712873 711678 711027 709940 706573
1019368 702517 697701 689842 678798 668477 668260 680101 692957 699801 702372 701322 700416 702336 705124 705884
1023640 704617 702408 700670 701177 701865 702625 703024 701937 700634 699656 698859 699439 699511 692812 682600 681477 689879 698932
1028767 703096 702553 702517 701720 703748 708021 708963 706536 703567 707261 712620 715481 718341 720840 725548 735434 745283
1033609 744668 739526 741010 746008 749520 751802 755857 760022 765128 770197 774217 779431 783849 787507 791563 796125
1038166 804635 816440 826507 833243 838095 842187 841934 839580 842586 850371 857940 862756 865580 868984 874271 880282
1042723H85026M599N323M491N214O301Q582R524Q583K100k173L802J0212J3037I69690
1046995I65309j449P97J521J485J195J557J738L223L947P278R271O011P568M780A016295
1051552A018287L114M382M925O228N794L404M092P388O663K498P97K53K18J919A074561
1056109A077820K716O880L585l114k861l766j955K89P3J629K173J666M309K933A091182
1060666A089118R78J304o52k861j267N033N287J702M671N070M925m309p750j919A098533
1065224A095347j45M889O047j014n033l151j883J666o16M527K89q473o772m563A079305
1069781A077965j557J666%m020m056k354N07J051N43j666k462J484K463J08k607A063987
1074623A063806o52j159Q69L259M346J485k246l078j412R05R06L62n79j920O88A068369
$$ plain form
1042723 885026 889625 894948 899439 904653 910954 919536 929060 937643 939743 937570 941372 951584 964621 969690
1046995 965309 963860 964657 966178 967663 968858 970415 972153 975376 979323 986601 995872 1001883 1009451 1014231 1016295
1051552 1018287 1021401 1025783 1030708 1036936 1042730 1046134 1050226 1057614 1064277 1066775 1067572 1067825 1068043 1069962 1074561
1056109 1077820 1080536 1087416 1091001 1087887 1085026 1081260 1079305 1079594 1079667 1081296 1083469 1085135 1089444 1092377 1091182
1060666 1089118 1090096 1091400 1090748 1087887 1086620 1091653 1096940 1098642 1103313 1108383 1113308 1108999 1101249 1099330 1098533
1065224 1095347 1095202 1100091 1106138 1105124 1100091 1096940 1095057 1096723 1096107 1100634 1100923 1092450 1085678 1081115 1079305
1069781 1077965 1076408 1078074 1078074 1074054 1069998 1067644 1068151 1069202 1069745 1068079 1065617 1067101 1069564 1069672 1067065 1063987
1074623 1063806 1063154 1061995 1062864 1066123 1070469 1071954 1069708 1066630 1065218 1066123 1067029 1067391 1066812 1064892 1065580 1068369
1079465A069310m34K89J376L187K861J702J883N43M164N034J81O52k607l006K752A091255
1084306A091110j593m672j702J630J050K499O047L549l62j413j557N034Q799l6A101539
1088864A098533k498J629L259Q70m71m71O16k90J014K498J413J666L186j557k499A108673
1093705A107261l839k028k209k317l911m310j484n43l26L585L693M889K028j2095A086330
1098263A084374l150j811q69J087L186L006L26P97j09k463j303K788L259j81k317A085207
1103105A084302m71j955m454j702K245L911K426l26J81k90R78L513J340m129k027A087416
1107946A090675r05j123k281k245m35J09L006L693K173J231k535o88J087k789m816A080246
1112788A077241l006k680j810j449q69p24j883P2n07l730l259j593k788l911l042A043346
$$ plain form
1079465 1069310 1068876 1069165 1070541 1073728 1076589 1078291 1080174 1080717 1084881 1089915 1090096 1090748 1088141 1085135 1087887 1091255
1084306 1091110 1089517 1084845 1083143 1084773 1085823 1088322 1094369 1097918 1097556 1096143 1094586 1099620 1108419 1108383 1101539
1088864 1098533 1096035 1097664 1100923 1101793 1101322 1100851 1101467 1101177 1102191 1104689 1106102 1107768 1110954 1109397 1106898 1108673
1093705 1107261 1103422 1101394 1099185 1096868 1092957 1088647 1087163 1086620 1086294 1089879 1093572 1098461 1100489 1088394 1086330
1098263 1084374 1081224 1079413 1078544 1079631 1082817 1085823 1086149 1086946 1086837 1084374 1083071 1085859 1089118 1088937 1086620 1085207
1103105 1084302 1083831 1081876 1077422 1075720 1077965 1081876 1084302 1083976 1084157 1083867 1084845 1088358 1089698 1085569 1083542 1087416
1107946 1090675 1089770 1088647 1086366 1084121 1083686 1083795 1086801 1090494 1092667 1093898 1091363 1090675 1091762 1088973 1084157 1080246
1112788 1077241 1074235 1071555 1069745 1068296 1067427 1066703 1064820 1064892 1064385 1060655 1057396 1055803 1053015 1049104 1046062 1043346
1117630A041716j593k499k643l730j376K54k173k789j991j811j448l223k897r42A011081
1122187A008727j340r41q69l332l766q33%J81K18M70N43l6O16R05J304K136J521A006627
1127599A008329K607L658J122K90J955J919L63J08R78J485J014J412N07j412L6A025711
1132441A026073J376J014k54J376K064J195J775J122Q33J81N44L25j339o52J485A037443
1137283A036936m34n43o16j45n79k571k535j847O16J159j123j304q33r77o16j050A022415
1142410A022741o52j267n43J08K028J702K209M71j376%%Q33K897J231r78%J050A030165
1147821A029042%j45o51j123j630L7L6j992j412m35L7N43L62L98p24M34K137J340A027123
1153518A028354K54q69o16Q69K390K788N44n07J195R77j45Q70J014n44j303j775A032012
$$ plain form
1117630 1041716 1040123 1037624 1034981 1031251 1029875 1030129 1027956 1025167 1023176 1021365 1019917 1016694 1013797 1012855 1011081
1122187 1008727 1007387 1006446 1005577 1002245 998479 997646 997646 997827 998045 998515 999058 999022 999638 1000543 1001847 1003983 1005504 1006627
1127599 1008329 1010936 1014594 1015716 1016006 1017961 1019880 1020243 1020351 1021329 1022814 1023828 1025240 1025747 1024335 1024371 1025711
1132441 1026073 1027449 1028463 1028209 1029585 1031649 1032844 1034619 1035741 1036574 1036755 1037299 1037624 1036285 1035633 1037118 1037443
1137283 1036936 1036502 1035959 1035343 1035198 1034619 1032048 1029513 1027666 1028282 1029441 1028318 1027014 1026181 1025204 1024588 1023538 1022415
1142410 1022741 1022089 1020822 1020279 1020387 1022415 1024117 1026326 1026797 1025421 1025421 1025421 1026254 1029151 1030382 1029404 1029404 1030454 1030165
1147821 1029042 1029042 1028897 1028246 1027123 1025493 1025530 1025566 1023574 1022162 1021727 1021764 1022307 1022669 1023067 1022343 1022777 1024914 1026254 1027123
1153518 1028354 1028608 1027739 1027123 1027992 1030382 1033170 1033714 1033207 1034402 1035379 1035234 1036104 1037118 1036574 1035271 1033496 1032012
1158644A031215m71K17J594j376l042l006j014J81j158j304l98J08R78M71l99n43A021691
1163771A020786j956N07J268%%k90j45%k17j050N79%j774j775k17L6j45A015933
$$ plain form
1158644 1031215 1030744 1030961 1032555 1031179 1028137 1025131 1024117 1024298 1023140 1021836 1021438 1021546 1022524 1022995 1022596 1022053 1021691
1163771 1020786 1018830 1019337 1020605 1020605 1020605 1020315 1020170 1020170 1019953 1018903 1019482 1019482 1017708 1015933 1015716 1015752 1015607 1015933
1169183A016042  $$checkpoint
##END=
##TITLE= adipic acid (1,6-hexanedioic acid)
##JCAMP-DX=5.00 $$
##DATA TYPE=INFRARED SPECTRUM
##DATA CLASS=XYDATA
##ORIGIN=Dept of Chemistry, UWI, JAMAICA
##OWNER=copyright UWI, Mona, JAMAICA 2002
##DATE=29/06/2000 11:57:00
##SPECTROMETER/DATASYSTEM= PERKIN-ELMER 1000 FT-IR
##$MODELS=
<Models>
<ModelData id="adipic_acid" type="MOL">
adipic acid
__Jmol-14_10221413563D 1   1.00000     0.00000     0
Jmol version 14.3.8_2014.10.14  2014-10-15 19:12 EXTRACT: ({0:19})
 20 19  0  0  0  0              1 V2000
   0.00000   0.00000   0.00000 C   0  0  0  0  0  0
   1.54000   0.00000   0.00000 C   0  0  0  0  0  0
   2.17750   1.10420   0.00000 O   0  0  0  0  0  0
  -0.51330  -1.45190   0.00000 C   0  0  0  0  0  0
  -2.05330  -1.45190   0.00000 C   0  0  0  0  0  0
  -2.56670  -2.90390   0.00000 C   0  0  0  0  0  0
  -4.10670  -2.90390   0.00000 C   0  0  0  0  0  0
  -4.74420  -1.79970   0.00000 O   0  0  0  0  0  0
  -4.85670  -4.20290   0.00000 O   0  0  0  0  0  0
  -5.88900  -4.01100   0.00000 H   0  0  0  0  0  0
   2.29000  -1.29900   0.00000 O   0  0  0  0  0  0
   1.60770  -2.09710   0.00000 H   0  0  0  0  0  0
  -0.36330   0.51381  -0.89000 H   0  0  0  0  0  0
  -0.36330   0.51381   0.89000 H   0  0  0  0  0  0
  -0.15001  -1.96580  -0.89000 H   0  0  0  0  0  0
  -0.15001  -1.96580   0.89000 H   0  0  0  0  0  0
  -2.41670  -0.93810  -0.89000 H   0  0  0  0  0  0
  -2.41670  -0.93810   0.89000 H   0  0  0  0  0  0
  -2.20330  -3.41770  -0.89000 H   0  0  0  0  0  0
  -2.20330  -3.41770   0.89000 H   0  0  0  0  0  0
  1  2  1  0  0  0
  2 11  1  0  0  0
  2  3  1  0  0  0
  4 15  1  0  0  0
  4 16  1  0  0  0
  4  1  1  0  0  0
  5  4  1  0  0  0
  6 20  1  0  0  0
  6 19  1  0  0  0
  6  5  1  0  0  0
  7  6  1  0  0  0
  8  7  1  0  0  0
  9  7  1  0  0  0
 10  9  1  0  0  0
 12 11  1  0  0  0
 13  1  1  0  0  0
 14  1  1  0  0  0
 17  5  1  0  0  0
 18  5  1  0  0  0
M  END
</ModelData>
 <ModelData id="5" type="XYZVIB" vibrationScale="0.1" baseModel="adipic_acid">
20
1  Energy: -2189.6361  Freq: 3476.05284
C     1.407400    1.315900   -0.000600   -0.000520   -0.000480    0.000000
C     2.905400    1.315900   -0.000600    0.000240    0.015560    0.000000
O     3.609500    2.327400   -0.000600   -0.002020   -0.006420    0.000000
C     0.755900   -0.047500    0.009100    0.000940   -0.001720   -0.000040
C    -0.752500    0.087000   -0.001500    0.000060    0.000140    0.000000
C    -1.411800   -1.275200    0.017000    0.000000    0.000060    0.000000
C    -2.900900   -1.154300   -0.006200    0.000100   -0.000120    0.000000
O    -3.610800   -0.147600   -0.072300   -0.000080    0.000080    0.000000
O    -3.544100   -2.355400    0.054300   -0.000360    0.000060    0.000000
H    -4.505100   -2.212500    0.033400    0.005700   -0.000620    0.000100
O     3.638700    0.163000   -0.000300    0.083080    0.109620   -0.000380
H     3.062400   -0.611600    0.002300   -1.296540   -1.818460    0.005980
H     1.074400    1.890600   -0.908700    0.000840    0.001620   -0.002040
H     1.074000    1.903500    0.898900    0.000860    0.001660    0.002000
H     1.082500   -0.636200   -0.889800    0.000080    0.008360    0.018140
H     1.072500   -0.617700    0.923300    0.000080    0.007660   -0.017640
H    -1.082200    0.650900   -0.914200   -0.000540   -0.000220   -0.000040
H    -1.091900    0.680300    0.888600   -0.000580   -0.000200    0.000060
H    -1.094100   -1.881700   -0.873300    0.000440   -0.000160   -0.000080
H    -1.116100   -1.846800    0.937200    0.000420   -0.000140    0.000060
20
2  Energy: -2189.6361  Freq: 3424.68426
C     1.407400    1.315900   -0.000600   -0.000040    0.000000    0.000000
C     2.905400    1.315900   -0.000600    0.000160    0.000120    0.000000
O     3.609500    2.327400   -0.000600   -0.000100   -0.000100    0.000000
C     0.755900   -0.047500    0.009100    0.000000   -0.000060    0.000000
C    -0.752500    0.087000   -0.001500   -0.000280    0.000100    0.000000
C    -1.411800   -1.275200    0.017000   -0.002340   -0.001500    0.000080
C    -2.900900   -1.154300   -0.006200    0.008620    0.013300   -0.000640
O    -3.610800   -0.147600   -0.072300    0.002260   -0.000480    0.000060
O    -3.544100   -2.355400    0.054300    0.134500   -0.022660    0.003060
H    -4.505100   -2.212500    0.033400   -2.242360    0.227360   -0.042520
O     3.638700    0.163000   -0.000300    0.000180    0.000300    0.000000
H     3.062400   -0.611600    0.002300   -0.003080   -0.004940    0.000020
H     1.074400    1.890600   -0.908700   -0.000060    0.000320   -0.000440
H     1.074000    1.903500    0.898900   -0.000080    0.000340    0.000440
H     1.082500   -0.636200   -0.889800    0.000220   -0.000220   -0.000460
H     1.072500   -0.617700    0.923300    0.000200   -0.000220    0.000480
H    -1.082200    0.650900   -0.914200   -0.000200    0.001060   -0.001380
H    -1.091900    0.680300    0.888600   -0.000220    0.001080    0.001320
H    -1.094100   -1.881700   -0.873300    0.000160   -0.001660   -0.001960
H    -1.116100   -1.846800    0.937200    0.000060   -0.001520    0.001840
20
3  Energy: -2189.6361  Freq: 3104.22044
C     1.407400    1.315900   -0.000600   -0.005060    0.011660   -0.000120
C     2.905400    1.315900   -0.000600   -0.001220    0.000420    0.000000
O     3.609500    2.327400   -0.000600    0.000080    0.000120    0.000000
C     0.755900   -0.047500    0.009100   -0.019980    0.029880   -0.000540
C    -0.752500    0.087000   -0.001500   -0.036440    0.064280   -0.001340
C    -1.411800   -1.275200    0.017000   -0.018220    0.042600   -0.001560
C    -2.900900   -1.154300   -0.006200   -0.004580    0.003040   -0.000180
O    -3.610800   -0.147600   -0.072300    0.001180   -0.001280    0.000080
O    -3.544100   -2.355400    0.054300   -0.000060    0.000080    0.000000
H    -4.505100   -2.212500    0.033400   -0.000080    0.000220    0.000020
O     3.638700    0.163000   -0.000300    0.000460    0.000200    0.000000
H     3.062400   -0.611600    0.002300   -0.001020   -0.006940    0.000000
H     1.074400    1.890600   -0.908700    0.034340   -0.063020    0.104560
H     1.074000    1.903500    0.898900    0.034320   -0.064280   -0.103360
H     1.082500   -0.636200   -0.889800    0.104920   -0.182600   -0.298900
H     1.072500   -0.617700    0.923300    0.102280   -0.177480    0.305260
H    -1.082200    0.650900   -0.914200    0.226380   -0.390980    0.675520
H    -1.091900    0.680300    0.888600    0.233660   -0.411940   -0.658920
H    -1.094100   -1.881700   -0.873300    0.132460   -0.255160   -0.396920
H    -1.116100   -1.846800    0.937200    0.125060   -0.243820    0.416120
20
4  Energy: -2189.6361  Freq: 3089.62256
C     1.407400    1.315900   -0.000600   -0.018760    0.038780   -0.000260
C     2.905400    1.315900   -0.000600   -0.004820    0.001300    0.000000
O     3.609500    2.327400   -0.000600    0.000320    0.000460    0.000000
C     0.755900   -0.047500    0.009100   -0.024840    0.048480   -0.000700
C    -0.752500    0.087000   -0.001500   -0.007520    0.001540    0.000200
C    -1.411800   -1.275200    0.017000    0.026140   -0.050360    0.002260
C    -2.900900   -1.154300   -0.006200    0.007000   -0.003640    0.000260
O    -3.610800   -0.147600   -0.072300   -0.001660    0.001800   -0.000120
O    -3.544100   -2.355400    0.054300    0.000000   -0.000200    0.000020
H    -4.505100   -2.212500    0.033400   -0.001340   -0.000580    0.000000
O     3.638700    0.163000   -0.000300    0.001140    0.000000    0.000000
H     3.062400   -0.611600    0.002300   -0.002200   -0.012120    0.000000
H     1.074400    1.890600   -0.908700    0.132260   -0.229480    0.387440
H     1.074000    1.903500    0.898900    0.132660   -0.235280   -0.384520
H     1.082500   -0.636200   -0.889800    0.167320   -0.306300   -0.496720
H     1.072500   -0.617700    0.923300    0.162100   -0.296700    0.505680
H    -1.082200    0.650900   -0.914200    0.020540   -0.024800    0.048220
H    -1.091900    0.680300    0.888600    0.022220   -0.028500   -0.049980
H    -1.094100   -1.881700   -0.873300   -0.184000    0.341820    0.538660
H    -1.116100   -1.846800    0.937200   -0.175040    0.328720   -0.567880
20
5  Energy: -2189.6361  Freq: 3081.93382
C     1.407400    1.315900   -0.000600    0.022420   -0.042120    0.000220
C     2.905400    1.315900   -0.000600    0.005540   -0.001180    0.000000
O     3.609500    2.327400   -0.000600   -0.000360   -0.000600    0.000000
C     0.755900   -0.047500    0.009100    0.005820   -0.021040    0.000260
C    -0.752500    0.087000   -0.001500   -0.022520    0.035780   -0.000520
C    -1.411800   -1.275200    0.017000    0.022920   -0.038640    0.001960
C    -2.900900   -1.154300   -0.006200    0.006040   -0.002760    0.000220
O    -3.610800   -0.147600   -0.072300   -0.001400    0.001480   -0.000100
O    -3.544100   -2.355400    0.054300   -0.000040   -0.000240    0.000020
H    -4.505100   -2.212500    0.033400   -0.001820   -0.000600    0.000000
O     3.638700    0.163000   -0.000300   -0.000920    0.000380    0.000000
H     3.062400   -0.611600    0.002300    0.000840    0.005600    0.000000
H     1.074400    1.890600   -0.908700   -0.155460    0.264960   -0.449960
H     1.074000    1.903500    0.898900   -0.156120    0.272060    0.447060
H     1.082500   -0.636200   -0.889800   -0.065740    0.126120    0.202740
H     1.072500   -0.617700    0.923300   -0.063560    0.122020   -0.206180
H    -1.082200    0.650900   -0.914200    0.150540   -0.257860    0.449440
H    -1.091900    0.680300    0.888600    0.156400   -0.274000   -0.441240
H    -1.094100   -1.881700   -0.873300   -0.154120    0.284240    0.449700
H    -1.116100   -1.846800    0.937200   -0.147280    0.274480   -0.475800
20
6  Energy: -2189.6361  Freq: 3069.70254
C     1.407400    1.315900   -0.000600    0.030580   -0.047780    0.000080
C     2.905400    1.315900   -0.000600    0.007660   -0.000720    0.000000
O     3.609500    2.327400   -0.000600   -0.000800   -0.001120    0.000000
C     0.755900   -0.047500    0.009100   -0.028120    0.046660   -0.000980
C    -0.752500    0.087000   -0.001500    0.007140   -0.018260    0.000260
C    -1.411800   -1.275200    0.017000   -0.005000    0.006680   -0.000460
C    -2.900900   -1.154300   -0.006200   -0.001420    0.000600   -0.000060
O    -3.610800   -0.147600   -0.072300    0.000380   -0.000360    0.000020
O    -3.544100   -2.355400    0.054300    0.000020    0.000060    0.000000
H    -4.505100   -2.212500    0.033400    0.001380    0.000280    0.000000
O     3.638700    0.163000   -0.000300   -0.000540    0.001420    0.000000
H     3.062400   -0.611600    0.002300   -0.000860   -0.011680   -0.000020
H     1.074400    1.890600   -0.908700   -0.202820    0.340640   -0.582800
H     1.074000    1.903500    0.898900   -0.204360    0.351180    0.580860
H     1.082500   -0.636200   -0.889800    0.195280   -0.348200   -0.572380
H     1.072500   -0.617700    0.923300    0.190480   -0.339460    0.585920
H    -1.082200    0.650900   -0.914200   -0.075560    0.132900   -0.230720
H    -1.091900    0.680300    0.888600   -0.078460    0.140900    0.226180
H    -1.094100   -1.881700   -0.873300    0.031040   -0.057540   -0.091500
H    -1.116100   -1.846800    0.937200    0.030020   -0.056220    0.097800
20
7  Energy: -2189.6361  Freq: 3034.86595
C     1.407400    1.315900   -0.000600    0.000020    0.000060    0.021700
C     2.905400    1.315900   -0.000600    0.000020    0.000020    0.000560
O     3.609500    2.327400   -0.000600    0.000000    0.000000    0.000060
C     0.755900   -0.047500    0.009100   -0.000380    0.000740    0.061160
C    -0.752500    0.087000   -0.001500   -0.000460    0.001460    0.092220
C    -1.411800   -1.275200    0.017000   -0.000960    0.001640    0.058340
C    -2.900900   -1.154300   -0.006200   -0.000160    0.000060    0.001660
O    -3.610800   -0.147600   -0.072300    0.000000   -0.000020    0.000220
O    -3.544100   -2.355400    0.054300    0.000020    0.000020    0.000120
H    -4.505100   -2.212500    0.033400    0.000100    0.000040    0.000040
O     3.638700    0.163000   -0.000300    0.000000    0.000000    0.000080
H     3.062400   -0.611600    0.002300   -0.000020   -0.000180    0.000420
H     1.074400    1.890600   -0.908700   -0.049620    0.090780   -0.128540
H     1.074000    1.903500    0.898900    0.048900   -0.091360   -0.125100
H     1.082500   -0.636200   -0.889800    0.148300   -0.259340   -0.364740
H     1.072500   -0.617700    0.923300   -0.143400    0.250500   -0.369140
H    -1.082200    0.650900   -0.914200   -0.222580    0.383300   -0.569280
H    -1.091900    0.680300    0.888600    0.228040   -0.400080   -0.551720
H    -1.094100   -1.881700   -0.873300    0.136540   -0.264080   -0.353620
H    -1.116100   -1.846800    0.937200   -0.123980    0.242960   -0.354260
20
8  Energy: -2189.6361  Freq: 3019.56924
C     1.407400    1.315900   -0.000600    0.000040    0.000280    0.052360
C     2.905400    1.315900   -0.000600    0.000020    0.000040    0.001480
O     3.609500    2.327400   -0.000600    0.000000   -0.000020    0.000120
C     0.755900   -0.047500    0.009100   -0.000540    0.000940    0.080060
C    -0.752500    0.087000   -0.001500   -0.000020   -0.000180   -0.012880
C    -1.411800   -1.275200    0.017000    0.001240   -0.002060   -0.079500
C    -2.900900   -1.154300   -0.006200    0.000160   -0.000060   -0.002380
O    -3.610800   -0.147600   -0.072300    0.000000    0.000000   -0.000180
O    -3.544100   -2.355400    0.054300   -0.000020   -0.000040   -0.000160
H    -4.505100   -2.212500    0.033400   -0.000120   -0.000040   -0.000200
O     3.638700    0.163000   -0.000300    0.000020    0.000020    0.000120
H     3.062400   -0.611600    0.002300   -0.000040   -0.000240    0.000980
H     1.074400    1.890600   -0.908700   -0.127080    0.221900   -0.320620
H     1.074000    1.903500    0.898900    0.126300   -0.224900   -0.314720
H     1.082500   -0.636200   -0.889800    0.192780   -0.353600   -0.496300
H     1.072500   -0.617700    0.923300   -0.186160    0.341520   -0.502220
H    -1.082200    0.650900   -0.914200    0.026940   -0.059400    0.084340
H    -1.091900    0.680300    0.888600   -0.027040    0.060680    0.079720
H    -1.094100   -1.881700   -0.873300   -0.196480    0.366480    0.499220
H    -1.116100   -1.846800    0.937200    0.180360   -0.339520    0.504960
20
9  Energy: -2189.6361  Freq: 3006.88662
C     1.407400    1.315900   -0.000600    0.000040    0.000360    0.058560
C     2.905400    1.315900   -0.000600    0.000020    0.000020    0.001720
O     3.609500    2.327400   -0.000600    0.000000    0.000000    0.000140
C     0.755900   -0.047500    0.009100   -0.000160    0.000300    0.022700
C    -0.752500    0.087000   -0.001500    0.000400   -0.001180   -0.071540
C    -1.411800   -1.275200    0.017000   -0.001060    0.001740    0.070100
C    -2.900900   -1.154300   -0.006200   -0.000120    0.000040    0.002160
O    -3.610800   -0.147600   -0.072300    0.000000    0.000020    0.000080
O    -3.544100   -2.355400    0.054300    0.000020    0.000020    0.000140
H    -4.505100   -2.212500    0.033400    0.000100    0.000020    0.000160
O     3.638700    0.163000   -0.000300    0.000000    0.000000    0.000120
H     3.062400   -0.611600    0.002300    0.000020   -0.000060    0.000180
H     1.074400    1.890600   -0.908700   -0.148380    0.252480   -0.370060
H     1.074000    1.903500    0.898900    0.147980   -0.256700   -0.364600
H     1.082500   -0.636200   -0.889800    0.053140   -0.105120   -0.146000
H     1.072500   -0.617700    0.923300   -0.050800    0.100860   -0.146480
H    -1.082200    0.650900   -0.914200    0.183660   -0.314260    0.474200
H    -1.091900    0.680300    0.888600   -0.189540    0.330240    0.463180
H    -1.094100   -1.881700   -0.873300    0.179660   -0.330300   -0.454360
H    -1.116100   -1.846800    0.937200   -0.165740    0.306980   -0.461660
20
10  Energy: -2189.6361  Freq: 2994.82444
C     1.407400    1.315900   -0.000600    0.000000    0.000620    0.092380
C     2.905400    1.315900   -0.000600    0.000020    0.000020    0.002840
O     3.609500    2.327400   -0.000600   -0.000020   -0.000020    0.000200
C     0.755900   -0.047500    0.009100    0.000420   -0.000760   -0.068760
C    -0.752500    0.087000   -0.001500   -0.000180    0.000540    0.033660
C    -1.411800   -1.275200    0.017000    0.000220   -0.000380   -0.015860
C    -2.900900   -1.154300   -0.006200    0.000020    0.000000   -0.000520
O    -3.610800   -0.147600   -0.072300    0.000000    0.000000    0.000020
O    -3.544100   -2.355400    0.054300    0.000000    0.000000   -0.000020
H    -4.505100   -2.212500    0.033400   -0.000020    0.000000   -0.000120
O     3.638700    0.163000   -0.000300    0.000000   -0.000020    0.000140
H     3.062400   -0.611600    0.002300    0.000060    0.000200   -0.000620
H     1.074400    1.890600   -0.908700   -0.242420    0.407520   -0.602980
H     1.074000    1.903500    0.898900    0.242420   -0.415420   -0.595880
H     1.082500   -0.636200   -0.889800   -0.179420    0.317380    0.454860
H     1.072500   -0.617700    0.923300    0.173980   -0.307240    0.461860
H    -1.082200    0.650900   -0.914200   -0.087880    0.153800   -0.232040
H    -1.091900    0.680300    0.888600    0.090580   -0.161260   -0.226080
H    -1.094100   -1.881700   -0.873300   -0.041700    0.076800    0.105980
H    -1.116100   -1.846800    0.937200    0.038580   -0.071560    0.108060
20
11  Energy: -2189.6361  Freq: 2086.59669
C     1.407400    1.315900   -0.000600   -0.001460    0.000420   -0.000020
C     2.905400    1.315900   -0.000600    0.008800    0.012180    0.000000
O     3.609500    2.327400   -0.000600   -0.005700   -0.008200    0.000000
C     0.755900   -0.047500    0.009100   -0.001400   -0.003980    0.000080
C    -0.752500    0.087000   -0.001500   -0.004640    0.002660   -0.000260
C    -1.411800   -1.275200    0.017000    0.074620   -0.025500    0.002440
C    -2.900900   -1.154300   -0.006200   -0.419780    0.516120   -0.034560
O    -3.610800   -0.147600   -0.072300    0.243320   -0.347380    0.022780
O    -3.544100   -2.355400    0.054300    0.003700   -0.051000    0.002960
H    -4.505100   -2.212500    0.033400    0.075820    0.413420   -0.022700
O     3.638700    0.163000   -0.000300   -0.000200   -0.000560    0.000000
H     3.062400   -0.611600    0.002300    0.006140   -0.004200   -0.000060
H     1.074400    1.890600   -0.908700    0.000540    0.001340    0.002040
H     1.074000    1.903500    0.898900    0.000560    0.001400   -0.001980
H     1.082500   -0.636200   -0.889800    0.003880    0.000920   -0.000420
H     1.072500   -0.617700    0.923300    0.004120    0.000860    0.000440
H    -1.082200    0.650900   -0.914200   -0.007120    0.002880    0.002680
H    -1.091900    0.680300    0.888600   -0.006360    0.002840   -0.002460
H    -1.094100   -1.881700   -0.873300    0.091780    0.032280    0.042800
H    -1.116100   -1.846800    0.937200    0.101040    0.030480   -0.044100
20
12  Energy: -2189.6361  Freq: 2064.35548
C     1.407400    1.315900   -0.000600   -0.065100   -0.015400   -0.000020
C     2.905400    1.315900   -0.000600    0.423180    0.550700   -0.000100
O     3.609500    2.327400   -0.000600   -0.263280   -0.376460    0.000020
C     0.755900   -0.047500    0.009100   -0.015860   -0.004820    0.000000
C    -0.752500    0.087000   -0.001500    0.005040    0.000160    0.000020
C    -1.411800   -1.275200    0.017000   -0.001220    0.000520   -0.000060
C    -2.900900   -1.154300   -0.006200    0.008720   -0.013320    0.000880
O    -3.610800   -0.147600   -0.072300   -0.005560    0.008460   -0.000560
O    -3.544100   -2.355400    0.054300    0.000380    0.001700   -0.000100
H    -4.505100   -2.212500    0.033400   -0.000460   -0.009200    0.000520
O     3.638700    0.163000   -0.000300   -0.021540   -0.015840    0.000080
H     3.062400   -0.611600    0.002300    0.320820   -0.176680   -0.000440
H     1.074400    1.890600   -0.908700    0.042180    0.039280    0.029700
H     1.074000    1.903500    0.898900    0.043380    0.039320   -0.029540
H     1.082500   -0.636200   -0.889800   -0.014960    0.002860    0.000220
H     1.072500   -0.617700    0.923300   -0.014080    0.003000   -0.000340
H    -1.082200    0.650900   -0.914200    0.002640   -0.000860    0.000440
H    -1.091900    0.680300    0.888600    0.002760   -0.000820   -0.000360
H    -1.094100   -1.881700   -0.873300   -0.002980   -0.000860   -0.000940
H    -1.116100   -1.846800    0.937200   -0.003280   -0.000800    0.000960
20
13  Energy: -2189.6361  Freq: 1551.81005
C     1.407400    1.315900   -0.000600    0.001200    0.009700   -0.000040
C     2.905400    1.315900   -0.000600    0.015760   -0.015000    0.000000
O     3.609500    2.327400   -0.000600    0.000020    0.002220    0.000000
C     0.755900   -0.047500    0.009100   -0.025780   -0.012200   -0.000060
C    -0.752500    0.087000   -0.001500    0.006300   -0.004940   -0.000020
C    -1.411800   -1.275200    0.017000    0.186500    0.046000    0.000800
C    -2.900900   -1.154300   -0.006200   -0.362100   -0.322720    0.013860
O    -3.610800   -0.147600   -0.072300   -0.007420    0.029740   -0.001760
O    -3.544100   -2.355400    0.054300    0.153080    0.148440   -0.006480
H    -4.505100   -2.212500    0.033400    0.168460    0.867420   -0.047680
O     3.638700    0.163000   -0.000300   -0.009360    0.009600    0.000000
H     3.062400   -0.611600    0.002300    0.035480   -0.024740    0.000040
H     1.074400    1.890600   -0.908700   -0.013680   -0.006560   -0.001200
H     1.074000    1.903500    0.898900   -0.013740   -0.006500    0.001240
H     1.082500   -0.636200   -0.889800    0.008800    0.008700   -0.000760
H     1.072500   -0.617700    0.923300    0.008620    0.008760    0.000680
H    -1.082200    0.650900   -0.914200    0.051500    0.002940   -0.014340
H    -1.091900    0.680300    0.888600    0.048240    0.001100    0.015000
H    -1.094100   -1.881700   -0.873300   -0.161120   -0.148820    0.026500
H    -1.116100   -1.846800    0.937200   -0.173800   -0.153440   -0.021620
20
14  Energy: -2189.6361  Freq: 1544.82008
C     1.407400    1.315900   -0.000600   -0.200880   -0.011640    0.000360
C     2.905400    1.315900   -0.000600    0.408000   -0.338220   -0.000120
O     3.609500    2.327400   -0.000600    0.005660    0.030120    0.000040
C     0.755900   -0.047500    0.009100    0.044700    0.032320   -0.000100
C    -0.752500    0.087000   -0.001500    0.009020    0.014020   -0.000220
C    -1.411800   -1.275200    0.017000   -0.017260   -0.011480    0.000040
C    -2.900900   -1.154300   -0.006200    0.013420    0.012520   -0.000520
O    -3.610800   -0.147600   -0.072300    0.000840   -0.001620    0.000120
O    -3.544100   -2.355400    0.054300   -0.004480   -0.005180    0.000240
H    -4.505100   -2.212500    0.033400   -0.003920   -0.025620    0.001280
O     3.638700    0.163000   -0.000300   -0.197940    0.229320    0.000020
H     3.062400   -0.611600    0.002300    0.503380   -0.318720    0.000440
H     1.074400    1.890600   -0.908700   -0.127700   -0.026720    0.011680
H     1.074000    1.903500    0.898900   -0.130360   -0.026980   -0.011900
H     1.082500   -0.636200   -0.889800   -0.103800   -0.009460   -0.025140
H     1.072500   -0.617700    0.923300   -0.100280   -0.007260    0.024020
H    -1.082200    0.650900   -0.914200   -0.012900   -0.004220   -0.000460
H    -1.091900    0.680300    0.888600   -0.012120   -0.003900    0.000480
H    -1.094100   -1.881700   -0.873300    0.017440    0.008400    0.000380
H    -1.116100   -1.846800    0.937200    0.017940    0.008440   -0.000360
20
15  Energy: -2189.6361  Freq: 1455.13308
C     1.407400    1.315900   -0.000600    0.108180    0.105200   -0.000580
C     2.905400    1.315900   -0.000600    0.021060   -0.026400    0.000060
O     3.609500    2.327400   -0.000600   -0.014780   -0.012480   -0.000020
C     0.755900   -0.047500    0.009100   -0.217160   -0.121940    0.000020
C    -0.752500    0.087000   -0.001500    0.213340    0.124260   -0.000520
C    -1.411800   -1.275200    0.017000   -0.106160   -0.097500    0.000980
C    -2.900900   -1.154300   -0.006200    0.003800   -0.001380    0.000240
O    -3.610800   -0.147600   -0.072300   -0.008640    0.012020   -0.000860
O    -3.544100   -2.355400    0.054300    0.018880   -0.024260    0.001600
H    -4.505100   -2.212500    0.033400    0.055100    0.308380   -0.017240
O     3.638700    0.163000   -0.000300   -0.015520    0.023980   -0.000020
H     3.062400   -0.611600    0.002300    0.027540   -0.008880   -0.000320
H     1.074400    1.890600   -0.908700   -0.194940   -0.127600   -0.018800
H     1.074000    1.903500    0.898900   -0.194580   -0.126540    0.020300
H     1.082500   -0.636200   -0.889800    0.288180    0.165720   -0.006840
H     1.072500   -0.617700    0.923300    0.287000    0.165740    0.006860
H    -1.082200    0.650900   -0.914200   -0.263660   -0.179120   -0.018140
H    -1.091900    0.680300    0.888600   -0.265280   -0.178240    0.020900
H    -1.094100   -1.881700   -0.873300    0.151740    0.101620   -0.027040
H    -1.116100   -1.846800    0.937200    0.152600    0.102460    0.026800
20
16  Energy: -2189.6361  Freq: 1449.77455
C     1.407400    1.315900   -0.000600   -0.012760    0.002740   -0.000080
C     2.905400    1.315900   -0.000600    0.092320   -0.088600    0.000380
O     3.609500    2.327400   -0.000600   -0.042760   -0.091560   -0.000040
C     0.755900   -0.047500    0.009100   -0.001940    0.030560   -0.000680
C    -0.752500    0.087000   -0.001500   -0.034640    0.002280    0.000200
C    -1.411800   -1.275200    0.017000    0.016020    0.008720   -0.000080
C    -2.900900   -1.154300   -0.006200    0.000060    0.000640   -0.000060
O    -3.610800   -0.147600   -0.072300    0.000360   -0.000700    0.000040
O    -3.544100   -2.355400    0.054300   -0.002380    0.001440   -0.000120
H    -4.505100   -2.212500    0.033400   -0.005800   -0.029780    0.001700
O     3.638700    0.163000   -0.000300    0.060420    0.089740   -0.000260
H     3.062400   -0.611600    0.002300   -1.184320    0.972760   -0.000100
H     1.074400    1.890600   -0.908700   -0.134340   -0.039840    0.026460
H     1.074000    1.903500    0.898900   -0.134940   -0.040500   -0.026200
H     1.082500   -0.636200   -0.889800    0.256200   -0.138380    0.183180
H     1.072500   -0.617700    0.923300    0.247960   -0.144640   -0.176280
H    -1.082200    0.650900   -0.914200    0.038940    0.001980   -0.026180
H    -1.091900    0.680300    0.888600    0.037020    0.003140    0.026560
H    -1.094100   -1.881700   -0.873300   -0.036660   -0.023700    0.002460
H    -1.116100   -1.846800    0.937200   -0.036340   -0.023240   -0.002260
20
17  Energy: -2189.6361  Freq: 1439.49567
C     1.407400    1.315900   -0.000600    0.108220    0.097240   -0.000560
C     2.905400    1.315900   -0.000600    0.013680   -0.019380    0.000040
O     3.609500    2.327400   -0.000600   -0.013620   -0.008360    0.000000
C     0.755900   -0.047500    0.009100   -0.103180   -0.071040    0.000180
C    -0.752500    0.087000   -0.001500   -0.018600   -0.038940    0.000540
C    -1.411800   -1.275200    0.017000    0.102980    0.108480   -0.001620
C    -2.900900   -1.154300   -0.006200   -0.037300   -0.025740    0.000680
O    -3.610800   -0.147600   -0.072300    0.038580   -0.062600    0.004100
O    -3.544100   -2.355400    0.054300   -0.031860    0.128480   -0.007740
H    -4.505100   -2.212500    0.033400   -0.163760   -1.053760    0.058700
O     3.638700    0.163000   -0.000300   -0.022380    0.018120    0.000000
H     3.062400   -0.611600    0.002300    0.131900   -0.094360   -0.000140
H     1.074400    1.890600   -0.908700   -0.187920   -0.146800   -0.033200
H     1.074000    1.903500    0.898900   -0.188260   -0.146120    0.035140
H     1.082500   -0.636200   -0.889800    0.142920    0.054180    0.015860
H     1.072500   -0.617700    0.923300    0.142120    0.053440   -0.015240
H    -1.082200    0.650900   -0.914200    0.049320   -0.040100   -0.036600
H    -1.091900    0.680300    0.888600    0.048060   -0.039140    0.038160
H    -1.094100   -1.881700   -0.873300   -0.145480   -0.193400    0.105280
H    -1.116100   -1.846800    0.937200   -0.148100   -0.198000   -0.101260
20
18  Energy: -2189.6361  Freq: 1414.7283
C     1.407400    1.315900   -0.000600   -0.128160   -0.110240    0.000660
C     2.905400    1.315900   -0.000600   -0.006800    0.014360   -0.000060
O     3.609500    2.327400   -0.000600    0.017400    0.010980    0.000020
C     0.755900   -0.047500    0.009100    0.041060    0.019240   -0.000040
C    -0.752500    0.087000   -0.001500    0.149860    0.069760   -0.000080
C    -1.411800   -1.275200    0.017000   -0.089800   -0.041580   -0.000620
C    -2.900900   -1.154300   -0.006200   -0.063520   -0.060980    0.002960
O    -3.610800   -0.147600   -0.072300    0.031600   -0.052140    0.003280
O    -3.544100   -2.355400    0.054300    0.020380    0.124520   -0.006920
H    -4.505100   -2.212500    0.033400   -0.059180   -0.517080    0.028700
O     3.638700    0.163000   -0.000300    0.026080   -0.014860   -0.000020
H     3.062400   -0.611600    0.002300   -0.188840    0.139940    0.000140
H     1.074400    1.890600   -0.908700    0.244820    0.241480    0.074640
H     1.074000    1.903500    0.898900    0.245600    0.240500   -0.077940
H     1.082500   -0.636200   -0.889800   -0.134500    0.113540   -0.134300
H     1.072500   -0.617700    0.923300   -0.134840    0.117140    0.130480
H    -1.082200    0.650900   -0.914200   -0.332320   -0.060080    0.091980
H    -1.091900    0.680300    0.888600   -0.330500   -0.061880   -0.093800
H    -1.094100   -1.881700   -0.873300    0.168000    0.003080    0.068860
H    -1.116100   -1.846800    0.937200    0.166260    0.000180   -0.064260
20
19  Energy: -2189.6361  Freq: 1407.2579
C     1.407400    1.315900   -0.000600    0.011460    0.043600   -0.000280
C     2.905400    1.315900   -0.000600    0.011840   -0.018320    0.000080
O     3.609500    2.327400   -0.000600   -0.013000   -0.022120   -0.000020
C     0.755900   -0.047500    0.009100    0.076180   -0.146400    0.001940
C    -0.752500    0.087000   -0.001500   -0.066100    0.040700   -0.001100
C    -1.411800   -1.275200    0.017000    0.034960    0.016040    0.000160
C    -2.900900   -1.154300   -0.006200    0.015360    0.015440   -0.000800
O    -3.610800   -0.147600   -0.072300   -0.006340    0.010820   -0.000640
O    -3.544100   -2.355400    0.054300   -0.007660   -0.026640    0.001440
H    -4.505100   -2.212500    0.033400    0.006180    0.076080   -0.004220
O     3.638700    0.163000   -0.000300    0.013920    0.019500   -0.000040
H     3.062400   -0.611600    0.002300   -0.217520    0.179620    0.000040
H     1.074400    1.890600   -0.908700    0.027840   -0.022760   -0.032960
H     1.074000    1.903500    0.898900    0.026640   -0.023400    0.033760
H     1.082500   -0.636200   -0.889800   -0.322660    0.609100   -0.579920
H     1.072500   -0.617700    0.923300   -0.326220    0.622240    0.563820
H    -1.082200    0.650900   -0.914200    0.096300   -0.254140   -0.215700
H    -1.091900    0.680300    0.888600    0.092440   -0.247380    0.224320
H    -1.094100   -1.881700   -0.873300   -0.086900   -0.032160   -0.009200
H    -1.116100   -1.846800    0.937200   -0.086320   -0.031520    0.008320
20
20  Energy: -2189.6361  Freq: 1400.42511
C     1.407400    1.315900   -0.000600   -0.050180   -0.060220    0.000380
C     2.905400    1.315900   -0.000600   -0.009400    0.016160   -0.000100
O     3.609500    2.327400   -0.000600    0.014160    0.019200    0.000020
C     0.755900   -0.047500    0.009100   -0.012900    0.044560   -0.000460
C    -0.752500    0.087000   -0.001500   -0.042280    0.147540   -0.002580
C    -1.411800   -1.275200    0.017000   -0.007980   -0.021600    0.000240
C    -2.900900   -1.154300   -0.006200   -0.003080   -0.002100    0.000080
O    -3.610800   -0.147600   -0.072300    0.004700   -0.006880    0.000500
O    -3.544100   -2.355400    0.054300    0.000840    0.012940   -0.000740
H    -4.505100   -2.212500    0.033400   -0.008620   -0.074200    0.004000
O     3.638700    0.163000   -0.000300   -0.002860   -0.017400    0.000040
H     3.062400   -0.611600    0.002300    0.097200   -0.085180   -0.000120
H     1.074400    1.890600   -0.908700    0.095020    0.121480    0.052080
H     1.074000    1.903500    0.898900    0.095320    0.120960   -0.053900
H     1.082500   -0.636200   -0.889800    0.215260   -0.154600    0.197980
H     1.072500   -0.617700    0.923300    0.217500   -0.158940   -0.192620
H    -1.082200    0.650900   -0.914200    0.314160   -0.668520   -0.583560
H    -1.091900    0.680300    0.888600    0.307400   -0.648600    0.608060
H    -1.094100   -1.881700   -0.873300   -0.050680   -0.029980    0.000940
H    -1.116100   -1.846800    0.937200   -0.050440   -0.029100   -0.000500
20
21  Energy: -2189.6361  Freq: 1376.12665
C     1.407400    1.315900   -0.000600    0.000460   -0.019560    0.000120
C     2.905400    1.315900   -0.000600    0.001000    0.000020   -0.000020
O     3.609500    2.327400   -0.000600    0.002080    0.002300    0.000000
C     0.755900   -0.047500    0.009100   -0.006620   -0.006100    0.000060
C    -0.752500    0.087000   -0.001500    0.008500   -0.011280    0.000400
C    -1.411800   -1.275200    0.017000   -0.053560    0.162440   -0.003720
C    -2.900900   -1.154300   -0.006200    0.030880    0.022600   -0.001460
O    -3.610800   -0.147600   -0.072300   -0.006520    0.017880   -0.001040
O    -3.544100   -2.355400    0.054300   -0.008480   -0.057780    0.003320
H    -4.505100   -2.212500    0.033400    0.032300    0.281920   -0.015480
O     3.638700    0.163000   -0.000300   -0.002000    0.000320    0.000000
H     3.062400   -0.611600    0.002300    0.007560   -0.006020   -0.000020
H     1.074400    1.890600   -0.908700   -0.009780    0.100940    0.073960
H     1.074000    1.903500    0.898900   -0.009880    0.099720   -0.075420
H     1.082500   -0.636200   -0.889800    0.045960    0.004780    0.008960
H     1.072500   -0.617700    0.923300    0.044940    0.003980   -0.008440
H    -1.082200    0.650900   -0.914200   -0.128540   -0.073900   -0.000600
H    -1.091900    0.680300    0.888600   -0.127040   -0.071980    0.001060
H    -1.094100   -1.881700   -0.873300    0.296740   -0.743460    0.677900
H    -1.116100   -1.846800    0.937200    0.315160   -0.769480   -0.642780
20
22  Energy: -2189.6361  Freq: 1371.02913
C     1.407400    1.315900   -0.000600    0.062860   -0.131520    0.001020
C     2.905400    1.315900   -0.000600    0.006940   -0.005320   -0.000120
O     3.609500    2.327400   -0.000600    0.006980    0.006360    0.000020
C     0.755900   -0.047500    0.009100   -0.051040   -0.032000   -0.000020
C    -0.752500    0.087000   -0.001500   -0.014960   -0.018860    0.000320
C    -1.411800   -1.275200    0.017000    0.059280    0.006080    0.000620
C    -2.900900   -1.154300   -0.006200    0.013940    0.016480   -0.000980
O    -3.610800   -0.147600   -0.072300   -0.006520    0.009740   -0.000620
O    -3.544100   -2.355400    0.054300   -0.012400   -0.025480    0.001320
H    -4.505100   -2.212500    0.033400   -0.004740    0.018680   -0.000940
O     3.638700    0.163000   -0.000300   -0.014500    0.008160    0.000020
H     3.062400   -0.611600    0.002300    0.048040   -0.037640   -0.000320
H     1.074400    1.890600   -0.908700   -0.320660    0.673340    0.600300
H     1.074000    1.903500    0.898900   -0.320680    0.665180   -0.610460
H     1.082500   -0.636200   -0.889800    0.206780    0.187520   -0.052760
H     1.072500   -0.617700    0.923300    0.203120    0.187440    0.051460
H    -1.082200    0.650900   -0.914200    0.010900    0.105780    0.058420
H    -1.091900    0.680300    0.888600    0.010500    0.103380   -0.061620
H    -1.094100   -1.881700   -0.873300   -0.164660    0.039900   -0.097420
H    -1.116100   -1.846800    0.937200   -0.166880    0.043420    0.091700
20
23  Energy: -2189.6361  Freq: 1339.23285
C     1.407400    1.315900   -0.000600   -0.123900   -0.023620    0.000160
C     2.905400    1.315900   -0.000600    0.008240    0.005900   -0.000160
O     3.609500    2.327400   -0.000600    0.018940    0.023500    0.000020
C     0.755900   -0.047500    0.009100   -0.063600   -0.065080   -0.000080
C    -0.752500    0.087000   -0.001500    0.018960    0.019900   -0.000040
C    -1.411800   -1.275200    0.017000    0.129720    0.049160    0.000840
C    -2.900900   -1.154300   -0.006200    0.032620    0.039060   -0.002780
O    -3.610800   -0.147600   -0.072300   -0.012220    0.020580   -0.001220
O    -3.544100   -2.355400    0.054300   -0.032620   -0.064560    0.003360
H    -4.505100   -2.212500    0.033400   -0.014000    0.042320   -0.002000
O     3.638700    0.163000   -0.000300    0.000600   -0.009420    0.000020
H     3.062400   -0.611600    0.002300   -0.002300   -0.004440   -0.000460
H     1.074400    1.890600   -0.908700    0.482440    0.009860   -0.179720
H     1.074000    1.903500    0.898900    0.483620    0.013240    0.179820
H     1.082500   -0.636200   -0.889800    0.390100    0.127420    0.032820
H     1.072500   -0.617700    0.923300    0.385880    0.127100   -0.029840
H    -1.082200    0.650900   -0.914200   -0.253640    0.040620    0.094340
H    -1.091900    0.680300    0.888600   -0.255840    0.035920   -0.098360
H    -1.094100   -1.881700   -0.873300   -0.418000   -0.110120   -0.081880
H    -1.116100   -1.846800    0.937200   -0.420680   -0.108840    0.075320
20
24  Energy: -2189.6361  Freq: 1300.22475
C     1.407400    1.315900   -0.000600    0.049520    0.071780   -0.000780
C     2.905400    1.315900   -0.000600   -0.005940   -0.007560    0.000120
O     3.609500    2.327400   -0.000600   -0.013100   -0.014280   -0.000020
C     0.755900   -0.047500    0.009100    0.067980   -0.015620    0.001480
C    -0.752500    0.087000   -0.001500    0.065080   -0.009780   -0.000440
C    -1.411800   -1.275200    0.017000    0.075520    0.088960   -0.000340
C    -2.900900   -1.154300   -0.006200    0.013080    0.015700   -0.001800
O    -3.610800   -0.147600   -0.072300   -0.003440    0.009820   -0.000460
O    -3.544100   -2.355400    0.054300   -0.019740   -0.039060    0.002080
H    -4.505100   -2.212500    0.033400   -0.007580    0.051160   -0.002360
O     3.638700    0.163000   -0.000300    0.003340    0.006160   -0.000020
H     3.062400   -0.611600    0.002300   -0.016040    0.018320    0.000680
H     1.074400    1.890600   -0.908700   -0.126520    0.115800    0.086180
H     1.074000    1.903500    0.898900   -0.128540    0.112280   -0.087600
H     1.082500   -0.636200   -0.889800   -0.403420   -0.386820    0.069400
H     1.072500   -0.617700    0.923300   -0.394320   -0.388980   -0.067840
H    -1.082200    0.650900   -0.914200   -0.528200   -0.378560   -0.017300
H    -1.091900    0.680300    0.888600   -0.523940   -0.379040    0.024240
H    -1.094100   -1.881700   -0.873300   -0.252140    0.059820   -0.094260
H    -1.116100   -1.846800    0.937200   -0.257120    0.059520    0.084860
20
25  Energy: -2189.6361  Freq: 1243.13928
C     1.407400    1.315900   -0.000600   -0.029700   -0.132880    0.001820
C     2.905400    1.315900   -0.000600   -0.005320    0.026580    0.000060
O     3.609500    2.327400   -0.000600    0.014100    0.011280    0.000020
C     0.755900   -0.047500    0.009100   -0.018680    0.191000    0.000160
C    -0.752500    0.087000   -0.001500    0.136860    0.076900   -0.005400
C    -1.411800   -1.275200    0.017000    0.028540   -0.035820    0.002700
C    -2.900900   -1.154300   -0.006200    0.019400    0.018280   -0.001620
O    -3.610800   -0.147600   -0.072300    0.004460   -0.005520    0.000440
O    -3.544100   -2.355400    0.054300   -0.014260   -0.027600    0.001460
H    -4.505100   -2.212500    0.033400   -0.006760    0.001140    0.000320
O     3.638700    0.163000   -0.000300    0.022860   -0.033520    0.000020
H     3.062400   -0.611600    0.002300   -0.021780   -0.000680    0.000860
H     1.074400    1.890600   -0.908700   -0.438780   -0.385900   -0.023500
H     1.074000    1.903500    0.898900   -0.435560   -0.381140    0.028960
H     1.082500   -0.636200   -0.889800   -0.175120    0.182680   -0.069300
H     1.072500   -0.617700    0.923300   -0.135120    0.195820    0.060220
H    -1.082200    0.650900   -0.914200    0.056840    0.057480    0.005860
H    -1.091900    0.680300    0.888600    0.071680    0.046800   -0.003140
H    -1.094100   -1.881700   -0.873300   -0.444560   -0.267660   -0.003860
H    -1.116100   -1.846800    0.937200   -0.464000   -0.286500    0.000320
20
26  Energy: -2189.6361  Freq: 1233.00803
C     1.407400    1.315900   -0.000600    0.054800   -0.013020   -0.003080
C     2.905400    1.315900   -0.000600   -0.013840    0.008040   -0.000440
O     3.609500    2.327400   -0.000600   -0.010860   -0.007520    0.000000
C     0.755900   -0.047500    0.009100    0.229220   -0.013820    0.003420
C    -0.752500    0.087000   -0.001500   -0.174200    0.120200    0.001840
C    -1.411800   -1.275200    0.017000   -0.068420   -0.059140   -0.002420
C    -2.900900   -1.154300   -0.006200   -0.000880   -0.019400    0.001360
O    -3.610800   -0.147600   -0.072300    0.012720   -0.023440    0.001380
O    -3.544100   -2.355400    0.054300    0.026900    0.043620   -0.002200
H    -4.505100   -2.212500    0.033400    0.021340    0.020920   -0.001260
O     3.638700    0.163000   -0.000300   -0.015240   -0.008260    0.000060
H     3.062400   -0.611600    0.002300    0.129760   -0.107520   -0.001580
H     1.074400    1.890600   -0.908700   -0.223060   -0.167080   -0.000260
H     1.074000    1.903500    0.898900   -0.247940   -0.194820    0.005720
H     1.082500   -0.636200   -0.889800    0.471920    0.114180    0.027360
H     1.072500   -0.617700    0.923300    0.419780    0.081000   -0.022480
H    -1.082200    0.650900   -0.914200   -0.476280    0.002140    0.058880
H    -1.091900    0.680300    0.888600   -0.466460    0.022500   -0.066940
H    -1.094100   -1.881700   -0.873300   -0.091020   -0.068680    0.004540
H    -1.116100   -1.846800    0.937200   -0.070700   -0.045000    0.000200
20
27  Energy: -2189.6361  Freq: 1226.19388
C     1.407400    1.315900   -0.000600    0.018520    0.119840    0.002100
C     2.905400    1.315900   -0.000600   -0.004240   -0.012280    0.000220
O     3.609500    2.327400   -0.000600   -0.011940   -0.009580    0.000020
C     0.755900   -0.047500    0.009100    0.030340   -0.104980    0.003080
C    -0.752500    0.087000   -0.001500    0.002860    0.178080   -0.012460
C    -1.411800   -1.275200    0.017000   -0.026000   -0.166300    0.006100
C    -2.900900   -1.154300   -0.006200    0.012000    0.008380    0.001480
O    -3.610800   -0.147600   -0.072300    0.003300   -0.012480    0.000480
O    -3.544100   -2.355400    0.054300    0.007380    0.011020   -0.000700
H    -4.505100   -2.212500    0.033400    0.003740   -0.050500    0.002420
O     3.638700    0.163000   -0.000300    0.001320    0.008680   -0.000020
H     3.062400   -0.611600    0.002300   -0.006480    0.012840    0.002320
H     1.074400    1.890600   -0.908700    0.112440    0.227640    0.041600
H     1.074000    1.903500    0.898900    0.125300    0.245160   -0.046060
H     1.082500   -0.636200   -0.889800   -0.266900   -0.302280    0.039160
H     1.072500   -0.617700    0.923300   -0.175740   -0.266060   -0.042320
H    -1.082200    0.650900   -0.914200    0.208440    0.342280    0.036840
H    -1.091900    0.680300    0.888600    0.219640    0.311060   -0.038940
H    -1.094100   -1.881700   -0.873300   -0.287520   -0.356080    0.052200
H    -1.116100   -1.846800    0.937200   -0.332460   -0.397700   -0.049900
20
28  Energy: -2189.6361  Freq: 1219.56898
C     1.407400    1.315900   -0.000600   -0.001460    0.004460   -0.062480
C     2.905400    1.315900   -0.000600    0.000180   -0.000220   -0.007420
O     3.609500    2.327400   -0.000600    0.000080    0.000240   -0.000240
C     0.755900   -0.047500    0.009100   -0.006080   -0.001600   -0.002820
C    -0.752500    0.087000   -0.001500    0.009580    0.010500    0.134080
C    -1.411800   -1.275200    0.017000    0.002440   -0.009440   -0.047500
C    -2.900900   -1.154300   -0.006200    0.001020    0.000060   -0.021840
O    -3.610800   -0.147600   -0.072300   -0.000260    0.000260    0.002000
O    -3.544100   -2.355400    0.054300   -0.000780   -0.001180    0.001320
H    -4.505100   -2.212500    0.033400   -0.000740   -0.003600    0.000660
O     3.638700    0.163000   -0.000300    0.000760   -0.000320    0.000320
H     3.062400   -0.611600    0.002300   -0.002680    0.001960   -0.029240
H     1.074400    1.890600   -0.908700    0.197160    0.239120    0.016460
H     1.074000    1.903500    0.898900   -0.187500   -0.216080    0.015680
H     1.082500   -0.636200   -0.889800    0.658860    0.334000    0.026120
H     1.072500   -0.617700    0.923300   -0.732720   -0.368420    0.027140
H    -1.082200    0.650900   -0.914200    0.097020   -0.200580   -0.040420
H    -1.091900    0.680300    0.888600   -0.036560    0.237420   -0.048480
H    -1.094100   -1.881700   -0.873300   -0.352080   -0.309420    0.040360
H    -1.116100   -1.846800    0.937200    0.295440    0.257260    0.032520
20
29  Energy: -2189.6361  Freq: 1216.6765
C     1.407400    1.315900   -0.000600   -0.000440   -0.000340   -0.036220
C     2.905400    1.315900   -0.000600    0.000180   -0.000280   -0.035000
O     3.609500    2.327400   -0.000600    0.000060   -0.000140    0.003440
C     0.755900   -0.047500    0.009100   -0.004240    0.000840    0.160060
C    -0.752500    0.087000   -0.001500    0.000660   -0.003880   -0.061060
C    -1.411800   -1.275200    0.017000    0.001100    0.001200   -0.040060
C    -2.900900   -1.154300   -0.006200   -0.000340    0.000000    0.004700
O    -3.610800   -0.147600   -0.072300   -0.000060    0.000280   -0.000560
O    -3.544100   -2.355400    0.054300   -0.000120   -0.000180   -0.000500
H    -4.505100   -2.212500    0.033400    0.000000    0.000560   -0.005760
O     3.638700    0.163000   -0.000300    0.000120    0.000540    0.002560
H     3.062400   -0.611600    0.002300   -0.002460    0.002300    0.020200
H     1.074400    1.890600   -0.908700    0.430780    0.344740    0.033060
H     1.074000    1.903500    0.898900   -0.416280   -0.337800    0.038900
H     1.082500   -0.636200   -0.889800   -0.313720    0.154160   -0.074000
H     1.072500   -0.617700    0.923300    0.318180   -0.152600   -0.067720
H    -1.082200    0.650900   -0.914200   -0.657620   -0.253740    0.032080
H    -1.091900    0.680300    0.888600    0.665680    0.253100    0.032400
H    -1.094100   -1.881700   -0.873300   -0.007940   -0.065500    0.001940
H    -1.116100   -1.846800    0.937200    0.019760    0.076380    0.000680
20
30  Energy: -2189.6361  Freq: 1188.29275
C     1.407400    1.315900   -0.000600    0.000140   -0.001200   -0.051920
C     2.905400    1.315900   -0.000600    0.000040    0.000020   -0.027400
O     3.609500    2.327400   -0.000600    0.000040    0.000000    0.002280
C     0.755900   -0.047500    0.009100   -0.000640    0.000940    0.063540
C    -0.752500    0.087000   -0.001500    0.000540   -0.003180   -0.086100
C    -1.411800   -1.275200    0.017000   -0.001080    0.002180    0.075420
C    -2.900900   -1.154300   -0.006200   -0.000060    0.001920    0.026600
O    -3.610800   -0.147600   -0.072300    0.000020   -0.000160   -0.002680
O    -3.544100   -2.355400    0.054300   -0.000200   -0.000620   -0.001580
H    -4.505100   -2.212500    0.033400   -0.000180   -0.000460    0.003640
O     3.638700    0.163000   -0.000300   -0.000280    0.000100    0.002020
H     3.062400   -0.611600    0.002300    0.000580   -0.000500   -0.006140
H     1.074400    1.890600   -0.908700    0.354960    0.315780    0.022860
H     1.074000    1.903500    0.898900   -0.351380   -0.316440    0.028020
H     1.082500   -0.636200   -0.889800    0.205440    0.256480   -0.043500
H     1.072500   -0.617700    0.923300   -0.202320   -0.254200   -0.039780
H    -1.082200    0.650900   -0.914200    0.308620    0.368440    0.049580
H    -1.091900    0.680300    0.888600   -0.308860   -0.371640    0.059260
H    -1.094100   -1.881700   -0.873300    0.400040    0.370420   -0.040120
H    -1.116100   -1.846800    0.937200   -0.387320   -0.365360   -0.035860
20
31  Energy: -2189.6361  Freq: 1122.92979
C     1.407400    1.315900   -0.000600    0.000700   -0.000380   -0.077520
C     2.905400    1.315900   -0.000600    0.000000   -0.000200    0.081860
O     3.609500    2.327400   -0.000600   -0.000020   -0.000080   -0.010960
C     0.755900   -0.047500    0.009100   -0.001120    0.000200    0.025300
C    -0.752500    0.087000   -0.001500    0.000100   -0.001540    0.009760
C    -1.411800   -1.275200    0.017000   -0.002620    0.000140   -0.085200
C    -2.900900   -1.154300   -0.006200    0.000920    0.005100    0.097320
O    -3.610800   -0.147600   -0.072300    0.002220   -0.003200   -0.013580
O    -3.544100   -2.355400    0.054300    0.000260   -0.000520   -0.007860
H    -4.505100   -2.212500    0.033400    0.001220    0.005300   -0.021720
O     3.638700    0.163000   -0.000300   -0.000660    0.000700   -0.008540
H     3.062400   -0.611600    0.002300    0.000500   -0.000180   -0.019540
H     1.074400    1.890600   -0.908700   -0.454720   -0.107580    0.037740
H     1.074000    1.903500    0.898900    0.461480    0.110840    0.036820
H     1.082500   -0.636200   -0.889800    0.266160    0.208700   -0.021360
H     1.072500   -0.617700    0.923300   -0.269800   -0.207900   -0.018620
H    -1.082200    0.650900   -0.914200   -0.303380   -0.213120   -0.017860
H    -1.091900    0.680300    0.888600    0.308280    0.210400   -0.020160
H    -1.094100   -1.881700   -0.873300    0.555800    0.131760    0.043820
H    -1.116100   -1.846800    0.937200   -0.570520   -0.128560    0.036780
20
32  Energy: -2189.6361  Freq: 1097.3661
C     1.407400    1.315900   -0.000600   -0.001600   -0.001060   -0.132620
C     2.905400    1.315900   -0.000600    0.000580    0.000440    0.107160
O     3.609500    2.327400   -0.000600    0.000500    0.000800   -0.015120
C     0.755900   -0.047500    0.009100    0.001220    0.000280    0.118040
C    -0.752500    0.087000   -0.001500    0.000340    0.002480   -0.108360
C    -1.411800   -1.275200    0.017000    0.009460   -0.003280    0.121060
C    -2.900900   -1.154300   -0.006200   -0.004400   -0.003960   -0.100980
O    -3.610800   -0.147600   -0.072300   -0.005080    0.007540    0.015020
O    -3.544100   -2.355400    0.054300   -0.002040   -0.002220    0.008660
H    -4.505100   -2.212500    0.033400   -0.003840   -0.016520    0.025240
O     3.638700    0.163000   -0.000300    0.000480   -0.001000   -0.012080
H     3.062400   -0.611600    0.002300   -0.000320   -0.000380   -0.003080
H     1.074400    1.890600   -0.908700   -0.471680    0.025420    0.085900
H     1.074000    1.903500    0.898900    0.460720   -0.028320    0.085980
H     1.082500   -0.636200   -0.889800   -0.027020    0.299220   -0.117880
H     1.072500   -0.617700    0.923300    0.031740   -0.303540   -0.111700
H    -1.082200    0.650900   -0.914200   -0.080880    0.246320    0.098920
H    -1.091900    0.680300    0.888600    0.072580   -0.238420    0.106600
H    -1.094100   -1.881700   -0.873300   -0.413680    0.038060   -0.086580
H    -1.116100   -1.846800    0.937200    0.463320   -0.042220   -0.078660
20
33  Energy: -2189.6361  Freq: 1085.65299
C     1.407400    1.315900   -0.000600    0.088340   -0.021720   -0.005440
C     2.905400    1.315900   -0.000600   -0.030780   -0.019340    0.004040
O     3.609500    2.327400   -0.000600   -0.018920   -0.039460   -0.000560
C     0.755900   -0.047500    0.009100   -0.034800    0.031660    0.005080
C    -0.752500    0.087000   -0.001500   -0.000360   -0.095220   -0.004500
C    -1.411800   -1.275200    0.017000   -0.242960    0.121720    0.003000
C    -2.900900   -1.154300   -0.006200    0.118020   -0.041200   -0.007140
O    -3.610800   -0.147600   -0.072300    0.090240   -0.137840    0.010580
O    -3.544100   -2.355400    0.054300    0.062520    0.094280   -0.003620
H    -4.505100   -2.212500    0.033400    0.088780    0.372300   -0.016980
O     3.638700    0.163000   -0.000300   -0.040260    0.067240   -0.000480
H     3.062400   -0.611600    0.002300    0.026620    0.016220    0.000280
H     1.074400    1.890600   -0.908700    0.229520    0.058580   -0.011720
H     1.074000    1.903500    0.898900    0.263280    0.052620    0.018700
H     1.082500   -0.636200   -0.889800   -0.013460    0.064060   -0.014140
H     1.072500   -0.617700    0.923300   -0.002080    0.038700    0.000840
H    -1.082200    0.650900   -0.914200    0.082700   -0.029840   -0.004880
H    -1.091900    0.680300    0.888600    0.077380   -0.064120    0.018440
H    -1.094100   -1.881700   -0.873300   -0.541280    0.015020   -0.059920
H    -1.116100   -1.846800    0.937200   -0.475140    0.014260    0.034760
20
34  Energy: -2189.6361  Freq: 1044.45015
C     1.407400    1.315900   -0.000600   -0.250200    0.143880   -0.002980
C     2.905400    1.315900   -0.000600    0.126840    0.040920    0.001840
O     3.609500    2.327400   -0.000600    0.056740    0.131920   -0.000340
C     0.755900   -0.047500    0.009100   -0.033340   -0.119820    0.002560
C    -0.752500    0.087000   -0.001500   -0.040600   -0.045080   -0.000900
C    -1.411800   -1.275200    0.017000   -0.093180    0.077880   -0.001060
C    -2.900900   -1.154300   -0.006200    0.057020   -0.018840   -0.000820
O    -3.610800   -0.147600   -0.072300    0.037860   -0.060300    0.004320
O    -3.544100   -2.355400    0.054300    0.027380    0.045780   -0.002000
H    -4.505100   -2.212500    0.033400    0.038620    0.168700   -0.008200
O     3.638700    0.163000   -0.000300    0.118420   -0.194320   -0.000200
H     3.062400   -0.611600    0.002300   -0.118340   -0.019160   -0.000460
H     1.074400    1.890600   -0.908700   -0.458840    0.047940    0.042500
H     1.074000    1.903500    0.898900   -0.452840    0.041280   -0.040080
H     1.082500   -0.636200   -0.889800    0.045020   -0.061680    0.006340
H     1.072500   -0.617700    0.923300    0.048960   -0.066900   -0.006640
H    -1.082200    0.650900   -0.914200    0.048800    0.017420    0.000520
H    -1.091900    0.680300    0.888600    0.047760    0.009260    0.002280
H    -1.094100   -1.881700   -0.873300   -0.121580    0.072520   -0.021740
H    -1.116100   -1.846800    0.937200   -0.111360    0.070920    0.013240
20
35  Energy: -2189.6361  Freq: 954.75167
C     1.407400    1.315900   -0.000600    0.000100   -0.001900   -0.124500
C     2.905400    1.315900   -0.000600   -0.000220    0.000080    0.089340
O     3.609500    2.327400   -0.000600    0.000200   -0.000220   -0.015640
C     0.755900   -0.047500    0.009100   -0.001180    0.000900    0.059900
C    -0.752500    0.087000   -0.001500   -0.000240    0.001040    0.067800
$$ [...]
##END=$$ end of adipic acid
##END= $$ end of file