##TITLE= Headspace GC of Coffee  $$ Ciênc. Tecnol. Aliment., Campinas, 21(1): 123-128, jan.-abr. 2001
##JCAMP-DX= 5.01
##DATA TYPE= GAS CHROMATOGRAPH
##DATA CLASS= XYDATA
##ORIGIN= Inst. Ciências Biológicas e Química -PUC-Campinas 
##OWNER= public domain
##LONGDATE= 2012/04/02 19:25:28.0042 -0500 $$ export date from JSpecView
##SPECTROMETER/DATASYSTEM= digitised from scan
##$MODELS=
<Models>
<ModelData id="acet" type="MOL">
acetaldehyde
RL-ISIS-  00000000003D

  7  6  0  0  0  0  0  0  0  0  0  1 V2000
   -0.4735    0.1689    0.4807 C  0  0  0  0  0  0  0  0  0  0  0  0
    0.5566    0.1377   -0.6263 C  0  0  0  0  0  0  0  0  0  0  0  0
   -1.3045    0.9110    0.3736 H  0  0  0  0  0  0  0  0  0  0  0  0
   -0.4481   -0.5482    1.4536 O  0  0  0  0  0  0  0  0  0  0  0  0
    1.3304   -0.6395   -0.4362 H  0  0  0  0  0  0  0  0  0  0  0  0
    1.0726    1.1200   -0.7094 H  0  0  0  0  0  0  0  0  0  0  0  0
    0.0750   -0.0873   -1.6040 H  0  0  0  0  0  0  0  0  0  0  0  0
  2  7  1  0  0  0  0
  2  6  1  0  0  0  0
  2  5  1  0  0  0  0
  1  4  2  0  0  0  0
  1  3  1  0  0  0  0
  1  2  1  0  0  0  0
M  END
</ModelData>
<ModelData id="coff" type="MOL" baseModel="acet">
acetaldehyde
RL-ISIS-  00000000003D

  7  6  0  0  0  0  0  0  0  0  0  1 V2000
   -0.4735    0.1689    0.4807 C  0  0  0  0  0  0  0  0  0  0  0  0
    0.5566    0.1377   -0.6263 C  0  0  0  0  0  0  0  0  0  0  0  0
   -1.3045    0.9110    0.3736 H  0  0  0  0  0  0  0  0  0  0  0  0
   -0.4481   -0.5482    1.4536 O  0  0  0  0  0  0  0  0  0  0  0  0
    1.3304   -0.6395   -0.4362 H  0  0  0  0  0  0  0  0  0  0  0  0
    1.0726    1.1200   -0.7094 H  0  0  0  0  0  0  0  0  0  0  0  0
    0.0750   -0.0873   -1.6040 H  0  0  0  0  0  0  0  0  0  0  0  0
  2  7  1  0  0  0  0
  2  6  1  0  0  0  0
  2  5  1  0  0  0  0
  1  4  2  0  0  0  0
  1  3  1  0  0  0  0
  1  2  1  0  0  0  0
M  END
$$$$4
2-methyl propanal
RLJmol-12_04031220513D 1   1.00000     0.00000     0
Jmol version 12.1.42_dev  2011-02-16 08:29 EXTRACT: ({0:12})
 13 12  0  0  0  0              1 V2000
   1.23294   0.65225  -1.04163 C   0  0  0  0  0  0
   0.41433  -0.28648  -0.15309 C   0  0  0  0  0  0
   1.18896  -0.57424   1.13455 C   0  0  0  0  0  0
  -0.90164   0.36430   0.18710 C   0  0  0  0  0  0
  -1.93815  -0.16630  -0.13290 O   0  0  0  0  0  0
   2.18475   0.18163  -1.28764 H   0  0  0  0  0  0
   0.68113   0.85734  -1.95897 H   0  0  0  0  0  0
   1.41608   1.58677  -0.51124 H   0  0  0  0  0  0
   0.23129  -1.22091  -0.68343 H   0  0  0  0  0  0
   1.37209   0.36028   1.66494 H   0  0  0  0  0  0
   0.60581  -1.24296   1.76765 H   0  0  0  0  0  0
   2.14077  -1.04486   0.88855 H   0  0  0  0  0  0
  -0.91775   1.30521   0.71706 H   0  0  0  0  0  0
  1  2  1  0  0  0
  2  3  1  0  0  0
  2  4  1  0  0  0
  4  5  2  0  0  0
  1  6  1  0  0  0
  1  7  1  0  0  0
  1  8  1  0  0  0
  2  9  1  0  0  0
  3 10  1  0  0  0
  3 11  1  0  0  0
  3 12  1  0  0  0
  4 13  1  0  0  0
M  END
$$$$
acetone
$$ [...]
  5  9  1  0  0  0
  5 10  1  0  0  0
  6 11  1  0  0  0
  6 12  1  0  0  0
M  END
$$$$
</ModelData>
</Models>
##$PEAKS=
<Peaks type="GC" xUnitsExpected="minutes"  >
<PeakData id="1" title="acetaldehyde (#3, 6.53)" peakShape="sharp" model="coff.1"  xMax="6.63" xMin="6.43" />
<PeakData id="2" title="2-methyl propanal (#7, 8.47)" peakShape="sharp" model="coff.2"  xMax="8.55" xMin="8.37" />
<PeakData id="3" title="acetone (#8, 8.66)" peakShape="sharp" model="coff.3"  xMax="8.74" xMin="8.57" />
<PeakData id="4" title="methyl acetate (#9, 8.85)" peakShape="sharp" model="coff.4"  xMax="8.95" xMin="8.76" />
<PeakData id="5" title="2-methyl furan (#10, 9.84)" peakShape="sharp" model="coff.5"  xMax="9.94" xMin="9.74" />
<PeakData id="6" title="2-butanone (#13, 11.1)" peakShape="sharp" model="coff.6"  xMax="11.2" xMin="11.0" />
<PeakData id="7" title="2-methyl butanal (#14, 11.44)" peakShape="sharp" model="coff.7"  xMax="11.52" xMin="11.34" />
<PeakData id="8" title="3-methyl butanal (#15, 11.63)" peakShape="sharp" model="coff.8"  xMax="11.73" xMin="11.54" />
<PeakData id="9" title="ethanol (#16, 12.4)" peakShape="sharp" model="coff.9"  xMax="12.5" xMin="12.3" />
<PeakData id="10" title="2,3-butanedione (#20, 13.85)" peakShape="sharp" model="coff.10"  xMax="13.95" xMin="13.75" />
<PeakData id="11" title="thiophene -internal standard (#25, 15.75)" peakShape="sharp" model="coff.11"  xMax="15.85" xMin="15.65" />
<PeakData id="12" title="2,3-pentanedione (#30, 17.43)" peakShape="sharp" model="coff.12"  xMax="17.53" xMin="17.33" />
<PeakData id="13" title="1-methyl pyrrole (#43, 21.3)" peakShape="sharp" model="coff.13"  xMax="21.4" xMin="21.2" />
<PeakData id="14" title="pyridine (#47, 24.1)" peakShape="sharp" model="coff.14"  xMax="24.2" xMin="24.0" />
<PeakData id="15" title="2-methyl pyrazine (#57, 27.7)" peakShape="sharp" model="coff.15"  xMax="27.8" xMin="27.6" />
<PeakData id="16" title="1-Hydroxy-2-propanone (#61, 29)" peakShape="sharp" model="coff.16"  xMax="29.1" xMin="28.9" />
<PeakData id="17" title="furfuryl mercaptan -internal standard (#77, 33.2)" peakShape="sharp" model="coff.17"  xMax="33.3" xMin="33.1" />
<PeakData id="18" title="acetic acid (#78, 33.8)" peakShape="sharp" model="coff.18"  xMax="33.9" xMin="33.7" />
<PeakData id="19" title="2-oxopropyl acetate (#79, 34.2)" peakShape="sharp" model="coff.19"  xMax="34.3" xMin="34.2" />
<PeakData id="20" title="propanoic acid (#87, 36.2)" peakShape="sharp" model="coff.20"  xMax="36.3" xMin="36.1" />
<PeakData id="21" title="Furfuryl alcohol (#98, 40.4)" peakShape="sharp" model="coff.21"  xMax="40.49" xMin="40.3"  />
<PeakData id="22" title="butyrolactone (#99, 40.6)" peakShape="sharp" model="coff.22"  xMax="40.7" xMin="40.51"  />
</Peaks>
##XLABEL= Time (minutes)
##YLABEL= Relative Intensity
##XUNITS= MINUTES
##YUNITS= ARBITRARY UNITS
##XFACTOR= 1
##YFACTOR= 7.500000E-05
##FIRSTX= 5
##FIRSTY= 5.250000
##LASTX= 4.232800E+01
##NPOINTS= 980
##MINY= 5
##MAXY= 80
##XYDATA= (X++(Y..Y))
5G0000M13M00YN47N73N60N74N60j080j720j707Tj706M426Q00G3333
5.839A00000O667j3334j3333T%TJ3333K3373j760j2120Tm773k840F8427
6.411A24787O68120J28440J45320p85160j49400m7654j493j507j493G8467
6.83G6960j013m94m93n07m93TJ253K387K400K386J2960K5214O7226D07493
7.402B14773j12800j8293p200N07M93TN07M93J47%UJ5480L12560G59013
8.012F32200l71627j36360l3213o387o373o387j520%J09360K3040F51173
8.47A066667p73360N73360K00000%To23947k96507j3666O7106Q67014E81080
8.927B77120j76680n627n626n627N73K827K840TK827l74k866k867H6493
$$ y = [70000, 70413, 70813, 71213, 71613, 72013, 72413, 72813, 73213, 73760, 74333, 74893, 75467, 76027, 74947, 73227, 71520, 69813, 68107, 72533, 73333, 73333, 100000, 106667, 93333, 80000, 66667, 66667, 66667, 80000, 103373, 101613, 89493, 77373, 72600, 69760, 68427, 124787, 792907, 921347, 1066667, 281507, 132107, 84453, 82960, 81453, 79960, 78467, 76960, 75947, 75453, 74960, 74453, 73960, 73467, 74720, 77107, 79507, 81893, 94853, 120067, 187293, 407493, 214773, 101973, 83680, 76480, 76987, 77480, 77973, 78480, 78973, 79120, 79120, 79120, 79120, 94600, 407160, 759013, 632200, 260573, 124213, 91000, 84613, 78240, 71853, 70333, 70333, 179693, 202733, 651173, 1066667, 293307, 866667, 1066667, 1066667, 1066667, 442720, 146213, 132547, 199653, 1066667, 581080, 277120, 100440, 94813, 89187, 83560, 84133, 86960, 89800, 92640, 95467, 95093, 92227, 89360, 86493]
9.461H3627j374M40M54M40UM53K1507L4013Q61360O4867r8800p08547A73600
10.033A04240k653J9800j74O8667m5520l4120k2027J987TJ986J987A01747
10.529A08733O974K8453M0840n3693m0747j987k000j986k000J413H6653
10.986A06280O5947O55693K38747j55160l27787l13467j04760m2880A14627
11.368D40267L66226K60174%m00000k00000K79280L20720q57227r2227A17213
11.787A17213%TK67J000WJ227J600J586J600L8160J66680K62734K70600D00000
12.473F13813r0520k43466j47147j6640R987N4040K40453j48493j43174A26573
12.893A24293k280UK14M93TN07M93O54P893Tl453o427o440n000L414A21587
$$ y = [83627, 82253, 82693, 83147, 83587, 84027, 84467, 84920, 106427, 140440, 1001800, 1066667, 967867, 259320, 173600, 104240, 101587, 121387, 121213, 189880, 144360, 110240, 88213, 90200, 92187, 94173, 96160, 101747, 108733, 115707, 144160, 185000, 131307, 90560, 88573, 86573, 84587, 82587, 84000, 86653, 106280, 172227, 827920, 1066667, 911507, 583720, 270253, 165493, 122613, 114627, 440267, 806493, 1066667, 1066667, 666667, 466667, 745947, 1066667, 209440, 117213, 117213, 117213, 117213, 117213, 117480, 118480, 119480, 120480, 121480, 122480, 123707, 125307, 126893, 128493, 166653, 333333, 596067, 866667, 400000, 613813, 523293, 279827, 132680, 116040, 126027, 180067, 420520, 272027, 128853, 126573, 124293, 122013, 119733, 117453, 117667, 118160, 118653, 119160, 119653, 120307, 128200, 136093, 132640, 126213, 119773, 114773, 118187, 121587]
13.579A24987L400L413p893n907l987M1867K44120N33333k56040m32506C11773
14.037C67347j72894m1933j2107j1533j000r87j000Uj06L960UP86A33787
14.646A31867%WJ600M000L986J2160K1560j7626j8840m814j146j147A30453
15.295A29307P653J1827M733p800r307N667N8933L97734L96613P1307A066667
15.752A066667%Ul70427r2413j89267r1493l5400j8427l0480k4693A95427
16.248A88240p187p173l320J333O027J9960L2773l8080k8533j0880B01320
16.706B01293k9973j2293P986l960o093p987p973k867O54O66O67K760A54840
17.239A49667j1974J4654K46333L04920L04907o96534j26533m0800A42107
$$ y = [124987, 128387, 131800, 123907, 118000, 114013, 155880, 400000, 933333, 677293, 244787, 311773, 367347, 194453, 152520, 140413, 128880, 127880, 126893, 125893, 124893, 123893, 123787, 127747, 131707, 135667, 136453, 133787, 131867, 131867, 131867, 131867, 131867, 131867, 133467, 137467, 141453, 153613, 175173, 157547, 138707, 133893, 132747, 131600, 130453, 129307, 136960, 148787, 153520, 145720, 136413, 142080, 201013, 598747, 995360, 1066667, 1066667, 1066667, 1066667, 1066667, 1066667, 696240, 603827, 414560, 323067, 287667, 269240, 238760, 214067, 195427, 188240, 181053, 173880, 170560, 171893, 177920, 197880, 230653, 192573, 164040, 153160, 201320, 201293, 171320, 159027, 167013, 163053, 156960, 148973, 141000, 138133, 138787, 139453, 140120, 142880, 154840, 149667, 137693, 152347, 398680, 703600, 1008507, 311973, 185440, 144640, 142107]
17.62A43707J586j73o040TK187J9600K9560M1160k2467n9333R86A45733
18.117A46093k000k653k867k866k854k866J453L973L960TL987M000A47667
18.65A41240o440n640K653K640K654K653J3747L1626K1560j4786A63093
19.108A34467k347L947k947J0413J3840J3854K0106l4533j2613l334A37533
19.565A34213k346%Vq0m94n06n07m93n07n20n73n60n74n60n86o67A24573
20.327A23907o67P07J133J147J133J147J1360J4440p974p973o827A24800
20.824A21587j987k000L4973L987l6560M2973K987k1947j3160N3947B38733
21.281D87573L91254j50680k23574k85546m1574l6853P987J0240J0520A96667
$$ y = [143707, 145293, 145120, 139080, 133040, 135227, 154827, 184387, 225547, 203080, 143747, 144733, 145733, 146093, 144093, 141440, 138573, 135707, 132853, 129987, 131440, 135413, 139373, 143333, 147320, 151320, 147667, 141240, 134800, 129160, 131813, 134453, 137107, 139760, 153507, 185133, 206693, 191907, 163093, 134467, 132120, 136067, 133120, 143533, 157373, 171227, 191333, 156800, 144187, 140853, 137533, 134213, 131867, 131867, 131867, 131867, 131867, 131787, 131293, 130787, 130280, 129787, 129280, 128760, 128187, 127627, 127053, 126493, 125907, 125240, 124573, 123907, 123240, 123947, 125080, 126227, 127360, 128507, 139867, 154307, 146333, 138360, 131533, 124800, 121587, 119600, 117600, 152573, 156560, 120000, 162973, 165960, 144013, 130853, 184800, 238733, 487573, 878827, 728147, 504573, 219027, 177453, 140600, 148587, 158827, 169347, 196667]
21.7B20627m7600j6054n573n587m826L986L987K867l307k280Vj533A38360
22.311A38867M93N07M93%q00Yq93q94q93Tq80q94m80%Vk53q00Tp87A38747
23.378A58227K1253n413j8467j1973j1774j013j000r73o67To53o67A28800
23.912A30200J320L2120L59480M04200J39347%Tj05480k49240l38347C29800
24.369B82933o6813N360k0133k0147k0307r666k000TP000O386j9946A31493
24.865A26800m680Tn87P894J0986L38627J25187j87707o8347j76133A73840
25.322A26880l987l986l987l560%XM440Q893Q907J6720K1427k8440A70573
26.009A51147j9427Tj413m93n07m93m94J387K3120K1560N3627l9320A34720
$$ y = [220627, 173027, 156973, 151400, 145813, 140987, 144973, 148960, 151827, 148520, 146240, 143960, 141680, 139400, 137867, 138360, 138867, 139360, 139867, 140360, 140360, 139560, 138760, 137960, 137160, 136360, 135560, 134760, 133867, 132973, 132080, 131187, 130307, 129413, 128933, 128933, 128933, 128933, 128933, 128680, 127880, 127080, 126293, 138747, 158227, 179480, 174067, 155600, 143627, 131853, 130840, 129840, 128867, 128200, 127533, 126880, 126213, 128800, 130200, 131520, 163640, 523120, 927320, 1066667, 1066667, 1066667, 961187, 711947, 373600, 329800, 282933, 216120, 221480, 201347, 181200, 160893, 151227, 149227, 147227, 154227, 160613, 140667, 131493, 126800, 122120, 117440, 116853, 124747, 135733, 474360, 599547, 411840, 343493, 167360, 173840, 126880, 122893, 118907, 114920, 111360, 111360, 111360, 111360, 111360, 111360, 111360, 115800, 124693, 133600, 150320, 171747, 143307, 170573, 151147, 131720, 112293, 110880, 110387, 109880, 109387, 108893, 110280, 133400, 154960, 208587, 169267, 134720]
26.543A10147n987K307N320TN333j667p840k280Vo53J333J334J333A07853
27.191I5667p240l987J55227M30613K32333n39880j96360m0533J37080B01920
27.61I48733J17934r23720J3800o1027j6240K000UJ987J5666J3187A13120
28.106A09933l200M187Q893Q907R2253L88067k06013k37440N1333A48027
28.526A51027K986r60o66%TM26K667K653M6920M8800Q12814%p30640B73480
29.097B31387o2640p054p040K6467L4387k7254k0013J5360p013p014A62560
29.555A55547o160m94n06m94n06m94L654J5680J58266m0240j9866A86013
30.051B34173Q1747L1973M4307j1693o8200j00507k4600k8440M80A81587
$$ y = [110147, 104160, 106467, 111787, 117107, 122440, 120773, 112933, 110653, 108373, 106093, 103813, 103160, 104493, 105827, 107160, 107853, 95667, 88427, 84440, 239667, 670280, 902613, 362733, 166373, 125840, 262920, 201920, 948733, 1066667, 142947, 156747, 95720, 79480, 81480, 83480, 85480, 87467, 103133, 116320, 113120, 109933, 106733, 110920, 119813, 128720, 220973, 609040, 403027, 165587, 216920, 148027, 151027, 154013, 153053, 152387, 152387, 152387, 152813, 155480, 158133, 205053, 253853, 1066667, 1066667, 336027, 273480, 231387, 168747, 161693, 154653, 181120, 215507, 188253, 168240, 183600, 176587, 169573, 162560, 155547, 149387, 148893, 148387, 147893, 147387, 146893, 150547, 166227, 324493, 284253, 264387, 186013, 234173, 315920, 347893, 392200, 380507, 312307, 211800, 187200, 158760, 159240, 181587]
30.47B13373M5240m8626m8627j2987K654K666K654N600J2853TO947A89280
30.966A95960N4773k1333TN613K5720k1240p360Vk6853N266N254M106A80493
31.576A84480J57760n0693n4280l4654k0306n520k400Tj827J333J334A84213
32.071A96107J1906J1894J040r067r053M26O574J3146j33j3467j2760A84640
32.567A77293N587TN586K280%k066n320l774K987L000K747K000J986F47867
33.139A029667L7000%To4320k51760r7480k46000r9587p3240k5653B20467
33.597B34053L8520M81080J7787J02427j33734k24106p9067n1387C41160
33.978C14747j0707m987m986M4053M52507K8266m59626N1520K29200D26387
$$ y = [213373, 258613, 209987, 161360, 148373, 151027, 153693, 156347, 161947, 174800, 187653, 194600, 189280, 195960, 250733, 229400, 208067, 213680, 239400, 218160, 210800, 203440, 196080, 188720, 161867, 167133, 172387, 176493, 180493, 184480, 342240, 291547, 237267, 202613, 182307, 176787, 174387, 171987, 170160, 171493, 172827, 184213, 196107, 208013, 219907, 220947, 211880, 202827, 203253, 209827, 222973, 222840, 209373, 196613, 184640, 177293, 182880, 188467, 194053, 196333, 196333, 194267, 188947, 185173, 188160, 191160, 193907, 195907, 197893, 647867, 1029667, 1066667, 1066667, 1066667, 1002347, 750587, 653107, 407107, 307520, 234280, 208627, 220467, 234053, 272573, 753653, 771440, 873867, 740133, 516027, 436960, 385573, 341160, 314747, 304040, 299053, 294067, 338120, 790627, 818893, 359267, 410787, 639987, 426387]
34.397B83413l8520n626n627m800K653K654j760k280VM706O987TM480B98387
35.045C70320j08587k5680l200l186l200n587o427o426m960R200TJ8186E32307
35.579F21853j39680j80026P973r373m0974n4333L947L933M2667k1334B13320
36.037B15293L8974l6787L57680L82413m92146j57294r4960l5133A57013
36.419A47027J9960J9920J7960k0960k1534m266j7774j000Tj293j720A33600
36.914A31880j720l73K973TQ467O0707J04493p1667o5346K6346m0640A42240
37.409A36987l027l013J3493L0933J5494l5200j5854j320L574R973C30200
37.867B56520r0600k5453R306Q374j000Tl87L000TR73o386o387Tj826A44187
$$ y = [283413, 244893, 239267, 233640, 228840, 231493, 234147, 232387, 230107, 227827, 225547, 223267, 227973, 234960, 241947, 246427, 298387, 370320, 261733, 236053, 232853, 229667, 226467, 220880, 214453, 208027, 203067, 212267, 221467, 239653, 532307, 621853, 482173, 302147, 310120, 300747, 259773, 205440, 209387, 213320, 255987, 234653, 213320, 215293, 254267, 217480, 575160, 957573, 465427, 308133, 213173, 178040, 157013, 147027, 166987, 186907, 204867, 183907, 162373, 158107, 140333, 139333, 138333, 137040, 135320, 133600, 131880, 130160, 129787, 132760, 135733, 144200, 204907, 309400, 237733, 172387, 198733, 158093, 142240, 136987, 133960, 130947, 144440, 175373, 190867, 155667, 139813, 138493, 142067, 152040, 330200, 256520, 165920, 140467, 149773, 158147, 157147, 156147, 155760, 158760, 161760, 162733, 156347, 149960, 143573, 141747, 144187]
38.477A52173P987j3080j6147p000l000TK307M000L227K626M54m054A26013
39.011A25680q00UJ280L253O574O186j986j627j333j334j346j334A30280
39.583A28947R73R87J426J5960J5814J7786k9920r306p560K000TJ813A42053
40.116A43187J146J134K7426L05960TK81854l63000n2414k17266j60907B34467
40.574E20787M25520k52187l37920j60613k3987j2120o787l986l987A40733
40.994A40667%l120n254q053Tl827K493K494K493TK494J706R87J000A29507
41.604A30507R86R4m40m54m40m53m40m67j000r86q94%TN74L400UA40187
$$ y = [152173, 160160, 147080, 130933, 123933, 120933, 117933, 120240, 124240, 127467, 130093, 130547, 126493, 126013, 125680, 124880, 124080, 123280, 124560, 127813, 134387, 140573, 138587, 136960, 135627, 134293, 132947, 131613, 130280, 128947, 129920, 130907, 132333, 148293, 164107, 181893, 151973, 142667, 135107, 137107, 139107, 140920, 142053, 143187, 144333, 145467, 172893, 478853, 784813, 1066667, 703667, 651253, 433987, 273080, 234467, 520787, 946307, 694120, 356200, 195587, 171600, 159480, 152693, 148707, 144720, 140733, 140667, 140667, 137547, 132293, 124240, 116187, 112360, 114853, 117347, 119840, 122333, 124827, 126533, 127520, 128520, 129507, 130507, 131493, 131587, 131147, 130693, 130253, 129800, 129360, 128893, 127893, 126907, 126013, 126013, 126013, 126587, 129987, 133387, 136787, 140187]
42.328A43587  $$checkpoint
##END=