##TITLE=cholesteryl acetate $$ Begin of the data block
##JCAMP-DX=5.00 $$ ACD/DocManager Library v 5.00
##DATA TYPE=NMR SPECTRUM
##DATA CLASS=XYDATA
##ORIGIN=Dept of Chemistry, UWI, Mona, JAMAICA
##OWNER=public domain
##DATE=97/08/29
##$$.SHIFT REFERENCE=INTERNAL,  ,1, -12.2103
##.ACQUISITION TIME=1.200
##.ZERO FILL=0
##.ACQUISITION MODE=SIMULTANEOUS
##SPECTROMETER/DATA SYSTEM= BRUKER ASPECT 3000
##SOLVENT NAME=
##.OBSERVE NUCLEUS=^13C
##.OBSERVE FREQUENCY=50.000
##$MODELS=
<Models>
<ModelData id="cholac" type="MOL">
cholesteryl acetate
  RasMol  09029716423D

 79 82  0        0              1 V2000
   -5.0280    0.0960   -0.6320 C   0  0  0  0  0  0  0  0  0  0  0  0
   -6.4960    0.1680   -0.1840 C   0  0  0  0  0  0  0  0  0  0  0  0
   -6.8520   -0.9560    0.8000 C   0  0  0  0  0  0  0  0  0  0  0  0
   -5.8560   -0.9400    1.9760 C   0  0  0  0  0  0  0  0  0  0  0  0
   -4.4160   -0.9280    1.5160 C   0  0  0  0  0  0  0  0  0  0  0  0
   -3.5040   -1.8880    1.9880 C   0  0  0  0  0  0  0  0  0  0  0  0
   -2.0600   -1.9080    1.5880 C   0  0  0  0  0  0  0  0  0  0  0  0
   -1.5920   -0.5360    1.0680 C   0  0  0  0  0  0  0  0  0  0  0  0
   -2.5680   -0.0600   -0.0320 C   0  0  0  0  0  0  0  0  0  0  0  0
   -4.0160    0.1680    0.5360 C   0  0  0  0  0  0  0  0  0  0  0  0
   -2.0160    1.1760   -0.7880 C   0  0  0  0  0  0  0  0  0  0  0  0
   -0.5560    1.0520   -1.2480 C   0  0  0  0  0  0  0  0  0  0  0  0
    0.3640    0.6880   -0.0720 C   0  0  0  0  0  0  0  0  0  0  0  0
   -0.1720   -0.6480    0.4800 C   0  0  0  0  0  0  0  0  0  0  0  0
    0.9440   -1.1360    1.4040 C   0  0  0  0  0  0  0  0  0  0  0  0
    2.2400   -0.6520    0.7240 C   0  0  0  0  0  0  0  0  0  0  0  0
    1.8200    0.2920   -0.4400 C   0  0  0  0  0  0  0  0  0  0  0  0
    0.3800    1.8120    0.9920 C   0  0  0  0  0  0  0  0  0  0  0  0
   -4.1120    1.5360    1.2480 C   0  0  0  0  0  0  0  0  0  0  0  0
    2.8560    1.4240   -0.6680 C   0  0  0  0  0  0  0  0  0  0  0  0
    2.4160    2.4120   -1.7680 C   0  0  0  0  0  0  0  0  0  0  0  0
    4.2240    0.8000   -1.0360 C   0  0  0  0  0  0  0  0  0  0  0  0
    5.3720    1.8160   -1.1480 C   0  0  0  0  0  0  0  0  0  0  0  0
    6.7200    1.1160   -1.3800 C   0  0  0  0  0  0  0  0  0  0  0  0
    7.8960    2.0840   -1.6240 C   0  0  0  0  0  0  0  0  0  0  0  0
    8.1960    2.9480   -0.3880 C   0  0  0  0  0  0  0  0  0  0  0  0
    9.1480    1.2760   -2.0080 C   0  0  0  0  0  0  0  0  0  0  0  0
   -8.9600   -1.5160    1.9320 C   0  0  0  0  0  0  0  0  0  0  0  0
   -8.4800   -2.9520    2.0160 C   0  0  0  0  0  0  0  0  0  0  0  0
   -8.1520   -0.6360    1.2800 O   0  0  0  0  0  0  0  0  0  0  0  0
   -4.8800   -0.8600   -1.1880 H   0  0  0  0  0  0  0  0  0  0  0  0
   -4.8280    0.9120   -1.3600 H   0  0  0  0  0  0  0  0  0  0  0  0
   -7.1600    0.1040   -1.0760 H   0  0  0  0  0  0  0  0  0  0  0  0
   -6.6920    1.1600    0.2760 H   0  0  0  0  0  0  0  0  0  0  0  0
$$ [...]
 13 18  1  0
 13 17  1  0
 13 14  1  0
 12 46  1  0
 12 45  1  0
 12 13  1  0
 11 44  1  0
 11 43  1  0
 11 12  1  0
 10 19  1  0
  9 42  1  0
  9 11  1  0
  9 10  1  0
  8 41  1  0
  8 14  1  0
  8  9  1  0
  7 40  1  0
  7 39  1  0
  7  8  1  0
  6 38  1  0
  6  7  1  0
  5 10  1  0
  5  6  2  0
  4 37  1  0
  4 36  1  0
  4  5  1  0
  3 35  1  0
  3 30  1  0
  3  4  1  0
  2 34  1  0
  2 33  1  0
  2  3  1  0
  1 32  1  0
  1 31  1  0
  1 10  1  0
  1  2  1  0
M  END
</ModelData>
</Models>
##$PEAKS=
<Peaks type="13CNMR" xUnitsExpected="ppm"  >
<PeakData  id="1" title="peak ~12" peakShape="singlet" model="cholac" atoms="18"  xMax="13" xMin="11"    />
<PeakData  id="2" title="peak ~19" peakShape="singlet" model="cholac" atoms="19,21"  xMax="19.5" xMin="18"    />
<PeakData  id="3" title="peak ~21" peakShape="singlet" model="cholac" atoms="11,29"  xMax="21.5" xMin="19.5"    />
<PeakData  id="4" title="peak ~22" peakShape="singlet" model="cholac" atoms="26,27"  xMax="22.5" xMin="21.5"    />
<PeakData  id="5" title="peak ~23" peakShape="singlet" model="cholac" atoms="23"  xMax="23.5" xMin="22.5"    />
<PeakData  id="6" title="peak ~24" peakShape="singlet" model="cholac" atoms="15"  xMax="24.5" xMin="23.5"    />
<PeakData  id="7" title="peak ~28" peakShape="singlet" model="cholac" atoms="2,16,25"  xMax="29" xMin="27"    />
<PeakData  id="8" title="peak ~31.8" peakShape="singlet" model="cholac" atoms="7,8"  xMax="23" xMin="30"    />
<PeakData  id="9" title="peak ~36" peakShape="singlet" model="cholac" atoms="20,22"  xMax="36.5" xMin="34.5"    />
<PeakData  id="10" title="peak ~37" peakShape="singlet" model="cholac" atoms="1,10"  xMax="37.5" xMin="36.5"    />
<PeakData  id="11" title="peak ~38" peakShape="singlet" model="cholac" atoms="4"  xMax="38.5" xMin="37.5"    />
<PeakData  id="12" title="peak ~39.5" peakShape="singlet" model="cholac" atoms="12,24"  xMax="41" xMin="38.5"    />
<PeakData  id="13" title="peak ~42.5" peakShape="singlet" model="cholac" atoms="13"  xMax="43" xMin="41.5"    />
<PeakData  id="14" title="peak ~50" peakShape="singlet" model="cholac" atoms="9"  xMax="51" xMin="49"    />
<PeakData  id="15" title="peak ~56" peakShape="singlet" model="cholac" atoms="14,17"  xMax="57" xMin="55"    />
<PeakData  id="16" title="peak ~74" peakShape="singlet" model="cholac" atoms="3"  xMax="75" xMin="73"    />
<PeakData  id="17" title="peak ~122" peakShape="singlet" model="cholac" atoms="6"  xMax="123" xMin="121"    />
<PeakData  id="18" title="peak ~138" peakShape="singlet" model="cholac" atoms="5"  xMax="139" xMin="137"    />
<PeakData  id="19" title="peak ~169" peakShape="singlet" model="cholac" atoms="28"  xMax="170" xMin="168"    />
</Peaks>
##XUNITS=HZ
##YUNITS=ARBITRARY UNITS
##XFACTOR=1.0000000000
##YFACTOR=0.6802435517
##MAXX=13185.38964844
##MINX=-610.51269531
##MAXY=21767.79296875
##MINY=-1011.76025391
##FIRSTX=13185.38964844
##LASTX=-610.51269531
##FIRSTY=-21.25825882
##NPOINTS=16561
##DELTAX=-0.83308589
##XYDATA=(X++(Y..Y))
13185.4c1S47j05K87nk5r4k81P17m36L5J04j44k01j48K42O4Oj03o2Q3K8K37l83L35
13044.6A20l15J57L47j66o3k53L45m32K54n3l4k32L40J31k0k5p8n97N25j87K2K54J01
13025.5A41m00O91l32j96p5L26J2j41K92l63l5L14m67L34q0K12on10P0k4M09p77N94
13006.3a1l87L15l55N56J13%k94P8J28l31J70M7K66n28J8Q00m66l73J05O1M09m88L99
12987.1B32m18K42K38j15j6Q5K6m48J20k98M98l01j05J35k0L03j38j46R4j01L64k54
12968.8b3M0J50j26k45M32m0M2m18L4J19k23K72J98n66J40p1K52k67k1L0K37j14k6
12949.6a94J19n2K20J09m44O7l5k13P91p11J45L03P2j84p1M46m70K13j78O5M0j96J65
12930.5GK86k26n02M68j46J09j03j9m3q2K9J57P9K73j11m67K87K81o4r4p1R7l1l29
12910.5b15N38j69j34K0l11L41l74N98n23JP82p00O1K63n29N07l90O9k9O13k60L89
$$ plain form
13044.6 120 -195 -38 309 143 80 -173 172 -260 -6 -59 -93 -325 15 146 126 101 23 -574 -49 -236 -214 40 141
13025.5 141 -259 432 100 -96 -171 155 167 26 318 -45 -80 234 -233 101 21 233 227 -283 -213 -237 172 -605 -11
13006.3 -11 -398 -83 -438 118 231 231 -63 15 143 -188 -18 29 295 -233 -215 585 119 -254 -149 -88 321 -167 232
12987.1 232 -186 56 294 179 163 248 274 -174 -54 -352 146 -155 -260 -125 -145 158 20 -126 -32 -133 231 -23
12968.8 -23 17 167 41 -204 228 188 230 -188 -154 -35 -258 14 212 -354 -214 -285 -33 -300 -321 -291 -54 -168 -194
12949.6 -194 -75 -127 93 202 -242 -175 -210 -423 368 -343 -198 105 177 -7 -78 368 -102 111 -67 -2 38 -158 7
12930.5 7 293 67 -435 33 -113 -4 -107 -126 -169 -251 -222 -65 14 287 176 -291 -4 277 213 119 48 145 114 -215
12910.5 -215 323 154 20 40 -271 70 -304 294 -229 -228 554 -146 -85 178 -351 156 -234 -165 -194 419 159 548
12892.2E48l66r1k81P8M9q4J81l08J91k12O41j38k72k14N66p7k7j08m3Q4k20%k31M80
12872.2A46L86m48k59K08nL9k60N98q79P40J25k26M0k93K77l93J33p6K31j93M22m41
12853.9a28L66k89j42N3J0K15P7l7k73l64O71O7J5k26l74L90j04l6Q1k44M66pl9j25
12833.9B3n2ok73J39K65m92O27l16M75q46O76n62O8O60l44o6l12J89K88l10K63k11
12815.5a17J38j82N6J95j49j33N48l13J64l05Jj2L90n27O92k31l57L10k29K69j51j56
12797.2i9K75j33l7M2j00L17jj15l2k84L96m1j39k58N0M72m84K50j67j6J13P3N5J63
12777.2C00l19k5j61M95m24J28J7N3J16l75K9KM83J3l69r3J16O4k93K22j12K26l57
12758.1b64L92k10J7J50M3J34J50o15J71l13N89l67n8N04n26J16K21j80L80n82L14
$$ plain form
12892.2 548 182 91 -190 -112 -63 -147 34 -274 -83 -295 346 208 -64 -278 288 211 184 76 33 117 -103 -103 -334 146
12872.2 146 532 84 -175 33 28 67 -193 405 -474 266 391 165 205 -88 189 -204 -71 -147 84 -109 313 -128
12853.9 -128 238 -51 -193 -140 -130 85 162 125 -148 -512 159 226 241 15 -359 31 -73 -109 -28 -272 194 187 148 23
12833.9 23 -29 -35 -308 -169 96 -396 231 -85 390 -456 220 -342 -274 386 42 -24 -336 -147 141 -169 94 -117
12815.5 -117 21 -161 -105 90 -59 -192 356 43 207 -98 -97 -109 281 -246 446 215 -142 168 -61 208 57 -99
12797.2 -99 176 43 6 48 -52 265 264 149 117 -167 229 188 49 -209 -159 313 -171 79 -88 -104 9 82 137 300
12777.2 300 -19 -44 -205 290 -134 -6 11 64 180 -195 -166 -164 319 332 -37 -130 -14 50 -243 -21 -133 93 -264
12758.1 -264 128 -82 -65 85 128 262 412 -203 -32 -345 244 -123 -181 323 -203 -87 134 -46 334 -248 66
12740.6F6M4KK11r7l85M18k58j60J30M6p6R3J87k98k59K44o6Q4K03k26M45j79O1l76
12720.6a46Q2K51n24O39o57O03k85N8k90M2M61n63M01l58L3J27Q0j02j28M15l32K08
12702.2A5l7K80k17j79K42j10l08K77J41m11L67O2k45J50l20K15J1o3R7K60j9o56M39
12683.1ik08MK73M7n24M09o9K29j36n41R20m79Qj43N92m97J69j51N55p70kM26m66J51
12663.1b12N4k4N83o30K21k17J30P6r4J29m9j32J89K05j87k70K47K21m13J03O00l45
12644.8A85n9o3r0L49r1j35j65J85l96K22L61J82n47N9r2K11r7m7K5K85l74J88j82
12625.6h6R2l5L47n86N01jq4l99M39k02k82k36L84K96m84L72J90k83N3l39M09J35k44
12606.4d3L12k38K0j75Q9m58J23N08k75k8j5L00Nn11L65J69j74l42M45j67K54l82J40
$$ plain form
12740.6 66 110 112 323 226 -159 259 1 -159 -29 17 -59 34 221 -77 -336 -92 -158 -74 129 -97 348 169 230 -146
12720.6 -146 -64 187 -337 302 -355 248 -37 21 -269 -227 234 -329 72 -286 -253 -126 -46 -148 -276 139 -193 15
12702.2 15 -22 258 41 -138 104 -6 -314 -37 104 -307 60 122 -123 27 -293 -78 -67 -130 -33 227 208 -448 -9
12683.1 -9 -217 -213 60 107 -417 -8 -77 152 16 -525 395 -84 -76 -219 373 -124 45 -106 449 -321 -323 103 -363 -212
12663.1 -212 -158 -182 401 -229 -8 -225 -95 -19 -113 16 -33 -165 24 229 42 -228 19 240 -173 -70 530 185
12644.8 185 126 63 -27 322 231 96 -69 116 -280 -58 303 485 -62 -3 -95 116 19 -28 -3 282 -92 96 -86
12625.6 -86 6 -29 318 -268 233 232 148 -251 188 -14 -296 -532 -148 148 -336 36 226 -57 -4 -343 66 201 -43
12606.4 -43 269 31 51 -124 -35 -493 -370 138 -137 -165 -180 120 125 -386 -21 148 -26 -368 77 -90 164 -218 -78
12587.3g8K13L2k60M66k69j12j90p1J87J15M6o5p1K23p38L91J39j62K86k76Q8p7m6
12568.1b29K57J87m6k37J35j43q6J62N0k01L32j74l9J30K74l14Q2j28j27P9k06N59
12549.8C17l60k07K58J60l83K51Jm39M14J27m23L54j64K65j82J50j60M5q0O2j47m5
12531.5a86j50O58j78M8K69o99J51q1M48j5M2n63l19M29K04P4j15P2j28m93O32o7m29
12512.3c96K72J56j55r0Q2M3J5J05k26K79J93k42n22L71p6K65N19n94l10J30M30k05
12494D4RJ35k00R6Q7l39L35k23J81r4J23P3ol65j3M59R4l86L12l49j30J16n9K21k74
12473.2a53j87M63J67k92J22K40m40J47m4J21l78N30o93L32q8p1K19J04k71K24j52
12455.7a00j59N06J22p58L27N0L85l09l63N15KJ9j53p6m40K65M91k06j56J56j38K49
$$ plain form
12587.3 -78 135 167 -93 373 104 -8 -198 -269 -82 33 79 14 -57 166 -572 -181 -42 -204 82 -194 -106 -183 -229
12568.1 -229 28 215 169 -68 67 -76 -162 0 50 -151 181 7 -32 98 372 58 140 12 -115 -36 -242 317
12549.8 317 -43 -250 8 168 -215 36 37 -402 12 139 -284 70 -94 171 -11 139 -21 24 -56 6 -141 -186
12531.5 -186 -336 322 144 192 461 -238 -87 -168 280 265 307 -256 -575 -146 58 132 17 89 -39 -532 100 33 -396
12512.3 -396 -124 32 -123 -213 -131 -88 -73 32 -194 85 278 36 -486 -115 -191 74 593 -1 -311 -181 249 44
12494 44 53 188 -12 84 171 -168 167 -56 125 31 154 227 221 -144 -157 302 396 10 322 -27 -157 -41 -100 121 -153
12473.2 -153 -340 123 290 -2 120 360 -80 67 23 144 -234 296 -397 -65 -153 -224 -5 99 -172 52 -100
12455.7 -100 -259 247 369 -389 -62 -12 373 64 -299 216 218 237 84 8 -432 -167 324 118 -38 118 -20 229
12437.3B29j47l54L28K84j52m30p9K83r6p9N14p11l3M35k18J27n0q0N52N6k13R6l8
12418.2B24m06J79l35K86L5L48m87L57l58J78k67N9k34K33J49p0J12l15L78m0J33M0
12399.9A99J26m50J51J9k46J0L2J82k61Q3N61k93K85n94L16k46J48k94M84k80J22L
12381.5E7j63M11n71O93l98q7R0M41o49M49j06l72L06n25J28O5k9p3N40j42j90j91
12363.2c16P48m55N84p98O02k04k21L57j69J43k92J93j27m70P51L5p5j88J51k62J77
12345.7A64j54N6K0m46K82J96j26R3j0N6k97O7J79l5k36J76q7O2k32L60m5k93P8J0
12325.7a62j51L66J10k38k27N58j04j08K98l94k09L01J15k21J99n6k91K57l31K83N71
12308.2E66q74L29r9k07K32j37N37o40M60n2k82N04m52M2K13j43J07m3l00K33L03m45
$$ plain form
12437.3 229 82 -272 56 340 188 -242 -321 -38 -134 -213 301 -410 -443 -8 -226 -99 -149 -229 323 379 166 262 224
12418.2 224 -182 -3 -338 -52 -17 331 -156 201 -157 21 -246 -187 -421 -188 -39 -109 3 -312 66 26 159 199
12399.9 199 325 -125 26 45 -201 -191 -159 23 -238 -155 406 113 398 -196 120 -126 22 -272 212 -68 54 57
12381.5 57 -106 305 -266 427 29 -58 32 473 -176 273 167 -205 101 -424 -296 -231 -260 -333 207 65 -125 -316
12363.2 -316 432 -23 561 -237 365 161 -60 297 128 271 -21 172 45 -425 326 361 286 98 249 -13 164
12345.7 164 10 66 86 -360 -78 118 -8 85 75 131 -166 -99 80 45 -191 -15 -102 -40 -272 88 43 -250 -172 -162
12325.7 -162 -313 53 163 -75 -302 256 152 44 342 -52 -261 40 155 -66 133 77 -214 43 -288 -5 566
12308.2 566 -308 21 -78 -285 -53 -190 347 -293 167 115 -167 337 -115 -73 140 -3 104 61 -239 -6 297 -148
12289.9a48J79n49N94j81Q0O6k32p0N32l87L04j33L9M33p71M17l92M06k19L40m85L62
12271.6A85j43j12M9K15j78R3K46m93j1J06J58L9k65j28N10j26l69K03R7K31m97O7
12253.3a23J74K51o09L17k2n33M37j76j12P56m88j99K41k48J46m70O67k46Q5M2L06
12235.8A96p9l58L93J84m81J56J14j47K13L8Q7m30k3P1j12K28O9J16M7k44j65L24k07
12216.6a0L33l51l2j23K2J85K26m03K9J07k16M81k89L14p5k96nj27O6K15k52L30l14
12197.4a85K97m9j20k36j95N84o46K65L41N5p3%j87j17L72k19j92L14l21M48l95J10
12179.1a49L53k48K78k17n4m4K63l51O09m95P9n25L91J48j23Q0J87nk94M0o5L41k23
12160b4%q8Nm6L97j47j21j65J39L76j82j56K49J23n21K09k8m66L17K13l7K64n0l8k73
$$ plain form
12289.9 -148 31 -518 76 -105 -25 41 -191 -261 271 -116 188 55 94 527 -244 173 -219 187 -32 308 -177 185
12271.6 185 42 -70 -21 194 16 109 355 -138 -149 -43 115 154 -111 -239 271 145 -224 -21 76 307 -190 -123
12253.3 -123 51 302 -307 10 -12 -545 -108 -284 -396 360 -128 -327 -86 -334 -188 -658 9 -237 -152 -110 196
12235.8 196 117 -241 152 336 -145 11 125 -22 191 229 316 -114 -137 -66 -178 50 119 235 282 38 -127 197 -10
12216.6 -10 323 -28 -60 -183 -161 24 250 -153 -124 -17 -233 248 -41 273 198 -98 -103 -230 -164 51 -201 129 -185
12197.4 -185 112 63 -57 -293 -488 96 -550 -285 56 111 38 38 -149 -266 106 -113 -305 9 -312 136 -259 -149
12179.1 -149 204 -44 234 17 -37 -81 182 -169 440 -55 24 -501 -110 38 -85 -5 182 177 -117 -77 -142 199 -24
12160 -24 -24 -112 -107 -153 244 97 -24 -189 -50 326 144 -12 237 360 -161 48 20 -446 -129 84 47 311 261 223 -50
12139.1e0L48L0j23j39j37Q9J47m73L96q5p76Q51L25p03O95k43l88N10k34j78L40k62
12120.8f0q4L29j68j66K03j09K43l64O3K86l84L92j76J56l98n1L73K2k67M8J04j97
12102.5b05K11M4L08m46j62M47m83L36l15j04L42L52j58j45j22M19l79Q7Q4J65k66
12085A0M83j26n67k8K76K38k34k43j95M52K91n03K44p7J35n2K82m35k15N65m89J35
12066.7e3n2n3l8R8j60K49r6L28l84o2L10j12L68j15j99j57M52m64Ol0k76M86J74p
12046.7B13ll38Q8l13Q11n13q8K26l52K91M3k23J63J05k71j9K40j39o2k56L16l97L89
12027.5h9L05j19j1l34N16m57j28K74k21K40lk34J77M81l64j07j83K24q9L55o4p6l0
12008.3F3j45J2R0K96k48l0n7L38k01m34J23L06k95L39k28k3l01M10N34k23m64K76
$$ plain form
12139.1 -50 298 328 205 66 -71 18 165 -308 88 3 -773 78 403 -300 395 152 -236 274 40 -138 202 -60
12120.8 -60 -144 185 17 -149 54 -55 188 -176 -113 173 -211 181 5 161 -237 -288 85 107 -160 -112 -8 -205
12102.5 -205 6 50 358 -88 -250 197 -286 50 -265 -369 -27 325 167 22 -100 319 -60 27 111 276 10
12085 10 493 367 -200 -228 48 286 52 -191 -386 66 357 -146 98 21 156 104 386 -49 -264 301 -188 -53
12066.7 -53 -105 -158 -196 -98 -258 -9 -105 223 -161 -223 87 -25 343 228 29 -128 324 -140 -134 -164 -440 46 220 213
12046.7 213 210 -128 -40 -353 458 -55 -143 83 -269 22 65 -158 5 110 -161 -180 60 -79 -141 -397 -81 -478 -89
12027.5 -89 216 97 86 -248 268 -189 -317 -43 -264 -24 -27 -261 -84 397 33 -74 -257 -33 -122 233 169 93 63
12008.3 63 -82 -70 20 316 68 38 -19 319 118 -316 -193 113 -182 157 -71 -94 -395 15 549 326 -138 138
11990A38J85J40n54j53J39K14mm81J02K47j43N3k00q7L44k53K53J75l76K82r8K1oJ35
11970G3N0j3J14k22M5k01TN86m3j93j42q6L2n8m7O27p32L63M1k03L34N2o4M07p77K59
11948.4AJ36k22J04O3J21n99M59J40m41R6L70m27M75p4m94J8J70pK23m16K35j50Q30
11929.2F11m93m10J60k13Q27l91k07M09m89R4J15r6L52m99Q0K04k5k15K69m37L34J15
11910.9I5j79j99K99J23j46k04K24j38L57j06j5j41K00k47R1lM12l32k11M1l48oN43
11891.7A10k42J57K18k62M29o35K05k06q5K08l6j82O60n2k47m7m9l52N55J67n27j74
11873.4c87L58J70K75m36k58J56K54k75lK49k47n5N1J2K84L09l13pk4n07O05Kl36M8
11853.4g5j5M5j99j87M26L03j29r8l06K49k43L45K51m38Q4N1J7k7l9L35l5M0m18j05
$$ plain form
11990 138 323 463 -91 -244 -105 109 105 -376 -274 -27 -170 -117 -317 -404 -60 -313 -60 115 -261 21 -77 -56 -62 73
11970 73 123 110 224 2 47 -154 -355 231 188 -5 -147 -233 -201 -259 -306 321 -411 -48 -7 -210 124 176 112 519 -258 1
11948.4 1 137 -85 19 82 203 -396 63 203 -238 -142 228 -199 276 202 -292 -274 -104 -111 112 -304 -69 -219 611
11929.2 611 118 -292 -132 -345 482 91 -116 293 -196 -102 13 -83 269 -230 -150 54 29 -186 83 -354 -20 95
11910.9 95 -84 -283 16 139 -7 -211 13 -125 232 126 111 -30 170 -77 14 11 423 91 -120 -79 -427 -433 110
11891.7 110 -132 25 243 -19 410 -225 -20 -226 -311 -103 -139 -321 339 287 40 -7 -56 -408 147 314 -213 -387
11873.4 -387 -29 141 416 -20 -278 -122 132 -143 -146 103 -144 -199 -148 -136 148 457 144 137 113 -394 211 213 -123 -75
11853.4 -75 -90 -45 -244 -431 -5 298 169 71 -235 14 -229 116 367 -71 13 64 81 54 15 350 315 355 -63 -168
11833.4a68P3M75n90M31l19K01k31j0M80j49j02o5j87J72K2J55j14j90l9J74j16J05
11815.1Hj96J8QJ75K81o08J27Q8L37n50L65m60N28l96J81j09K78j2P2p3k89m0M99J44
11795.1C76l29r7K43j38k2K3m11K93Lq8M02j55Ml14L76n37K07J44R4q7k84K01K95j49
11775.1E0J35j88j46J91l07M16l26J12M17k97l9o7MJ44j83L0l01J22M28j08r1J58K39
11755.9C93n07J25j35J02L65m64J76k78K23K47k78q7n6K64m40K67r3J69qK4m8Rk57
11736.8b87O13l30J91n73L00mj86K98k18M55n37k51N29J41l78q0l8N98q0o11L95L64
11718.5C11l27P2j0J07l72K13r6J60p0j15L94l12Jo0L2q0K00N85r01K53l05P7L5N32
11698.5C24p79Q3L69J64l57L18J6k96J95k36kJ88j06P7j04m38K60L53k30J33K32L0
$$ plain form
11833.4 -168 -95 380 -210 221 -98 103 -128 -138 342 193 91 26 -161 11 33 188 74 -116 -155 19 -97 8
11815.1 8 -188 -170 -162 13 294 -314 -187 -99 238 -312 53 -407 121 -275 -94 -203 75 63 135 62 -227 -267 232 376
11795.1 376 47 -50 193 55 33 56 -355 -62 -59 -147 255 100 104 -210 166 -371 -164 -20 74 -13 -297 -96 199 50
11775.1 50 185 -3 -149 42 -265 151 -175 -63 354 57 18 -49 -45 99 -84 -54 -355 -233 195 87 -4 154 393
11755.9 393 -114 11 -124 -22 343 -121 55 -223 0 247 -31 -118 -174 90 -350 -83 -176 -7 -15 9 -39 -30 -287
11736.8 -287 326 -4 187 -386 -86 -90 -276 22 -196 259 -278 -529 0 141 -237 -317 -355 243 163 -448 -53 311
11718.5 311 -16 56 46 153 -219 -6 -102 58 -12 -127 267 -45 -44 -104 -72 -152 48 633 -268 -15 -320 -243 -208 324
11698.5 324 -455 -372 -3 161 -196 122 138 -158 37 -199 -201 -13 -119 -42 -146 -584 -324 29 -201 -68 164 194
11680.1A94J42l75J39MR8k46P7K55j85J09k07p0L37j72j87j19M87k06Lp4mL7J59n1
11660.2A45n68p8N52k9k83K84l06J37J02L94k87J46M0k01J05k75P9K44l71M2J44j78
11641.8a62R3J8K98l16J80qK09k10N1k91M39l16k59L68k22J68K09lK8j87Q0k09q5J94
11621.8F7r9L62o56M75k4%L0j3J7K45m32Kj1R4m1KJ50k55k08N69l19K30j90J48k80
11601a37o2j76L75l7k1p3q5J22p8J41O3J20k13J00j56J8R5O2R1l89J40K19p9l2J12
11580.2A20j44J85l38M83m08O39l94j04K33k98k78J82k24M09K4Q9l37L63m62K20q0
11562.7a20J25n6K50l26J36L2k10K77j91K16k15j87M28j3K3m81R6P0j28M95n85L54
11544.4a0k99L1K41L8k77M31k92K26k9j93J97Ok6J87q92M73K67k16l6R8J9Q3j20L17
$$ plain form
11680.1 194 336 -39 100 104 202 -44 33 288 103 212 5 -65 272 100 -87 -206 281 75 78 4 0 37 196 145
11660.2 145 -423 -501 51 22 -261 23 -283 -146 -44 350 63 209 249 48 153 -122 -43 201 -170 -128 16 -162
11641.8 -162 -69 -51 247 -69 111 103 312 102 153 -138 301 -15 -274 94 -128 40 249 246 274 87 167 -42 -127 67
11621.8 67 -32 330 -326 149 125 125 155 142 159 404 -28 -26 -37 57 16 18 168 -87 -295 274 -45 185 -5 143 -137
11601 -137 -199 -375 0 -37 -58 -131 -216 -94 -172 -31 32 152 -61 39 -117 -99 -4 58 149 -240 -100 119 40 8 120
11580.2 120 -24 161 -177 306 -102 537 143 39 272 -26 -304 -122 -346 63 87 176 -161 202 -260 -40 -120
11562.7 -120 5 -51 199 -127 9 41 -169 108 -83 133 -82 -269 159 146 169 -312 -216 -146 -274 221 -364 -10
11544.4 -10 -309 -278 -37 1 -276 155 -137 89 60 -133 64 70 44 231 -661 -188 79 -137 -173 -75 -56 27 -93 224
11524.4B24k9k97J28j25k18M66m10M90m17K58J21m81M49m8J1m9j45J49J4K22m27J22
11506Hk32K36N36m49q6Nk00J12L36n57J67N3j91l7O00k23j59k34K23R5l9R5p5L7l06
11485.2b85M39M8k71n7K40m6l66N50l60k90L71k21J90ql4K2L7K31j04l19L18M5o7k33
11465.2a70K22k65O6l5J34R3L6j39K36K42n43oM38m36L45m06N00l42K42m38N80j48
11446.9B06l17j35p6J3N66k59k74L79l7j95O27n73M60l22j49J40k55L07k14OL55o94
11428.6d41L71l10N07n60L27N34l98k83O3L27k8k89J56L4J26m75L50K8K28l64nK28
11410.3A26Ll52K02k2J59k63M0J15J80m36M8k90O45n36R09q8l76J8l7J73m3m2k16K29
11390.3A46k58k75M96M5j64r7K47k12j14L90k52Q6J69J65o54L29J58L3l47q7j64N54
$$ plain form
11524.4 224 195 -102 26 -99 -317 149 -261 229 -188 70 191 -290 159 111 122 73 -72 77 91 313 -114 8
11506 8 -224 12 548 99 13 18 -182 -70 266 -291 -124 -71 -262 -299 301 78 -81 -315 -92 3 -36 59 -16 21 -285
11485.2 -285 154 202 -69 -126 114 68 -298 252 -108 -398 -27 -248 -58 -66 -100 -78 -41 190 86 -233 85 130 63 -170
11465.2 -170 52 -213 -147 -182 -48 45 81 -58 178 420 -123 -129 309 -127 218 -188 312 -30 212 -226 354 206
11446.9 206 -111 -246 -322 -309 257 -2 -276 103 66 -129 498 -75 385 63 -86 54 -201 106 -108 -102 253 -441
11428.6 -441 -70 -380 127 -433 -106 428 30 -253 -190 137 109 -180 -24 10 136 -339 11 39 267 -97 -102 126
11410.3 126 129 -223 -21 -43 116 -147 -107 8 188 -248 -200 -490 155 -381 528 440 64 82 45 218 175 133 -83 146
11390.3 146 -112 -387 109 154 -10 -107 140 -72 -186 204 -48 38 207 372 -282 47 205 238 -109 -196 -360 194
11371.9A94j05k84j18O36l92L48p38M55K69l29Q2J22j12q6J21j24pl78K93n1K88o3
11353.6B1P5k69O8k91L23J18j2l53K90M55m98N5jl91K98r1N4k06M25j41l0K26o01Q83
11333.6D07j51O1m05m7P9J69j46r9j38J37o6O9J51J10j26l57K62J8p8o9q8L82j63m3
11313.6a31P1L9k26J10j72K85k3J40p7j81P06o25J34l19J50J52l3mK31m25m6K96j73
11294.5a21N3l65O41m05J13N5K80Q9l85L39m6j4j74j29l09J04M28r2J88k87J9K21m40
11275.3b37J15j49M00l43O04m50k05P2L39k01P4m19K86J99j39O8k47Q6o6J07o7K02
11257B9L71o53L44O4l46J10o8L55l91K35J33l8l42M68o60M07q0k49Q24n87N03m25j55
11237.8a51MK17m4l39L98r7pJ64J23J08m3l96K49m75K10P7k44J62L5L06o75P94l73
$$ plain form
11371.9 194 89 -195 -313 323 -69 279 -459 -4 265 -64 18 140 28 -58 63 -61 -68 -446 -153 -204 84 21
11353.6 21 96 -173 -105 -396 -73 45 33 -320 -30 425 -73 -18 -19 -410 -112 -203 -149 -355 70 -71 -101 125 -476 407
11333.6 407 256 317 -88 -135 -56 113 -33 -132 -270 -133 -199 -130 21 131 5 -352 -90 -72 -150 -219 -307 75 -88 -131
11313.6 -131 -60 -21 -247 -137 -309 -24 -47 93 16 -165 541 -84 50 -269 -119 33 0 -4 227 -198 -244 52 -121
11294.5 -121 -68 -433 208 -197 -84 -29 251 340 -45 294 248 234 60 -69 -378 -274 154 62 250 -37 -18 203 -237
11275.3 -237 -122 -271 129 -214 390 -60 -265 -193 146 -55 19 -400 -114 85 -54 14 -233 -147 -213 -106 -173 29
11257 29 400 -253 91 155 -191 -81 -149 206 -185 50 183 145 -197 271 -389 18 -62 -311 513 -74 429 4 -151
11237.8 -151 -147 70 26 -313 85 -12 -19 145 268 376 333 -63 186 -289 -79 -2 -246 -84 -49 257 -418 376 3
11218.7Ck44J43J55k5q2M2L02k56K18k11j70K06J18p5R1k0m12J38Q7j38jj28L98j36
11198.7CoO9O4n2J71k28J35R4k4k63K51m39J36j0J02O3k29R8q8K23J30l92K17K25k48
11177.8BJ29k47J58q1M4n93O70q9k0K30l58N6J93l84K44J53j13J11K29l50k79N06k92
11158.7h1k13Q8mL7J46K13J46j86K3k26J98P7m77L99m20O2J10J11k33J15K20l48K22
11139.5b1K2J87P8o45K82K73k87M47k18L7P4m13k02N26j54k15m2q1N34l43k85P26m79
11120.4a99J05k83L29j19j76M99o6P7k68K44j87J63J9J88o01R2M45n65K40k8L41o24
11102c74M32j39M39m21j44K35l51M41k19j15N2M92l26n16N20l25K89J59j97J32k83
11084.5b19J40k8j1O7l3n8R9J47J25p98L82L87j87J63l70j4N04k59Q2k54L01m43L54
$$ plain form
11218.7 3 -241 -98 57 32 -50 -8 294 38 256 45 -125 81 199 124 215 195 -217 -79 8 -130 -131 -259 139 3
11198.7 3 -3 66 130 78 249 21 156 250 226 -37 214 -225 -89 -99 3 66 -163 -65 -153 70 200 -192 25 250 2
11177.8 2 131 -116 42 -39 5 -588 82 -7 -27 203 -155 -99 94 -290 -46 107 -6 105 334 -16 -295 211 -81
11158.7 -81 -294 -206 -210 -173 -27 186 332 146 169 -57 141 218 -259 140 -280 -218 -108 3 -230 -115 105 -243 -21
11139.5 -21 1 188 266 -379 -97 176 -111 336 118 155 229 -184 -386 140 -14 -229 -271 -352 182 -161 -446 280 -199
11120.4 -199 -94 -377 -48 -167 -343 156 90 167 -101 143 -44 119 138 326 -275 -183 262 -303 -63 -91 250 -374
11102 -374 58 -81 358 -63 -207 28 -323 118 -101 -216 -164 328 2 -514 6 -319 -30 129 -68 64 -219
11084.5 -219 -79 -107 -118 -51 -84 -142 -43 104 229 -569 -187 200 13 176 -194 -208 296 37 119 -135 166 -277 77
11065.4G7K1j59q2J04K89qk41K02j95N5K7k39jL45n48M31k76K66k28L1J78q5m4L6J93
11044.6A49J1k37l12Q86n18K87l25j27M1M62n28N10k62j90K09Q5n18n6O82l05k59K45
11026.2g0n3K42m76K61J40L20l89Q1J91j95N0Ok78m8M53k87J53m53M97j73K50m77M40
11007.1A85k48n7j29j55N06J62j52k71o0N17j61m23j4N99o82M55J3J8j16pQ1q9J00
10987.9G2J16o55O55m2K04n37N70p12O33k78L8k1J61l39q6J53K56k24Q0j41L6j47l4
10968.8b42R7P9L19l06k38kpL01k34K63j77l32K62j34K79r2K5M87n07j63K55K14j84
10949.6c7k41J76J07k64L58q9j12R5k26J67Q1m20M57j67K2l71K61L56K6k14m8L12m25
10930.4a96L91n77M30m02L29j23J27J31j84J61j21j12M1L35O7l35pp5J61M08o72K95
$$ plain form
11065.4 77 98 -61 -143 -39 250 242 1 203 8 63 90 -149 -150 195 -353 78 -198 68 -160 -129 49 -36 -80 -44 149
11044.6 149 160 -77 -389 497 -21 266 -59 -186 -145 317 -211 299 37 -153 56 141 -377 -433 249 -56 -315 -70
11026.2 -70 -123 119 -357 -96 44 364 -25 56 247 52 102 108 -170 -218 235 -52 101 -352 145 -28 222 -255 185
11007.1 185 -63 -120 -249 -404 102 264 112 -159 -219 298 137 -286 -300 299 -383 72 85 103 -13 -20 61 -28 72
10987.9 72 188 -467 188 146 350 -187 383 -329 304 26 64 43 204 -135 -221 -68 188 -36 44 -97 -61 -208 -242
10968.8 -242 -145 -66 253 -53 -291 -293 -300 1 -233 30 -147 -479 -217 -351 -72 -164 -139 348 -159 -322 -67 147 -37
10949.6 -37 -278 -102 5 -259 99 10 -102 -7 -233 -66 15 -405 52 -115 -93 -464 -203 153 179 -35 -83 229 -196
10930.4 -196 195 -382 48 -354 -25 -148 -21 110 -74 87 -34 -146 -105 230 297 -38 -45 -120 41 449 -223 72
10912.1G2k18pm1m6j27L61n6q4K7O4J53n4N9l57J14j43Q4L45m2p5n69N03l3Q7kj92
10890.5a77K64PJ62j78J6L95l47m46K37J30p9n0M78o45J06K62N2j60j66kj90J60j92
10871.3c63J07J92R1K29O7j80j36N39o26P9N6k76K67j00J07j40j69o1K1J65L12n7j32
10852.1hk19K34j70Q5M9J82l49j69K28k08N27k24J02Q1n34N02N0j56j55M20q04L63
10833.8a73K41J46m41R6J13M2P3rk80K96Q8l44J54J92l68N4O3rr6n5K80J69j25r5j40
10813a28L61l09j43K89k67j47J35RJJ05M39l20p0r5J96L5l87J85K06l45M18K14l19
10793.8F3J27k19j45N8L40j15L01m31k1K89j91j27L75J66m10k94M61j95K41l75K21
10776.3A19k50J70J83o9j21l64J03rN64m99J18J9m26M25L8j24lP9j81R0M82j08n8J97
$$ plain form
10912.1 72 -146 -153 -194 -240 -367 -6 -62 -146 -119 -55 98 44 103 -254 -140 -283 -199 146 104 29 -540 -37 -70 17 15 -177
10890.5 -177 87 94 256 78 94 489 142 -304 -67 63 -16 -66 412 -233 -127 135 187 27 -139 -141 -331 -171 -363
10871.3 -363 -256 -64 27 256 323 143 7 546 -80 -1 55 -221 46 -54 53 -87 -256 -317 -296 -131 181 124 -8
10852.1 -8 -227 7 -163 -78 -29 153 -196 -365 -137 -345 182 -42 60 141 -393 109 159 3 -152 268 -536 -173
10833.8 -173 68 214 -227 -131 -18 24 97 88 -192 104 192 -152 2 194 -174 -120 -57 -66 -162 -217 63 232 107 12 -128
10813 -128 233 -76 -219 70 -197 -344 -209 -200 -199 -94 345 25 -45 -140 56 91 -296 -111 95 -250 168 382 63
10793.8 63 190 -29 -174 -116 224 109 410 -21 -42 247 56 -71 304 470 60 -234 227 32 273 -102 119
10776.3 119 -131 39 222 153 32 -332 -229 -238 326 -173 -55 -36 -462 -37 1 -123 -126 -47 -228 -138 344 236 178 375
10756.3C75k58l31M18k81M2j65K28J52r2k49M96n46J41K20p0l99N61l62L24o64L71
10738.8h9J23k61K92k9k63K97k70o2K68M7m1K89n04O6J89p1J28j0j00k70K10Q2n0m11
10718.9d40k4J65K28K60K83n51j91O60m68j07MK60j27k68N02m00Q1L60k77L12o26M43
10700.5G9k06K03K3M7P1k1k27j29J58jj32J93L40n67O2R5k60L8j33K17J07K43n89J29
10680.5b60R8J57k64L15J79r8j26j51j18L27q6L09m22j66N59k78L8j37L10l12J46m78
10662.2d58K81L75P2j36k87J09j44J51l07L46j27N0J13k00j14J45p8n9K87R6k04j43
10643.9b32L84j3k0nm98l6k9L11J79k71L9K67O3k21O4m3PJ00L6l31L01J4r5L43k91
10623.1B3k32k13K38J80l49o0K36K41k46l3L22r6N1J77m72N93o45L90m75M07l86L09
$$ plain form
10756.3 375 117 -214 204 -77 -35 -200 28 180 88 -161 335 -211 -70 150 80 -319 242 -120 204 -460 -89
10738.8 -89 34 -227 65 36 -227 70 -200 -262 6 53 12 301 -203 -137 52 -19 109 99 -1 -271 -61 21 -29 -440
10718.9 -440 -464 -299 -71 189 472 -79 -270 390 -78 -185 -181 79 -48 -316 186 -214 -133 227 -50 262 -364 79
10700.5 79 -127 76 99 146 217 196 -31 -160 -2 -3 -135 58 398 -169 -107 -12 -272 -234 -367 -150 -43 200 -389 -260
10680.5 -260 -162 -5 -269 46 225 127 1 -150 -268 59 -27 282 -140 -306 253 -25 13 -124 186 -126 20 -458
10662.2 -458 -177 198 270 134 -153 -44 -188 -37 -344 2 -125 -75 38 -162 -276 -131 -209 -268 19 115 -89 -232
10643.9 -232 152 139 119 114 -384 -420 -449 -138 41 -230 -191 76 139 -82 -18 -61 -54 46 82 -249 52 66 -29 314 23
10623.1 23 -209 -422 -184 -4 -353 -413 -177 64 -182 -215 107 11 62 239 -233 360 -285 105 -370 37 -349 -40
10604.7d0J8M58m87j78J40L7M1j96K83p7j18n6r0J84K20Kj90J58k24P0j58J31Q5J01
10584.7A14l68J61P0J27m00N10k99J32k54L32J28l10J19j35j7L02n78K87l4L27j14
10567.2A00J8j42N5k1p2j45P5J99m81M01M51k25k27J7K1n6N8J83j79J78Ko9k90j13
10547.3b62N81k85k80N19p27N89j5j73L5n9J70q7k00K52j46K04l66J12R8n3K10j6k82
10528.1a81K27m63N38R3k62J2j31J34j84L71l56o1L36l4J49n60L62O9j69j25J38l45
10509.8d42L58K73k22k00N7M15j89m05P16o74j04N45k25J79j22l07N97n78N00J15l15
10492.3b8J27J07R8k74j33Q9J84l14J61K16n63N89k69J18m54qM37k20j60J43J6J72
10473.9C4K2k13J73l64L14K88l69K86j09p5P3k02K25r1R0K7k32l3M52j28Q5l47o5M12
$$ plain form
10604.7 -40 -22 436 -51 -229 -89 -52 -11 -207 76 -1 -119 -175 -265 -81 139 141 -49 109 -115 -45 -203 -72 13 114
10584.7 114 -254 -93 -23 104 -296 214 -85 47 -207 125 253 -57 62 -73 -90 212 -366 -79 -113 214 100
10567.2 100 118 -24 31 10 -62 -207 -132 67 -414 -13 438 213 -14 3 24 -32 26 209 30 208 210 141 -149 -262
10547.3 -262 319 34 -246 273 -454 135 120 -53 -18 -77 93 6 -194 58 -88 116 -250 -138 -40 -93 117 101 -181
10528.1 -181 46 -417 121 214 -48 -36 -167 -33 -217 154 -202 -263 73 39 188 -372 -10 59 -110 -235 -97 -442
10509.8 -442 -84 189 -33 -233 -176 239 50 -355 361 -313 -417 128 -97 82 -40 -347 250 -328 172 287 -28
10492.3 -28 99 206 304 30 -103 -14 170 -144 17 233 -330 259 -10 108 -346 -354 83 -137 -297 -154 -138 34
10473.9 34 56 -157 16 -348 -34 254 -115 171 62 -13 60 -142 83 -8 82 109 -123 -156 296 168 253 -94 -159 253
10454B53k79m60K29k6K82N6L3P7k86k7k49J80L25k40K15k4J32j94J3l5K85m49L26j02
10434C5m9J03m2L06m57p2J13K92j97N6r8nj20o9L27K38l89q9q8L53j60k9m2k69J40
10413.1b12Q0R9O1k57O2P29q00l3K29M7j66J24m9k29M33l77J51K38k48j13N3L24j40
10394Fp2q8J75k93N62l73N62m01m99M48R1k51K32K6l00n5J14l47N76k28k5K80l11K28
10374E7j81O56m10l76j17O92m91J74k21J91L54m67K17J82p11M06l86O60o67M20K25
10356.5B07l19J05k00N5n0K89k7l5j95M44o29K21l3P3R0k4M0k01O57n78M9N47l72n2
10336.5F2J41k89o2L28j43j12j66M94J4p1n44J13M64l11M3J26j91L3m48L73Q6J13r4
10317.3d1p2J76k24P4n7J9L38m84K86N2J25L7l56k20N25m45M67k00J44m6m14L69j38
$$ plain form
10454 253 -26 -486 -257 -283 -1 55 88 165 -121 -148 -397 -217 108 -132 83 59 191 -3 10 -25 260 -189 137 35
10434 35 -14 89 47 353 -104 -176 -63 229 32 88 -10 -15 -135 -204 123 361 -28 -117 -205 148 -12 -41 -83 -352 -212
10413.1 -212 -132 -33 28 -229 -167 562 -238 -271 -42 5 -161 -37 -86 -315 118 -259 -108 130 -118 -231 -178 146 6
10394 6 -66 -154 21 -272 290 -83 479 78 -421 27 118 -133 99 125 -175 -230 -116 -463 113 -115 -140 140 -171 57
10374 57 -124 532 122 -254 -371 321 -170 4 -217 -26 328 -139 78 260 -451 -45 -431 229 -438 -18 207
10356.5 207 -112 -7 -207 -152 -202 87 60 25 -170 274 -355 -134 -167 -94 -4 -28 12 -189 468 -110 -61 486 114 62
10336.5 62 203 -86 -148 180 37 -75 -241 253 267 196 -348 -235 229 -82 -39 87 -104 -71 -519 -146 -60 53 -41
10317.3 -41 -113 63 -161 -87 -144 -125 213 -271 15 67 192 229 -127 -347 178 -267 200 0 144 98 -316 53 -85
10298.2h5L5J77J54k77j19K22j0j82J27n07L70j9L32n82N49k19K26K23k28k83K08q3
10279.9B9o6J04j40r4j45K95j51r6M99m98N68m95j58M11j66lJ79j67M13o55K00J60
10261.5B4k35J84J70k13K59J04m44k0J29l31J82L02m63K88m7l3J37K68k66j45j72M22
10243.2A00j93k3J61M4l18k77M46k8K86k31j55k42N26j35L3j1L5R0qj73k5J04j54N05
10223.2C57m61j38J07No4M76l55L90k33R8l05M35K4n71M04L2n54M86j24l43R6r7K00
10204.1a35k90L57K1J10J98l72K94J46n47n3L34J70k29K25k58k07M29J35m50L45k41
10186.6a8l5P8k24O67o56j69K14Q8K0j02L04K20j96k06k25K03j26P0N02n29j70M89
10168.2A99k16k28J70l74K82K35J01m84r8M26K69j08l4P2l08L64k46k53J57J95j78
$$ plain form
10298.2 -85 -50 127 281 4 -115 107 97 -85 42 -465 -95 -114 218 -364 185 -34 192 415 187 -96 112 29
10279.9 29 -37 67 -73 -167 -312 -17 -168 -264 235 -263 305 -190 -348 63 -103 -106 73 -94 319 -336 -136 24
10261.5 24 -211 -27 143 -70 189 293 -151 -171 -42 -373 -191 111 -352 -64 -111 -144 -7 261 -5 -150 -322 100
10243.2 100 -93 -116 45 89 -229 -506 -60 -88 198 -33 -188 -430 96 -39 -6 -17 18 108 100 -73 -98 6 -148 357
10223.2 357 -104 -242 -135 -130 -194 282 -73 317 84 182 -123 312 336 -235 169 201 -353 133 9 -334 -238 -335 -135
10204.1 -135 -425 -68 -47 63 261 -111 183 329 -218 -271 63 233 4 229 -29 -236 193 328 -122 223 -18
10186.6 -18 -53 25 -199 468 -188 -357 -143 -55 -35 -137 167 387 191 -15 -240 -37 -163 -93 409 -120 -290 199
10168.2 199 -17 -245 -75 -449 -167 68 169 -315 -413 13 282 174 140 212 -96 268 22 -231 -74 121 -57
10150.7e7j87K01j37K59j32q1L57j73N8l74J29M5L1J34l80J60J64M9Tjj6j66j20M8
10130.8a40J04j26K08Q4k33K7j46o1K42j81K85p3k02J01kP8M09k30j28j61q4M13k6
10111.6A58k01k64K83o9L6l1lK23q4j86K6L76n06Q4L58k79J29k9n7P4k5k78K24O8J5
10090.8D2j03K33j02K53k66j04Q9r8k24K70J80n3q6n8p4l78L79o9M74l30L63k37J33
10071.6B34k13J34l15O7rL80m75J47r4J01j7J61M2j31L7n2J01O2j30l48L60j06Q1L24
10051.6C41l87L29q0J22m29K80k41P4l34Q3K39j78L86j32j41J7K14k06K03k99L7K56
10033.3A54k68J55r6J94l4o6l66K83k54N80j78j02k14L83k68l40N68N7k85L05m80P00
10015D28l4l88J09n14K06l1K55NJ46j25L8r7J06l19J86j77L38m7qM3O8J91m43K47n39
$$ plain form
10150.7 -57 -244 -43 -180 79 -53 -134 223 50 108 -266 -137 -92 -61 73 -307 -147 17 66 115 114 98 -68 -188 -140
10130.8 -140 -36 -162 46 130 -103 -76 -222 -283 -41 -222 63 -10 -212 -111 -113 -35 374 144 16 -145 -229 184 158
10111.6 158 -43 -307 -24 -93 -57 -88 -91 132 48 -138 -112 264 -242 -158 200 -79 50 21 -36 38 13 -265 -41 27 42
10090.8 42 -61 172 70 323 57 -47 42 -56 -280 -10 170 117 31 -27 -101 -479 -100 -169 305 -25 338 101 234
10071.6 234 21 155 -160 -93 -102 278 -197 -50 -144 -43 -60 101 143 12 49 -3 98 160 30 -318 42 -64 17 341
10051.6 341 -46 283 203 325 -104 176 -65 9 -325 -242 -3 -181 205 73 -68 -51 163 -43 160 -139 -102 154
10033.3 154 -114 41 -55 139 105 39 -327 -44 -298 282 104 2 -212 171 -97 -437 131 188 -97 208 -272 428
10015 428 394 6 115 -399 -193 -224 31 36 182 57 95 -2 104 -215 -29 -206 132 85 77 120 188 379 -64 183 -356
9994.1c56k23P63l91L53m5qk53J10R6k6j03O7K5J23l97L27K7k29L38m36O1J61K33K85
9974.1E02n91N4j7R8mL8k76J80L52k94p5k45Q9J49n1M39l15k47O88m26j27K66L09m99
9954.2cj98O61k17m64P4L75k33j02N17k13l55k14K63o1rO2J16o10N48J13j16J09p6
9935c3o4J46o8j1o7p6P1L94k11O0j54K2p6k18M35j2r3p7o0K73l6l91M67m94K10r2j92
9912.5c47M92k75L94n67N91o03J98J95j42LO3J7J27r7J2J35j58j7m55L09j1R1K5L47
9892.5C27k26j01O8q5j81L6K81j78p7n7K79Q9N8l92K03j85J39l3j57J92M3J44k26q
9872.5d7K13k58L63k82J50l18okK0R2L67l61J35k26P6K13j41k75L71j79Jj39L60Q8
9852.5B15k78J59j58r1K85k23j47L9J61j06K41K57l89l83J21Q8j08J54K21k71L59l74
$$ plain form
9994.1 -356 -579 184 -207 146 101 93 -160 -50 46 20 -83 -16 9 132 -265 62 89 -140 198 -238 -177 -16 217 502
9974.1 502 -89 -35 -52 46 42 80 -196 -16 336 42 -33 -278 -189 -40 -91 348 33 -214 474 48 -79 187 496 -3
9954.2 -3 -201 460 243 -221 -147 228 -5 -107 410 197 -158 -372 -109 -170 -179 -117 -1 -611 -63 50 -66 43 -33
9935 -33 -97 49 -19 -30 -97 -173 -102 292 81 141 -13 9 -67 -285 150 138 45 -32 -92 181 145 -246 221 -273 -63 -155 -347
9912.5 -347 145 -130 264 -303 288 -315 -117 78 -64 -61 2 19 146 49 61 196 38 21 -434 -125 -136 -45 -20 327
9892.5 327 101 0 68 -17 -198 -162 119 -59 -136 -193 86 175 233 -159 44 -141 -2 -35 -192 0 43 187 -39 -47
9872.5 -47 166 -92 271 -11 139 -179 -185 -187 -167 -75 292 -69 66 -160 -84 129 -12 -287 84 -95 -94 -233 127 215
9852.5 215 -63 96 -62 -153 132 -91 -238 -199 -38 -144 97 354 -35 -418 -297 -209 -317 -163 58 -213 146 -228
9834.2b28j24m7O04k76M32k35j31k6K4j60L7K72L6j60k49l9m3M27j13j00q3L70k99
9815a11N8K77j32l62L64J10l32o1M1k2N7q6M42k95R8p3j0p9J37K9J84n22K10L31l03
9794.2e0J9R2p7j30j72K12O2m8J53LP6l20O13o21J95k2J70J2l01K82l65Q5J1rr9q7
9772.6c16J29M82n56P2J78J54j72Q3o2K53m30r0L2K28K56m40J71K12k74j4j5N0j52
9753.4b21P9J73k21J89j48j72N36j65k11N8N9Kn6K8L36j20j72j17J97Mk29K51l35K97
9733.4D2Q2r6q6P3l5p2J07k45K71O3k11L80o54K56K98l3MM4J83m96L02k98M1J94K8
9712.6A42kj2k00P7J6p9J86p3K77m61J11j03J77J55J22m00N0K61m13K39j16J16J67
9693.4B37LJ8m66L23j89J96l27K82k93J39n7J54K69j66lK92k9m87j54M89o2k41L79
$$ plain form
9834.2 -228 -352 -399 205 -71 361 126 -5 -31 -7 -167 -130 142 178 18 -231 -270 -313 114 1 -99 -182 188 -111
9815 -111 -53 224 92 -270 94 204 -128 -189 -148 -170 -113 -199 243 -52 46 -27 -37 -116 21 50 234 -288 -78 253 -50
9794.2 -50 -31 61 -16 -146 -318 -106 -44 -92 61 64 140 -180 433 -188 7 -15 155 167 -134 148 -217 -132 -121 -130 -229 -316
9772.6 -316 -187 295 -261 -189 -11 143 -29 54 -8 245 -185 -275 -243 -15 241 -199 -28 184 -90 -104 -119 -69 -221
9753.4 -221 -142 31 -190 -1 -149 -321 215 50 -161 -103 -44 -42 -98 -70 266 146 -26 -143 54 58 -171 80 -255 42
9733.4 42 124 28 -58 15 -20 -92 15 -230 41 104 -107 273 -381 -125 173 140 144 188 371 -125 177 -121 -80 114 142
9712.6 142 140 128 -72 5 21 -58 128 55 332 -129 -18 -121 56 211 333 -67 -17 244 -169 70 -46 70 237
9693.4 237 240 258 -208 115 -74 122 -205 77 -216 -77 -134 20 289 123 120 412 383 -104 -258 231 169 -72 307
9674.3C07j31k35q1J13J00j83m9L05lj08l12M60k33K9M8L42k66l7r1j93M35k38K8k43
9654.3b36L03m0r0j15j01N64k39j9j58LK6M09m76K50n3J24j56q5M16l40L17o15O40
9635.1C29k17k77K82L8k5m59M91l54K58j88k3M83j53m22L83l8Q0l90J46j36J07l7O2
9616f0L04m1Q8o71L17l80J442j036J12k64K89M9n79L13L39k79o3M1q5J82m9k2k76K08
9596a21J53k92K48k2K11m82N52l63j24L45j40k29O68r6m1l05j24TJ23n5K02MK56j11
9576A33k11j79R1M18n97K76Lk25L38m3l08O04m42l71M49o0j12J01j66J94J90L83k59
9556.8B07j59N4l9M6j82K09rm29M16k61L96l68L2J50j69M0q0Tj2K02j03J90j32k88
9536.8c69L66l34K09J8K12j59j9M0p1Pr5J38k43m1J24J38L73j33J5l88M04j84PJ46
$$ plain form
9674.3 307 176 -59 -140 -27 73 -110 -159 146 143 35 -277 183 -50 -21 27 369 103 66 -25 -218 217 -21 7 -236
9654.3 -236 67 27 -63 -178 -279 285 46 27 -131 -128 -102 307 -169 81 28 152 -4 -89 327 -13 304 -311 329
9635.1 329 112 -165 117 155 130 -329 162 -192 66 -122 -145 338 185 -237 146 108 188 -202 -56 -192 -85 -122 -60
9616 -60 244 203 291 -380 -63 -443 999 -37 75 -189 100 149 -430 -117 222 -57 -120 -79 -164 18 -31 -53 -329 -121
9596 -121 32 -260 -12 -34 177 -305 247 -116 -240 105 -35 -264 404 308 267 -38 -162 -286 -163 -218 -16 -12 244 133
9576 133 -78 -257 -166 252 -345 -69 -66 -291 47 4 -304 300 -142 -513 -64 -124 -236 -135 -301 -107 83 466 207
9556.8 207 48 102 63 109 -73 136 127 -302 114 -147 249 -119 -87 63 -106 -66 -146 -226 -238 -36 -139 51 -81 -369
9536.8 -369 -3 -337 -128 -110 102 -57 -76 -36 -107 -100 -195 -57 -300 -341 -217 -79 294 161 176 -212 192 8 15 161
9516.8A61j93j43O4J55j68O5M3l3J73k81N2Q2K22q5J42l91K06k58K86o6j7l1k5p5R1
9496b4m8n3q6K6M8j95L97l27K17r6K28j38k16J88O04n46J69J0l27J71O2j24L9K07j59
9475.2B7k43M09J34k71j40m7J87k81j53N34k36K95k03J0J19j91K08l83L12n2m7N5r6
9456e3n3j59M34l90%L90J25m26K11k20J09q8J15j12J33K01k64m96N83n19M95J03QJ0
9436A37l76R6q7J41j21N2O3L5j66J37m0j0J07J5J88l00P6j87M41k71p0K85J45l5j73
9415.2H2Nm93M15m0k5j61L22l8l19R1j8K11k25j5Q0J84J29l47K68k34j37R0R4L09l70
9394.4a42K79l7k04J3J9L6J72j01J42l90K61q8l31L61j82l3O7K41l81J83k37J01J61
9375.2i0R6k3K07j37K3m26P5L22j84j0J83r6j52M32l59L50n05L52k80M18Pj98L23j71
$$ plain form
9516.8 161 -32 -175 -111 44 -124 -59 -16 -49 124 -157 -105 -23 199 114 256 -135 71 -187 99 33 16 -15 -40 -115 -24
9496 -24 -72 -125 -211 -185 -137 -332 65 -262 -45 -141 87 -51 -267 -79 525 -21 148 158 -169 2 64 -60 -21 186 27
9475.2 27 -216 193 327 56 -84 -131 56 -225 -378 156 -80 215 12 22 141 -50 158 -225 87 35 -12 43 -53
9456 -53 -106 -265 169 -221 -221 169 294 -132 79 -141 -32 -120 -5 -117 16 217 -47 -543 40 -479 16 119 127 137
9436 137 -239 -143 -230 -89 -210 -158 -95 -60 -226 -89 -129 -139 -32 -17 171 -129 -53 -240 201 -70 -140 145 290 255 82
9415.2 82 87 -406 9 -31 -56 -217 105 67 -252 -161 -179 32 -193 -208 -128 56 185 -162 106 -128 -265 -175 -81 228 -142
9394.4 -142 137 100 -104 -91 -72 -36 136 35 177 -213 48 -40 -371 -10 -192 -225 -158 83 -298 -115 -352 -251 -90
9375.2 -90 6 -17 190 53 76 -350 -275 47 -137 -147 36 -60 -212 220 -139 211 -294 58 -222 196 203 5 328 157
9355.2A57j00j11k50M95l28J04j91M25k25j99K29k01n8K21l28M71r4n2J13j52k21l2
9336.9c27J94L0M2K10j4jl53K32n1R6K29j29k36L08j72J93j30k46J33k1Q8m62L19j09
9316.9a77L34k80Q4Q0o2m0k10K02K15j72J31l64N7N81m00p8pj43M28j88jj32L57j87
9296.9B8K0l19j06L82J36j10j50J14j36k21J63M99L2j60r3o1j0k18K31r4k4J50K65
9277.7C18n29K87N3k53n9M29l58j12P8L32n0k06r7J33J76k01M7J02o5P4k89J65j43
9258.6a68K10j09L60k38k05k63J67M40k92R1j99M27l92L27k3j51R7j98K64l63LO2q0
9239.4b33J1R7M9J74J84m12K76m61M41l59O8N82n82j44O27m59K41n8m17j8Q35n35k68
9220.3c61L24K41q5l44J11j15M32j38Tk38M90l56K95K73n74N1J45L03k30l10M20j48
$$ plain form
9355.2 157 57 -54 -304 191 -137 -33 -224 201 -24 -223 6 -195 -253 -32 -360 111 17 -35 78 -74 -295 -327
9336.9 -327 -133 -103 -61 149 135 134 -219 13 -38 58 287 158 -78 230 58 251 121 -125 8 -13 75 -387 -68 -177
9316.9 -177 157 -123 -39 41 -21 -61 -271 -69 146 -26 105 -259 -202 379 -21 -99 -106 -249 179 -9 -10 -142 215 28
9296.9 28 48 -271 -377 5 141 31 -119 -5 -141 -362 -199 300 332 172 79 18 8 -210 21 -73 -97 53 318
9277.7 318 -211 76 129 -124 -183 246 -112 -224 -146 186 136 -70 -167 -34 142 -59 -12 90 25 99 -190 -25 -168
9258.6 -168 42 -67 293 55 -150 -413 -246 194 -98 -7 -206 221 -171 156 133 -18 79 -119 145 -218 -215 -153 -233
9239.4 -233 -222 -125 -76 98 282 -130 146 -315 126 -233 -165 417 -165 -309 318 -141 100 42 -375 -393 442 -93 -361
9220.3 -361 -37 204 119 -225 -114 -229 203 65 -73 -311 179 -177 118 391 -183 -132 13 316 86 -224 196 48
9201.9D8k7j17J84j30l4K92p0n46N33l64M62n44N51l11j32L32j48N7k66J06J58o3Q1
9182.8E2k11N8N3j07J2N03l42k18M20l1m88M81l3k62J62m8J22j86q6q4q7J89l4L03
9162.8A38m25P4J92J07j15K02l65L49k64n1K08J38l62L67l83j7K78k40P9M6p9J00j14
9143.6a37J64M4N3m9m3k64K68J36l38p0L38j41k74L14J37j23Q4L4l32K45k16K36p1
9124.5elk63j52P92k65r4j3J68Q7k69j01j31n2N69m98k89P69Kj39L1j79k39N69k59
9104.5C6J23j54m44M29MN9K27N7pl90Q1j18J58q3q2J3O9J49l56J1K01q7L5j46L61n42
9082.8c96M94j36J04k6O4k17R7N4J52l30N37k65J81p52M46m22L95J12k30J05NJ00J87
9063.7B59m66L98n04K53Q9j54Q4J08j72N9r1lP4N0m63M80P4m43N54l12O6j21K77J14
$$ plain form
9201.9 48 21 -96 88 -42 -76 216 146 -400 133 -231 231 -313 238 -73 -205 127 -21 36 -230 -124 34 -29 52
9182.8 52 -159 -101 -48 -155 -143 360 18 -200 220 189 -299 182 149 -113 49 1 123 -63 -149 -233 -320 -131 -165 138
9162.8 138 -287 -213 -21 86 -29 173 -192 157 -107 -158 50 188 -174 193 -190 -207 71 -169 -90 -44 -123 -23 -137
9143.6 -137 27 71 124 75 32 -232 36 172 -166 -236 102 -39 -313 1 138 15 99 133 -199 46 -170 66 -5
9124.5 -5 -8 -271 -423 369 104 10 -3 165 252 -17 -118 -249 -301 268 -230 -519 250 252 113 144 -35 -274 295 36
9104.5 36 159 5 -439 -10 -6 53 280 337 330 -60 21 -97 61 -22 -104 -91 -22 127 -229 -218 -17 -104 -69 -215 146 -396
9082.8 -396 98 -38 66 40 104 -113 -16 38 190 -140 397 132 313 -439 7 -415 -20 92 -138 -33 -28 72 259
9063.7 259 -207 191 -313 -60 29 -125 -41 67 -105 -46 -137 -140 -66 -16 -479 1 75 -368 186 -126 -60 -181 96 210
9043.7B10Jl15K65J55l02J78j25q0K86l64j00M4j57R9K86K43m26m4L03N6k29M8R8j59
9023.7b9L0n0K8J22j00j56J59o6L34k32O7K2m35P0J38N6L10r1k08j60J53K64l34K48
9003.7A40k36j65K27j03j77L95k28j10L66k78J79j14L16l19N8j93M49j31k98K23r9
8986.2i8Q7L30o56M90l01J37n6j27M8K19o8m29O37l12R3J75k19L7M51o85M02m6J68
8967B77j51j1k19L92k41J1j64J56p5j23l8J98j07k4J70j34K35P9m92J08M5M43k43r6
8947dJ42j15l17L52Q2k46J10J3k23R4J64k14L74n8p0j41K15m01K32K0k14L92k17k64
8927.1b94L69j30J30q1K09K6l53J01k66L86l17K62j06l64L91o8K81l21K22K9l00J06
8908.7h8Q8K18m9k62J69k49j45J31q1K38m6j39M16n37M10L3j99m1k6J24R9m11K36J27
$$ plain form
9043.7 210 211 -104 161 316 14 192 67 -13 273 -91 -191 -147 -304 -205 81 324 -102 -146 157 213 -16 32 130 -29
9023.7 -29 1 -49 -21 101 1 -155 4 -62 272 40 107 129 -306 -236 -98 -42 268 177 -31 -191 -38 226 -108 140
9003.7 140 -96 -261 -34 -137 -314 81 -147 -257 109 -169 10 -104 212 -107 -49 -242 207 76 -222 1 -98
8986.2 -98 -11 319 -337 153 -148 -11 -67 -194 -146 73 5 -424 213 -99 -6 169 -50 -13 438 -247 155 109 277
8967 277 126 115 -104 288 47 58 -106 50 -25 -148 -186 12 -95 -119 51 -83 152 231 -261 -153 -108 335 92 -4
8947 -4 138 23 -294 58 140 -106 4 17 -206 -112 52 -162 212 154 84 -57 158 -243 -11 9 -205 187 -30 -294
8927.1 -294 75 -55 75 -6 203 229 -124 -23 -289 97 -220 42 -64 -428 -37 -105 176 -145 77 106 -194 -88
8908.7 -88 0 218 169 -93 76 -173 -318 -187 -268 -30 -76 -215 201 -336 74 107 -92 -133 -159 -35 64 -347 -111 16
8888.7A6l91L26o0j00J28L4R4k94L51J94o77M65j79m5M5o8m5L52j33J28k66J37j41
8869.6a29J15j94L65l58K64m12M58j27J18k87J61j43M35j20k25J34j97K46j03j90P3
8852.1a16L0L04m63L23m14O90l18j00N3l7K69j46Ko2n46L31K88k00J99o2k05L6m5M8
8832.1a41K3J5j00RJ69R3J40l04K49n2J50l60l5J37J05k42K04O4k09K5j62k7J12j80
8812.1c17L24k11M59j84J47j64M7j08j81J22K5k34K22k7k01J29j83L77j44J14J34l28
8793.8a82K30m27L60J46O1r0m60K34k19L60L84l82o4j56K07p9K23j59k13j34K87R6
8775.4B3l01M6K69j31J1m5j40O38l05J13l89M30m43K69K75m02j11RJ92k15K22J44k64
8756.3a05M4K56q8TK42ll41K80l92J52m3K74M0l79L29l00j3K39j00J99l55J12q9K30
$$ plain form
8888.7 16 -375 -49 -109 -209 -81 -47 47 -247 104 298 -379 86 -93 -138 -93 -161 -206 146 13 141 -125 12 -129
8869.6 -129 -14 -208 157 -201 63 -349 109 -18 100 -187 -26 -169 266 146 -79 55 -142 104 1 -189 -116
8852.1 -116 -86 218 -245 78 -336 354 36 -64 -11 -48 221 75 77 15 -531 -200 88 -112 87 25 -180 -144 -189 -141
8832.1 -141 -118 -103 -203 -194 -25 68 208 -96 153 101 251 -109 -144 -7 98 -144 60 124 -85 -60 -222 -249 -137 -317
8812.1 -317 7 -204 255 71 218 54 101 -7 -188 -66 -41 -275 -53 -80 -281 -152 -335 42 -102 12 146 -182
8793.8 -182 48 -379 -19 127 188 98 -362 -128 -347 13 397 15 -49 -205 2 -77 146 -13 -226 -360 -73 23
8775.4 23 -278 -232 37 -94 -83 -128 -268 370 65 178 -211 219 -224 45 320 -82 -193 -184 8 -207 15 159 -105
8756.3 -105 -61 195 107 19 261 258 -83 197 -195 -43 -86 188 228 -151 178 -122 -135 104 4 203 -152 -40 -129 101
8736.3A01l38L09J43n19M32l8K0m29L00PK9k05K71Q0j00J79m07L42K8l5J58m40K4J77
8716.3H9J40k63J08l88K61LK82k07K4K6N5m24L61k1j26J42J15p2p9q5K30j92J40l22
8696.3b03L49j14M7l0R1K7l85O8J00K40j09p4R1m43M88k07k8L31l31O69n62k49L48
8677.2A14j9j23r0K64l9j84L02l96N4L00Jl77L63m45L47L76l29M3n75M36p8m5K05k37
8657.2a32K63J35k75P4j52K30k30j75K45J06l9j73K84l14n2L17J8l13J64O5r9K44j3
8638A78j50l21J05L1N99l56K8J26k24k87L22j95K30K08m98Q9%k43N60J23k95j4j64
8618.8a48j33j12J85M4P0j29J79p0m9N7n4k68L25n3N22k53k99L8J12J60j73J54j49
8599.7d4J79j79L1k09L35l30J98o9pM1M6j49J38k09J91N3O0K66l23j13j56lJ49L05
$$ plain form
8736.3 101 -237 72 215 -304 128 90 110 -319 -19 -12 17 -188 83 163 63 242 -165 177 205 170 328 -112 -88 89
8716.3 89 229 -34 74 -314 -53 -50 232 25 49 75 130 -294 67 46 -80 62 177 105 26 -59 171 -21 119 -203
8696.3 -203 146 32 79 49 140 167 -218 -150 -50 190 81 7 98 -345 143 -64 -92 239 -92 577 15 -234 114
8677.2 114 95 -28 -118 146 107 -77 225 -171 -117 183 184 -193 170 -275 72 448 119 162 -413 23 -55 -100 105 -132
8657.2 -132 131 266 -9 65 -87 143 -87 -262 -17 89 50 -123 161 -153 -205 112 130 -183 -19 46 -53 191 178
8638 178 28 -293 -188 -157 442 86 114 240 16 -271 51 -144 86 294 -204 -115 -115 -358 202 325 30 16 -148
8618.8 -148 -281 -393 -208 -164 -94 -223 -44 -114 -163 -106 -160 -428 -103 -156 366 113 -186 -148 -36 124 -49 105 -44
8599.7 -44 135 -44 -13 -222 113 -217 -19 -88 -95 -54 -8 -157 -19 -228 -37 16 76 342 19 -94 -250 -253 -104 201
8579.7B01j34k13M84l80j88M82j80K16K3k82j57L70l30j49n6M79l88R5K46l03JK81
8561.4A18J50j84j52M46k81J07j5j97j53J74k9Q7k0k34O2J01k16K03R1l1n2j56K75
8542.2I4Nk03qoL59n18J07K55k49L85k04K59j30J05j88J09Q3l85o2L00m01N1J79J18
8522.2E5j41l0O5L67n84L24Q8j52O3k58N03j90J34n39J49J41j23r8J72K32r8q4J94
8503.1A90r3K54l74p8M61k53j40K28k46r5j50O17n30J2PK13r3l1q2J64m7J57j82q2
8483.1a73J74P9k38K28M4k72J33L80l12J31n47N9J47L03j18K6k58N31l61O2N26n40
8464.7DR3Q5J00L23M65N418o577r0j12L30k73L93j80j04K80l17R71r19OJ92n3M0p4
8445.6Aj2p0J64n05K38L70m16J10k16%J90N48n07J72j45KJ15Q8O5l33L19k82j00K49
$$ plain form
8579.7 201 67 -146 338 -42 -230 252 72 288 311 29 -128 242 -88 -237 -293 186 -202 -107 139 -164 -163 118
8561.4 118 268 84 -68 378 97 204 189 -8 -161 13 -16 71 51 -183 -121 -20 -236 -33 58 27 -25 -181 94
8542.2 94 99 -104 -112 -118 241 -277 -170 85 -164 221 17 276 146 251 63 172 255 -130 -192 108 -293 -242 -63 55
8522.2 55 -86 -116 -51 316 -268 56 144 -8 55 -203 300 110 244 -295 -146 -5 -128 -226 -54 178 80 -4 190
8503.1 190 97 351 -23 -101 360 107 -33 195 -51 -146 -296 321 -209 -197 -190 23 -70 -101 -183 -19 -66 91 -91 -173
8483.1 -173 1 80 -158 70 114 -158 -25 355 43 174 -373 -314 -167 136 18 44 -214 317 -44 18 544 4
8464.7 4 97 182 282 605 1070 6488 -89 -179 -291 39 -234 159 -21 -125 155 -162 809 -110 -104 88 35 75 1
8445.6 1 -11 -81 83 -422 -184 186 -230 -120 -336 -336 -146 402 -105 67 -78 -76 39 127 192 -141 178 -104 -204 45
8425.6D5k44J23p0k16K39K22j69J83k52J75m14J87J32K68m70r3K65P2OJ3rM8k82L09
8405.6F8k15J88l5M2j46j42LJ60K63l99J71n5M6mK37k27r7J14l0j32L55j68L9j22J22
8384.8C6n8j13q0K56o62N65j35K74l7l30L4L3K35L18m57%l1k05N06k18K9P6k51R6n5
8363.9a74r1K17R8k07K74l16N18m47J30k73L7M82o31M16l26j78Q83k32J44l06j5l7
8345.6c4P1P5k6j72p7N57l02k40m2L5J89l33M23k19J57J27k79J69l4K0J29n06N49l94
8325.6a57K71j11J23m20L36j17j1Q5k04r6o0M23l06J96N6k05K95M02l83j58Q7j65P8
8306.5d1K2K16j76k73L36m08L70k30L10m49L23N2k94L8L9j17P5R6M53J8m48K21j92
8287.3e9J6j51P7j2K16l23L34J3M7k94J47j19j07M83l06j68L97n46K11L50n32MK12
$$ plain form
8425.6 45 -199 -76 -146 -362 -123 99 -70 113 -139 36 -378 -191 -59 209 -261 -354 -89 -17 -11 2 -7 41 -241 68
8405.6 68 -147 41 6 48 -98 -240 -237 -77 186 -213 -42 -97 -51 -55 182 -45 -142 -28 -58 -190 165 -3 36 -86 36
8384.8 36 -22 -135 -215 41 -621 -56 -191 83 46 -284 -250 -217 18 336 -121 -121 -152 -357 149 -69 -40 36 -215 -119 -174
8363.9 -174 -265 -48 50 -157 117 -199 319 -128 2 -271 -234 248 -383 33 -293 -471 412 180 324 18 3 -34
8345.6 -34 37 112 86 -86 -163 394 92 -148 -190 -155 34 -299 124 -95 62 189 -90 79 45 65 194 -312 237 -157
8325.6 -157 114 3 126 -294 42 -75 -86 -1 -205 -301 -361 62 -244 -48 8 -197 98 500 117 -41 46 -119 -41
8306.5 -41 -19 197 21 -252 84 -324 46 -184 126 -323 0 52 -242 -204 -165 -282 -207 -111 342 360 -88 133 -59
8287.3 -59 -43 -194 -117 -129 87 -236 98 111 158 -136 11 -108 -215 268 -38 -206 191 -355 -144 206 -326 -322 -110
8268.1a10Q0R9j66N9K32j03l48M98r9j54J2J04l89L43m05M43l65M44j31k5j11M1j64
8249b15k65N97k7po8pj80k6J01K95m9l41J14J49J12k78j12L14l29Q4L25k71K00m11
8229b95N98m21k5K25n84L88J66k90J08J77P4l51K42O4k3j21M5N9j4J66m25J23j07K61
8209D0K18k37Kj59J16p2K34m08j11L71r6r8J97RP0r7n15L85jK05k26kN3J43q1p7M87
8186.5C50l93JP9j14O6k67L42j37J48J07o5j82J96j50J15l72L24j06l43N46k75J63
8168.2C3L4P2j98j28j79K98K04j11J95m30R8J78p8m8q2J66J09k30J30K46q9l46j04
8149b60M12k39K30q3m18J78K59k19Pn0j29K42K16l36j05L58O6k0j27l71O47l23J1L50
8129B96L7l25J58k30k4L09k03J2J10l32L77l52J03j06J96l5K2j51M13k06r3Q3j99P2
$$ plain form
8268.1 -110 -30 69 -97 -38 194 91 -257 241 142 -12 0 104 -285 58 -347 96 -269 175 44 19 -92 -51 -215
8249 -215 -480 117 90 83 15 8 -172 -198 -97 198 149 -192 -78 71 183 -95 -207 107 -222 -138 187 -84 116 -295
8229 -295 303 -118 -143 82 -502 -114 52 -238 -130 47 121 -230 12 76 53 -68 -23 36 22 188 -237 -114 -221 40
8209 40 258 21 23 -136 -20 -92 142 -266 -377 -6 -102 -200 -3 6 76 -21 -536 -151 -152 53 -173 -175 -122 21 -60 -137 350
8186.5 350 -43 -42 37 -77 -11 -278 64 -73 75 182 117 -65 131 -19 96 -276 48 -58 -401 145 -130 33
8168.2 33 67 139 -59 -187 -366 -68 136 25 220 -210 -112 66 -12 -60 -142 24 133 -97 33 279 190 -156 -260
8149 -260 152 -87 143 60 -358 -180 79 -140 -133 -183 -312 -70 146 -190 -295 63 129 109 -18 -389 258 -65 -54 296
8129 296 333 8 166 -64 -88 221 18 30 140 -192 185 -167 -64 -170 26 -9 13 -138 275 69 -24 59 -140 -68
8109f8J46k01L88j16j88J20j00j91J41K24J5j20R8J41m47K77k23M92n39r1K21K17k94
8089.9i8J96j03L28m97j49R5L49k79j60K81p6k3K82k88J03m8K26m70J40j79K58k93
8071.6d05O14k28Q6O2J01l93L94m61K69K11l70J29J40k45K27j96j9nrJ30j93j73K43
8052.4i1K31k02R3r1J68j05K50J31m29j2j7K9O9K40m45R4j42j2N60o55N12l24K87J93
8032.4C32p42N83j34J20k38K20k62K38k33K40n45L92J60j47M51m82K48j54m80O90l20
8014.9f3Q0j90J45N0j72K03n0K2M6p6l37N10l82K73k03K64K18o09K96N0j15K28l06
7995.8a18L10l88K07k54J95j11P8J8m7kK05l1R8N1l4m44M89j30K1j23J07O7N1k48O5
7974.9C2l77K19M4j75L99l87L13k9l0K69m62K26P2R5l36J80o0P3K71m93K7K32j60o3
$$ plain form
8109 -68 78 -123 265 149 -39 81 -19 -210 -69 155 170 50 148 289 -158 119 -104 388 -151 -242 -21 196 -98
8089.9 -98 98 -5 323 -174 -323 -228 121 -158 -318 -37 -113 -136 146 -142 -39 -87 139 -331 -191 -370 -112 -405
8071.6 -405 209 -19 67 129 230 -163 231 -230 39 250 -120 9 149 -96 131 -65 -84 -89 -98 32 -161 -334 -91
8052.4 -91 140 -62 31 -60 108 3 253 384 -45 -57 -74 -45 24 264 -181 -87 -229 -241 319 -336 176 -148 139 332
8032.4 332 -410 173 39 159 -79 141 -121 117 -116 124 -421 -29 131 -16 435 -47 201 47 -433 257 -63
8014.9 -63 17 -173 -28 22 -150 53 3 25 71 -5 -342 168 -214 59 -144 120 338 -271 25 75 -40 188 -118
7995.8 -118 192 -196 11 -243 -48 -159 -81 -63 -110 -112 93 62 160 211 177 -267 222 92 113 -10 97 164 215 -33 32
7974.9 32 -345 -126 -82 -257 142 -245 68 39 9 278 -184 42 114 209 -127 53 -7 66 337 -156 -129 103 -57 -120
7954.9a20k17K54q4L70k31p3K15J26l20O3M2k23P8M4k4j36K63l8K70j46rJ22k88J42
7934.9H0r8j82M1K03M5j28J79o09N13k01n5L42j75K53m5j05k90l73N27M11n62QJ26
7915.8i5J59p5k7m1K8j32k1K30N8k68R1L35m30l0K96r2L0K0j16J88l81N5M47k50L36
7895C15o51L17p3q4m9O1J71K37kk60o3J22j16Q9K88o02K90r4L33k24j94k8Op3K21J65
7873.3A02l06K87k12J18K77j58N6j48j36K26k12l2J4L47j89J7l19K5J00M04k33j88
7855a60N6L12l53j8J18K08k62k2K86L0k70L21m42N14n26l5L51j7j50J11m8k3M9j15
7835h5m1R4mK16k11P7k75L75j11l4J01l85L55r0j39K53j6k59J57N9O6j29j28K83r9
7814.2C0n0j07K29k80K05K6j51J5J59j80j73N32j80J9P3m38N45j70j26k6J9j41J74
$$ plain form
7954.9 -120 -337 -83 -167 203 -28 -101 114 240 -80 -17 25 -198 -120 -76 -100 -236 27 -11 259 113 104 226 -62 80
7934.9 80 -18 -200 -159 44 89 -39 140 -469 44 -157 -212 130 -45 208 163 58 -232 -605 -78 333 -229 -221 -95
7915.8 -95 64 -11 -38 -79 -51 -183 -204 26 84 -184 -93 242 -188 -218 78 -14 16 36 -80 108 -273 -218 229 -21 315
7895 315 -336 -19 -92 -176 -225 -164 7 244 242 -18 -81 41 -75 14 302 -300 -10 -104 229 5 -189 -217 -211 -284 -63 102
7873.3 102 -204 83 -129 -11 266 108 164 16 -120 106 -106 -138 -124 223 34 51 -268 -243 -143 261 28 -160
7855 -160 -104 208 -145 -163 -45 163 -99 -121 165 195 -75 246 -196 318 -208 -243 108 91 -59 52 4 -19 30 -85
7835 -85 -126 -32 -36 180 -31 46 -229 146 35 1 102 -283 72 -18 -157 96 80 -179 -22 37 103 -26 -154 129 30
7814.2 30 -20 -127 102 -178 27 53 -98 -83 76 -104 -277 255 75 94 167 -271 274 104 -22 -48 -29 -170 4
7795DL9o6K70l76P7OPl04M89l28J39R5J43k20K73l57J02K50q4K7n91L85j59K58K5k14
7773.3a10K39J34k26J47j11j45J46p9l58K38O2j03K62J62n67M69j40k54K54N4J05k39
7755f0q2m7k03L55M0J17k39j16M89m0k79j05K57o3O7m5p7P9k7J67J34l42Q1j18L48
7734.2B91k69K65k58j88J69L03o6n37L10K49m20J86O3m42O11l61J1K18P2k69o5R0J9
7715a8j78L58l28L9k73J70O53m42L8L0K41j93p9r6M12l75k41L05K55l34O5K48j98R5
7695A54m32L82j67k69J82K69r2j58Q6l01R4K25j87J61K2j98K33j02J80k68j93L10O9
7675.9@j22J29J20j50M8qj4l03L69L5j2l20K86o1n1k4L43m25M6p1P18l90l9k29Q4Q1
7654.2D0K25l30J06Q4j71J50j60p8J93o5k63K77o9k26J36J20L7J40j45J16k18j01K42
$$ plain form
7795 4 43 -23 247 -129 -52 -46 -39 -343 146 -182 -43 52 195 -25 248 -109 -7 243 159 186 -405 -20 -179 79 104 -110
7773.3 -110 129 263 37 184 73 -72 74 -5 -363 -125 -63 -166 96 258 -309 160 20 -234 20 74 179 -60
7755 -60 -142 -189 -392 -37 3 120 -119 -235 254 214 -65 -170 87 24 91 46 -31 48 21 188 322 -20 61 -57 291
7734.2 291 22 287 29 -159 10 313 247 -290 20 269 -151 35 98 -344 267 -94 -83 135 207 -62 -127 -37 -18
7715 -18 -196 162 -166 -127 -400 -230 423 -19 19 49 290 97 18 -78 334 -41 -282 23 278 -56 9 257 59 154
7695 154 -278 104 -63 -332 -150 119 27 -131 -45 -346 -252 -27 -214 -53 -31 -229 4 -98 82 -186 -379 -69 0
7675.9 0 -122 7 127 -23 25 17 3 -300 69 104 92 -228 58 -3 -54 -78 265 -160 -114 -185 533 143 104 -125 -41 40
7654.2 40 265 -65 41 125 -46 104 -56 -134 59 -6 -269 8 -61 -287 -151 -31 6 146 1 117 -101 -202 40
7635.1D0j5q0K05K93n13K51l00p2J85n5l30K91j21N84m42K06l5p7o9J18J16m22M42
7615.9B00j77J03Ol17J19l99K05M06n6K8l20L26k23O7j29J91o9J08k09p1M40k05J54
7596.7A78k12l18N67n05L96j6r4J9k87K17M6j2o8M18l94J8L0K12j45j36J5K8r1L0M38
7575.9C34o39O28p24K44p6r4M13j01J13l57J32J21j17K01k51K8L12o8m5K43l29o8Q6
7556.8a4N3K9j85k14J93Q2R5j65M47l05r7o4r6j0L44q6Jk7j41m2Q4L36n27O12m03K19
7535.1A19j79j86m3J48j68K32m6K42J1J90l62K92M1l07P5o0k72J46r9L72m1J68l56
7515.9h3L36J53m43J95j33l06Q8M31j03j31k89M13j92j69N69l71J68k81J61j52qJ57
7497.6A0J38L16q09P5J06J52Q7J07p4m2k33K18Q9k10J52L6m1q7K31l84K06J29k52J36
$$ plain form
7635.1 40 25 -55 150 443 -70 181 -119 -191 -6 -61 -391 -100 -221 363 -79 127 92 15 -54 64 180 -242 200
7615.9 200 23 126 132 -185 -66 -465 -260 146 90 118 -202 124 -99 -32 -161 30 -39 69 -140 -211 229 24 178
7596.7 178 -34 -352 215 -290 106 90 -4 15 -272 -55 -9 -21 -89 329 -65 -47 -17 195 50 -86 -71 -43 -134 -104 334
7575.9 334 -305 323 -401 -157 -233 -327 86 -15 98 -259 -127 -6 -123 78 -173 -145 167 99 54 297 -32 -100 -14
7556.8 -14 39 68 -117 -331 -138 -56 39 -126 321 16 -81 -145 -241 -251 93 7 8 -19 -160 -202 -118 218 -309 303 -100 119
7535.1 119 -60 -246 -289 -141 -309 -77 -123 119 130 320 -42 250 291 -16 59 -1 -273 -127 -226 146 105 273 -83
7515.9 -83 253 406 -37 158 25 -281 -193 238 135 4 -285 128 -64 -233 336 -35 133 -148 13 -139 -147 10
7497.6 10 148 464 -345 -270 -164 -12 75 182 108 66 -167 51 140 -70 82 118 77 -10 221 -163 43 172 -80 56
7477.6E6n6j75L5l20J58K22K03j39N0J04k31p7K30n1l97O79m72J93j16k8L10k49R4
7458.5B3k76K36J41l71J77j25J94K63l83j6J45k9M6o2L0M4l99L24j62K92k22P2k2K44
7438.5A64l30mJ70P8R9l11r6K96k02K18r0Ml46J42K15J05k22q1l31N30O9j75L11j80
7418.5C3j84J10Pm6j45J46P2q0P8J39r9O5j66l26M20J17o6N1P3l76J28q0j12o9K84
7397.7b6j12l40L09o9L9J49L20k89J19k96K16j90M40k88K44J59n59NL60l21N1J78J86
7378.5B85l08o6J36j32R0K22j05q2l13M05J43j38l13J90l27kK55J34o44L14M87k12
7360.2A9k93K88l13L38k77L5L86l19J78J2l14J60K89k90J08j07L41k6m88J80M2J64
7341.8A13k02K77l26k03K22R4k58M45j01j21J3K04n11M65p2k5J68l68J66J6Q2k31P
$$ plain form
7477.6 56 0 -175 -140 -460 -302 -80 123 -16 34 138 -93 -170 60 9 -388 291 -181 12 -104 -132 178 -71 23
7458.5 23 -253 -17 124 -247 -70 -195 -1 262 -121 -137 8 -21 25 -37 -7 37 -362 -38 -200 92 -130 -58 -80 164
7438.5 164 -166 -170 0 78 177 -134 -230 66 -136 82 -8 -4 -350 -208 7 112 -110 -191 -522 8 77 -98 213 33
7418.5 33 -151 -41 -34 -80 -225 -79 -7 -87 -9 130 31 96 -70 -396 24 141 75 126 199 -177 -49 -129 -241 -310 -26
7397.7 -26 -138 -478 -169 -238 -199 -50 270 -19 100 -196 20 -170 270 -18 226 385 -174 -169 191 -130 -79 99 285
7378.5 285 -23 -89 47 -85 5 227 122 40 -273 132 275 137 -176 14 -313 -315 -60 74 -570 -256 231 19
7360.2 19 -274 14 -299 39 -238 -203 183 -136 42 54 -260 -100 189 -101 7 -100 241 215 -273 -93 -51 113
7341.8 113 -89 188 -138 -341 -119 -25 -283 162 61 -60 -47 157 -354 111 39 14 182 -186 -20 -4 78 -153 -146
7322.7a46J05j0J50j45j98L01k2L2M1k09K21j64J86j50j36J22j60N7PN7R0K00k23o5
7302.7e9P1j67J44j95J22L47m53N23j13j95o3p0L12m32R0q1R5m4L36l26J43L22n87
7283.5b80K75J63k49K24j67L23j82k44j4J96k54J70R8m4p2k8l1K20L2j27J50j11j31
7264.4h3K8J28k20J33M84j04n12J63j6l27N02j45J05l79K9K17N5J90k12l6k59L6J38
7245.2h5Q4l50K81K20m2j4l14J08k88L14j02L35K49n75K41j79M33n23L11q9k42J68
7226.9e9J43J2j36K29m59L78j68n4j78L53m13O26j53k75M23m38L10j77J44p9p0K38
7208.6A97j61L1j97L51r0L8J05n76R9J89o8m9J16j04J98p0J6k59L44j31j37J10j80
7189.4b28K23M6L46j70k90J24J52j84J35j64j29j42L97l4J26Nk43j58L76Lj06J07K4
$$ plain form
7322.7 -146 -41 -51 99 -46 -244 57 35 67 108 -101 120 -44 142 -8 -144 -22 -182 -125 -118 -61 29 229 6 -59
7302.7 -59 12 -155 -11 -206 -84 263 -190 333 220 25 -38 -108 204 -228 -138 -219 -124 -168 168 -158 -15 307 -280
7283.5 -280 -5 158 -91 133 -34 289 107 -137 -151 45 -209 -39 59 15 -57 -85 -116 104 136 9 159 48 -83
7264.4 -83 -55 73 -147 -14 470 366 -146 17 1 -326 176 31 136 -243 -214 3 58 248 36 0 -259 -223 -85
7245.2 -85 -1 -351 -70 150 108 94 -220 -112 -400 -86 -188 147 396 -179 62 -117 316 -207 104 15 -227 -59
7226.9 -59 84 96 -40 189 -270 108 -60 -114 -292 61 -352 274 121 -154 269 -169 141 -36 108 29 -41 197
7208.6 197 36 67 -130 221 131 169 274 -302 -203 -14 -82 -131 -15 -119 79 9 25 -234 110 -21 -158 -48 -228
7189.4 -228 -5 41 387 217 -73 51 203 19 154 -10 -139 -281 116 82 208 213 -30 -188 188 191 85 192 216
7170.2B16l74JK42k14j83K24k5N7J6J51n0J37m88l6L48L35n63N16l16Q5j80K3lo3M23
7149.4B79o05M20n0K38l98M46l09O1k87J21r4K71l22j22M64l76K49o1J58O6k95N00
7131.1C54j84o1j07k1K40l16P1L5L29m49J15o6J4k68L45j9k13L2K92l82K52L07m02
7111.9a02r4k5L8L90k91J68j03k27J36kK05P5m02K91j61m5L45n5j92K71j24L35l53
7092.8G8l36L09J2n3k78J40L06l10K3L59q9k05J51m7j81J27q0J9J29J32l51K49l3k48
7072.8a77K23Q5K68l42L4L8j07j04R8L5n7J00o4j40p8j2j40K39R7K33j51m22L11j23
7052.8a56M21n06m0M71l02M8J10m0nj46M83o15M23J5N0l66J65J26k63J72j63L69p1
7033.6A80o23M65j00k03O89J4k56n74L55k6k55L10ql0Q6j31K08j60L7J31M9k38K03
$$ plain form
7170.2 216 -158 -157 85 -129 -312 -88 -113 -56 -40 111 61 198 -290 -326 22 357 -206 310 -6 79 -101 -78 -81 -144 279
7149.4 279 -326 94 44 282 -116 330 21 82 -205 -84 -178 93 -229 -351 113 -263 -14 -75 83 149 -146 354
7131.1 354 170 109 2 -19 221 -95 -24 11 340 -109 6 -60 -46 -314 31 12 -201 -169 123 -259 -7 300 -102
7111.9 -102 -196 -221 -183 207 -84 84 -19 -246 -110 -112 93 168 -234 57 -104 -149 196 141 -51 220 96 431 78
7092.8 78 -258 51 63 10 -268 -128 178 -132 -109 250 161 -44 107 60 -121 6 -74 -55 74 206 -145 104 71 -177
7072.8 -177 46 131 399 57 91 129 22 -82 16 51 -6 94 30 -110 -188 -200 -340 -101 -4 229 78 -344 -33 -156
7052.8 -156 265 -241 -281 190 -112 -64 46 6 1 -145 338 -277 146 161 211 -155 10 136 -127 45 -118 251 180
7033.6 180 -443 22 -78 -281 408 422 166 -408 -53 -79 -334 -24 -32 -62 24 -107 101 -59 -22 109 158 -80 123
7014.5A23l8Q4n1L7j4j14l02M03m0R3m38K8L59l78J20Q5K32m95K31K94j57k28N9K09
6994.5A02p3J02M1N5k32J68j83J24k43J27L6j41J027o24r8k31N2L7l72O25l63J39j09
6975.3c4O6R8l80j9L04j2M1N5j5j58L20m42J35L6l39L07J24J06m25L91o14L83J35p0
6955.3gN3j47K53k70J74m0O4j50J17j5J05l49L21N3n03L96j77j56K29j10K17J36q1
6936.2A13m5l3j27k5K40R2k30j04J31o6K7O96J2495j2407n91k41J26k4p0o4j52O16
6917.8C57j04j46o6q3k10J53j44K40L58k69J79n69L31l4k63N7J76r3J15n4N6J12m54
6898.7c55N18j91Q4j81r7L46k34j54L95p5j39J10j62J6m8k4K13J24p8P4k10J02K21
6879.5B55k82J20k32J28m1k87L07J0J67J00l72J27j68L1J96L46l11k69K85k08J11j05
$$ plain form
7014.5 123 85 169 118 155 141 27 -275 128 88 181 -257 -229 130 -248 -128 -43 189 -306 -75 219 62 -166 -107 102
6994.5 102 29 131 172 227 -5 163 -20 104 -139 -12 24 -117 910 286 188 -43 9 46 -326 299 -64 75 -34
6975.3 -34 32 130 -250 -269 35 23 64 119 104 -54 266 -176 -41 -5 -344 -37 87 193 -232 159 -455 -72 63 -7
6955.3 -7 46 -101 152 -118 56 16 80 -70 47 32 137 -212 109 162 -341 55 -122 -278 -49 -159 58 194 113
6936.2 113 68 35 -92 -117 123 215 -15 -119 12 -54 -27 669 13164 757 166 -75 51 27 -43 -107 -259 357
6917.8 357 253 107 41 -42 -252 -99 -243 -3 355 86 265 -304 27 -7 -270 -213 -37 -130 -15 -69 -13 99 -355
6898.7 -355 163 -28 56 -125 -222 124 -110 -264 131 56 -83 27 -135 -119 -167 -191 22 146 68 142 -68 34 255
6879.5 255 -27 93 -139 -11 -52 -339 -32 -22 145 245 -127 0 -168 -137 59 405 94 -175 110 -98 13 -92
6861.2i2m4J65j31j27K60J49J81l60j3m9L2j70m3K09J23K26p43M62J25k67rl26N6J71
6841.2b15J23J73l1k75j32K92j01j2K97l48L65m42L91q0j43m5Q2oJ44j79J59j44J79
6822E2Q7q1J89j33K6l23K63j13K42j97j4O9k59K49J94l67j33K27J89l90J40l3J71j35
6802.1h0j30J21J70m3k68J01J37j06L15l21J5J24j02M11m93J94J34l43J51k85N08k69
6783.7e9k4J25l57L11K33j72K69m60r0L28r4J76j62q5l22J38M49m62J14J21j87o4L59
6764.6H5P0k57l89O98N2j87j62J04j18J78p1j80N1J60k22nJ84j32J45N3p7l6k72L09
6744.6a9r2J55J1q5r4J93J2L42l45Q0P5l59M14p5J4l19Q3j43j57K20R5j95J75M6l48
6723.7c16j18K37j12J90RR4J16J47m61L58j02l54K27J40Mj01J88k2Q3l03J84n9J53
$$ plain form
6861.2 -92 -136 29 -102 -229 31 180 361 1 -12 -61 -29 -199 -242 -33 90 316 -427 35 160 -107 -116 -442 -386 -215
6841.2 -215 -92 81 50 -225 -357 -65 -166 -178 119 -229 136 -306 85 5 -138 -183 -101 -107 37 -142 17 -127 52
6822 52 139 58 247 114 140 -183 80 -33 209 12 -2 67 -192 57 251 -116 -249 -22 167 -223 -83 -116 55 -80
6802.1 -80 -210 -89 81 38 -230 -129 8 -98 217 -104 -89 35 -67 344 -149 45 179 -164 -13 -298 210 -59
6783.7 -59 -83 42 -315 -4 229 57 326 -134 -224 104 10 186 24 -61 -383 -245 204 -258 -144 -23 -210 -274 85
6764.6 85 155 -102 -491 207 259 72 -90 14 -104 74 3 -177 -126 34 -188 -193 -9 -141 4 57 -20 -56 -328 -19
6744.6 -19 -111 44 55 -30 -124 69 81 423 78 158 233 -126 288 213 227 -92 -9 -152 -309 -89 6 -189 -14 32 -316
6723.7 -316 -434 -197 -309 -119 -110 -16 100 247 -214 144 42 -312 -85 55 59 -42 146 124 207 -96 88 29 182
6704.6A82j84R5j98K21r0j71n6J37L30k03k08m5L9p3J52J04kl07M02K3q6m67K03Q7
6684.6a15L12j28o8M99m70j72Q8J4m4M4J50k56M41m99J86k57L86o1n7J05rJ41m28J55
6664.6d3M3j84J47k24J29J97k79Q5J6M19o25L82q8l63M35k48O74o40J09l65N51j52
6646.3b4K3l6P9p8K86k48J57k51M02m83J20k10K9M23n73K72R2J15n1o5K8J86k85K58
6626.3A66j91nq3N2J93Qk74J77k0k42K07Q7j04K32r8k93o5J48K21k44j41J26M40j37
6606.3A60k74j0K68k64J39j6j94LK74j29j37J13J50n9j63J25K57j38l57M83k33k59
6588b61J32M34l26N1Q4Q3j73Q3k0K51m21J01M9K69k60mj3m6J77l27L93j84j44K58j03
6567.1H3J04Kl12L78j42l28J30L50o9J4k45q8l0K29j26o0Q9J96o34J62K34K2j21O6
$$ plain form
6704.6 182 -2 93 -105 116 26 -145 -201 -64 266 63 -145 -190 -151 -224 -72 32 30 -277 125 148 62 -405 -202 -115
6684.6 -115 197 69 1 500 30 -142 -54 -40 -84 -40 110 -146 295 -204 -18 -275 111 50 -7 98 89 230 -198 -43
6664.6 -43 0 -184 -37 -261 -132 65 -214 -129 -113 306 -319 63 -25 -388 47 -201 473 -167 -58 -423 128 -24
6646.3 -24 -1 -37 42 -36 250 2 159 -92 310 -173 -53 -263 -234 189 -384 -112 -20 95 44 -21 7 193 -92 166
6626.3 166 -25 -30 -113 -61 132 140 -134 43 23 -219 -12 75 -29 203 105 -188 -253 -105 116 -128 -269 -143 297 160
6606.3 160 -114 -124 144 -120 19 3 -191 -188 86 -43 -180 -67 83 24 -139 -14 243 105 -252 231 -2 -261
6588 -261 -129 305 -21 30 114 197 24 107 87 338 -83 18 67 336 76 72 59 13 190 -137 256 72 -72 186 83
6567.1 83 187 189 -123 255 113 -215 -85 265 196 210 -35 -123 -153 76 -50 -110 -21 175 -459 -297 -63 -41 -162 -96
6547.2i6N1Kj91P7o7n8M6N78k91j39j06J01L47k74L44m19J25m7k81L02J73pk61K21
6527.2A30j82j93R4J42K4K5r8J62q2q6K76j05n25N26j06J7j89j50L66ol04R7K39k45
6507.2a73L55l22k52P51l50k3q5K93l50N3K38l3n6J28k0n2J41k11j77J30N4j17K4J39
6487.2H5k11J96J22m67K33j9PK3O3j95MJ64J35k50L4J15m5M35k95j28J39o7k38J46
6467.2a4J46k71J76O6p6P3k46n1K42K2j20M1M08j96m57L74J41j03Kl21J17J15P9M1
6447.2A88l35L5K84k59lM3l7j43J88J39j1m1l09J15K87m2l39J54K11j70Jk5J35k78
6427.2b12O4M51l56L01m18M0M31k98j27L74j47j51J70j78Pj21L60m06K68L9K54m77
6408.9a32L99l15K81j44k56M0K97j32m0QP3J00p5r4N6l10J3K87l24J3M60l10J21N4
$$ plain form
6547.2 -96 -45 -43 -234 -157 -224 -282 -236 342 51 -88 -194 -93 254 -20 324 -95 30 -17 -298 4 177 170 -91 130
6527.2 130 -52 -245 -151 -9 15 40 -58 104 22 -64 212 107 -418 108 2 19 -170 -320 46 40 -264 -167 72 -173
6507.2 -173 182 -140 -392 359 9 -14 -99 194 -156 -103 135 102 46 174 154 102 243 32 -145 -15 39 -78 -54 85
6487.2 85 -126 70 192 -275 -42 -61 -54 -31 32 -163 -159 5 140 -110 -76 39 -6 429 134 6 145 78 -160 -14
6467.2 -14 132 -139 37 103 27 100 -146 -197 45 67 -53 -12 396 200 -257 117 258 155 157 -164 -47 68 147 188
6447.2 188 -147 -112 172 -87 -90 -47 -84 -227 -39 100 89 48 -261 -146 141 99 -240 -86 125 -45 -44 -69 66 -212
6427.2 -212 -148 303 -53 248 -170 -130 301 3 -124 250 103 -48 122 -56 -49 -170 190 -216 52 91 345 -132
6408.9 -132 267 -48 233 89 -167 -127 170 38 -2 6 79 179 104 10 66 -244 -231 56 -268 -255 205 -105 16 70
6388.9G0J57k16j46M04q4k60L07k83J62m3J44j24j47j53M18L6l31j34L59J69o08M81
6370.6A78j99j46P2O3M06m07k43K29J89k24o5L46k44j44M43l49J70j0pj35P4l07M09
6351.4I9L17l95M5m9P6l36L39R4j55m27J06R3N3K01k05j52K88J74k23O2k76L86l87
6332.2b72K06M12m30M10l25N74m93J45o5k64L34j17M9k92K9K17m13N33j8j16j46O9
6313.9B7k08M7J64j42J10R9j11l10L28j5RK63m57M35m83M19m66M2N24l06TL16%K17
6293.9A96n2j65K79l15J05p2K1r1l48L91r2K46j68q1M94k29n8j40J74K0j41J56O3j46
6273.9D7K7k62M17l18O8K60l13K65J38l42n9k43M17o4K3p2j31J3J18O7l76J50K19J24
6253.9A73j15J46j28k49Koj62K24Q1q8r3M12k34J21j66J81j124Q57N17k32o9K32j13
$$ plain form
6388.9 70 227 11 -135 269 185 -75 232 -51 111 68 212 88 -59 -212 206 242 -89 -223 136 305 -303 178
6370.6 178 -21 -167 -95 -32 374 -33 -276 -47 142 -82 -147 199 -45 -189 254 -95 75 65 58 -77 -3 -310 99
6351.4 99 416 21 66 17 93 -243 96 190 35 -392 -286 -193 -140 61 -144 -296 -8 166 -57 5 -271 115 -272
6332.2 -272 -66 346 -84 326 1 575 82 227 162 -102 232 115 164 -128 -99 118 -295 238 220 104 -42 27
6313.9 27 -181 -134 30 -112 -2 97 -14 -324 4 -11 -2 261 -196 239 -244 175 -291 -249 275 -31 -337 -21 -21 196
6293.9 196 144 -21 258 -57 48 -24 -3 -94 -442 -51 -143 103 -65 -146 348 119 61 -79 95 115 -26 130 193 47
6273.9 47 74 -188 229 -89 -21 239 -74 191 329 -13 -72 -315 102 38 61 -11 -142 -129 -11 56 -320 -170 49 173
6253.9 173 58 204 76 -173 -171 -177 -339 -115 -34 -122 -215 197 -37 84 -82 99 -1025 -168 349 117 48 280 167
6234.8A67o2q1j29J85k65L12J73p49Q26m93O3N4J8m4j65L82q7j88Q8r8j39K92l68R9
6214.8b09L50j5m38K21K89J5k21M9N3L2m62K30K4J6K18j21j32J89k39M57m95N53M1
6195.6D05o51J53K58J94k93k0J12l41L45n3m21K62l05K57r0L33r0j47K83l86j78M68
6177.3I5P9l44M43m49MJ85Q1R03q60QL81l95k20L26l3j34R6n40J95J11K93k54j92K97
6157.3G6j96J75N9n0N8j6Q2j02n0K7N3J0k08j65L91M9k30Q5k40K23J40L8l63R5K48
6136.5A89Q2k04r9l64M59J50j3j48n0j9J22PM4L4M4j29k20L40k88r1K70k33J4O9j40
6115.7a74M55j77j9k98L78Q6k32K2j75Q2J77m51J80J83k09j8K37j34L4j04m3K79k44
6096.5a65N17k57k67K65L3O5J00k64J98N60K554J9391j9577j605r01m68RQ4j78M05
$$ plain form
6234.8 167 105 24 -105 80 -185 127 300 -449 377 -116 -53 1 19 -25 -190 192 105 -83 5 -93 -232 60 -308 -209
6214.8 -209 141 126 -312 -91 198 213 -8 41 94 126 -336 -106 -82 -66 152 31 -101 88 -151 306 -189 364 405
6195.6 405 -246 -93 165 359 66 46 158 -183 162 109 -312 -50 -355 -98 -188 145 55 -92 191 -195 -373 95
6177.3 95 174 -170 273 -176 -172 13 94 997 137 145 526 131 -89 237 204 70 166 -374 -179 -68 225 -29 -221 76
6157.3 76 -120 55 114 64 122 106 188 86 36 63 116 126 -82 -247 144 193 -37 48 -192 31 171 209 -154 -59 189
6136.5 189 271 67 -32 -396 63 213 200 52 2 -17 105 112 156 190 234 105 -115 225 -63 -154 116 -117 -103 -34 -174
6115.7 -174 281 104 85 -213 165 251 19 41 -134 -52 125 -326 -146 37 -172 -190 47 -87 -53 -157 -200 79 -165
6096.5 -165 352 95 -172 93 126 191 291 27 225 785 3339 22730 3153 1548 647 179 188 272 94 499
6079.8D99k2O92j142K10k19J61l53N39l16l1n47O02K25k65Q8r9N2j55L7K49j25j0J3
6060.7H3nj20k42K86J06K2j52r9j85O47o61M97j23L87k79J19R8k95q2j48K91P66q05
6041.5A06o6m7j10j09K35j08J75k82K32J38n9qj1r4K12k24jo3J06j96K14L9j81J01
6021.5aK24j95jL2N5k25J77J84m06j76J57M01l08K53k67J12kk32J51J50M1l80M20l01
6001.5a37k21K63K49l66p3L17L12j83Oj98JM4O5k55L04l43J83l02L93j86J79M8L4j01
5981.5C3J13l02k35L09J3R2J88j34o3j36K39o0j0J51j47M7j08J47l04K30p3j3k05P5
5961.5a53L15j73J57o2k00M0rN6J40k13M97j36l11N3k03Q4r4L02R2n56L31R5m90M06
5941.6c2m1K58J49k21q5j97J91J74l7j43j41l0n1J17Q6L4j38kJ00K22p2l77L02j49
$$ plain form
6079.8 499 477 1169 27 237 18 179 -174 365 49 18 -529 73 298 33 121 22 74 -81 -44 205 80 70 83
6060.7 83 78 -42 -284 2 108 130 -22 -121 -306 341 -320 177 54 441 162 281 379 84 2 -146 145 911 106
6041.5 106 40 -7 -117 -226 9 -99 76 -206 26 164 105 97 86 -8 204 -20 -21 -84 22 -174 40 79 -102 -1
6021.5 -1 223 28 27 59 114 -111 66 250 -156 -332 -175 226 -82 171 -96 16 14 -218 -67 83 124 -256 164 -137
6001.5 -137 -358 -95 154 -212 -285 32 344 161 167 -31 -30 14 79 -176 128 -215 -32 -334 59 -127 52 100 134 33
5981.5 33 146 -156 -391 -82 -69 23 211 77 14 -122 117 57 47 198 51 98 -10 137 -167 63 -10 -23 -228 -153
5961.5 -153 162 -11 146 84 -116 -76 -85 -29 111 -102 395 259 -52 1 -202 -118 -212 90 182 -374 -43 52 -438 -32
5941.6 -32 -73 185 334 113 28 -169 22 196 159 16 -125 -155 -206 -89 -3 31 -107 -109 -9 213 141 -236 66 -83
5921.6h3p3J0o0K31K08k93k02J99J97j64P9j71K50j33J83j33J46j85k61J71mo4O2L56
5901.6B66l20j15J81j85J64P4k00o6j80L39J01j06J58m13K82l89L94M8n6J86j84p1
5883.2i2J15l30K43j88J57K11l8j17q5K5o6K19J29o2l69J79K47j71j47K90N8m52j4
5864.1b58p2L45j0j10J83l73N75n49J16K14k19j34j33M39p4n3J40k54K61m3n3p8J67
5844.9B7l37K22K14M86m77J77K1l40j61L24j49L19k40k75J81J03P0j28n2k04J14K85
5826.6A80k10J68k65J42O5j31k75K29M9k83J56k57K25L32k97K3J53p7J07K04l50J63
5808.3E1k67K06J97p9m08K87J96l61J52k6J69l87L18k24j13J72J07Ko2LJ59k16K17
5789.1I3k50M23Ol65J52j76n2L77m40K67J1K07n92L32K3K1j78m4O2L45j31k46J34j4
$$ plain form
5921.6 -83 -156 -146 -206 25 233 -60 -262 -63 134 -30 49 -122 128 -5 178 45 191 6 -255 -84 -88 -152 -90 266
5901.6 266 -54 -169 12 -173 -9 65 -135 -201 -381 -42 59 -47 111 -302 -20 -409 -15 33 -23 163 -21 -92
5883.2 -92 23 -307 -64 -252 -95 116 78 -39 -124 -99 -165 54 183 121 -248 -69 178 7 -140 150 208 -244 -258
5864.1 -258 -330 15 5 -105 78 -295 280 -269 -153 61 -158 -292 -425 14 -60 -113 27 -227 34 -9 -62 -140 27
5844.9 27 -310 -88 126 612 135 312 333 -7 -168 156 7 326 86 -189 -8 95 165 37 -15 -219 -105 180
5826.6 180 -30 138 -127 15 80 -51 -326 -97 -48 -331 -175 -432 -207 125 -172 -149 4 -73 34 238 -112 51
5808.3 51 -216 -10 187 108 -300 -13 183 -178 -26 -52 117 -270 48 -176 -289 -117 -10 -8 -70 -67 92 -124 93
5789.1 93 -157 266 272 -93 59 -117 -169 208 -232 35 46 253 -339 -7 16 37 -141 -185 -123 222 91 -155 -21 -35
5769.1c5J27l71L70k96L27j80K0J13r0n2K3j0J47J34l41Q0j07J29O6m03L79j90L30
5750A70j27l77J35K7K19J84k28M4r0Q6l0n5J81k56K59j65K07k63L15j08L1n75O68k88
5730c6L18k24k65K66j25l59M23l3p9J98m55M15J48j96k11J51Q4p1r3r1J26J10o9j07
5710a75M92k78NN4k27L03l65N7J37p6j79L47k04N8j70K68J40j61n5J49l81K83J29J00
5690B51l25k5J22k9k2J33k69J27%J47Ql8l86L20p2K26j32j61L50j18k53K13j74K5K29
5669.2A47j35J87m42K74p6L15k3k75K04k75j30L50k28J17k2j8K2J03k09L00r6K9r4
5650B5J10j83m8Q8L6j86N4J05J87l31K32k02J94j35J49m08M09r4j11J88k10K70J20
5630.8B59m40j16J37RL23k31j80M87j97r4q4J87k79R1N5J29J04k20j2K65k61K65K1
$$ plain form
5769.1 -35 92 -279 91 -205 122 -58 -38 75 -15 -67 -44 -54 93 227 -114 -34 -141 -12 54 -349 30 -160 170
5750 170 43 -334 -199 -172 47 231 3 47 -43 43 13 -42 139 -117 142 -23 184 -79 236 128 159 -416 252 -36
5730 -36 282 58 -207 59 -66 -425 -2 -35 -114 84 -371 44 192 -4 -215 -64 20 -51 -144 -235 -109 1 -68 -175
5710 -175 317 39 44 98 -129 174 -191 -134 3 -73 -252 95 -109 -51 -221 47 187 26 -29 120 -261 22 151 251
5690 251 -74 -99 23 -6 -28 105 -164 -37 -37 110 118 80 -306 14 -58 168 36 -125 225 107 -146 67 -107 -82 147
5669.2 147 12 199 -243 31 -45 270 247 -28 176 -99 -229 121 -107 10 -12 -30 -8 95 -114 186 90 119 25
5650 25 135 -48 -96 -8 28 -158 -104 1 188 -143 89 -113 81 -54 95 -313 96 2 -109 79 -131 139 259
5630.8 259 -181 -297 -160 -151 172 -59 -239 248 51 -43 -127 60 -219 -128 -73 56 160 -60 -72 193 -68 197 218
5611.7B18j05J16j23K8l89M53j30j84K87m8l67J82r2M87m86J32j53N6L20j06J8l50
5593.4b36O4J10K47j2k40L9J22J08Q1l82j50K69Q0j83J87k62j55K77o5L36k92n5L82
5574.2B70l82j20P3Q6np2L23l97K13k2m3l34M08j65K36nM0q8m2L0L77m63j87O4Q2L01
5552.5A78p8k76j55P20n09j9J40J20k86L09k03K14k03j69J20q9K25k80J37O8J19J37
5534.2B20l44J53P7j17M7J78n4J10k75K50k25J1j84O9k90R8J57j45N41l33J72j73j92
5515.1b49K30R5l04m8L91J56k34p5k1Q1l23J55J51o7J1J45m96L46R5j1p0J8K32j25
5495.1H3Jq9j82J68M2K5J7l51M29M4l61L72j97O0J90n41j00L97k46R9J60k03K02J51
5475.1A70k29J90k56j34K93K9K16l98K73j97J53j73j6k1j5K54j83N3P0k98L49j96j88
$$ plain form
5611.7 218 113 229 106 134 -255 198 68 -116 171 123 -244 -62 -154 333 -153 -21 -174 -118 202 96 114 -236
5593.4 -236 -172 -62 185 173 -67 -28 94 202 283 -99 -249 20 100 -83 104 -158 -313 -36 -101 235 -57 -112 270
5574.2 270 -112 -232 -159 -73 -78 -150 173 -224 -11 -33 -76 -410 -2 -167 69 64 104 16 -26 4 381 -82 -269 -205 -123 178
5552.5 178 100 -176 -331 389 -120 -139 1 121 -165 144 -59 155 -48 -217 -97 -186 39 -241 -104 -36 83 220
5534.2 220 -124 29 106 -11 36 214 160 270 -5 245 20 31 -153 -84 -374 -276 -119 -264 277 -56 116 -57 -249
5515.1 -249 -19 76 -228 -276 115 271 37 -38 -59 22 -301 -146 5 -62 -51 94 -402 -56 39 28 -42 -24 208 83
5495.1 83 84 -5 -187 -19 23 48 65 -286 143 187 -174 198 1 61 251 -290 -390 7 -239 -140 20 -183 19 170
5475.1 170 -59 131 -125 -259 34 63 279 -119 154 -43 110 -63 -79 -100 -115 139 -44 9 79 -219 130 -66 -254
5455.9b54j8M38l90L51K52m17r2J62J58j73j04P8P9j99K43n3m0P4j43J59l5M8k34L36
5435.9B26l69J02k1J23M5l43K53N5j75O4k0j33P8J42J0l06N3M18p8J83l97k9L29m68
5415.9b58K93r8J63j70K80l24L74q7l36k9j17L27K11M0j65k31J64K01m08J77L0q8J83
5396.8A32j73K15m54K69n1QP5K16Q3r6l90K6n4L5L01k01L00k00k35K18j15J16j67J10
5376.8c2j42L09L91l94j67k3nM5J68l18M04k16J38p6n0K21j07J59l30l5M32n97J32
5357.6i3K52m58J56K41j36L1j36j78J86r6lK07J39j60l1J32j80kj17K36j16p6L30j93
5337.6f5p0J20R5l25L4M59M6r5j34l01K73J20k24J39q0j43J47J73k44j76L44j72J86
5318.5A07p1p7M8ML3k6l57L57L72k96j00m7k52L28j6rk05M55r3K5j38o2j88K05J15
$$ plain form
5455.9 -254 -272 166 -224 127 379 -38 -130 32 190 17 -87 -9 70 -129 114 61 21 95 -48 111 76 124 -110 226
5435.9 226 -143 -41 -62 61 106 -237 16 71 -104 -40 -60 -193 -115 27 37 -269 -216 202 124 307 -90 -119 210 -258
5415.9 -258 35 -63 100 -70 210 -114 260 173 -163 -192 -309 18 229 269 104 -127 37 238 -170 7 37 -51 132
5396.8 132 -41 174 -280 -11 -62 -54 21 237 320 224 -166 -140 -194 -159 142 -59 241 41 -194 24 -91 25 -142 -32
5376.8 -32 -174 135 526 132 -35 -58 -63 -18 150 -168 236 20 158 82 32 253 146 305 -25 -60 372 -225 -93
5357.6 -93 159 -299 -143 98 -38 -7 -143 -321 -135 -231 -234 -27 112 -48 -79 53 -127 -129 -246 -10 -126 -202 128 -65
5337.6 -65 -135 -15 80 -245 -211 248 294 199 65 -236 37 157 -67 72 -8 -151 -4 169 -75 -251 93 -79 107
5318.5 107 36 -41 7 11 44 18 -339 18 390 94 -6 -53 -305 23 7 -2 -207 248 155 180 42 -20 -208 -3 112
5297.6A12l16K95j35J57p1j71j90K59J90l47L63k41J47k19Q7K9K61r2m68O16k40j05
5279.3g9M1K07n4j72J97k26o4K9R4j44Ln3K18j22Q9j4K98n0M6k7P5k03k07j11P1K50
5257.7I2N1j76Q5j90j3K35J18N1j47J0j21k78o2O65l72n5M87m82J3o7p8J61k73K40
5237.7a06l7J89K3k50j89O42n04K56m9J29j21r4J34J41l2l4o9L6j25J14j83J37k32
5218.5b24N4R6%N37m26J47k36O6Q7m26K98J62j59l6J41M0k39o5j00K79L1q8J33l1K10
5197.7B51q1k41M3K96k40j32J87J13J7k12j5R1R4m75K63j1J24K2k03jk23M17o6j86
5177.7a68J46k7J63k21k5J6J37m55K31N45o87O5N23K6l18p6p1J42K52N1m59L65m46
5158.5b91K29j60K30K78j87j21p6M53l30k60J36P7Q0J29r3k10j36M51R7l63J30j12
$$ plain form
5297.6 112 -204 91 -44 113 42 -129 -319 -60 130 -217 146 -95 52 -167 -80 -51 210 118 -350 266 26 -79
5279.3 -79 -38 169 115 -57 140 -86 -150 -121 -27 -171 -168 -221 -3 -125 -36 -50 248 198 244 217 292 89 -118 -229 -158 92
5257.7 92 143 -33 52 -138 -151 84 202 253 106 116 -5 -283 -345 320 -52 -107 380 -102 -89 -156 -234 -73 -346 -106
5237.7 -106 -143 46 69 -181 -370 272 -232 24 -25 104 -17 -111 23 164 132 98 29 65 -60 54 -129 8 -224
5218.5 -224 -170 -74 -74 463 37 184 -52 14 101 -325 -27 135 -24 -60 81 121 -118 -183 -283 -4 27 -61 72 41 251
5197.7 251 170 -71 -28 268 28 -104 83 196 213 1 -14 77 171 -304 -41 -52 72 94 -109 -110 -333 84 18 -168
5177.7 -168 -22 -49 114 -107 -132 -116 21 -434 -203 342 -345 -280 243 269 -49 -125 -196 -54 198 249 -210 155 -291
5158.5 -291 -62 -222 8 286 99 -22 -98 355 25 -235 -99 -22 58 187 94 -116 -252 199 296 -67 63 -49
5140.2d9P7J5n9K06l23J88l56M89j46l6j93M04j49k77L92j64j21J6J28n10M89q4Q5
5121B2o0K76r8J64m56L24k24l6K07j82K20M6j43j41P0J79o2l12K69K23j38l38J24j94
5101b60j99L95L75n07M69j92j16K9J19j41N4L4j17L37m68P5P3J5q4K30p9l79L22j99
5081.1b14J51k24K29j53L12l77M87j27n0j72L6J10J95p2Q8r6k40MK51l15L31p8K18
5061.9B94l12m7j48L79n0q9O7k18K55j65J39J1l57J39L06n6k08J55N8o5l27J6N63m25
5041.9h5K63M7j84j56J1j15L05j0j69R0J39n6l48k7Q4J05O9o7N5j84K02M3p5P1l85
5021.1c77K18l3R07n99L2%m26K19PK53k36j13J36k19K09p7J20k26K39r2K5l7o8J90
5001.1E2k18n2J46q6L35k10k92L99R3k00j8m9J84j8qn6j29L99m39k22L68K16n5l31
$$ plain form
5140.2 -49 28 43 -16 190 -133 55 -301 188 42 6 -187 217 68 -209 183 19 -102 -86 42 -468 21 -63 22
5121 22 -38 238 140 304 -152 172 -52 -88 119 -63 157 203 60 -81 -11 168 106 -206 63 286 148 -190 -66 -260
5101 -260 -459 -64 311 -196 273 81 -35 -6 113 -28 26 60 -57 280 -188 -113 -40 -25 -109 121 42 -337 -15 -214
5081.1 -214 -63 -287 -58 -211 101 -276 211 84 34 -138 -102 8 203 131 219 123 -117 -113 138 -177 154 76 294
5061.9 294 -18 -65 -213 166 116 27 94 -124 131 -34 105 116 -241 -102 204 148 -60 95 153 88 -239 -223 340 -85
5041.9 -85 178 225 41 -115 -104 -219 86 76 -93 -3 136 80 -268 -295 -211 -106 -37 -104 -49 -233 -31 12 -63 8 -377
5021.1 -377 -159 -192 715 116 148 148 -278 -59 -52 201 -35 -148 -12 -231 -22 -99 21 -205 34 -58 -33 -70 -138 52
5001.1 52 -166 -218 -72 -158 177 -33 -325 74 167 -33 -51 -100 84 66 58 2 -127 272 -167 -389 -21 195 140 -191
4981.1a91L17j89M5j47J06J73KJ99j72Q6j78R8m7k62J51mj25K6J13M5j76N4P0K8j43
4960.3a21J11K27k33oq4r6K17K34l94o1J86K29m30L82k65M21m20K7J8J12l94M74j83
4941.1d9R7j93N65k25m45L54jPJ80l18K1J66k52r0J12O4r2K20k76p6K00K83j23m55
4921.1c26K61L35j49j70K9J86j46Jm8J40k11j59J51P2J04k30J8M8K40M2n37L88m4l46
4901.1c51L48k3K61n30J04N87m98K4N7j62L44l33O40n06L9K21J2l58J70k41N38j21
4882.8B22q3k12M6O0R9k15q9J79L86j89l68L05J0k47L10k09k50K32K11k61Lk04M16
4863.6A52K6k8k33o8J59j07J84M2j24J79j81k17K22j52J65r7l3r7L58n59L5L00J54
4844.5H0k01j77J63J69l66L46L7j32l1J73l2k66M11j75K04p5j52o0K87P7k44r0J78
$$ plain form
4981.1 -191 126 -63 -18 -165 -59 114 116 315 143 229 51 149 102 -160 -9 -13 -138 -112 1 46 -130 -76 -6 22 -121
4960.3 -121 -10 217 -16 -22 -106 -202 15 249 -145 -206 -20 209 -221 161 -104 317 -103 -76 -58 54 -340 134 -49
4941.1 -49 48 -145 420 195 -250 104 103 110 290 -28 -7 159 -93 -183 -71 -7 -99 121 -155 -231 -31 252 129 -326
4921.1 -326 -65 270 121 -49 -20 166 20 21 -27 113 -98 -257 -106 -34 70 -160 -142 -94 146 188 -349 39 -5 -351
4901.1 -351 -3 -26 235 -295 -191 396 -102 -78 -21 -183 161 -172 468 -38 1 222 234 -124 46 -195 343 222
4882.8 222 139 -73 -27 33 132 -83 -172 7 393 204 -164 141 151 -96 214 5 -245 -13 198 -63 -60 -264 152
4863.6 152 178 150 -83 -151 8 -99 85 127 3 182 1 -216 6 -146 19 -78 -111 -208 150 -409 -374 -74 80
4844.5 80 -121 -298 -135 34 -332 14 51 -81 -112 61 29 -237 174 -1 203 128 -24 -84 203 280 36 -54 124
4825.3A24l32J68m2J89k42n9JJ10K00J36j63m43J80J78k62K21J66q0k07p4L35O4l23
4806.2a55L0N3J39r0k64J98q2N2J41L9k69M59m84J66J9N2l5J02j10J45j99j22J35R1
4786.2A1L4l95L13j92L79m10j37M69K68n22N47m25k6K10m6Q8O0j8Kj84L0L56m91o7
4766.2a46K76m7j60K05o4J25l80N15l04L20l38J58k54rl9K64k47m9M25R1j94j08l70
4747c30K80J17j16L82k01m41j0J25J79J7N4j85L3K91n25M32k06k50M93k15MJ41k85
4727.9b16M01j8l87L22J2J25J5j04k61J50j21J21K65l40L28k63k15K33j75K54n04M54
4709.5G6k3M4l71L37j10Q2l55M60j1m7j5j74L6k32M08l32L33k69J99Mk61M07l58L12
4689.5A40r5k4j00J25R6q1l85K58kj42M72nl20l5J33mJ73j75j99K72j65J9J23K28m87
$$ plain form
4825.3 124 -208 -40 -82 107 -135 -194 -193 -83 117 253 90 -353 -173 5 -257 -36 130 50 -157 -231 104 168 -155
4806.2 -155 -125 -72 67 -23 -287 -89 -171 -119 22 61 -208 251 -233 -67 -48 4 -31 71 -39 106 -93 -215 -80 11
4786.2 11 45 -350 -37 -229 150 -260 -397 72 340 -182 365 -60 -86 124 78 166 226 208 210 26 56 412 -79 -146
4766.2 -146 130 83 -77 128 64 189 -191 324 20 340 2 160 -94 -103 -142 122 -125 -174 251 342 148 40 -330
4747 -330 -50 67 -49 333 132 -309 -319 -194 -15 2 56 -129 -96 195 -330 102 -104 -354 139 -76 -72 69 -216
4727.9 -216 185 167 -220 102 114 239 254 150 -111 39 -82 39 304 -36 292 29 -186 47 -128 126 -378 76
4709.5 76 53 97 -274 63 -47 35 -320 140 129 82 67 -107 -71 -303 105 -227 106 -163 36 40 -221 186 -172 140
4689.5 140 45 21 -79 46 142 61 -324 -66 -68 -210 262 257 -63 -98 35 31 204 29 -170 102 -63 -44 79 307 -180
4668.7a80rK10J11k36L04j54j59R6J0j11J69L1k39J58k1q6J27Q4K02o20P0l8L14J23
4648.7A56Q1k55j93K78M5J13k26m9M3l01L62q9k96L94m76O3M15j28P4p7J74k11N65
4629.6D62l15p31P01p5J85k11k56K88L0J6k43O5J36l34L14L3l60M22k2k92N4p5J90
4610.4a8P8n0Rm9J66k6P3N6n07K8J42L40k20oR9j36m7r3L07q3K9TJ28j05m0j83qN0
4587.1c7L96n72nL42m9l30P1J29K00K7m9p4M26n68J0j1P7O3J70l19q2L31pk82K64J00
4565.4B21l11O6J52j46K52j97J19k74K6N9k7n4j41K58L0p3k92L64k62K20RP2j86K08
4545.4I3j7J88q2o44N84l78L31j90j7K44k54K66k28q5K15J86P0j67j17q3K1P0J10m00
4525.4b84K50k69K38L04m71J22l6J48l11K5N12l50K96l9l57M78j01J2L8l09J41L0J7
$$ plain form
4668.7 -180 -189 21 132 -104 200 46 -113 -17 -7 -118 51 82 -157 1 -20 -106 21 105 307 -313 -243 -281 33 156
4648.7 156 237 -18 -211 67 112 225 -1 -50 -7 -308 54 -35 -331 63 -413 -350 65 -63 11 -66 108 -103 462
4629.6 462 147 -584 117 42 227 16 -240 48 78 94 -149 -84 52 -282 32 65 -295 127 105 -187 -133 -208 -18
4610.4 -18 60 10 19 -30 136 110 183 239 -268 -240 -98 242 22 16 115 -21 -68 -161 146 63 92 121 249 144 104 -79 -87 -37
4587.1 -37 359 -213 -218 124 75 -255 -184 -55 145 172 123 49 475 -93 -83 -94 -17 46 216 -103 -185 146 139 -143 121 221
4565.4 221 -90 -24 128 -18 234 37 156 -118 -92 -33 -60 -114 -255 3 33 -40 -332 32 -230 -10 -1 71 -115 93
4545.4 93 76 264 182 -462 122 -256 75 -115 -132 112 -142 124 -104 -189 26 212 282 115 -2 -85 -64 6 116 -284
4525.4 -284 -34 -303 -65 239 -232 -110 -146 2 -309 -284 228 -122 174 135 -222 256 155 167 205 -104 37 67 84
4506.3H4j43N9j07K23o2o4L28l65K46k96q5L59l22R3j69L10K16l53N8k29j15L49K15
4487.1B30l61J54J4k46L42k30j11j10M98j45J59l51L28K2k77K30l84K20k04K36l9K23
4468.8A98k13M06k49k61N4M16m40J07J27L9l05J56J09l53M3K99N5l23O2J64j75mN8
4449.6c0K15r6K47j27j40P5j34r4J67Q6k07J76r0N8n72M27L35j39k37K06k53J19q5
4430.5i3K16m8RK18k29k88Q8k61L15r7J36J71m8j67N7k48J32K20k18n4j72K52q8J11
4410.5h6q1O5J97l67K89m3j11K58J56k61J4l28K80O6m1n8k30L04k11N0J38j56L02j74
4390.5b8k68L01K20l15J16N6n7k22q1K58M8L0J85m14O0K78l09L08m57l7M16O2k38J17
4370.5B9j7J09k25PL64p8j58j72Q6P7j56R3m1J24O6l15K94p4k29L26m05L23K11l73
$$ plain form
4506.3 84 -59 0 -107 116 54 -10 318 -47 199 -97 -182 177 -145 -52 -221 89 305 -48 10 -219 -334 15 230
4487.1 230 -131 23 37 -209 133 -97 -208 -318 180 35 194 -157 171 193 -84 146 -238 -18 -222 14 -25 198
4468.8 198 -15 391 142 -119 -65 351 -89 18 145 184 -121 35 144 -209 -166 133 188 -135 -73 91 -84 -88 -30
4449.6 -30 185 89 336 209 69 144 10 -84 83 169 -38 138 48 106 -466 -39 296 157 -80 126 -127 -8 -93
4430.5 -93 123 75 84 302 73 -215 -127 -388 -73 -170 -34 137 89 -78 -21 -269 -137 83 -135 -189 -361 -109 -197 -86
4410.5 -86 -167 -102 95 -272 17 -26 -137 121 277 16 30 -298 -18 48 7 -51 -281 23 -188 -138 0 -156 146 -28
4390.5 -28 -296 5 225 -90 26 82 25 -197 -278 -20 28 58 243 -171 -111 167 -142 166 -291 -328 88 150 -88 29
4370.5 29 12 121 -104 -97 267 189 31 -141 -55 22 -134 -41 -82 42 108 -207 87 13 -216 110 -295 28 239 -134
4350.5a34J9j30L34j48J68j96L8O9K12j41p0j45K79k10m6J75l2o7L29j99k56l0L31
4331.3A50k50K97l5k8m52K01K22J10l59M7j18L19k18K76N0R8N90j078j57K67J74j48
4313d2O5k04L10p3j26N6J28k62J03L50m09Q8K3p2J07l96N27l18M97j49l56J11j32J09
4293f5L01j99l4K11j58nJ20j79JK81k30j57j09K95J12o6l69L1L29j34L75l91r5l2R3
4272.2g4q8M06r8l92M40P5o3Ln65P88m96k8K47j23l13N17l91K75k9n18K88J25L10k70
4252.2B6K36J02m00j13l2K02m20M85k01q9k1K71l4l2jj11L1p4n6J22K25P1j47O0o7
4231.4C3J13j75k90N26l39J29k45K84L6j47k8L67m16M78n85L32J76j02l07O8%rM9k00
4211.4b52L16l9m65N63j29J15k78N14l66PJ02rq3k39K48k24K14k44J65L62n23K51K7
$$ plain form
4350.5 -134 -115 -245 89 -59 109 -87 -49 20 232 91 21 -124 155 -55 -101 74 42 -25 304 105 -151 -181 150
4331.3 150 -100 197 162 134 -318 -117 105 215 -144 -97 -215 104 -114 162 212 310 900 -178 -335 -68 106 -42
4313 -42 23 -181 129 56 -70 -14 114 -148 -45 305 -104 -16 7 -65 42 -354 173 -145 352 203 -153 -42 -174 -65
4293 -65 236 37 3 214 56 51 171 -8 -7 274 44 -113 -222 73 185 119 -250 -219 110 -24 351 -40 -135 -167 -74
4272.2 -74 -162 244 146 -246 194 269 206 209 -356 432 -64 -92 155 32 -281 236 -155 120 91 -427 -139 -14 296 26
4252.2 26 262 364 -36 -149 -181 21 -399 86 -115 -204 -225 46 12 -20 -21 -132 -101 -175 -231 -109 116 187 40 100 33
4231.4 33 146 -29 -319 207 -132 -3 -248 36 72 -75 -103 264 -152 326 -259 73 249 147 -160 -92 -92 -101 -52 -252
4211.4 -252 64 25 -440 123 -6 109 -169 345 -21 -14 88 79 -4 -243 5 -219 -5 -249 -84 278 -245 6 33
4192.2C3k0J710j541k81L41l36p2J98l26L04j26J63k2j56J60l11K20L54k94j86k2L37
4173.9A27j85K83j57n2J35K6j96K15q7j58q1J08r5J51k70K2M78k81j32L09k68K56j18
4154.8C0K24k51Mj73J8K73j74k77L53l1J27k60J35M14j71k51j36J8j83J44K01J79j90
4135.6B3N3P2J1k24M94p01K55n9R8r2p0k92J96M79j93j5n6J41J2l02K82l02M53j08
4115.6A55m68O89j33k54k27J98K84m51J62M9J36k44n2M29j21n2j38j86M72j65j32L14
4097.3B65k44J25j9PK47n38M20o24N62J45m28N1J8J14j27j02J62m4q3K07j26k53N28
4078.1B63j58L9k99j0L53j30K39l95L03j48p3M8L32m60k51K51L3j74J84o9j88M15l61
4059b56L64j76K2m3Q8p7q8j0K02J15J83o04M65m63L42M8l50KJ50J37k21M5l9M39n4
$$ plain form
4192.2 33 13 1723 182 -99 242 -94 -166 32 -294 10 -116 47 25 -131 29 -282 -62 292 -2 -188 -210 127
4173.9 127 -58 225 68 16 151 177 -19 196 109 -49 -130 -22 -117 34 -236 -214 264 -17 -149 160 -108 148 30
4154.8 30 254 3 7 -166 -148 125 -49 -326 27 -4 123 -137 -2 412 241 -10 -146 -128 -311 -167 34 213 23
4135.6 23 76 148 159 -65 429 -272 -17 -76 22 -70 -140 -432 -236 243 50 35 -21 120 132 -170 112 -190 263 155
4115.6 155 -313 376 243 -11 -238 -40 244 -207 -45 4 140 -104 -156 273 152 100 -38 -224 248 83 -49 265
4097.3 265 21 146 127 134 381 -157 263 -361 201 346 -82 -31 -13 101 -26 -128 34 -10 -93 114 -12 -265 263
4078.1 263 105 144 -155 -165 188 58 297 -98 205 57 -16 32 364 -96 -347 -96 -63 -237 -53 -122 -310 105 -256
4059 -256 108 -68 -46 -89 -1 -78 -166 -176 26 141 324 -280 185 -278 64 112 -238 -236 -86 51 -170 -125 -164 275 221
4038.1B21k76j78K43pP6J53m91K48p0K76nn04N77l12M3k67K86J3j15o6K09M5j41J69
4018.1A27l80K87k79J31J36k10P2l22N63k37L03j92l74K56J48j35m05M65K8q2J00K3
3999.8B3j16m0q8L44n5J4m50N76j60O1j71j07P1K79L9l19j18J59J75l79J78j30L1J43
3979.8d0j9K47k6j41n01O37j36N4K69l42R5lj15J07j69J44j83K45k85J64J02r5L04
3960.7C13m13M09l80K86Rk60R9r7o7n8Q9k08J96K52q4k19J30M29l93j2k39K00n5M3
3940.7c0j6NN0K26k14J17k31Q6m0J5k23K3p7K08J63L74n82J39k01L02K90r11M61k64
3920.7c30N11k82J24J85n1l38M35k02O1J0J38l29l35P85l13O1j11l65L6L78K2%r5K43
3900.7B38m08J30K44k17J47o0K09q1o9m9Nj29K59m00j8M69j93N3R0j2l35J70J12K39
$$ plain form
4038.1 221 -55 -233 10 3 79 232 -259 -11 -81 195 190 -314 263 -49 -6 -273 13 26 -89 -155 54 99 -42 127
4018.1 127 -253 34 -245 -114 22 -188 -116 -438 125 -112 191 -1 -375 -119 29 -106 -511 -46 -18 -100 0 23
3999.8 23 -93 -133 -221 123 68 82 -368 208 48 109 -62 -169 -98 181 220 -99 -217 -58 117 -262 -84 -214 -183 -40
3979.8 -40 -59 188 162 21 -480 157 21 75 344 2 97 94 -21 86 -83 61 -122 123 -162 2 104 9 313
3960.7 313 -100 309 -71 215 224 -36 63 -34 -101 -159 -70 -278 -82 170 86 -133 -3 426 33 21 -218 -18 -73 -30
3940.7 -30 -46 -41 9 235 21 138 -93 -7 -47 -32 -255 -232 -309 -101 62 436 -146 -7 -208 94 384 -527 -66 -330
3920.7 -330 181 -101 23 208 157 -181 254 52 113 123 261 -68 -403 382 69 130 19 -346 -310 68 90 90 -5 238
3900.7 238 -170 -40 204 -13 134 74 283 202 133 84 89 -40 219 -181 -199 270 77 130 220 208 -127 43 155 394
3880.7C94m93K09MJ84l39K86m13L63l4j4j40j48J62K21k48K37j89j67N78l96N35M59
3862.4A051J367j425k73m07j73L9q5q2lJ92rj64J65J80j94k42k61M94L8k46j11K26
3844G7K74n28N03Q0k65j30k08O28k93N0K41m5j84N6P04K08J652j984m19j87M6k64R9
3824.9A11L5L8j83o9O5J60j12M8Qk88M58j59qK09k07J90J78m12k79L23J92j95k0o3
3804.9B0K27K2L29k13M4N80O17N03j258j84m05m4j00j47p5P7k38P5J23M8O0k62M58
3785.7B57oj33j75L3p5j12K68n1J37l31K65k04K22j22n9l4J41m8j05O2K13p6N4k1n9
3764.9D1j59J46J65j11p8N8L55M6l16q8P1j6K8l02R4M5k79K13J41J43l98j1k0K96l34
3744.1b70K8K51j32K42j74J04O8K76n65K60k08J57k76J50M43q78O19j94J86J89j62
$$ plain form
3880.7 394 -99 110 114 298 -41 245 -168 195 161 147 7 -141 21 242 -6 231 42 -125 453 57 592 1051
3862.4 1051 2418 993 720 313 140 179 94 12 9 201 192 28 193 373 179 -63 -324 170 208 -38 -149 77
3844 77 351 -177 326 406 141 11 -197 431 138 188 429 384 200 256 960 1168 2820 836 417 230 276 12 111
3824.9 111 146 184 1 -68 -3 157 45 93 101 -187 271 112 104 313 106 296 474 62 -217 106 298 103 83 20
3804.9 20 247 269 598 385 429 1009 1626 2129 871 687 282 238 138 -9 -84 -7 -245 -170 -47 1 61 -201 257
3785.7 257 251 118 -57 -24 -99 -211 57 6 143 -188 77 -127 95 -27 -86 -120 21 -27 -132 -70 143 67 121 100 41
3764.9 41 -118 28 193 82 4 62 417 463 147 59 130 114 142 -160 -66 -21 -300 -87 54 197 -201 -212 -232 64 -270
3744.1 -270 -242 9 -123 119 -55 49 117 393 -172 88 -120 37 -239 -89 354 -524 95 -99 87 276 114
3726.6A14j49K07j09l19K65k01J19J10j89J17J16N6j79j94K89j83L18j15L49n27J94
3709.1H9j03R1j06P9l17M56O2j82J31oo2k04K25l9k07N12l99J22j96l5L38k83K07L3
3689.1B06q3J24o4j03N04J153M008J3756j6977j999j77k20Tj41K19L5r3L41N1l1l30
3671.6d1j42K52J0P1j88q4J50m31N60J26m23L02m53N80j22%k87k33L22K86k47J86k71
3652.4g7k17N5J62j6J77j66M25j46qo14O73k01j93K09k41M49l0k52k67K48K42m78J19
3633.3a47p2K12p1k22L42L5k4Rj09pL38j65p8rj1J12j12k04L08j43p5N7J57l00j09
3612.5b88N05K8l90K44J25l2k59N49l69j74N0J35k57J54q5m4l19Q59p84N21l22o7L82
3593.3A62k79R3n8p1P0J51k25L52J77k85R5K65j85J83p56L96N0J114j079k28m4K24
$$ plain form
3726.6 114 -35 172 63 -256 9 -192 -73 37 -152 -35 81 137 -42 -236 53 -130 188 73 422 -105 89
3709.1 89 -14 77 -29 50 -267 189 251 69 200 194 132 -72 153 114 -93 419 20 142 -54 -89 249 -34 173 206
3689.1 206 123 247 183 80 584 1737 5745 19501 2524 525 348 128 -92 -233 -14 21 -72 269 320 289 -41
3671.6 -41 -183 69 79 150 -38 -122 28 -403 157 283 -140 162 -291 289 167 167 -120 -353 -31 255 8 194 -77
3652.4 -77 -294 -239 -77 -93 84 -82 343 197 189 -425 248 47 -146 63 -178 271 241 -11 -278 -30 212 -266 -147
3633.3 -147 -219 -7 -78 -300 42 77 53 62 -47 -54 284 119 41 32 21 133 21 -183 125 -18 -93 -36 121 -179 -288
3612.5 -288 217 245 -145 99 224 192 -67 482 113 -61 -11 124 -133 21 -64 -108 -427 432 -352 169 -153 -220 162
3593.3 162 -117 -24 -82 -153 -83 68 -157 195 372 87 182 447 262 445 -311 85 135 1249 170 -58 -102 122
3575A22j71q6J03K16k40m8M65l46j90L42K6l20P9Tn7M38p09J55j1j74O80n41K90j61
3555e9n1MJ41J22P7k19K55p8J6j96j56L10j65P5L2K3l88K24K61J9m20L36l09p9K27
3534.2Bk44M35P6k49K20L4m3j27p4J28JN1q1j90K68l36J66r9J00M2q2M9N1N26m49N7
3512.5B32Q00K224k709m95m38M70j78K21j56j5Q6N9j58L82l30J49M2k98J66Jo3M8K18
3493.3B58k43J66j44l02r7L20M4%k03L97k77N09n36jK68NQR7k34J8m72L14J45m63J39
3472.5b84O82o85J82k5j07K26p5K74l70J31l1Q3Q5K18l62j3L7o42P82K2m5j87n7L02
3452.5A41l51L24n48L38M34m32J92l2j75K95j29o5K94k78J29L5l04K66K50m63J59J06
3434.2A86l85p3J60j44K76j3J27j55j45K50k49P0O7p7l97O95J43k41p6r4J51j51J66
$$ plain form
3575 122 -49 -135 -32 184 -56 -104 361 15 -175 167 193 -127 -48 31 -26 412 -297 -142 -153 -327 353 -188 102 -59
3555 -59 -110 -106 35 157 234 15 270 192 208 12 -144 166 1 76 108 131 -257 -33 228 247 -173 163 -146 -225 2
3534.2 2 -242 193 269 20 240 274 231 104 30 158 159 210 129 -61 207 -129 37 -62 38 80 -2 47 98 624 175 232
3512.5 232 1032 3256 547 52 -386 84 -94 127 -29 -44 42 101 -57 325 -5 144 186 -112 54 55 -8 40 258
3493.3 258 15 181 37 -265 -362 -42 2 2 -201 196 -81 428 -108 -109 159 164 172 269 35 53 -419 -105 40 -423 -284
3472.5 -284 398 -287 -105 -130 -237 -11 -86 188 -182 -51 -82 1 86 304 -58 -71 -34 -676 106 128 83 -104 -161 141
3452.5 141 -210 114 -434 -96 338 -94 98 66 -109 186 57 -8 286 8 137 172 -132 134 384 -79 80 186
3434.2 186 -199 -272 -112 -256 20 7 134 -21 -166 84 -165 -95 -28 -105 -502 193 336 95 19 -75 76 -75 91
3415I1j83j59O28k65Nl77K39j86J92j94L04l29M03j7q9M1j34j29J31J79k58K86k13
3395.9c4k33P5j43N44j82q0P4k8j1J51k68Pk1J84J91N1l03k1r8K24K6q2J50L7l45J75
3374.2D0j14N3l1O3o2k67J01j64L82l63O54j44j18J29m57N67n55K04j03J81K00r4M2
3355.1A44k5m4j33J36J46l45J06J39q4jl56L70j29J69J30l69J51j06r2R7P8mj31R1
3335.1f2oJ13NQ4k04K52o73M96k29N43r7l24K24Qk50K9J29J7J67K1j95kn9k73K69K08
3313.4A91o3Pj24j26L44m68L75k16K12m16L00j65M20l56K99m85K01k30J00j82L19K63
3295.1B00j92R0k16K18k49L51k00m8J19M78n84k00J38j6k5K99J49j74m03J29j73J11
3276.8a98O36m19J47j38P1J45k75J54k42j6m1K51j33k5j18R7L32k05K35l14K13k61
$$ plain form
3415 91 -92 -251 377 112 117 -260 -21 -207 -15 -209 95 -234 169 152 63 104 -30 -159 -28 151 -107 179 -34
3395.9 -34 -267 -192 -335 209 27 -53 21 -7 -18 133 -135 -128 -149 35 226 277 -26 -47 -145 79 105 23 173 210 -135 40
3374.2 40 -74 -21 -52 11 -51 -318 -217 -381 1 -362 292 148 30 159 -298 269 -286 -82 -185 -4 196 102 144
3355.1 144 119 75 -58 78 224 -121 -15 124 40 39 -317 53 -76 93 223 -146 5 -101 -193 -96 -18 -22 -153 -62
3335.1 -62 -68 45 50 134 -70 182 -491 5 -224 319 222 -102 122 130 -120 -91 38 55 222 243 48 46 -13 -286 -17 191
3313.4 191 128 135 11 -115 229 -239 136 -80 132 -284 16 -149 271 -85 214 -271 -70 -300 -200 -382 -63 200
3295.1 200 8 98 -118 100 -149 202 2 -46 73 551 -33 -233 -95 -111 -136 163 312 138 -265 -136 -309 -198
3276.8 -198 438 19 166 28 99 244 -31 123 -119 -135 -176 75 -58 -83 -201 -104 228 23 258 -56 157 -104
3258.4a04N74m04o2K30l10M7m6J6M4J47K26J06p68K90L39n13K61p5L64k86L13k74m7
3239.3F8r1J27P5m3M1j71j1k60L36J72l35K0l4K52j65M34k59k7r4M2j47K74p1j81M08
3218.5C60n33PL84R0l01Q9l21L37l05K10j50PJ17j00K17l08N3J7J55R0Rq4j91J83j50
3197.6a18J83K62j09l55L57N9j75o0k50J82q5k30M14Ok66J72L61j82k96L64j95m8K64
3178.5B55j46J20l16L90k55j44R6K77m68K18p8J81M27j19m95N22j11m78K06L2m40O8
3160.1b58Q13p08n4J65J85k51K51J1l4k13j61J51J47P8O6J9K18l44p9K73M2j59j52
3141FNP8P80o03j75j02J88k16l6k16N71j55m3K4rO1l38n1K45L69l16K90l16j24M04
3120.2C21l82Q1j0k20P3p6K29Q8o8j9J88J96n72K68k11j3J18j02M2J64k9r4J03j94
$$ plain form
3258.4 -104 470 66 4 234 -76 -29 -75 -59 -15 132 358 464 -304 -14 325 -188 73 -2 362 76 389 115 68
3239.3 68 -23 104 179 136 177 6 -5 -265 71 243 -92 -72 -106 146 -19 415 156 129 35 77 -70 204 133 -48 360
3218.5 360 -173 -166 218 308 7 96 -225 112 -193 17 -133 -126 -9 -109 108 -200 -147 -130 25 115 124 40 -151 32 -118
3197.6 -118 65 327 218 -137 220 279 104 44 -206 -24 -109 -339 75 81 -185 -13 348 166 -130 234 39 -9 255
3178.5 255 109 229 -87 303 48 -96 0 277 -191 27 -51 130 557 438 -57 465 354 -124 82 114 -326 -258
3160.1 -258 555 -153 -207 -42 143 -108 143 154 120 -93 -254 -103 44 122 188 207 425 81 2 275 317 158 6
3141 6 11 89 869 266 91 -11 177 -39 -75 -291 280 125 82 106 97 158 -180 -231 14 383 67 357 41 -83 321
3120.2 321 -61 20 10 -210 -137 -213 16 104 36 17 205 401 -171 97 -114 -127 -9 -111 -69 95 66 -28 75 -119
3100.2a19L40k7n4k69k2N7qJ54J2j07M4k4j23P6j59L59k18K68j40q4M59k30k59J14
3080.2D0J76k82j06J1K05j0k11k9L51K9J51j79m21L52j30K09n06N86k69J31R3l03M92
3061C80l43L8j05o8k95J60L14J22p0P8L50m20L7K3j98k4J33k07J93m89O32J97p1j87
3041A80k29K2k13L44l5J06K45l57J62O8m72P6jJ73k53N9J46K49j03k22J8o0L55l55
3021i7K44j75j01m3L71k78N1k43L41M5p0L3j29J34r2J4J02j64J22l89K59J496j201
3001.9B30j2L94o26M17k61R2m41M34j03j30J45m6R9q2P1N6J26l11J20m01K27k16J85
2982.7c3M0P6k43k72O60q2j10j2m22L01Q0n1K53j23k14K4K88k80N67k96n7j00R8j08
2962.7a6M5n7K03j1j77Q6j59m8J00K7j3PR3Mq0P7j02K41m73M47j13p3J93J3k77nJ92
$$ plain form
3100.2 -119 221 194 140 -129 -151 -94 -102 52 64 -43 1 -23 -146 -70 -229 130 -88 180 40 -44 415 185 -74 40
3080.2 40 216 -66 -172 -161 44 34 -177 -206 145 174 325 146 -275 77 -53 156 -350 236 -33 98 191 -112 380
3061 380 37 75 -30 -98 -393 -233 81 203 133 211 561 141 178 201 3 -21 112 -95 98 -391 241 438 367 180
3041 180 -49 -27 -240 104 69 175 420 63 225 293 -179 -103 -104 69 -184 -125 21 270 167 -55 -37 -97 258 -97
3021 -97 147 -28 -129 -172 199 -79 -28 -271 70 115 45 78 -51 83 -9 5 107 -57 65 -324 -65 1431 230
3001.9 230 218 612 -14 403 142 234 -207 227 124 -6 139 93 192 110 181 237 363 52 172 -229 -2 -218 -33
2982.7 -33 7 83 -160 -432 228 146 36 24 -398 -97 -17 -68 185 62 -152 -128 160 -120 447 151 94 -6 92 -16
2962.7 -16 29 -28 175 164 -13 73 -86 -134 -34 -7 -20 -13 80 84 4 81 -21 220 -253 194 81 8 201 214 -63 -68 124
2940.2A24%O0R4K2n18L54l51N60k4k63R9j53K82l74J56M44k77l61o8N89k78K4k20l8
2920.2a17N00l93Q9j33J47m06L05J71p4N1j13J28j10J3J56j01J58J84m97J12j6j27
2901.9g3K32j18k6K72j9m12O34m03PP0q4M23m32Q1j53K91m14K96k06J83M7J4k61KL64
2881.1C15l01L61n2Mm01K93m44M66j18l66M25J72k64m2K07j85n8j2J88l15J77L5k9
2861.9E6j8J53P2k43K23J30k33K83j62j15J46k40J95k3J04k9n1j7K4Q2L01o83N10J00
2841.9E65Q6j89p41N56j50J90k13M52k28L37m06N06j6k4K80N81o58M92J068K820J8409
2824.4B3717k2329j098q76O81l28j81L40N6j61N57m37K46l3n1o05P47j76K56J53m44
2807.8C4J22o9M0K09j14K72k8M28n8K64K577N478R310j6334q02o31j69l54m08K45K03
$$ plain form
2940.2 124 124 184 278 300 -218 136 -215 345 321 58 157 4 286 -88 68 512 235 -126 -194 395 117 141 -79 -117
2920.2 -117 383 -10 79 -54 93 -313 -8 163 89 140 27 155 45 58 214 113 271 455 -42 70 54 -73
2901.9 -73 159 41 15 287 268 -144 490 87 94 164 80 503 71 152 -1 290 -124 172 -34 149 196 210 -51 -49 315
2881.1 315 14 375 323 327 -74 219 -225 241 123 -243 182 354 90 48 255 70 12 0 188 -127 50 85 56
2861.9 56 38 191 263 20 243 373 140 423 261 146 292 52 247 224 328 299 248 231 255 337 638 -45 465 565
2841.9 565 651 462 -279 277 127 317 104 556 328 665 259 765 749 725 1005 1586 928 1420 2488 5308 23717
2824.4 23717 1388 290 -586 95 -233 -414 -74 -18 -179 378 -59 187 154 103 -502 245 69 325 478 34
2807.8 34 156 87 127 336 222 494 466 894 836 1100 3677 9155 18465 2131 1329 698 529 175 -233 12 215
2790.3B15j81P86m03L47K631l301k88L89l87L87K84j31l99mj3l6o6J63J93J82k00L94
2772E62p52L65j05M2k58M15j4k59K21l52J17O3J91n53J38N33J52n06J37p5J16j58J93
2752.8B13l72J3r9L89j46J1j8M6m5o3J48J37k2l26K08J64J07l16K78l5k51j4N77r0
2732.8D94P1l12k03k5r4K96k25K78k34l8K92k95n2K06l88K47q6m2o0K41K92m06j1J86
2712.8A32m7j62J84P0k89R3K58j5j37j50L25l16J93k2N3j85L29m42P8N01m98J81o6
2693.7F8J59k28L46k28J99K73m77l08M57p0K50m46R3j1j36j70L45Q2J24q0J70l63J46
2674.5A95j4o0M8j59l34K50K88j05K98k93L77m73L07j84j38M2j12J97K20n96J14K04
2656.2G2j6l5J70l57L92j85J98k36r7r4M78O5l37K30j69K13l14j92P58n79j46L28K20
$$ plain form
2790.3 215 34 820 417 764 3395 94 -194 195 -192 195 479 348 -51 -55 -68 -104 -170 -7 186 368 168 562
2772 562 -190 175 70 112 -146 269 255 -4 217 -135 -18 45 236 -317 -179 354 506 0 137 62 178 20 213
2752.8 213 -159 -146 -245 144 -2 9 -9 37 -8 -71 77 214 192 -134 74 238 345 29 307 272 21 7 584 494
2732.8 494 565 253 50 25 -69 227 2 280 46 8 300 5 -47 159 -229 18 -68 -110 -170 71 363 -43 -54 132
2712.8 132 85 -77 107 177 -112 -19 239 224 87 -63 262 -54 139 117 170 -15 314 -128 -50 451 -47 134 68
2693.7 68 227 -1 345 117 316 589 112 -196 261 191 441 -5 88 77 -59 -229 116 198 322 242 412 49 195
2674.5 195 181 121 169 10 -324 -74 214 109 407 114 491 18 325 141 3 45 -67 130 350 -246 -132 72
2656.2 72 56 21 191 -166 226 41 239 3 -94 -188 290 355 18 248 79 292 -22 -214 544 -35 -181 147 367
2637C67l18J27J54m90O26k07l79J66J85l30o3K39K10m44O07j97l91j1M58r5jJ12l76
2617.9e1K15M0j87J75l12L37J46n4j57l66K40L43k23J34m03M10m32O48o79R5L93n81
2599.5b69P60p0k18m59O11o14L57L43k83r8k38L10N40j82n28K68q9j5j44M18l45p5
2581.2b0L03j70m3J72k36k2J20k33K5L01J62l47J91k14JK43j64K34j51j81L1OJ12J51
2561.2B71j62K60j80k82M6N60l98j16M7K12o4j23O1k94J73%k10R0j13N51k53J09p5
2542A10R4j61j17K38k73J44q6k94O01j00K24k42K57k44qK30m07L80k37p4O1M02j92
2522.9C06k82K21M4k27O0N5j35n8M1L52n16O44L6k52rL9k28M07j84N14n94L76k5j38
2502.9D47J82M5O57n47J41K62K231N56J5504j5952l387n12M57n7K7k2j05l08p5L71
$$ plain form
2637 367 49 176 330 -160 466 259 -120 46 231 -99 -162 77 287 -157 450 253 -138 -149 309 214 213 325 -51
2617.9 -51 164 204 17 192 -120 217 363 309 152 -214 26 369 146 280 -123 287 -145 503 -176 -81 312 -269
2599.5 -269 491 421 203 -256 355 -259 98 441 158 60 -178 132 672 490 -38 230 141 126 -18 400 55 -20
2581.2 -20 283 113 70 242 6 -16 104 -129 -104 197 359 12 203 -11 -10 233 69 303 152 -29 2 8 120 271
2561.2 271 109 369 189 -93 -47 513 115 -1 46 258 194 71 132 -162 11 11 -199 -109 -222 329 76 185 110
2542 110 204 43 -74 164 -109 35 -51 -345 256 156 380 138 395 151 143 373 -34 346 109 35 96 498 306
2522.9 306 24 245 289 62 122 177 42 -16 25 377 -139 505 541 289 280 319 91 498 314 828 234 610 585 447
2502.9 447 629 674 1331 784 925 1187 3418 3974 19478 3526 139 -373 84 27 54 32 -73 -381 -456 -85
2486.2h5J31n22L95l8N9Mk05L43k85L76k25L30o17J12K02n9O2L0l2r4L62l44Q8j78
2466.2a90K46j52j91M71J02k61J42J69k18P3J13l62J4J35K3k7k41K93l3J35l52J54
2447.9D3l56J31O67m99R7O3k36m1J59K5K10Q0r6p1l52R6J8l8J51lj05r8J01L21n22
2427.1b55K30L98l84L00k11P7l2J0j32J99j47m9K75r0M4l7K62p00N0J65j34p2L66K68
2407.1D01k36j55K61j32j3j66J51k65K10Ok14N23l95j6M03j91L4J79k55r1j02L00k99
2387.9f2L44q7k6K33m85L67k1l1K28k26k40Q6Oj03L10m06K02J31p4K0k00p7K66r4J35
2367.1A96k58m7K90l09L71l2Q4j41k10j36K56o9K82n35K25p2k08N65j92J82r8k87L75
2348B32m46M08k21j27l9J88J41N8m43O14m99M11k16K17m29K9k9J72k49K23K80j77L84
$$ plain form
2486.2 -85 46 -476 -81 -119 -60 -56 -261 82 -203 173 -52 278 -339 -227 -25 -84 -22 8 -24 -118 244 -100 -12 -190
2466.2 -190 56 -96 -287 184 286 25 167 336 118 191 304 -58 -44 91 114 87 -154 139 106 241 -111 43
2447.9 43 -313 -182 485 -14 83 146 -90 -131 28 53 263 343 247 176 -176 -80 -62 -100 51 48 -57 -155 -54 267 -255
2427.1 -255 -25 373 -11 289 78 155 123 133 1 200 53 4 279 189 233 196 458 -242 -192 -27 -161 -233 133 401
2407.1 401 165 10 271 139 126 -40 111 -154 56 62 -152 371 -24 -40 363 172 206 385 130 39 -63 237 -62
2387.9 -62 282 195 169 402 -83 284 263 232 460 234 -6 80 86 -17 293 -113 89 220 146 166 -34 -111 155 61 196
2367.1 196 -62 -109 181 -128 243 211 295 154 -56 -192 64 -5 277 -258 -33 -105 -313 252 60 242 144 -143 232
2348 232 -214 194 -27 -154 -193 -5 136 194 -249 365 -134 277 61 278 -151 -122 -151 21 -228 -5 275 98 482
2328.8D82n77n3K51L64l48QR4J61J47n78L56m85L22L3m4m0N9K03M1j55R4N5l31J59
2308.8B18o5k88N18k9j04M68K156j726q87J73m66M80j96k75J37j26J90l75N1N06k09
2291.3A51j80L11j30o5k02L34K57k01q8j44p7m7j58L81K15k51m0O0j78O7p7k06J12
2272.2a56J85q2J17L3l55O05l32P38o21k7K09l45J89j30J5J36J83l29O7j35L12j12
2253.8A65jl02J50J7L2L01j30j54k49K48J24q7l24L07m0L17n24K56J26j08k99K36J38
2234.7A99k69K35j70L92m84L52J91j74j84J68j01m15K43L70l14J22K37j15p3j49M3
2217.2A04p0K32m00J22M18m21p1J73K72j02l77J20K43k74Jj90L73l67M58J07kn9l51
2198f1M80m00o4l59P91k85J62m8j5j45J86K7m03K20j38Q0L32l09J23M7k07O7q4K93
$$ plain form
2328.8 482 -95 -148 103 467 119 127 221 382 529 -49 307 -178 144 177 133 93 152 355 396 241 335 390 59 218
2308.8 218 153 -135 383 354 250 718 2874 1148 261 434 -32 448 252 -23 114 -12 178 -197 -146 360 151
2291.3 151 -29 282 152 87 -115 219 476 275 187 43 -34 -81 -239 142 357 106 66 126 -52 15 -62 -268 -156
2272.2 -156 29 -53 64 97 -258 347 15 753 132 105 314 -31 158 28 43 179 362 33 100 -35 277 165
2253.8 165 164 -138 12 29 61 362 232 78 -171 77 201 114 -210 97 57 374 -150 106 232 124 -175 61 199
2234.7 199 -70 165 -5 387 -97 255 446 272 88 256 155 -260 -17 353 39 161 398 283 210 61 104
2217.2 104 34 266 -134 -12 406 -15 -86 87 359 257 -120 0 243 -31 -30 -220 153 -214 244 351 349 290 -61
2198 -61 419 19 -45 -404 387 102 264 216 201 56 242 269 -134 86 -52 28 360 51 174 221 14 81 -3 290
2178B90j40M78l98M5j05M4L56j30k04J2l4J353j396m74L58Q0l20L62l88J15K47M8K38
2158.9D37j73l05nP80n16P7m28L43J39l59N2K17L6k4j26K6l27K9M68j40k63J95j84
2139.7e1M25n67L81M89l10k17M5q0K92o4J416j839K28r6J25nj71J72n2O6J71l70rM16
2119.7C95l02N17n93K64K24N16J965m85j964R9l14n1l03L25k32M72M22L73j151K0r3
2102.2A04j18M38m45L15j01k29J91K03l73K43j23K55l67L13j23N6j33k12n4N65k31
2084.7A74l67L32j17L4m2J06K19K34j10m77J64k86J90K74l8K2j28NJ71j47J50L23J346
2065.6B032J09j644l2k68j32M04o74O8KL9M16l76L60j02%p2L2L11n3j42j0j93j02L01
2045.6B74p7k21L65N0N7m97K68J75j96k19J30L4K17j03kQK14k20k21K38J45l77M90
$$ plain form
2178 290 150 628 230 275 170 214 570 440 236 248 214 1567 171 -303 55 135 -185 177 -211 -96 151 199 437
2158.9 437 264 -41 -46 734 218 295 -133 210 349 -10 42 259 295 271 145 171 -156 -127 341 201 -62 133 -51
2139.7 -51 374 -193 188 677 367 150 195 115 407 343 1759 -80 148 52 177 172 1 173 121 187 358 -12 -21 395
2119.7 395 93 610 17 281 505 1021 2986 2501 537 636 322 271 -32 293 61 533 955 1328 177 197 104
2102.2 104 -14 424 -21 294 193 -36 155 358 -15 228 105 360 -7 306 183 239 106 -106 -160 405 174
2084.7 174 -193 139 22 56 14 120 339 573 463 -14 150 -136 54 328 290 312 184 189 360 213 363 686 2032
2065.6 2032 2141 497 465 197 65 469 -205 -137 -135 -96 320 -56 304 202 202 130 162 473 420 278 268 75 -27 274
2045.6 274 197 -24 341 391 448 -49 219 394 198 -21 109 143 360 257 255 263 477 257 36 274 419 42 532
2026.4E32M14l09k70Q4K3N7l38j60K83j53K50M8n37K74K29l7j50K30n3k09p1L51k98
2007.3A90K08j15J98p8P4J7L39l9k21j76K25k97M90k21O5K3M38K1L31K8K387p62m67
1988.1B658N39O404N367j1002k248o78k62QJ92oK26Q97O99L004K1965k0865o094n80
1973.1B24l35J83r8J13J31k61k47M96kj41J24k62K75k53L83j00N7J70L94K8O69j206
1954.8C42n15K76m7L0m16R52l39l18rL02j04r1QO6R0R7J58m25O0Q35p37l44M14o1k02
1933.9B2j61J52O75p02K32m0J88K26n32K34K90m97O22k04m97M93k42K21J64m35L23
1916.4E32Rl4k7J0k51L13R8k9J34P94J422M283J0126j4568j737n94j21k92J93k39K38
1898.9B60K9l64j44L10L80j61l15L97J04m05J51K26l65J47J31j39o0r5J45j08J35k89
$$ plain form
2026.4 532 946 637 367 451 474 531 193 33 316 163 413 461 -76 198 427 390 240 470 417 208 137 488 190
2007.3 190 398 283 481 403 477 494 833 794 573 397 622 325 815 594 659 682 1120 1141 1472 1500 3887 3125 2658
1988.1 2658 3197 9601 14968 3966 1718 1040 778 786 978 972 1198 2095 2794 5798 27763 6898 804 224
1973.1 224 -111 72 -26 87 218 -43 -290 206 204 63 187 -75 200 -53 330 230 287 457 851 879 1548 342
1954.8 342 -173 103 56 86 -330 622 283 -35 -44 258 154 63 71 137 227 324 482 57 117 952 215 -129 285 224 22
1933.9 22 -139 13 688 -14 218 178 366 592 60 294 584 87 709 505 8 501 259 480 644 209 532
1916.4 532 541 507 480 490 239 552 650 621 755 1549 2971 7254 17380 2812 1075 481 360 68 261 22 260
1898.9 260 289 -75 -219 91 471 310 -5 392 496 91 242 468 103 250 381 242 182 87 232 124 259 -30
1880.6c0M24l42l18M11k42L20P6k54N5J72p2nM12q5l61P5j9N52l16LR01j088J69J71
1860.6F09j75R3r9Q6K15J04l56J030o00R61K254R990n756p051q27k13q5q6K07K21O3
1843.1E85m23j58O08k15j22L78j98k1m20L83n26K91J55O61N07K553k760l21k32l41
1826.5C84M50n20M84k83LQ2j32O71k62l37J253J287k183L40J54M60J352M476J4853
1810.6B2532j8275p27%k377o95k56l0M41k20l32K20O54j71o4l04k68K61K85J00N06
1794A280J349K562K6809k8418k759K30L86j058j63j82L04k30K71l55K1K53j55m3j04
1778.1bJ53k76L27j32N04m16J4L2k96l4K20j03j84j05L74J3l31J46L6K67j20j19l4
1759f6K30q2M77l21j57q8Q3k47j80L03N4R2l7M16k21l60N6P42o12j09J87J24P1k31
$$ plain form
1880.6 -30 394 52 -266 145 -97 223 299 45 100 272 200 195 607 522 161 236 217 769 453 456 1357 269 438 609
1860.6 609 434 527 428 514 729 833 477 1507 907 1868 4122 14112 8356 1305 478 265 180 94 301 522 585
1843.1 585 162 4 612 397 275 653 455 434 14 397 -129 162 317 978 1485 4038 1278 957 725 384
1826.5 384 834 314 798 515 518 600 468 1139 877 540 1793 3080 897 1237 1391 1851 3203 7679 22532
1810.6 22532 4257 3530 3530 1153 458 202 172 613 393 61 281 935 764 700 396 128 389 674 774 1280
1794 1280 2629 5191 32000 3582 823 1053 1439 381 218 36 340 110 381 26 47 300 145 102 -2
1778.1 -2 151 -125 202 70 574 158 172 204 -92 -126 94 -9 -193 -298 76 89 -242 -96 -60 207 87 -32 -66
1759 -66 164 82 559 238 81 -7 76 -171 -351 -48 6 98 61 477 256 -104 -48 694 82 -27 160 284 355 124
1739A24J05m85M33N7J17Q48K186l187J53l0l79N2J43J49l3L6j2L63o32J05j01J03J62
1719.8B77k82O03n65N3j8l92L24L28k95M2M24j50m60L00n9l7j31K60j30J5j18M91l50
1700.7A30L42p8k62P54j085M39j36M53j83m8N76q39K59k88L43Nl65k88K23M47k4l47
1682.3B8n7N37m54K41l19J31L40o92M86K7R7M36r0p40k01O81l73k11N36j03j1j28m4
1663.2A17k7j23J98k5k87j28J29K31L68Q5n11qRJ6O14k59q2K19l29k13O50o50K54N21
1643.2G69J85n26m4L8J97j98P3k58o5k31K24o9K43L48q10K69M41r5J93Q9J69l7m55
1624D50k92J50m2K05l43N39J44n80J72Q5k34K84m0j94M19k92P0J2l17K77Q9J67l5L
1604F97P63l69K55Q10J262N568J1203j2743J9291k4976l63j462L2J423j004l41m2j28
$$ plain form
1739 124 229 -256 177 234 351 1199 3385 198 351 321 -58 -6 137 286 253 289 277 640 8 113 12 115 277
1719.8 277 -5 598 33 86 68 -324 0 328 33 75 499 349 -111 189 130 93 -38 222 92 107 -11 480 130
1700.7 130 472 394 132 886 -199 240 104 557 374 326 902 63 322 34 377 382 17 -271 -48 399 375 28
1682.3 28 -29 508 54 295 -24 107 447 -245 241 268 365 801 711 -29 -230 451 78 -133 403 300 289 161 117
1663.2 117 90 -33 165 140 -147 -275 -146 85 453 538 27 19 28 44 658 399 317 536 207 -6 644 -6 248 769
1643.2 769 954 428 384 422 619 421 494 236 171 -60 164 95 338 686 -124 145 586 491 684 773 942 905 450
1624 450 158 308 266 471 128 667 811 231 403 488 254 538 498 304 723 431 501 513 196 473 562 729 694 697
1604 697 1460 1091 1346 2156 3418 8986 20189 7446 26737 1761 1398 -64 -32 1391 387 46 4 -124
1589a24L7o9R9L9K31m61N13j50l2K98l7N59n14n3O49K370k784j86O6n13K22J43l25
1569.9b2K41j18J03o5K1K70k99M1n01M58o4K74J3l61L63l40O2k88M34R7k45J95mr1
1549.9A74l68j67N25l4J08K94Lj63J59m15K45n44P84l07J65m79O8j81M94l12l4n6J47
1530.7A06jk25j92J98M99l0k13M1J35j69J04LK59l32K67k04J3k66K38J49j71j14O42
1511.5G37q2n74l52L68J92k57J79J5L65l46m0k16J61N6j41K15J54j69j1K36l09L3M30
1492.4F44m10M39k73m77j27O49m84M53l43K16R0P1m4l99M58m97K90J08L68m16O7L4
1474D17j82J64J24l90K64K66n84N38P7l94J81m71M93r4R7p19N93j8j28P5M8J97o72
1454.9a18Q67l54J64OR4Kk99L69n94M23j75R8j80J20m2l40N37m57N20j11L7J70J1N41
$$ plain form
1589 -124 -87 -156 -57 -18 213 -248 265 115 83 381 344 903 389 336 985 3355 571 385 451 -62 160 303 -22
1569.9 -22 219 101 204 139 160 430 131 172 -329 129 65 339 352 -9 354 14 76 -212 222 319 74 269 265 174
1549.9 174 -194 -361 164 130 238 532 535 372 531 116 361 -183 601 294 459 -20 48 -133 361 49 15 -41 106
1530.7 106 105 -120 -312 -114 385 355 142 183 318 149 253 256 515 183 450 246 259 -7 231 380 209 95 737
1511.5 737 655 81 -271 97 289 32 211 226 591 245 205 -11 150 206 65 280 434 265 254 490 181 214 644
1492.4 644 234 673 400 -77 -204 445 -39 414 71 287 377 448 404 5 463 -34 256 364 732 316 383 417
1474 417 235 399 523 133 397 663 79 617 694 300 481 10 503 409 506 -213 380 362 234 309 357 554 -118
1454.9 -118 749 395 559 565 659 661 362 731 137 560 385 483 303 423 381 41 578 121 641 530 567 737 748 1289
1434.9A289l38j99j79j4j7O9J05j0k95M48K63m5n0K92p5J53L53K30J884L804J5559
1417.4B3227j6760m845o38m25J67J40J54o9J47L90O72K171J5059j6942k989K61j05
1403.2c85M32m6J06K47M5O7J23K09J515L160J4014j6308k803o32K62k0L78J03p55J49
1386.6a39j3K50J52o00K46p5O4K72k1n72L22L13p36P61p3m89J06J37L1J99R4j38L2
1367.4A23j16n3J28j44J61q3L6N3M05j65J29l30J25m77L45l00L42J3O42m43l00L55
1349.1D46l79J78K0m35K29P62q79M57l17j09J10l09N50l54Q3N38m23K05K07k68J39
1331.6D51k11K21N44K294k117p57n5K0j8N33L67J483k482k09k25J29O6K18l30L81r3
1314.1B10j03K03j02j06j01o1L06l78J62J76j55J33J29l01j97M6L57K28Q6n24M26l18
$$ plain form
1434.9 1289 951 752 573 559 542 611 716 706 411 859 1122 1077 1027 1319 1244 1397 1750 1980 3864 7668 23227
1417.4 23227 6467 1622 984 559 726 866 1020 951 1098 1488 2160 4331 19390 2448 -541 -280 -385
1403.2 -385 47 1 107 354 399 466 589 798 2313 5473 19487 3179 376 -256 6 -14 364 467 -288 -139
1386.6 -139 -152 98 250 -350 -104 -179 -115 157 136 -436 -114 199 -537 224 151 -338 -232 -95 -64 135 229 91 123
1367.4 123 7 -46 82 -62 99 16 52 105 510 345 474 144 269 -208 137 -163 179 192 834 391 91 446
1349.1 446 67 245 265 -170 59 821 -58 399 82 -27 83 -226 324 -30 53 591 168 373 580 312 451
1331.6 451 240 461 1005 3299 1182 425 370 390 372 905 1272 2755 273 64 -161 -32 34 252 -78 303 210
1314.1 210 107 310 208 102 1 -60 246 -132 30 206 51 184 313 12 -185 -139 218 446 532 8 434 116
1295.8A16j83L05J71j4m34qM14L17n34J4N66q96M72j64L87m00K71j94RTN1J09J24j75
1275.8C33J47m49K73K3m43L58j47r5L93l61J83Q7l79J10M3M0J66l92M47J05j85k49
1257.4HL72J56j18k09K60Q9o99N46n6L9Or4M8j6K33r9TK8OJ44k39M83j00k45j40O85
1235.8I89n34K0Q8m39P12J03m42K90m39O11J05J80kO59J757O744M449j2032j808o0
1219.1I51n56Q6J89Q3j37q0m8P9l7Q29M71J385k067q57O21J19j9K25j0Q23J476L439
1200.8F965K0858k3359l983n09k62l0J21k58M43m7M15n81j77J55L12l2K94n68Q1J18
1184.1d4o0N73m52J4p3N2O7m1L34k63j16K53l55J10p3O80l10k52M89m15j57K0J01j06
1164.1b4M33l92M40l60M84J00n45M74j33L70k1L85k65O14O84J436J0989m082j0222
$$ plain form
1295.8 116 -67 238 409 395 -39 -47 367 684 150 164 730 -166 306 142 529 129 400 206 215 224 275 384 508 333
1275.8 333 480 31 304 327 -116 242 95 0 393 32 215 302 -77 33 76 116 282 -110 337 442 257 8
1257.4 8 380 536 418 209 469 558 -141 405 349 388 394 300 348 332 565 466 367 395 401 545 306 789 689 444 304 989
1235.8 989 455 475 563 124 836 939 497 787 348 959 1064 1244 1242 1901 3658 10402 14851 2819 1011 951
1219.1 951 395 481 670 753 616 536 488 567 530 1359 1830 3215 1148 291 912 1031 1012 1237 1227 2050 3526 6965
1200.8 6965 27823 4464 481 -28 -290 -320 -199 -457 -14 -61 354 -227 -404 -249 63 31 325 -243 -162 -44
1184.1 -44 -104 469 17 31 -42 10 77 36 370 107 -9 244 -111 -1 -74 606 296 44 533 118 -39 -19 82 -24
1164.1 -24 409 17 457 97 581 681 136 610 477 847 826 1211 946 1560 2244 3680 14669 10587 365
1148.3C65q85N53M74k00L92n8k85N12k49M22J39Q49N380J3509j8926j621l29N92q51
1132.5b17Q45l07j63r1j82L42k68K12n04L31j29M92j79O4l32J43P1p6j75M24p23N20
1114.1I8Q0k65J56L38l32J11M26l86K8O9P1O9l11q0L14j09k04J43p3k7L05J37m27O09
1094.1G40m4k57k03J44j29j81J98P8j1r4J04L50K01qN67K961J4399j7078q22j0K541
1076.6C446l234J6m8q4J49l31L50p7M09r2J64j57L52J18L48K2J536N253P520j3576
1060B084j236l40Q57j099j32j71L71l66K39m23J34o1M48n54J0K9Q5J00J23K966k853
1042.5B11m09J67m3M39j31o52%K09J99J09L1j77k26M41k80L55k38K27k17l5j50j5L6
1023.3a49J69j48O1K13l40J31j14L20j25j68J45M2r4J29J33l1m0J4j4J59n1j38j88
$$ plain form
1148.3 365 -520 33 507 307 699 641 356 868 619 1041 1180 2029 7409 20918 1992 371 42 634 -217
1132.5 -217 628 321 158 67 -115 227 -41 171 -333 -2 -131 361 182 246 -86 57 128 52 -123 301 -422 98
1114.1 98 178 -87 69 407 75 186 612 226 254 323 394 463 152 72 386 277 73 216 143 116 421 558 131 740
1094.1 740 696 439 236 380 251 70 268 346 335 241 345 695 896 888 1455 4416 18815 1737 915 905 3446
1076.6 3446 212 228 180 96 245 -86 264 187 596 504 668 511 863 981 1329 1351 2887 8140 15660 2084
1060 2084 848 508 1365 266 134 -37 334 -32 207 -216 -82 -143 305 -249 -239 -210 -125 -25 98 3064 211
1042.5 211 -198 -31 -74 365 234 -418 -418 -209 -10 99 130 -47 -273 168 -112 243 5 232 15 -20 -170 -185 -149
1023.3 -149 20 -128 -67 146 -194 -63 -177 143 18 -150 -5 37 -57 72 205 174 134 148 134 293 242 104 -84
1004.2h4qJ83J38j40K94K6k99L22k77O14q11J85k60M04m33L29M28K9l17q8k96M99M4
985D82Q7l30K61J21r0J000k02q4K42K906J4191j5688l062O32m04l99J25J60m07O50
968.3A91M5k4pL2p4J09j22K5J66l79L83JJ2j18J46Q15j72p18OM73k68N63K36R12K647
947.5D880J8922k1965j940J056K983l623n51j20J76o4k86j67J32K94P3K56n47M54j11
931.7a48j05L34j59m4l5m8L3O8l04N10j15n6K9k48k05M30l03L48L79m09R4L5N8k99
911.7a60K07k97L86k4k38n4J53k66L34r6j98O09k00m51J86K38m39J43Q2J61J81n20
893.4b63J04l35K92Q7J89O43p20l19L72j9k39o9J57kK07j47K71j9j04N77q83L13q9
874.2DL99n34K95L5K34k95l4p9L6q3r2j30L83J60q8k21k20M89l97J04j60oJ08K52m23
$$ plain form
1004.2 -84 -92 91 229 89 383 409 110 432 155 769 -42 143 -117 287 -146 183 611 640 323 235 -61 438 482
985 482 569 239 500 621 531 1531 1329 1245 1487 4393 18584 2896 -166 466 62 -337 -212 -52 -459 191
968.3 191 236 212 205 237 163 272 150 175 341 -38 345 346 358 240 386 1201 1029 311 317 790 522 1085 1321 2233 4880
947.5 4880 23802 1837 -103 953 3936 313 -238 -358 -182 -246 -532 -699 -567 -273 -200 56 -491 -37 -148
931.7 -148 -253 81 -78 -122 -157 -205 -172 -104 -408 102 -13 -69 -40 -288 -493 -63 -366 -18 361 -48 46 81 139 -160
911.7 -160 47 -250 136 112 -126 -180 -27 -293 41 -55 -253 356 156 -295 -109 129 -310 -167 -85 76 257 -263
893.4 -263 -159 -494 -202 -115 74 717 -3 -322 50 31 -208 -277 -120 -122 85 -62 209 190 86 663 -220 93 4
874.2 4 403 -131 164 199 433 138 104 25 61 -22 -114 -244 139 299 211 -10 -230 259 -138 -34 -194 -200 -92 160 -263
853.4b63L40K4m17J22M68k75J7P5K44j80K18m67k29J35n0J27L9j5M20k58n91N44N5
834.2H3j05K51j90R3Ok05L72m91R5M1J06K20p4j14L2j84L31m4K412k582k15J68O0j12
814.2d6m9j89J00j86O45l89L87l23l26K17J61k70R2L91l6k34p6k4K09M9J83j73l33
795.1b20K88L89m46J2r8j21N07k5r4J1N3q9O2m36L11J09k0l32l1Q7J09l05L68j29K89
774.2B49j92j80j57k26M08K58k50r2K22k0N8K9N4k91m52M66j03J99J72j52l21J39j50
755.1c32K41O3k46p1L59l8J29j50n28N17j50K60L7j30J17P0l87M46J78M8k21M25o38
735.9aj67J79k93M42rK86p74K78l79L18J90k27j32l9J65L72J21l09J12k13j8QJ74J88
715.9B72k23L89k99j46j71L13l79o0M67j6l64L19k2P2k72L3k56J12L85L03p64L13j23
$$ plain form
853.4 -263 77 101 -316 -194 274 -1 16 91 335 155 373 -94 -323 -188 -238 -111 -72 -87 333 75 -516 28 83
834.2 83 -22 229 39 132 138 -67 305 -186 -91 -50 56 276 202 88 120 -64 267 223 2635 53 -162 6 66 -46
814.2 -46 -95 -284 -184 -370 275 -114 273 -50 -376 -159 2 -268 -176 215 179 -55 -131 -155 54 103 286 113 -220
795.1 -220 68 457 11 23 -75 -196 311 286 192 203 256 167 229 -207 104 213 193 -139 -170 -83 26 -279 89 -40 249
774.2 249 57 -123 -280 -506 -98 160 -90 -182 40 20 78 107 161 -130 -582 -116 -219 -20 152 0 -321 -182 -332
755.1 -332 -91 -28 -274 -345 14 -24 105 -45 -573 -56 -206 54 91 -39 78 148 -239 207 385 433 212 637 -1
735.9 -1 -168 11 -282 160 151 437 -337 -59 -438 -120 70 -157 -289 -328 -163 209 330 21 133 -80 -98 -90 84 272
715.9 272 49 438 139 -7 -178 135 -244 -304 163 147 -217 102 80 152 -120 -87 -343 -231 154 457 -307 6 -117
696.8a17K87n05K80k30N11j30P9j0j35k15K56N12r04M65Lk8M5m86M26o5R5j74n8J1
676.8h7l45L50j1J65k56k2N96q57L81l01J14K99K85m1m23M21m86P1QM9MJ55P5k82j54
655.9b92J73O8K23k36p7M9k4N01k05k84J15M58o16J96l33O22n42J19K09l43P10k55
637.6B36K3o39L20j97J37N70K9pl59O5j55L90k01j5q8M50m2P01J625k213n45O5K23
618.5C73K33l45K83k02L4M21J83n3j28K50O63J600Q757n052o871n75L78q7q8k13P6
601c63R4L7j54O9k10J02L65n6k73J08J23k04K99L77j33Pn11j2j82L26j89L29R5l06
581b62j18J58m0L81r1o5K35l35K10k15L10k6K36Np39o4L15K69m14J3J75N9P6j32R9
560.1D0j05k6K42K06q08M50N9J85l13j01K60k72j99O17m05L51m56K83J05m88L97m8
$$ plain form
696.8 -117 170 -335 -55 -285 226 96 175 165 30 -185 71 583 -321 144 147 119 164 -322 104 39 134 -40 -98 -87
676.8 -87 -432 -82 -93 72 -184 -206 390 -467 -86 -387 -273 26 311 270 -153 268 -218 -147 -139 -90 -86 69 144 -138 -292
655.9 -292 -119 -51 172 -64 -141 -92 -116 385 180 -104 11 469 -147 49 -284 338 -204 -85 124 -219 491 236
637.6 236 259 -380 -60 -257 -120 450 479 472 113 178 23 413 212 197 109 559 517 1218 2843 630 85 150 373
618.5 373 606 261 544 342 376 797 980 927 799 1049 1712 3312 12069 7017 146 -429 -51 -138 -226 -439 -363
601 -363 -269 -232 -386 -317 -527 -425 -60 -116 -389 -281 -158 -362 -63 314 181 188 -323 -335 -517 -191 -380 -51 44 -262
581 -262 -380 -222 -262 119 28 -37 198 -137 73 -142 168 142 378 383 -356 -420 -105 164 -250 -237 -62 -3 73 -59 40
560.1 40 -65 -91 151 357 -451 -1 58 243 -70 -171 89 -183 -382 235 -170 181 -275 8 113 -375 22 -26
541.8b6j10K81j94o9L16n9l64K30K29J87r27Q78n17L33k85M50l68O6m46L54kJ11j56
522.7h8o8L13L9N9l35J86j56j87L49o5j04L98o9k89k66L75K12l45J05k67j25P98l43
503.5A27k19K31l08J3Q9j21M61J8n13L65k08K38O2k97j38j7K34J23j61k52N15o19K79
484.3i8j1j8k61K96J13M8N5J58l32l27M30M43o10m5J55J6k74L62K05m44k16K87l5o5
464.3a68J48m02m1K42M50l22J69J38m64L20K10j82J07j70j16on68Q41k57k97J24L49
446A05K49l75j01K44j69L06m95q7J94J14J70k89n4K12k04Q9J56K25j53q4j74j28R4
426.8a55o2L64o20J84K42J08j44J82j04K43m25J90NL05m59J68l73O9J53R1j74J58l56
407.7d10M12l95N08k98O5M68Q1o30J2M81o10L08n9Nj00K3j11J88n5M43m16j93L15R4
$$ plain form
541.8 -26 -136 145 -49 -118 198 139 -225 5 234 421 -506 372 -145 188 -97 353 -15 51 -395 -41 -43 68 -88
522.7 -88 -156 157 196 255 -80 106 -50 -237 112 47 -57 341 272 -17 -283 92 304 -41 64 -203 -328 470 127
503.5 127 -92 139 -169 -156 -67 -188 273 291 -222 143 -65 173 235 -62 -200 -217 17 140 -21 -273 242 -377 -98
484.3 -98 -109 -127 -388 -92 21 69 124 282 -50 -377 53 496 -114 -159 -4 12 -262 100 305 -139 -355 -68 -103 -168
464.3 -168 -20 -422 -463 -221 229 -93 76 214 -250 70 280 98 205 35 -81 -87 -655 186 -71 -368 -244 105
446 105 354 -21 -122 122 -47 259 -236 -323 -129 -15 155 -134 -188 24 -180 -91 65 290 137 53 -121 -249 -155
426.8 -155 -217 147 -473 -289 -47 61 -83 99 -5 238 -187 3 8 313 -146 22 -351 -282 -129 -38 -212 -54 -410
407.7 -410 2 -393 115 -183 -118 350 431 -199 -187 294 -316 -8 -67 -62 -162 -139 -250 -62 -117 326 -90 -283 32 126
387.7A26m59K01K90L08p55p2K21J16l4N0Q7J03j85J43k33L57k77jJ13n25N69m23K18
368.5f2J45j76k04l4N10l26J48p5K21M1k83K01R4m30L67j16J25j24l20P8K86M9l18
349.4b03N7Q3p7R3L86%n97K65K00l58J40k97M32J54l91n0K57o7k02J08K89l16J91P7
329.4A74J38l75q6K68N6m43K05K72m16J16J26j1lk15r7J08P9m4R3K01K5M70l35n43
309.4b37L17M1k19k0o1O4O5J65k1k35M63k7k47J64m07J05O67p36O6L8j99K04L15k77
289.4a2J87l35J70j8J48L9l76m8K16j21j2O2K7l60O62r1L1L4o43N37J20j72k43N2Q3
268.6f3l69N0M80j95j53J5J31K44M3l80K60l73K81R1j8L02k00n43L63r6m1o7Q6M60
248.6C08l9n90J58K4j51N35l21L37j19n14M21J50j17J89l63J94m4J33j82K34n32M13
$$ plain form
387.7 126 -333 -132 158 466 -289 -361 -140 -24 -58 -8 79 182 -3 140 -93 264 -13 -14 99 -426 143 -280 -62
368.5 -62 83 -93 -297 -331 179 -147 1 -74 147 188 -95 106 200 -230 137 21 146 22 -298 -220 66 115 -203
349.4 -203 -146 -63 -140 -47 339 339 -258 7 207 -151 -11 -308 124 278 -113 -163 94 27 -175 -67 222 -94 97 174
329.4 174 312 -63 -149 119 175 -268 -63 209 -207 -91 35 24 21 -194 -291 -183 -104 -148 -55 146 171 641 306 -237
309.4 -237 80 121 -98 -118 -179 -115 -50 115 94 -141 322 295 48 212 -195 -90 577 -159 -93 -55 -254 -50 265 -12
289.4 -12 175 -160 10 -8 140 179 -197 -245 -29 -150 -162 -100 -73 -433 229 138 169 203 -440 97 217 45 -198 -146 -63
268.6 -63 -432 -382 98 -97 -250 -235 -104 140 183 -197 63 -310 -29 62 44 346 146 -397 -34 -130 -171 -238 -152 308
248.6 308 269 -321 -163 -139 -290 245 -76 261 142 -372 49 199 82 271 -92 102 58 191 9 243 -289 124
230.2A24l80M61M8K02o2o20M11j97J32l36K52O15p24j86N81P3m00K9J06L6k37M65o28
211.1b35M03k41M09r7k63j47o8n3J86J47J88k92J7K53q8j86M22m79j2K01j00J38j24
191.9b1J18n2j24J65n35O15m91N40k11l5J58j20K5J14J71l70L49n01n7L77J30l6l30
172.8a21m2j03k35N82N8j1j37j17L49L0R4n71J58L10k04J03k75m7K70R7k26J21m25
153.6c42Q78n01m34M76j49q2M9J8J68k06M53k7n30K21M68m38J01k05J2j20N7K85J39
134.4B91l92N1N5j92K45O8o29P90j14J6J26o71N80k53l66P50l40j53J46m3K73l77K38
115.3I9j95J63J5J29m85M08M7Q1k95K26m89K94k4J28j67N8l73N05p47O28l2k60L53
96.1F7J4l76R2L73j32Q3r3J0P3L42l62j36L4L53m65O92m62J8J62j13m33J13O14m62
$$ plain form
230.2 124 -256 205 253 455 393 -227 184 -13 119 -217 35 650 -74 -260 321 394 -6 23 129 165 -72 393 -235
211.1 -235 168 -73 336 239 -24 -171 -239 -292 -106 41 229 -63 -46 207 119 -67 355 -124 -136 65 -35 103 -21
191.9 -21 97 45 -79 86 -449 166 -325 215 4 -31 127 7 32 146 317 -53 296 -205 -262 115 245 209 -121
172.8 -121 -163 -266 -501 81 139 128 -9 -126 223 253 347 -224 -66 244 40 143 -132 -179 91 188 -38 83 -342
153.6 -342 536 35 -399 77 -72 -154 -105 -87 81 -125 328 301 -229 -8 460 22 123 -82 -70 -190 -133 152 291
134.4 291 -101 -50 5 -187 58 126 -503 287 173 189 315 -356 224 -29 -395 355 15 -138 8 -35 238 -139 99
115.3 99 -96 67 82 211 -274 134 181 262 -33 193 -296 -2 -26 102 -65 -7 -380 125 -622 6 -26 -286 67
96.1 67 81 -295 -203 170 38 121 28 38 111 453 91 -45 -11 342 -123 569 107 125 287 174 -259 -146 468 6
76.1FL98k24k34K62J92j0k34k35L7J87j88R5k39J77L1j93J36J03J62k04j54M99l25
57D5J45k33p1M15j86k58J56J44j66l1M25j17n43M92k52K34l34M43m54L24l96K39J02
37.8A23o8j14m3L95l06k79N79J02m25k2J23J22j13j73K46Q3J38K48p9N82o95%o21K48
17.8E1nk10O4J25p2K67l84J35l05M19m19L78j39K55M3j44M75p85M04Q4j27L84%r0m32
-3b8J59k77M29l74N51k12m03L15O8l6n60L87j64J19L33j84K60o70L34P3l86%K84j7
-23Aqr9j4J72m50P76n06J66j68R7j59J44N04q63L66QM8j62K9O8k16K47K83M8%k66J03
-45.5A49k25J42K79q4k60P9j9j99j68L21J52lP5l77J42J22k90K74k45L37l50j2%L23
-65.5A63Rn0K3r3l71M65k92k59O98k51j47n0L06o9l13K87K32k28j74K18l49O33k05
$$ plain form
76.1 6 404 180 -54 208 400 390 156 -79 -42 145 -43 52 -187 -10 21 -172 -36 67 229 25 -129 370 45
57 45 190 -43 -114 301 115 -143 13 157 -9 -40 385 268 -275 217 -35 199 -135 308 -146 178 -218 21 123
37.8 123 55 -59 -102 293 -13 -292 287 389 -36 -58 65 187 74 -99 147 230 368 616 537 1119 424 424 -197 51
17.8 51 46 -164 -100 25 -47 220 -164 -29 -334 85 -334 44 -95 160 203 59 534 -251 153 237 110 494 494 404 -28
-3 -28 131 -146 283 -91 460 248 -155 160 228 192 -368 19 -145 -26 307 123 383 -287 47 120 -266 -266 18 1
-23 1 -7 -106 -120 52 -398 378 -128 38 -130 -33 -192 -48 456 -407 -41 -33 15 -147 -118 -50 -266 -19 264 312 312 46 149
-45.5 149 -76 66 345 261 1 80 61 -138 -306 15 167 164 239 -138 4 126 -164 110 -135 202 -148 -160 -160 163
-65.5 163 172 122 145 52 -319 146 -146 -405 293 42 -105 -155 151 82 -231 56 288 60 -114 104 -245 388 183
-84.7A83%j49K9K07j78j51N02l20R2k94k2J40l2j69J83J98n80L05k30K11K72R7m83
-103.8a89L75j83%L66n04L05j68j08J04K30j16Mo1K70R9m41l6q8K04j26J91l43L41
-123A26L50J47n80j22%J40K49k02K91n61Q04r96J75R6L22k65K85L25l75m56K78p1k2
-142.2f2K1K7j22L89J5k80%j73K02K01m1j05J1Q1r6k65L75m50K66j27K54N7l2j4J39
-163B71l11R8m4q4k72N84l65M91%n56J43r5J75N3l81M48j7n2J17J52k56j83O9oP06
-183.8F85q86j86N38K11k51k74N33j71j96%K67j11j35n57N28m8O48o22k39K02P4m3
-202.1c3N21n29N4j93K40L5j37j19M96m64J6J93%J67j98K02N7j25l73L98m21L00K49
-221.3C36n97L04j48r7M33l13K79k15j92M03k49N69m61%M0K48Q6l2j80j72P4j89L06
$$ plain form
-84.7 183 183 34 63 270 92 -59 443 123 215 -79 -101 39 7 -162 21 219 -361 -56 -286 -75 197 294 -189
-103.8 -189 186 3 3 369 -135 170 2 -106 -2 228 112 116 55 325 424 -17 -53 -141 63 -63 128 -215 126
-123 126 476 623 43 -79 -79 61 310 108 399 -162 642 -354 -179 -83 239 -26 259 584 209 -247 31 -40 -62
-142.2 -62 -41 -14 -136 253 268 -12 -12 -185 17 218 177 72 83 164 68 -197 178 -272 -6 -133 121 178 146 132 271
-163 271 -40 58 14 -70 -342 242 -123 368 368 -188 -45 -140 35 88 -293 155 138 86 203 355 99 -84 -15 -21 685
-183.8 685 -201 -387 151 362 111 -163 370 199 3 3 270 159 24 -533 -5 -53 595 -27 -266 -64 10 -33
-202.1 -33 488 -41 13 -180 60 95 -42 -161 335 -129 -113 80 80 247 49 251 308 183 -190 208 -213 87 336
-221.3 336 -261 43 -105 -202 231 -82 197 -18 -210 193 -56 513 52 52 92 340 426 394 214 42 116 -73 233
-240.5B33k45mJ38j61J02k15N1K48n21L33%K35l68M30l50L05%o6j77J71m86O37l01
-259.6a1l48O39J27o25K43J0J91j99J17n4j7j41j08J92j00L27l45%M15l41Q3j01P6
-278.8C0J58N45m71l71k05L07k84K69K30j52l66N64j77r8M39l63N8K7p7%l67M65N7
-297.9B18l58o8J84m2M33k43j62k3L74j44j77J51O2o40O38k13p3M21k86M02m30%k81
-317.1b57K24j7N05m13j38L48l61L00j84k27J79o1J84L98m50L1M0n44M34j18K69J02
-335.4B44p6%m06K96J53m67M35j83j5k11O82k65j70k08K94M3j07P0j78J07n53R22j0
-354.6C97l00K58%l77R8K22o10L90r6j1n9J65K89n06J00j03M05m1k9n9k51n1p4L93
-374.6A50j95kK04n8P9%l90N38O2m49J69p4j14L57n2j41nQ7n05qQ01n89k3r9K24j08
$$ plain form
-240.5 233 -12 -16 122 -39 63 -152 -101 147 -374 -41 -41 194 -174 256 -94 211 211 145 -32 139 -347 290 -11
-259.6 -11 -359 280 407 -218 25 35 226 27 144 90 73 -68 -176 16 -84 243 -102 -102 313 -28 55 -46 30
-278.8 30 188 733 262 -109 -314 -7 -291 -22 208 56 -310 254 77 -21 418 55 113 140 63 63 -304 161 218
-297.9 218 -140 -208 -24 -66 367 124 -38 -61 313 169 -8 143 205 -435 203 -10 -83 338 52 454 24 24 -257
-317.1 -257 -33 -50 455 42 -96 252 -109 191 7 -220 -41 -102 82 480 30 61 101 -443 -9 -127 142 244
-335.4 244 168 168 -238 58 211 -256 179 -4 -19 -230 452 187 17 -191 103 146 39 109 -69 38 -515 407 397
-354.6 397 97 355 355 -22 76 298 -312 78 -18 -29 -88 77 366 -140 -40 -143 262 221 192 133 -118 -169 -243 150
-374.6 150 -45 -47 157 99 178 178 -212 326 388 -61 108 34 -80 277 225 84 79 166 -339 -347 454 -135 -158 -257 -33 -141
-396.2a41k14M13K78n13K57%m94M7p5J76J83l81J82J97L69l72K54J42k90k84N71j99
-414.6A06j25L19p8k96K21k66P8%j41p6J92J78k59j75J27J26r2j16K22K30N9p7j6j5
-434.6A26j22K47j80J06J75k10l45P5%K92l02L07R8k66J09jk33K4qJ92O4J05J89p92
-454.6c50P3J08J46k07M28k13R3k78M52%m51L5M45j77o8M0j18j06J19N8J76m35K51
-473.7B1l85J64Q1J40R4l6j85K39J1K2j90L47%k58m30M12J01j86J42M8m2k34M84o94
-493.7c34O82o3M7J64n23N43m62K9J8k57K69J87k39%Qj68K66m61M67N5l0j9l42J96
-513.7C3K92k16k12K80M1k01L57m54J32J45O8k56K69q9%q7J47l07L35J46j57r9k58
-532.9i1K44J44r0j82j33M65k87m9k7k40O05l03n71M74K6J4%J23n0n6L6J61l49K30
$$ plain form
-396.2 -141 -355 58 336 -177 80 80 -414 -367 -442 -266 -83 -464 -282 -85 284 -88 166 308 18 -266 305 106
-414.6 106 -19 300 222 -74 147 -119 -41 -41 -182 -258 -66 112 -147 -322 -195 -69 -161 -277 -55 175 234 157 141 126
-434.6 126 4 251 71 177 352 142 -203 -128 -128 164 -138 169 267 1 110 109 -124 -100 -108 84 148 253 442 -350
-454.6 -350 -277 -169 -23 -230 198 -15 78 -200 252 252 -199 -164 281 104 36 76 -42 -148 -29 29 205 -230 21
-473.7 21 -364 -200 -119 21 115 79 -106 133 144 166 -24 323 323 65 -365 47 148 -38 104 152 110 -124 360 -334
-493.7 -334 348 285 332 496 -27 516 54 83 101 -156 113 300 61 61 69 -99 167 -294 173 228 198 179 -163 33
-513.7 33 325 109 -103 177 218 17 374 -80 52 197 265 9 278 189 189 102 249 -58 277 423 266 167 -91
-532.9 -91 153 297 207 25 -108 357 70 21 -6 -246 359 56 -515 -41 -15 -1 -1 122 72 16 52 213 -136 94
-552.9I4j27P6j60K57n4j67J6L71p26M20n3O5O2L63j46m24J85k51%K51k10M22K28q70
-572.9c78L94M15r6r7l38J96k75L77j72J74j29K68m85J62L51l90n4J88%m8q3j9j6k15
-592.9b70K04L24k58J11O4m6J25j96P1J37K12k45k28J08J35k76L32j67K84j908
-609.5a487
$$ plain form
-552.9 94 -33 43 -117 140 86 -81 -65 306 -420 0 -53 12 74 437 291 -133 52 -199 -199 52 -158 264 492 -378
-572.9 -378 16 431 335 238 -100 96 -179 198 26 200 71 339 -146 16 367 -23 -77 111 111 63 -20 -39 -55 -270
-592.9 -270 -66 258 0 111 175 129 254 58 129 266 478 233 5 113 248 -28 304 137 421 -1487
-609.5 -1487
##END=$$ End of the data block
