##TITLE=  aspirin,  2-(acetyloxy) benzoic acid
##JCAMP-DX= 4.24
##DATA TYPE= LINK
##BLOCKS= 4
##ORIGIN= Dept of Chemistry, UWI, Mona, JAMAICA
##OWNER= public domain
##TITLE= aspirin in DMSO,  2-(acetyloxy) benzoic acid
##JCAMP-DX= 5.01  $$ exported from JSpecView
##DATA TYPE= NMR SPECTRUM
##DATA CLASS= XYDATA
##BLOCK ID=1
##ORIGIN= rbadger  PROTON-UWSP
##OWNER= public domain
##LONGDATE= 2012/03/18 18:56:22.0774 -0500 $$ export date from JSpecView
##SPECTROMETER/DATA SYSTEM= Bruker BioSpin GmbH 400 MHz
##$MODELS=
<Models>
<ModelData id="aspirin" type="MOL">
aspirin (2-(acetoxyl)benzoic acid)
RLACD/Labs0520021140  
http://wwwchem.uwimona.edu.jm/spectra
 21 21  0  0  0  0  0  0  0  0  0 V2000
   -0.8665    0.8024    0.0000 C   0  0  0  0  0  0  0  0  0  0  0  0
    0.4499    0.2908    0.0000 C   0  0  0  0  0  0  0  0  0  0  0  0
    1.5489    1.1509    0.0000 C   0  0  0  0  0  0  0  0  0  0  0  0
    1.3462    2.5308    0.0000 C   0  0  0  0  0  0  0  0  0  0  0  0
    0.0581    3.0583    0.0000 C   0  0  0  0  0  0  0  0  0  0  0  0
   -1.0298    2.1931    0.0000 C   0  0  0  0  0  0  0  0  0  0  0  0
   -2.1591    0.0020    0.0000 C   0  0  0  0  0  0  0  0  0  0  0  0
    1.5412   -2.0441    0.0000 C   0  0  0  0  0  0  0  0  0  0  0  0
    2.9836   -1.6136    0.0000 C   0  0  0  0  0  0  0  0  0  0  0  0
    0.5219   -1.1013    0.0000 O   0  0  0  0  0  0  0  0  0  0  0  0
   -3.2313    0.5672    0.0000 O   0  0  0  0  0  0  0  0  0  0  0  0
   -2.0988   -1.3365    0.0000 O   0  0  0  0  0  0  0  0  0  0  0  0
    1.1799   -3.1900    0.0000 O   0  0  0  0  0  0  0  0  0  0  0  0
    2.5593    0.7752    0.0000 H   0  0  0  0  0  0  0  0  0  0  0  0
    2.2106    3.1880    0.0000 H   0  0  0  0  0  0  0  0  0  0  0  0
   -0.0976    4.1321    0.0000 H   0  0  0  0  0  0  0  0  0  0  0  0
   -2.0482    2.5645    0.0000 H   0  0  0  0  0  0  0  0  0  0  0  0
   -1.1721   -1.6380    0.0000 H   0  0  0  0  0  0  0  0  0  0  0  0
    3.5898   -2.5187    0.0000 H   0  0  0  0  0  0  0  0  0  0  0  0
    3.2178   -1.0204   -0.8881 H   0  0  0  0  0  0  0  0  0  0  0  0
    3.2178   -1.0204    0.8881 H   0  0  0  0  0  0  0  0  0  0  0  0
  1  2  4  0  0  0  0
  1  6  4  0  0  0  0
  1  7  1  0  0  0  0
  2 10  1  0  0  0  0
  2  3  4  0  0  0  0
  3 14  1  0  0  0  0
  3  4  4  0  0  0  0
  4 15  1  0  0  0  0
  4  5  4  0  0  0  0
  5  6  4  0  0  0  0
  5 16  1  0  0  0  0
  6 17  1  0  0  0  0
  7 12  4  0  0  0  0
  7 11  4  0  0  0  0
  8  9  1  0  0  0  0
  8 10  1  0  0  0  0
  8 13  2  0  0  0  0
  9 21  1  0  0  0  0
  9 20  1  0  0  0  0
  9 19  1  0  0  0  0
 12 18  1  0  0  0  0
M  END
</ModelData>
</Models>
##$PEAKS=
<Peaks type="HNMR" xUnitsExpected="ppm"  >
<PeakData  id="1" title="methyl group ~2.23" peakShape="singlet" model="aspirin" atoms="19,20,21"  xMax="2.36" xMin="2.1"    />
<PeakData  id="2" title="OH ~13.10" peakShape="multiplet" model="aspirin" atoms="18"  xMax="13.30" xMin="12.95"    />
<PeakData  id="3" title="H14 ~7.18" peakShape="multiplet" model="aspirin" atoms="14"  xMax="7.25" xMin="7.07"    />
<PeakData  id="4" title="H16 ~7.36" peakShape="multiplet" model="aspirin" atoms="16"  xMax="7.45" xMin="7.28"    />
<PeakData  id="5" title="H15 ~7.62" peakShape="multiplet" model="aspirin" atoms="15"  xMax="7.70" xMin="7.54"    />
<PeakData  id="6" title="H17 ~7.93" peakShape="multiplet" model="aspirin" atoms="17"  xMax="8.01" xMin="7.85"    />
</Peaks>
##SOLVENT NAME= DMSO-D6
##.OBSERVE FREQUENCY= 400.132470966543
##.OBSERVE NUCLEUS= ^1H
##XUNITS= HZ
##YUNITS= ARBITRARY UNITS
##XFACTOR= 1
##YFACTOR= 9.579479E-03
##FIRSTX= 5.601995E+03
##FIRSTY= 0
##LASTX= -4.000910E+02
##NPOINTS= 23916
##MINY= -1.496560
##MAXY= 9.577982E+03
##XYDATA= (X++(Y..Y))
$$ [...]
$$ plain form
2778.5099568732 -1494 -1681 -1339 -1494 -2055 -1930 -1494 -1183 -1401 -1743 -1588 -1961 -2086 -1743 -1806 -1525 -1774 -2210
2773.5574189577 -1992 -1868 -1837 -1525 -1027 -1961 -2677 -1899 -1619 -1837 -1899 -1899 -1930 -1899 -2179 -1774 -2335 -1525 -1183 -1837
2768.0545 -1588 -1401 -1619 -1681 -2771 -2055 -2055 -1090 -1556 -1339 -1837 -2241 -1774 -1774 -1837 -1214 -1401 -1806 -1401
2762.8266568732 -2241 -2304 -1774 -2490 -2086 -1806 -1774 -2117 -1961 -2055 -1556 -1183 -1370 -1463 -1494 -2210 -1806 -2272 -1806
2757.5989189577 -1152 -1806 -2117 -1930 -1370 -1494 -1774 -1743 -2335 -2459 -2335 -2055 -2023 -2677 -1121 -1774 -1494 -1930
2752.6462568732 -2553 -2490 -2459 -1774 -1525 -1525 -1774 -1183 -1525 -1899 -2179 -1774 -1588 -1681 -1961 -1774 -1401 -1961 -2117
2747.4185189577 -1806 -1930 -1774 -2335 -2428 -2304 -1588 -1774 -2397 -1681 -1525 -1743 -1961 -1712 -1588 -2055 -2397 -2646 -2117
2742.1908 -1650 -2023 -1868 -1588 -1992 -2055 -1774 -1774 -2210 -1743 -1681 -1619 -1619 -1868 -1307 -1183 -1121 -2117 -2086 -1774 -1743
$$ packed form
2778.5099568732a494j87L42j55n61J25M36L11k18l42J55l73j25L43o3K81k49b210
2773.5574189577a992J24L1L12M98r34p16P78K80k18o2%l1L1k80M05n61Q10L42a837
2768.0545a588J87k18o2j090P16%R65m66K17m98m04M67%o3O23j87m05a401
2762.8266568732b241o3N30p16M04K80L2l43J56r4M99L73j87r3l1p16M04m66a806
2757.5989189577a152o54l11J87N60j24k80L1n92j24J24K80L2o54J556o53K80a930
2752.6462568732b553O3L1O85K49%k49N91l42l74k80M05J86r3k80J87L73n60b117
2747.4185189577a806j24J56n61r3J24P16j86o23P16J56k18TK49J24m67l42k49b117
2742.1908a650l73J55K80m04o3K81%m36M67O2T%k49N61J24O2r96L1L12a743
$$ plain form
2736.4127 -1556 -2023 -1899 -1806 -1868 -1837 -1370 -1494 -1339 -1712 -2210 -1743 -2055 -1899 -1556 -1432 -2864 -2459
2731.4599379154 -1743 -2023 -1899 -1619 -1712 -2117 -1681 -1401 -2117 -2055 -2241 -2148 -2366 -2086 -1556 -2553 -1868 -2117 -1961
2726.2323 -1588 -2428 -2366 -2086 -2148 -2148 -1868 -2117 -1588 -1837 -1930 -1556 -2304 -2148 -2055 -2397 -1992 -1588 -1806 -1681
2720.7293 -1619 -2086 -1930 -1899 -1774 -2241 -2023 -1961 -1681 -1743 -1868 -2023 -1681 -1556 -1899 -2148 -1743 -2241 -1837
2715.5014379154 -1401 -1525 -2023 -2366 -1992 -1681 -1930 -1556 -1276 -1868 -1712 -1899 -2366 -1930 -2335 -2023 -1339 -1370
2710.5489 -934 -1276 -1214 -1058 -1121 -1681 -1837 -1650 -1650 -1650 -1743 -1681 -809 -1432 -1868 -1961 -2086 -1899 -2210 -1837 -1556
2704.7708 -2055 -2459 -2210 -2304 -2055 -2304 -1712 -1494 -1837 -1307 -2086 -1961 -2272 -1774 -1868 -1339 -716 -1712
2699.8181379154 -1992 -2023 -1058 -1307 -1494 -1339 -1027 -1245 -1152 -2148 -2148 -2055 -1806 -2086 -2086 -1868 -1276 -1245 -996 -1432
$$ packed form
2736.4127a556m67J24R3o2L1M67j24J55l73m98M67l12J56L43J24j432b459
2731.4599379154a743k80J24K80r3m05M36K80p16O2j86R3k18K80N30r97O85k49a961
2726.2323a588q40O2K80o2%K80k49N29k49r3L74p48J56R3l42M05M04k18a681
2720.7293a619m67J56L1J25m67K18O2K80o2j25j55L42J25l43k49M05m98a837
2715.5014379154a401j24m98l43L74L11k49L74K80n92J56j87m67M36m05L12O84a370
2710.5489i34l42O2J56o3n60j56J87%Tr3O2Q72o23m36r3j25J87l11L73a556
2704.7708b055m04K49r4K49k49N92K18l43N30p79J25l11M98r4N29O23a712
2699.8181379154a992l1R65k49j87J55L12k18R3r96%R3K49k80%K18N92L1K49a432
$$ plain form
2694.3152379154 -1837 -1868 -1588 -1401 -2055 -1961 -1743 -1743 -1245 -1868 -2241 -1183 -1027 -1058 -1525 -1837 -2023 -1556 -2708
2689.0875 -3673 -3393 -2335 -2553 -2023 -1930 -2023 -1992 -2335 -2490 -2833 -2179 -1774 -1930 -1588 -1339 -1681 -1930
2684.1347379154 -1619 -1556 -2086 -1774 -1370 -2179 -1712 -1401 -1588 -1681 -1743 -1307 -1837 -1837 -1743 -1619 -1432 -1494 -1183 -1619
2678.6319189577 -2490 -2335 -2304 -1743 -1837 -1837 -2739 -2304 -2459 -1868 -1837 -2023 -1743 -1494 -1183 -2459 -1743 -1961 -2304
2673.4041 -2023 -1712 -1525 -1619 -1868 -2055 -2397 -1930 -1525 -1806 -1930 -1619 -1774 -2179 -1650 -1743 -2055 -2055
2668.4515189577 -1619 -1806 -2708 -2241 -2023 -1370 -1152 -1588 -1774 -1401 -1090 -1245 -1899 -2553 -2210 -1868 -1090 -1525
2663.4987568732 -1961 -2148 -2335 -1743 -1525 -1774 -1401 -1214 -1806 -2241 -1837 -1961 -2521 -2055 -2397 -1650 -1058 -2241
2658.5462189577 -1743 -1712 -2241 -1619 -1401 -1650 -2148 -1494 -1743 -1774 -1837 -1276 -1463 -1214 -1307 -2210 -2055 -1774 -1992
$$ packed form
2694.3152379154a837l1K80J87o54R4K18%M98o23l73J058J56l1m67l12j86M67b708
2689.0875c673K80J058k18N30R3r3L1l43j55l43O54M05j56L42K49l42a930
2684.1347379154a619O3n30L12M04q09M67L11j87r3o2M36n30%R4J24J87o2L11a619
2678.6319189577b490J55L1N61r4%r02M35j55N91L1j86K80K49L11j276P16k18b304
2673.4041b023L11J87r4k49j87l42M67M05k81j24L11j55m05N29r3l12b055
2668.4515189577a619j87r02M67K18O53K18m36j86L73L11j55o54TL43L42P78a525
2663.4987568732a961j87TN92K18k49L73J87n92m35M04j24n60M66l42P47N92b241
2658.5462189577a743L1n29O22K18k49m98O54k49l1o3N61j87K49r3r03J55K81a992
$$ plain form
2653.3183568732 -1868 -1681 -1961 -2086 -1743 -1494 -1339 -1619 -1370 -1276 -1806 -1868 -1774 -2210 -1743 -1868 -1899 -2677 -2553
2648.0906379154 -2646 -2553 -2335 -2117 -1992 -1432 -1681 -2335 -2055 -2210 -2366 -1961 -1806 -1432 -1214 -1930 -1806 -2148 -1619
2642.8629 -1868 -2148 -1712 -2023 -2023 -1619 -1494 -1307 -1712 -1619 -1494 -1401 -1494 -1806 -1432 -1307 -1556 -2179 -1307
2637.6349568732 -1525 -1837 -1961 -1463 -1588 -1307 -1930 -1899 -1743 -1339 -2023 -1556 -2117 -1868 -1743 -2086 -1681 -2241
2632.6824189577 -2179 -1556 -1743 -1806 -1494 -1588 -1712 -996 -1681 -1401 -2055 -1868 -1681 -2241 -1339 -2490 -2055 -1868 -2397
2627.4545568732 -2148 -2023 -1868 -1556 -2023 -1712 -2304 -1837 -1214 -1588 -1432 -1774 -1899 -1588 -1681 -1090 -1868 -1027
2622.5020189577 -2055 -1619 -2148 -2086 -2023 -1868 -1556 -1712 -1837 -1868 -2210 -1961 -1494 -1619 -1619 -2055 -1712 -2304 -2802
2617.2741568732 -1743 -1743 -1525 -2179 -2179 -2272 -2117 -1525 -1806 -1868 -1183 -1027 -2086 -1650 -1588 -1681 -1681 -1712 -1276 -1899 -1806
$$ packed form
2653.3183568732a868J87k80j25L43K49J55k80K49R4n30o2R4m36M67j25l1p78b553
2648.0906379154b646R3K18TJ25N60k49o54K80j55j56M05J55L74K18p16J24l42a619
2642.8629a868k80M36l11%M04J25J87m05R3J25R3r3l12L74J25k49o23a307
2637.6349568732a525l12j24M98j25K81o23L1J56M04o84M67n61K49J25l43M05b241
2632.6824189577b179O23j87o3L12r4j24P16o85K80o54J87Tn60R02j151M35J87b397
2627.4545568732b148J25J55L12m67L11n92M67O23l74J56l42j25L11r3N91p78a027
2622.5020189577b055M36n29O2O3J55L12j56j25l1l42K49M67j25%m36L43n92b802
2617.2741568732a743%K18o54%r3J55N92k81o2O85J56j059M36O2r3%l1M36o23a806
$$ plain form
2611.4962 -1432 -1619 -1432 -1681 -1463 -1837 -1992 -1619 -2179 -2023 -1837 -1712 -1992 -1774 -1868 -1027 -1307 -1743
2606.5435189577 -1806 -1743 -2148 -1961 -1650 -1837 -1556 -2366 -1992 -1837 -1525 -1525 -1837 -1806 -1058 -1152 -1370 -1556 -1525
2601.3158 -1588 -840 -1152 -1494 -1525 -2086 -1058 -1276 -1743 -1837 -1494 -1027 -1588 -1930 -1152 -1556 -1432 -1743
2596.3631189577 -1556 -1556 -1494 -1712 -1650 -1681 -1806 -1245 -1432 -1650 -2148 -1183 -1214 -1432 -2428 -1774 -1401 -1588 -1681 -2086
2590.8601189577 -1712 -996 -1619 -1712 -1899 -1370 -1058 -1837 -1183 -1245 -1027 -1556 -1837 -1619 -1339 -1650 -1494 -1868
2585.9075379154 -2148 -2086 -1712 -1899 -1339 -1276 -1245 -2210 -1307 -965 -1774 -2335 -1992 -1774 -1432 -1525 -2428 -1992 -1058
2580.6797189577 -2366 -2179 -1681 -1432 -1650 -1806 -2210 -1681 -1494 -1463 -1681 -2272 -2490 -1774 -1837 -1712 -1339 -1619
2575.7270568732 -1650 -1619 -1774 -1121 -1432 -1370 -1401 -1961 -1961 -1837 -2272 -2490 -2210 -1961 -1743 -2210 -2055 -1276 -716
$$ packed form
2611.4962a432j87J87k49K18l74j55L73n60J56J86J25k80K18r4Q41k80a743
2606.5435189577a806O3m05J87L11j87K81q10L74J55L12%l12L1P48r4k18j86a525
2601.3158a588P48l12l42l1n61J028k18m67r4L43M67n61l42P78m04J24a743
2596.3631189577a556%O2k18O2l1j25N61j87k18m98R65l1k18r96O54L73j87r3b086
2590.8601189577a712P16o23r3j87N29L12p79O54o2K18n29k81K18K80l11J56a868
2585.9075379154b148O2L74j87N60O3L1r65R03L42q09n61L43K18L42r3r03M36a058
2580.6797189577b366J87M98K49k18j56m04N29J87L1k18n91k18P16o3J25L73a619
2575.7270568732a650L1j55O53l11O2l1n60%J24m35k18K80K49K18m67J55P79g16
$$ plain form
2570.4993189577 -1401 -1370 -1401 -1245 -1930 -1525 -1525 -1743 -1837 -2304 -1774 -1432 -1681 -1339 -1183 -1743 -1619 -1588 -1525 -1214
2564.9964189577 -1494 -1868 -1930 -1401 -1961 -1152 -1743 -1556 -1027 -1463 -1806 -1463 -1650 -1806 -934 -1556 -1494 -1681
2560.0437379154 -1961 -1494 -1401 -1619 -1681 -996 -1339 -1588 -1556 -1556 -1650 -1183 -1556 -903 -1058 -1899 -1712 -1650 -1525 -2272
2554.5408379154 -1556 -1619 -2241 -1868 -1774 -1494 -1961 -1774 -2055 -1774 -1401 -1556 -778 -1556 -1899 -1930 -1245 -1588 -1494
2549.3131 -1743 -1650 -1245 -1774 -1432 -1619 -1307 -1588 -778 -1930 -1494 -2055 -2086 -1183 -1214 -1463 -1712 -1183 -2023
2544.0851568732 -2148 -1743 -1681 -1806 -1370 -1494 -1245 -1370 -1743 -1401 -1370 -2210 -1650 -1276 -1027 -1276 -1121 -1463
2539.1327 -1401 -2304 -2304 -1868 -1588 -1712 -1401 -1588 -1027 -1090 -1401 -1837 -2055 -1152 -1743 -1992 -2179 -2210 -1774
2533.9047568732 -1712 -1837 -1774 -2241 -1712 -1525 -1806 -1806 -1090 -1743 -1463 -2023 -1743 -1463 -1774 -1432 -1556 -1494 -1556 -1930
$$ packed form
2570.4993189577a401L1l1J56o85M05%k18r4m67N30L42k49L42J56n60J24L1O3a214
2564.9964189577a494l74o2N29n60Q09n91J87N29m36l43L43j87j56Q72o22O2a681
2560.0437379154a961M67R3k18o2O85l43k49L2%r4M67l73O53j55q41J87O2J25b272
2554.5408379154a556o3o22L73R4K80m67J87k81K81L73j55P78p78l43l1O85l43a494
2549.3131a743R3M05n29L42j87L12k81Q10j152M36n61l1R03l1k49TN29b023
2544.0851568732b148M05O2j25M36j24K49j25l73L42L1q40N60L74K49k49J55a463
2539.1327a401r03%M36K80j24L11j87N61o3l11m36k18R03n91k49j87l1a774
2533.9047568732a712j25O3m67N29J87k81%P16o53K80n60K80Tl11L42j24O2o2a930
$$ plain form
2528.4018379154 -1961 -1992 -1276 -996 -996 -1432 -965 -1245 -1868 -2304 -1588 -1619 -1619 -1774 -1774 -1837 -1650 -1152 -1619 -1619 -1090
2522.6237568732 -1463 -1245 -1121 -1806 -1899 -1681 -1401 -965 -1556 -1556 -1276 -1774 -1992 -1401 -903 -1027 -1090 -1992 -1307
2517.3960379154 -1463 -1121 -1681 -1806 -2086 -1090 -1058 -1370 -1650 -1837 -1650 -2366 -1992 -1743 -1463 -1588 -1806 -1774
2512.4433568732 -2521 -1961 -1432 -1401 -965 -1121 -778 -809 -1307 -1432 -1339 -1276 -1245 -1494 -2210 -1806 -1650 -1090 -1432
2507.2156379154 -1183 -1090 -1494 -1214 -1432 -1463 -996 -1401 -1027 -1090 -1619 -840 -872 -1090 -872 -1743 -1743 -1556 -1681 -1121
2501.7127189577 -1432 -1121 -1930 -1370 -1339 -1494 -903 -1868 -1899 -1463 -1463 -1494 -1681 -1245 -1525 -1930 -2210 -1494 -1058
2496.485 -1525 -1868 -1992 -1681 -1463 -2023 -1525 -1276 -1556 -1525 -1027 -965 -1681 -1276 -996 -1899 -716 -996
2491.5322379154 -1494 -1276 -872 -747 -1588 -1058 -1370 -1774 -1370 -1339 -1183 -1307 -1058 -1183 -1307 -778 -965 -1121
$$ packed form
2528.4018379154a961l1P16K80%m36M67k80o23m36P16l1%j55%o3J87M98m67%a090
2522.6237568732a463K18J24o85r3K18K80M36n91%K80m98k18N91M98j24o3r02a307
2517.3960379154a463L42n60j25k80R96L2l12k80j87J87p16L74K49K80j25k18a774
2512.4433568732b521N60N29L1M36j56L43l1m98j25R3O3L1k49p16M04J56N60a432
2507.2156379154a183R3m04K80k18l1M67m05L74o3n29P79l2k18K18q71%J87j25a121
2501.7127189577a432L11q09N60L1j55N91r65l1M36%l1j87M36k80m05k80P16a058
2496.485a525l43j24L11K18n60M98K49k80L1M98O2p16M05K80r03J183i96
2491.5322379154a494K18M04J25q41N30l12m04M04L1J56j24K49j25j24N29j87a121
$$ plain form
2486.5795568732 -1525 -1463 -872 -1307 -1525 -1681 -1650 -1806 -1681 -1370 -1401 -1588 -1432 -1806 -1837 -1339 -778 -1276 -1183
2481.3518379154 -903 -685 -654 -716 -1463 -1027 -1806 -1712 -1837 -1401 -1121 -529 -1432 -1463 -1401 -1806 -1494 -840 -1121 -1307
2475.8489189577 -1463 -1837 -1681 -1588 -1992 -1432 -1868 -1058 -1463 -1245 -1245 -1588 -1245 -1152 -1588 -1712 -1930 -1339 -778
2470.6212 -996 -965 -1463 -1183 -1121 -1214 -654 -965 -685 -747 -280 -498 -685 -1152 -840 -591 -591 -716 -125 -342
2465.1181568732 -125 -654 -1027 -1681 -1463 -1463 -685 -934 -872 -1525 -654 -840 -1152 -405 -840 -1090 -1494 -280 -747
2459.8904379154 0 -249 -187 -342 0 -93 -342 -560 -809 -1183 -778 -1525 -809 -903 -467 -436 -1463 -1650 -1121 -872
2454.3875189577 -903 -467 -840 -623 -1432 -654 -1432 -1494 -685 -747 -249 -747 -809 -716 -93 218 2023 2802 3704
2449.1598 4607 4047 3424 2179 2708 3611 4389 3891 2210 1307 591 529 31 -93 -405 -716 -529
$$ packed form
2486.5795568732a525O2N91m35k18j56L1j56J25L11l1j87J56l74l1M98N61m98a183
2481.3518379154i03K18L1o2p47M36p79R4j25M36K80N92r03l1O2m05L12O54k81a307
2475.8489189577a463l74J56R3m04N60m36Q10m05K18%l43L43R3m36j24k18N91g78
2470.6212i96L1m98K80O2r3N60l11K80o2M67k18j87m67L12K49%j25N91c42
2465.1181568732a25n29l73o54K18%P78k49O2o53Q71j86l12P47m35k50m04J214g47
2459.8904379154@k49O2j55L42r3k49k18k49l74M05p47P16r4M36L1j027j87N29h72
2454.3875189577i03M36l73K17q09P78p78o2Q09o2M98m98o2R3O23L11J805P79C704
2449.1598D607n60o23j245N29R03P78m98j681r03p16o2m98j24l12l11e29
$$ plain form
2444.4823 -156 -280 218 -249 0 62 -374 249 374 1556 3269 3985 3642 3798 3486 3144 3580 4389
2439.5295379154 4981 4389 2926 1961 1245 778 62 -31 -218 467 93 187 -342 -965 -436 187 -374 -125
2434.5768758309 -436 -1058 -872 -685 -591 -467 -1090 -1494 -1276 -1027 -872 -1276 -716 -436 -778 -778 -840 -996 -716
2429.3491379154 -654 -685 -529 -560 -1058 -809 -1058 -996 -965 -747 -934 -1121 -965 -1058 -965 -1619 -1183 -685 -1183 -685 -716
2423.5710568732 -654 -778 -591 -747 -965 -1432 -996 -405 -311 -218 -809 -1027 -1307 -1027 -747 -1090 -1494 -1214 -934
2418.3433189577 -1463 -1432 -1432 -1276 -996 -1183 -1090 -1027 -965 -872 -716 -467 -218 -903 -342 -249 -934 -1214 -965 -654 -965
2412.5652379154 -1245 -1370 -840 -1432 -840 -311 125 -311 -996 -996 -529 -560 -591 -218 -591 31 -623 -187 -374
2407.3375 623 -218 -280 374 -374 -436 -342 -93 -125 93 -498 -62 -311 -280 -405 249 156 280 747 685
$$ packed form
2444.4823a56j24M98m67K49O2m36O23J25J182J713P16l43J56l12l42M36D389
2439.5295379154D981n92j463r65p16m67p16r3j87O85l74R4n29o23N29O23n61a25
2434.5768758309d36o22J86J87R4J24o23m04K18K49J55m04N60K80l42%o2j56g16
2429.3491379154f54l1J56l1m98K49k49O2L1K18j87TJ56r3R3o54M36M98m98M98g16
2423.5710568732f54j24J87j56k18m67M36N91R4R3n91k18k80K80Tl43m04K80i34
2418.3433189577a463L1%J56K80j87R3O3O2R3J56K49To85N61R3o85k80K49L11i65
2412.5652379154a245j25N30n92N92N29M36m36o85%M67l1TL73l73O22o54M36c74
2407.3375F23q41o2O54p48o2R4K49l2K18n91M36k49L1j25O54r3J24M67F85
$$ plain form
2401.8346 1588 2117 1619 1774 2677 2148 1743 1743 2086 2490 2241 1463 1525 1276 934 374 1027 654 1090
2396.6067379154 654 1058 685 1121 623 560 965 1058 1712 2148 2677 3455 3611 2677 3455 3891 4607 5012 5541
2391.3789189577 5199 4732 4638 3891 4109 4514 4981 5634 6537 7471 8903 12483 22008 47130 72656 104065
2386.9767 114961 116922 98431 90804 91956 112844 122899 129560 105902 80594 47752 29760
2383.6749 24405 21012 18864 17526 16187 14755 14537 13884 13884 13790 14818 16841 20950 30787 56282
2379.5475568732 82182 116330 126977 130619 110105 99956 100174 120720 132144 137810 114992 87007
2376.2458568732 51799 32343 24250 20826 18148 16654 15316 13977 12981 11549 11549 11923 11393 11113 10864
2372.1187189577 10709 10926 10584 9775 9681 9712 8249 7689 7253 5977 5199 5323 4452 3175 3549 1961 1432
$$ packed form
2401.8346A588N29m98J55R03n29m05%L43M04k49p78O2k49l42n60O53l73A090
2396.6067379154F54M04l73M36m98o3M05R3O54M36N29P78J56r34P78M36P16M05E541
2391.3789189577E199m67r4p47K18M05M67O53R03R34J432L580R525K5122K5526A04065
2386.9767A14961J961j8491p627J152K0888J0055O661k3658k5308l2842B9760
2383.6749B4405l393k148j338j339j432k18o53%r4J028K023M109R837E6282
2379.5475568732H2182L4148J0647L642k0514j0149K18K0546J1424N666k2818H7007
2376.2458568732E1799j9456q093l424k678j494j338j339r96j432%L74n30k80A0864
2372.1187189577A0709K17l42q09r4L1j463n60m36j276p78J24q71j277L74j588A432
$$ plain form
2367.4411379154 1743 1681 1090 934 1058 1774 1432 1868 2366 2895 3269 2926 2584 2241 1619 2739 2802 2397
2362.4886 1556 436 -685 -125 -467 -996 -809 -747 -218 -218 -654 -840 -1619 -1027 -996 -1058 -809 -872 -591
2357.2607379154 -840 -1121 -1121 -498 -1339 -1027 -1370 -903 -1090 -1774 -1152 -1339 -1525 -1090 -2366 -1743 -1276 -1121
2352.3082 -1339 -1432 -1588 -1276 -1432 -1743 -1806 -1245 -840 -716 -996 -1214 -1090 -840 -1090 -1245 -716 -1183
2347.3555189577 -872 -560 -747 -342 -1276 -498 -1370 -1930 -1619 -1619 -1432 -1214 -716 -498 -1121 -654 -1556 -1588 -1307
2342.1278 -1494 -1090 -1588 -1743 -1152 -1183 -996 -934 -342 -872 -903 -591 -1401 -685 -1090 -1743 -1339 -1556 -1401
2336.8999379154 -1090 -1152 -1339 -1245 -903 -1556 -1588 -1525 -1837 -1556 -1121 -840 -654 -903 -872 -1307 -778 -1058 -716
2331.6722189577 -716 -685 -840 -934 -1494 -996 -1058 -1152 -1214 -747 -1494 -1525 -1183 -1183 -903 -1245 -1494 -1619 -1339 -1432 -1712
$$ packed form
2367.4411379154A743o2n91j56J24P16l42M36M98N29L74l43l42l43o22J120O3B397
2362.4886A556j120j121N60l42n29J87O2N29%m36j86p79N92L1o2K49o3e91
2357.2607379154h40k81%O23q41L12l43M67j87o84O22j87j86M35j276O23M67a121
2352.3082a339r3j56L12j56l11o3N61M05J24k80k18J24K50k50j55N29a183
2347.3555189577h72L12j87M05r34P78q72n60L11%J87K18M98K18o23M67r02l2a307
2342.1278a494M04m98j55N91l1J87O2N92n30l1L12q10P16m05o53M04k17a401
2336.8999379154a090o2j87R4L42o53l2O3l12K81M35K81J86k49L1m35N29k80g16
2331.6722189577g16L1j55r4n60M98o2r4o2M67p47l1L42%K80l42k49j25K80r3a712
$$ plain form
2325.8941189577 -1214 -1930 -1401 -1432 -1463 -1432 -1712 -1525 -1339 -1619 -1276 -1183 -903 -1619 -965 -1307 -1370 -716 -809 -654
2320.3911189577 -1588 -1245 -1058 -996 -1121 -280 -1152 -1058 -1556 -1214 -965 -1058 -840 -934 -1058 -1121 -1214 -1214 -1774 -1712
2314.8883 -840 -996 -716 -1183 -1837 -1339 -1868 -1183 -965 -1245 -1058 -1370 -1401 -1121 -1432 -623 -747 -1090
2309.9355379154 -1307 -1307 -903 -872 -1712 -809 -405 -560 -374 -374 -654 -1152 -1214 -1090 -778 -1152 -591 -342 280 1339
2304.4327189577 2179 2272 1961 1245 1556 2086 1401 1712 2055 1401 342 156 -342 -747 -996 -903 -778 -996
2299.4799568732 -405 -529 -1027 -1090 -903 -591 498 1619 2055 2615 4234 5012 4265 4389 4732 3953 4825
2294.8026 5448 4701 2957 2459 1961 1183 -342 -125 -405 311 -280 93 342 374 342 62 -156 218
2289.8499189577 654 1370 1837 2397 3082 2988 2179 1432 1307 2739 2957 3393 2988 1681 529 467 1307 1930
$$ packed form
2325.8941189577a214p16N29l1TL1k80J87J86k80L43R3K80p16O54l42o3O54r3f54
2320.3911189577a588L43J87O2j25Q41q72R4m98L42K49r3K18r4j24o3r3%n60a712
2314.8883h40j56K80m67o54M98n29O85K18k80J87l12l1K80l11Q09j24a090
2309.9355379154a307%M04L1q40R03M04j55J86%k80m98o2J24L12l74N61K49O22A339
2304.4327189577B179R3l11p16L11N30o85L11L43o54j059j86m98m05k49R3J25i96
2299.4799568732d05j24m98o3J87L12J089J121M36N60J619P78p47J24L43p79D825
2294.8026E448p47j744m98Tp78j525K17k80P16n91L73K49L2l2k80k18B18
2289.8499189577F54P16M67N60O85r4q09p47j25J432K18M36m05j307j152o2Q40A930
$$ plain form
2284.8971568732 2584 2272 1276 405 685 467 560 1121 1214 1432 1432 1401 903 934 872 1090 31 467 747 934
2279.3943379154 778 747 716 965 1743 809 1121 809 1463 1339 2304 2272 2584 3362 3362 3549 3985 3611 2646 2677
2273.8913379154 2771 2646 2771 3020 2739 2771 2802 3206 4047 5043 7315 12296 25588 41620 52266 56624
2269.4890189577 56687 45605 38569 48219 55224 60733 58554 50305 31472 20732 15845 13137 11767
2265.9121379154 10864 10210 10148 9339 8965 9993 11051 13074 18366 30445 50679 64905 74524 81092
2262.0601 89808 93139 109918 120440 123272 107147 98711 91022 84298 79909 74057 55971 36172
2258.4832 26304 21012 18086 16156 14600 14351 13821 13386 13790 14320 15845 18927 25869 43581 61761
2254.3559568732 74493 76578 73963 57683 50928 61792 69979 74524 69885 56095 34149 21479 15876
$$ packed form
2284.8971568732B584l12r96q71K80k18R3N61R3K18%l1m98L1o2K18j059M36K80I34
2279.3943379154G78l1TK49P78r34L12l12O54j24R65l2L12P78%J87M36l74r65B677
2273.8913379154B771j25J25K49k81L2L1M04Q41R96K272M981J3292J6032J0646E6624
2269.4890189577E6687j1082p036R650P005N509k179q249j8833j0740m887k708A1767
2265.9121379154A0864o54o2q09l74J028J058K023N292J2079K0234J4226R619H1092
2262.0601H9808L331J6779J0522K832j6125q436p689o724m389n852j8086C6172
2258.4832B6304n292k926j930j556k49n30m35M04N30J525L082O942J7712F1761
2254.3559568732G4493K085k615j6280o755J0864Q187M545m639j3790k1946j2670A5876
$$ plain form
2250.7791 12794 10926 9432 8934 7876 8031 7471 8000 7097 6288 7440 6911 7533 7627 7564 6911 6195
2246.1017 5417 4981 4514 4327 4607 3829 2272 2304 1899 1276 1183 591 311 996 747 903 374 218
2241.1489379154 591 311 934 1214 1432 498 840 809 1463 1712 1432 1401 1556 778 249 -467 -529 -1090 -716
2235.9212189577 -1090 -1556 -560 -654 -498 -280 -840 -1588 -934 -1339 -747 -965 -1588 -1121 -1152 -1370 -1214 -747
2230.9685379154 -1339 -1183 -1339 -1307 -1401 -996 -934 -1183 -1276 -1090 -467 -342 -716 -591 -591 -1152 -1276 -1681 -996 -1090
2225.4656379154 -934 -965 -1307 -1370 -1214 -1556 -840 -560 -125 311 1121 1276 2117 2117 1650 1992 1899 1930 1370 218
2219.9627189577 -560 -187 -996 -623 -747 -342 -311 -405 -654 -280 -498 -374 -560 -342 62 31 1152 2584 3736
2214.735 3953 5012 5261 5136 4514 3704 3113 2428 1027 -249 93 -93 0 -903 -685 -1121 -498
$$ packed form
2250.7791A2794j868j494m98j058J55n60N29r03q09J152n29O22R4o3o53F195
2246.1017E417m36m67j87K80p78j557L2m05o23r3n92k80O85k49J56n29B18
2241.1489379154E91k80O23K80K18r34L42l1O54K49k80l1J55p78n29p16o2n61g16
2235.9212189577a090m66R96r4J56K18n60p48O54m05N92k18o23M67l1k18J56g47
2230.9685379154a339J56j56L2r4M05O2k49r3J86O23J25l74J25%n61j24m05O85a090
2225.4656379154i34l1l42o3J56l42P16K80M35M36Q10J55Q41%m67L42r3L1n60B18
2219.9627189577e60L73q09L73j24M05L1r4k49L74k18J24j86K18M04l1J121J432C736
2214.735C953J059K49j25o22q10n91o85j401j276L42j86R3r03K18m36d98
$$ plain form
2210.0574189577 -840 -1152 -560 249 -374 -249 -405 -342 405 1090 1743 1432 2179 2646 1868 1868 1058 1183 747
2204.8295568732 218 -716 -498 -1027 -1090 -903 -1183 -529 -623 -809 -1183 -840 -405 -560 -560 -280 311 -996 -1027
2199.6018379154 -591 -436 -623 -685 -125 -405 -747 -1027 -623 31 218 560 2179 2428 3767 4296 3237 1619
2194.6491568732 1432 965 218 249 156 -31 -218 -187 872 1121 1339 1681 1463 1121 1027 1401 1588 996 405
2189.4214379154 374 31 31 529 1121 1712 1401 1556 1992 1058 405 405 1183 1090 1121 1214 1183 1463 2272 1058 903
2183.6433379154 1837 3455 6942 10117 16592 33091 86695 202621 255354 303262 293021 194776
2180.3415379154 75022 44422 31690 25464 21386 20016 18864 16779 14631 13386 11611 10366 8934
2176.7646568732 8592 8063 7533 7440 7315 7066 7160 6319 6724 8218 10428 10304 8623 7440 5946 4638 3922
$$ packed form
2210.0574189577h40l12N92Q09o23J25j56O3P47O85O53l11P47M67p78%q10J25G47
2204.8295568732B18r34K18n29o3J87k80O54r4j86l74L43M35j55%K80N91j307a027
2199.6018379154e91J55j87o2N60k80l42k80M04O54J87L42J619K49J339N29j059A619
2194.6491568732A432m67p47L1r3j87TL1J059K49K18L42k18l42r4L74J87n92D05
2189.4214379154C74l43%M98N92N91l11J55M36r34o53%P78r3L1R3l1K80Q09j214I03
2183.6433379154A837J618L487L175O475J6499N3604J15926N2733M7908j0241A94776
2180.3415379154G5022l0600j2732o226m078j370j152k085k148j245j775j245H934
2176.7646568732H592n29n30r3j25k49R4q41M05J494K210j24j681j183j494j308C922
$$ plain form
2172.0871568732 3175 3269 3113 2366 2086 2646 2117 2055 1712 1090 591 809 1183 1058 685 1494 4171 6132
2167.1346189577 7471 8187 5697 5167 3985 2708 1588 1463 716 934 778 -374 311 778 560 374
2162.7323 -249 -125 -187 -405 -374 -996 -1214 -1121 -1494 -1121 -716 -654 -685 -125 -436 -374 -311 -654 -809 -778
2157.2293 -934 -529 -872 -374 -778 -1058 -996 -1494 -1339 -716 -249 0 280 280 1401 2428 4545 5666
2152.2766189577 5883 6382 5572 5292 5323 3767 2677 1058 498 840 62 0 125 -685 -280 342 125
2147.5991379154 -156 -560 -280 -654 -529 -747 467 436 1307 2957 3985 4296 5666 5666 5852 5105 4638 4171
2142.6466 2771 1370 -93 -218 -31 685 125 -218 -654 -374 -560 -654 -31 -125 -280 125 -187 -467
2137.6939189577 31 311 560 903 778 -93 -342 -809 -623 -685 -156 -560 -467 -342 -374 -342 -280 -747 -591 -280
$$ packed form
2172.0871568732C175R4j56p47k80N60n29o2l43o22m99K18L74j25l73Q09K677F132
2167.1346189577G471P16k490n30j182j277j120j25p47K18j56j152O85M67k18C74
2162.7323b49J24o2k18L1o22k18R3l73L73M05O2l1N60l11O2O3l43j55g78
2157.2293i34M05l43M98m04k80O2m98J55O23M67K49K80%J121J027K117E666
2152.2766189577E883M99q10k80L1j556j090j619n60L42p78o2J25q10M05O22A25
2147.5991379154a56m04K80l74J25k18J214l1Q71J650J028L11J370%J86p47m67D171
2142.6466B771j401j463j25J87P16n60l43m36K80j86r4O23r4j55M05l12d67
2137.6939189577C1K80K49L43j25q71k49m67J86o2N29m04R3J25l2L2O2m67J56b80
$$ plain form
2132.1910189577 -654 -125 -654 -156 -560 -31 62 93 374 62 187 93 -62 -156 -436 249 -125 280 809
2126.9631568732 342 249 1090 1806 2584 2739 3424 3269 3393 2148 1930 1214 716 996 591 747 1121 716
2122.0105189577 1152 840 809 342 311 747 778 903 1058 1432 965 1183 934 1090 2148 2553 3642 3985
2117.0578379154 4265 4420 4140 3829 4047 4296 4078 4389 4265 4109 4389 4452 5012 6631 8467 11362 18802
2112.3803568732 37853 65963 100548 125171 152690 163056 172426 161624 153997 125358 93264 55846
2109.0785568732 36639 28390 24281 21510 20110 18989 18024 17090 15907 15191 14693 14818 14506 13572 13666
2104.9515189577 13977 17370 20483 29573 51644 76890 110105 127973 150853 151818 157701 141234 133607
2101.3745379154 101669 73154 43488 30413 25308 22569 20950 19612 18335 17713 16841 15253 14631
$$ packed form
2132.1910189577f54N29n29M98m04N29R3L1K81l12J25r4j55r4k80O85l74M05H09
2126.9631568732C42r3Q41P16P78J55O85j55J24j245k18p16m98K80m05J56L74G16
2122.0105189577A152l12l1m67l1M36L1J25J55L74m67K18k49J56J058M05J089C985
2117.0578379154D265J55k80l11K18K49k18L11j24j56K80O3N60J619J836K895A8802
2112.3803568732C7853K8110L4585K4623K7519J0366R370j0802p627k8639l2094E5846
2109.0785568732C6639q249m109k771j400j121r65r34j183p16m98J25l12r34A3666
2104.9515189577A3977L393L113R090K2071K5246L3215J7868K2880R65N883j6467A33607
2101.3745379154A01669k8515k9666j3075n105k739j619j338j277o22q72j588A4631
$$ plain form
2097.7975568732 14880 15534 14849 14631 14818 14724 14164 14039 13292 12763 12296 12016 12234 12203 14039 19861 36079
2093.1202 59582 74244 82617 93699 93170 82213 78446 72127 54103 31534 22631 18553 16312
2089.5433 16094 15471 15098 15627 15378 14475 14849 14382 13604 14070 15534 20016 33713 60111 78788
2085.4159568732 104221 134417 153779 149203 156923 152036 128129 102322 85357 64313 38787 28141
2082.1142568732 22942 20265 18584 17495 16032 15129 12981 12234 12576 12234 12109 12389 15285 19643 31908
2077.9871189577 53356 66181 76298 82680 88750 76267 73808 66866 55628 31565 20327 15253
2074.6853189577 12234 9993 8872 7969 7564 6848 6568 5323 5323 4514 5012 4856 5666 5603 6568 7160 7191
2070.0078379154 6631 5603 5634 5167 3985 2926 1588 1588 1276 529 778 591 280 249 498 0 -716 -934
$$ packed form
2097.7975568732A4880O54o85k18J87r4n60j25p47n29m67k80K18l1J836N822C6079
2093.1202E9582J4662Q373J1082n29j0957l767o319j8024k2569q903m078A6312
2089.5433A6094o23l73N29k49r03L74m67p78M66J464M482J3697K6398G8788
2085.4159568732A04221L0196J9362m576P720m887k3907k5807j6965k1044k5526B8141
2082.1142568732B2942k677j681j089j463r03k148p47L42l42j25K80K896M358C1908
2077.9871189577E3356J2825J0117O382O070j2483k459o942j1238k4063j1238A5253
2074.6853189577A2234k241j121r03m05p16k80j245%q09M98j56Q10o3R65N92G191
2070.0078379154F631j028L1m67j182j059j338%l12p47K49j87l11l1K49m98p16i34
$$ plain form
2065.0551568732 -498 -311 -249 -311 -405 -62 311 -93 747 405 -280 -436 218 -311 -1214 -1961 -1899 -1276 -1276
2059.8274379154 -996 -996 -1494 -1868 -2241 -2304 -2210 -2117 -2957 -3020 -2210 -2055 -2335 -1806 -1463 -1152 -1463 -1712 -1650 -1930
2054.3245189577 -1588 -2148 -1432 -1837 -2272 -2055 -2459 -1806 -2241 -1868 -2148 -2304 -2272 -2304 -2272 -2553 -2428 -2459 -2459
2049.0968 -2117 -1619 -2210 -2335 -2023 -2148 -1899 -2086 -2397 -1650 -1961 -1806 -1774 -1743 -1806 -1806 -2210 -1712 -1494
2043.8689379154 -1650 -1992 -2397 -2304 -2895 -2615 -2397 -2677 -1961 -1930 -2148 -2397 -1899 -2179 -2428 -2584 -2864 -2708
2038.9163 -2459 -2366 -2553 -2272 -2397 -2397 -2366 -2179 -1961 -2366 -2335 -1432 -1899 -1806 -1743 -1712 -1868 -2335 -2459 -2802
2033.4133568732 -2304 -1806 -1432 -2086 -2677 -2428 -1743 -1774 -2148 -1961 -2210 -1992 -1276 -1525 -1152 -1121 -1370 -1774
2028.4607189577 -1121 -1245 -1401 -1650 -1401 -1743 -2117 -1930 -1339 -2459 -2055 -2148 -2335 -1930 -2179 -2148 -1806 -1494
$$ packed form
2065.0551568732d98J87O2o2r4L43L73m04Q40l42o85j56O54n29r03p47O2O23a276
2059.8274379154i96%m98l74l73o3R4R3q40o3Q10J55k80N29L43L11l11k49O2a930
2054.3245189577a588n60P16m05m35K17m04O53m35L73k80j56L2l2L2k81J25l1b459
2049.0968b117M98n91j25L12j25K49j87l11P47l11J55L2L1o3%m04M98a494
2043.8689379154a650l42m05R3n91K80K18k80P16L1k18k49M98k80k49j56k80b708
2038.9163b459R3j87K81j25%L1J87K18m05L1R03m67R3O3L1j56m67j24b802
2033.4133568732b304M98L74o54n91K49O85l1l74J87k49K18P16k49L73L1k49a774
2028.4607189577a121j24j56k49K49l42l74J87N91j120M04r3j87M05k49L1L42a494
$$ plain form
2023.5080568732 -1868 -1214 -2023 -2490 -2210 -2148 -1401 -1183 -1806 -1588 -1121 -1339 -1183 -1619 -1494 -1588 -1556 -2179 -2055
2018.2803189577 -1681 -2304 -2397 -2335 -1868 -1556 -1806 -2086 -1712 -2148 -2366 -1588 -1619 -1556 -2148 -1774 -1525 -1183 -1432
2013.0526 -2397 -2023 -2397 -2117 -2179 -1930 -1525 -1494 -1681 -1463 -1650 -1556 -1650 -1650 -1774 -1899 -1090 -1556 -2304 -2023
2007.5495568732 -1961 -1401 -1619 -1806 -1743 -1401 -1806 -2055 -2117 -2428 -2148 -2023 -2086 -2023 -1650 -1806 -1027 -934 -716
2002.3218379154 -903 -1214 -1307 -1214 -1525 -1245 -1152 -1961 -1806 -1525 -1401 -1307 -1432 -1556 -1712 -2148 -1930 -1650 -1712
1997.0941 -1774 -1650 -2055 -1743 -1992 -2117 -1525 -1868 -1588 -1588 -2117 -2117 -1588 -1494 -1432 -1650 -2210 -1774 -1806 -2086
1991.5912 -2241 -1650 -1899 -1837 -1588 -1774 -1806 -1961 -1712 -1463 -1681 -1090 -1961 -2055 -2708 -2459 -2117 -2615 -1868
1986.3633379154 -1525 -1619 -1806 -1806 -1245 -1494 -1588 -1588 -1556 -1899 -1899 -1712 -1588 -1339 -1276 -2055 -1401 -1868 -1712 -2366 -1868
$$ packed form
2023.5080568732a868O54q09m67K80O2P47K18o23K18M67k18J56m36J25r4L2o23b055
2018.2803189577a681o23r3O2M67L12k50k80L74m36k18P78l1O3n92L74K49L42a432
2013.0526b397L74l74K80o2K49M05L1j87K18j87R4r4%j24j25Q09m66p48b023
2007.5495568732a961N60k18j87O3L42m05k49o2l11K80J25o3O3L73j56P79R3g16
2002.3218379154i03l11r3R3l11K80R3q09J55K81J24R4j25j24j56m36K18K80a712
1997.0941a774J24m05L12k49j25N92l43K80%n29%N29R4O2k18n60M36l2b086
1991.5912b241N91k49O2K49j86l2j55K49Tk18N91q71r4o53K49L42m98a868
1986.3633379154a525r4j87%N61k49r4%L2l43%J87J24K49O3p79O54m67J56o54a868
$$ plain form
1980.5851568732 -1619 -1837 -1837 -1307 -1432 -1588 -1837 -2086 -1619 -1837 -1276 -1494 -1837 -1432 -809 -1992 -1806 -1774 -1774
1975.3575189577 -1556 -1401 -1525 -1681 -2086 -1619 -1121 -1121 -1276 -1401 -1681 -1027 -1806 -1370 -1868 -1370 -1183 -1899
1970.4047568732 -1556 -1930 -1837 -1681 -1961 -1401 -1401 -1214 -1556 -1743 -1774 -1961 -996 -965 -1058 -1525 -1837 -1370 -1619 -2023
1964.9018379154 -1556 -1712 -1712 -1837 -1121 -1463 -1307 -1307 -1339 -1339 -1121 -1806 -1961 -1650 -1619 -1806 -2055 -1463 -1307 -1681
1959.3989379154 -1712 -2086 -1992 -1339 -1650 -1619 -1432 -1307 -1121 -1307 -1121 -1494 -1525 -1090 -1463 -1743 -1619 -1214 -1214
1954.1712189577 -1774 -1961 -1588 -1432 -1712 -1681 -1837 -1743 -1401 -872 -1712 -1837 -1432 -809 -1276 -1339 -1556 -1837 -1774
1948.9433568732 -2148 -1992 -1712 -1245 -1712 -1619 -1027 -1307 -1432 -1245 -1992 -1681 -1961 -2148 -1183 -1090 -1432 -1556
1943.9908189577 -1401 -1121 -1214 -1463 -1245 -996 -996 -1027 -1712 -1930 -778 -1463 -2117 -1588 -1152 -1899 -1214 -1401 -1214
$$ packed form
1980.5851568732a619k18%N30j25j56k49TM67k18N61k18l43M05O23j183J86L2a774
1975.3575189577a556J55j24j56m05M67M98%j55j25k80O54p79M36m98M98J87a899
1970.4047568732a556l74R3J56k80N60%J87l42j87l1j87R65L1r3m67l12M67k49b023
1964.9018379154a556j56%j25P16l42J56%l2%K18o85j55L11L1j87k49N92J56a681
1959.3989379154a712l74R4O53l11L1J87J25J86j86J86l73l1M35l73k80J24M05a214
1954.1712189577a774j87L73J56k80L1j56R4L42N29q40j25M05O23m67o3k17k81a774
1948.9433568732b148J56K80M67m67R3N92k80j25J87p47L11k80j87R65R3l42a556
1943.9908189577a401K80r3k49K18K49%l1o85k18J152o85o54N29M36p47O85j87a214
$$ plain form
1938.7628758309 -1619 -2148 -1432 -1650 -1681 -1525 -2210 -1463 -1961 -1432 -1432 -1307 -716 -1152 -1276 -1370 -1121 -1152 -716
1933.5351379154 -934 -1432 -1276 -1276 -1370 -1525 -1307 -1214 -1370 -1214 -1619 -1214 -1837 -1837 -1961 -1058 -1276 -1121 -872 -1245
1928.0322379154 -1930 -1307 -1370 -1432 -903 -1276 -934 -529 -1214 -1401 -1463 -1525 -2086 -1588 -903 -1245 -1058 -1214 -654
1922.8045 -1837 -965 -1183 -934 -1494 -1588 -1588 -1588 -1090 -1712 -1806 -1121 -1556 -1525 -747 -1214 -965 -1588 -1401 -934
1917.3016 -560 -1307 -1556 -1868 -903 -1276 -1463 -1712 -1525 -1899 -2023 -1588 -1307 -1961 -1494 -809 -1214 -1681
1912.3489189577 -996 -778 -1494 -1276 -1214 -1370 -1619 -1774 -1276 -2023 -1245 -996 -591 -1463 -1245 -1588 -965 -1463
1907.3962568732 -1307 -1245 -872 -1307 -1432 -1339 -1245 -1121 -1370 -1899 -1556 -1152 -809 -934 -685 -1121 -93 -1090
1902.4437 -1058 -1121 -591 -1245 -1339 -1525 -2086 -1588 -903 -840 -965 -1307 -1868 -1868 -1245 -1463 -1276 -1214 -1556 -965
$$ packed form
1938.7628758309a619n29P16k18l1J56o85P47m98N29%J25N91m36j24r4K49l1g16
1933.5351379154i34m98J56%r4j55K18R3j56J56m05M05o23%j24R03k18J55K49a245
1928.0322379154a930O23o3o2N29l73L42M05o85j87o2Tn61M98O85l42J87j56f54
1922.8045a837Q72k18K49n60r4%TM98o22r4O85m35L1P78m67K49o23J87i34
1917.3016e60p47k49l12R65l73j87k49J87l74j24M35K81o54M67O85m05a681
1912.3489189577i96K18p16K18O2j56k49j55M98p47P78K49M05q72K18l43O23a463
1907.3962568732a307O2L73m35j25R3R4J24k49n29L43M04L43j25K49m36J028a090
1902.4437a058o3N30o54r4j86n61M98O85O3j25l42n61%O23k18J87O2l42i65
$$ plain form
1896.9408 -1183 -903 -1588 -1058 -1276 -1837 -1370 -1339 -872 -1432 -1650 -1650 -1494 -872 -872 -1214 -1494 -1432 -1401 -1650
1891.4377568732 -1276 -1183 -1370 -1650 -1307 -1307 -1619 -1619 -1401 -1588 -1245 -716 -996 -1183 -1183 -1121 -1494 -1432 -934 -934 -903
1885.6598 -934 -1027 -1121 -1027 -560 -1090 -840 -560 -1058 -934 -1401 -1245 -903 -840 -840 -1588 -1588 -1339 -1152 -1183 -1556
1879.8817 -934 -1307 -1774 -1152 -716 -1588 -1276 -1152 -1401 -1463 -1339 -1183 -934 -560 -62 -1027 -1619 -1090
1874.9289379154 -965 -1214 -1090 -716 -560 -965 -1058 -1307 -1463 -1276 -1152 -311 -778 -623 -840 -1058 -903 -1556
1869.9762568732 -840 -1556 -1152 -1992 -809 -840 -934 -1152 -1214 -1743 -1370 -1525 -1027 -1339 -872 -809 -872 -1152 -498
1864.7485379154 -1214 -1276 -809 -467 -1027 -654 -280 -685 -436 -560 -623 -1027 -1401 -996 -872 -996 -249 -1214
1859.7958758309 -1090 -1214 -1868 -1432 -809 -903 -1058 -623 -903 -685 -1432 -1463 -1152 -1307 -1090 -1370 -965 -529
$$ packed form
1896.9408a183K80o85N30k18n61M67L1M67n60k18%J56O22%l42k80O2L1a650
1891.4377568732a276R3j87k80L43%l12%K18j87L43N29k80j87%O2l73O2M98%i03
1885.6598i34r3r4R4M67n30K50K80m98J24m67J56L42O3%p48%K49J87l1a556
1879.8817i34l73m67O22M36q72L12J24k49o2J24J56K49L74M98r65n92a090
1874.9289379154i65k49J24L74J56m05r3k49j56J87J24Q41m67J55k17k18J55a556
1869.9762568732h40p16M04q40J183l1r4k18o2n29L73j55M98l12M67O3o3k80d98
1864.7485379154a214o2M67L42n60L73L74m05K49j24o3m04l74M05J24j24P47a214
1859.7958758309a090j24o54M36O23r4j55M35k80K18p47l1L11j55K17k80M05e29
$$ plain form
1854.8433189577 -1121 -467 -1090 -996 -1214 -965 -965 -1276 -903 -1152 -809 -436 -529 -654 -778 -685 -1214 -872 -778
1849.6156 -498 -934 -778 -1058 -560 -1152 -1370 -1401 -1432 -1245 -747 -872 -934 -529 -903 -778 -965 -1027 -1370 -1214
1844.1125568732 -1152 -1276 -1463 -1370 -1401 -1090 -1432 -996 -1183 -1058 -778 -934 -436 -1276 -591 -1121 -809 -934
1839.1599189577 -1619 -1650 -1245 -529 -467 -1276 -1276 -654 -1245 -654 -1152 -840 -1058 -436 -872 -1090 -1058 -218 -187
1833.9321568732 -529 -311 -716 -93 -560 -187 -654 -903 -1027 -809 -498 -872 -1121 -840 -591 -654 -1058 -809
1828.9795189577 -996 -591 -374 -903 -467 -685 -591 -405 -654 -747 -560 -716 -249 -872 -716 -747 -872 -716 -840
1823.7516568732 -809 -1712 -1432 -934 -809 -560 -156 -654 -560 -498 -1183 -560 -125 -156 -840 -840 -1245 -654 -840 -249
1818.2487568732 -623 -996 -872 -1121 -1401 -965 -1058 -311 -809 -872 -1152 -996 -498 -467 -125 -249 -125 -840 -840
$$ packed form
1854.8433189577a121O54o23R4k18K49%l11L73k49L43L73r3j25j24R3n29L42g78
1849.6156d98m36J56k80M98n92k18l1TJ87M98j25o2M05l74J25j87o2l43a214
1844.1125568732a152j24j87R3l1L11l42M36j87J25K80j56M98q40O85n30L12i34
1839.1599189577a619l1M05P16O2q09%O22n91N91m98L12k18O22m36k18L2Q40a87
1833.9321568732e29K18m05O23m67L73m67k49j24K18L11l74k49K81K49o3m04h09
1828.9795189577i96M05K17n29M36k18R4J86k49r3J87j56M67o23J56l1j25J56h40
1823.7516568732h09r03K80M98J25K49M04m98R4O2o85O23M35l1o84%m05N91j86b49
1818.2487568732f23l73J24k49k80M36r3P47m98o3k80J56M98L1L42j24J24p15h40
$$ plain form
1813.0210379154 -934 -1058 -747 -1868 -872 -1058 -903 -1027 -809 -996 -1339 -1339 31 -529 -436 -685 -498 -623
1808.0683568732 -436 -685 -498 -374 -467 -62 -685 -840 -965 -280 -1058 -1027 -374 -560 -903 -436 -405 -965 -560
1802.8406379154 -872 -1214 -716 -903 -591 -1214 -591 -965 -623 -405 -436 -436 -311 -436 -467 -778 -1245 -934 -840
1797.6129 -903 -716 -809 -903 -1027 -342 -31 374 0 -654 -685 -1027 -1058 -467 -374 -1214 -1152 -218 -218 -374 -249
1791.8348189577 -374 -467 -685 -218 -93 -778 -249 -436 -654 -591 -311 -218 -623 -342 -716 -498 -685 -374 -747
1786.6068758309 -498 -280 -374 -436 31 -467 -996 -529 -747 -1058 -1090 -591 -778 -436 -498 -716 -716 -623 -529 -436 -560
1780.8289 -996 -1121 -685 -716 -498 -903 -374 -311 -685 -809 -498 -840 -529 -747 -31 -436 -623 -498 -965
1775.6010568732 -747 -747 -311 -280 -623 -498 -654 -218 -560 -436 -93 -62 -498 -498 -218 -591 -716 -934 -716 -872
$$ packed form
1813.0210379154i34j24L11j121R96j86J55j24K18j87l43%J370n60R3k49J87f23
1808.0683568732d36k49J87J24r3M05o23j55j25O85p78L1O53j86l43M67L1n60e60
1802.8406379154h72l42M98j87L12o23O23l74L42K18l1%J25j25l1l11m67L11h40
1797.6129i03J87r3r4j24O85L11M05l74o54l1l42l1N91R3q40O2R34%j56b49
1791.8348189577c74r3k18M67J25o85N29j87k18O3K80R3m05K81l74K18j87L11g47
1786.6068758309d98K18r4o2M67m98n29M67k18l11l2M99j87L42o2k18%R3R4R3e60
1780.8289i96j25M36l1K18m05N29O3l74j24L11l42L11k18P16m05j87J25i65
1775.6010568732g47%M36L1l43J25j56M36l42J24L43L1m36%K80l73j25k18K18h72
$$ plain form
1770.0981379154 -934 -809 -436 -467 -872 -467 -93 -280 -872 -1214 -529 -498 -342 -280 -187 -93 -405 -654 -498 -374
1764.5952379154 -405 -405 -405 -685 -218 -654 -1058 31 -62 -62 311 187 405 -280 -311 -747 -218 -467 -498 -1058 -374
1758.8171379154 -342 -249 -342 -342 -436 -436 -529 -498 -872 -311 280 93 -778 -342 -778 -93 -623 -934 -560 -872 -965
1753.0390568732 -249 -280 -467 -280 -1027 -529 -342 31 -685 -405 -125 -342 -374 -654 -280 -840 -374 -249 -809
1747.8113189577 -467 -311 -685 -436 -591 -623 -747 -778 -560 -280 -249 -654 -778 -125 -529 -249 -654 -778 -280
1742.5836 -560 -405 -840 -125 31 0 -374 -156 -125 -156 -187 0 93 93 -498 -903 -342 -529 -654 -560 -156
1736.8055 -62 -311 -498 -249 -311 -1245 -591 -809 -591 -311 -467 -187 31 685 529 -311 -436 -809 -560
1731.5776568732 -498 -591 -93 467 125 -436 -809 -809 -1090 -436 -405 -156 -156 -467 -934 -280 342 -93 0 -591
$$ packed form
1770.0981379154i34J25L73l1m05M05L74j87n92l42O85L1J56O2R3R4l12k49J56c74
1764.5952379154d05%Tk80M67m36m04J089r3%L73j24K18o85l1m36N29k49l1n60c74
1758.8171379154c42R3r3%r4%r3L1l74N61N91j87q71M36m36O85n30l11L74l12i65
1753.0390568732b49l1j87J87p47M98J87L73p16K80Tk17l2k80L74n60M66J25h09
1747.8113189577d67J56l74K49j55l2j24l1K18K80L1m05j24O53m04K80m05j24b80
1742.5836e60J55m35P15J56l1l74K18L1l1TJ87R3%n91m05N61j87j25R4a56
1736.8055f2k49j87K49o2r34O54k18K18K80j56K80K18O54j56q40j25l73e60
1731.5776568732d98r3M98N60l42n61l73%k81O54L1K49%l11m67O54O22m35R3e91
$$ plain form
1726.0747379154 -311 -778 -560 -716 -342 -31 -934 -125 -187 -249 -934 -249 -342 -560 -591 -187 -187 0 -560 -1152
1720.5718379154 -623 -93 0 -560 -62 -218 311 311 -405 405 -529 -187 -498 -93 249 -218 -311 -31 -311
1715.3441 31 249 62 156 -311 -156 -218 -93 -31 93 311 436 374 93 560 156 93 156 -156 280
1709.8412 405 187 -405 62 -218 -125 62 249 218 374 529 62 -374 249 1027 623 93 93 62 -218
1704.3381568732 -125 -249 -125 62 280 125 -93 -311 -903 -436 405 342 -374 -218 -560 -218 -374 -311 -311
1699.1103379154 -436 -809 436 218 529 342 31 -31 -467 560 -93 -249 125 -249 -187 249 31 125
1694.1576568732 311 249 62 436 -374 62 840 -280 280 187 -125 -311 -93 591 -31 405 125 -62
1689.2051189577 467 62 -125 -311 747 560 436 405 -93 -467 -623 0 498 -62 405 218 -31 -342
$$ packed form
1726.0747379154c11m67K18j56L74L11r03Q09o2To85O85r3k18l1M04%J87n60a152
1720.5718379154f23N30R3n60M98j56N29%p16Q10r34L42l11M05L42m67r3K80c11
1715.3441C1K18j87R4m67J55o2J25O2J24K18J25o2k81M67m04o3O3l12B80
1709.8412D05k18n92M67k80R3J87Tl1J56J55m67m36O23P78m04n30%l1b18
1704.3381568732a25j24J24J87K18j55k18Tn92M67Q41o3p16J56l42L42j56O3c11
1699.1103379154d36l73J245k18L11j87l11o2m36J027o53j56L74l74O2M36k18A25
1694.1576568732C11o2j87L74q10M36P78j120N60r3l12j86K18O84o22M36k80f2
1689.2051189577D67m05j87j86J058j87j24l1m98l74j56O23M98n60M67j87k49c42
$$ plain form
1684.2524379154 -405 -187 -156 -125 -560 -1556 436 934 342 -374 -218 -62 -156 -436 716 280 311 -218 498 187
1678.7495379154 125 -342 560 405 280 -156 -31 591 62 405 342 -156 -218 280 31 -156 -31 31 -156
1673.5218189577 -187 249 405 156 125 -467 -62 840 436 405 498 125 218 280 -529 -560 62 125 -623 125
1668.0189 809 560 218 311 125 342 498 342 -125 187 560 280 156 -31 467 623 467 342
1663.0661379154 156 591 31 311 685 -125 -62 93 -218 -93 498 654 965 405 654 -280 218 -342
1658.1136 187 560 218 -467 93 591 654 405 623 623 685 840 498 31 374 747 685 342 -62 187
1652.6105568732 405 -436 280 405 -31 249 93 311 93 93 31 218 467 716 498 31 -560 93 218 903
1647.1076568732 872 872 809 840 529 623 1027 965 1090 1339 498 -311 125 -342 467 93 436 623 591 280
$$ packed form
1684.2524379154d05K18L1Tm35r96J992M98n92p16J56Tr4k80J152m36L1n29P16A87
1678.7495379154A25m67R02j55j25m36J25O22n29L43o3m98o2M98k49j87J25O2a56
1673.5218189577a87M36J56k49l1n92M05R02m04l1R3l73R3O2q09l1O22O3p48A25
1668.0189H09k49l42R3j86K17J56j56m67L12L73k80j24j87M98J56j56C42
1663.0661379154A56M35n60K80L74q10O3J55l11J25N91J56L11n60K49r34M98c42
1658.1136A87L73l42o85N60M98O3k49K18%O2J55l42m67L43L73o2l43m04A87
1652.6105568732D05q41P16J25m36K80j56K18k18%o2J87K49Tk18m67n91O53J25I03
1647.1076568732H72%o3L1l11R4M04o2J25K49q41q09M36m67Q09l74L43J87l2B80
$$ plain form
1641.6047379154 311 125 311 405 623 623 778 467 685 405 -93 716 840 529 311 529 529 623 654 -125
1636.1018379154 342 218 840 436 93 436 280 311 405 591 374 872 1588 1027 1058 623 249 591 965
1630.8741 1058 -62 405 1121 872 467 125 498 -31 560 156 467 903 311 436 1525 965
1626.1966189577 591 840 716 498 654 218 405 560 342 529 1090 747 498 840 591 342 467 872 654
1620.9687568732 436 -280 1027 311 747 685 872 1058 840 747 467 436 280 93 529 529 716 747 996 1307
1615.4657568732 747 654 218 0 467 778 809 1121 342 342 872 809 840 840 716 1183 1027 872 529 591 965
1609.6877568732 249 623 934 778 996 1090 809 591 591 1245 872 560 342 1027 965 965 872 529 778 934
1604.1847568732 1152 1121 1121 1058 1090 747 809 436 1245 -156 280 311 405 934 1307 1401 840 1152 1463 840
$$ packed form
1641.6047379154C11j86J86R4K18%J55l11K18k80m98Q09J24l11k18K18%R4L1a25
1636.1018379154C42j24O22m04l43L43j56L1R4J86k17M98P16n61L1m35l74L42I65
1630.8741A058j120M67P16k49m05l42L73n29N91m04L11M36n92J25J089I65
1626.1966189577E91K49j24k18J56m36J87J55k18J87N61l43k49L42k49TJ25M05F54
1620.9687568732D36p16J307p16M36o2J87J86k18r3k80l1j56j87M36%J87L1K49A307
1615.4657568732G47r3m36k18M67L11L1L12p79%N30o3L1%j24M67j56j55l43O2I65
1609.6877568732B49L74L11j56K18R4k81k18%O54l73l12k18O85o2%r3l43K49I34
1604.1847568732A152l1%o3L2l43O2l73Q09j401M36L1R4N29L73R4n61L12L11H40
$$ plain form
1598.6819379154 342 529 405 685 342 342 311 623 965 591 560 872 965 1058 840 716 1152 31 1214 778
1593.1789379154 1401 809 1183 1339 778 1339 1090 591 1370 1339 1307 1276 1214 1058 1121 996 1401 840 1463
1587.9513 1370 1090 1370 374 840 1276 934 747 809 1276 1152 1058 218 747 374 716 747 654 1183
1582.7233568732 1463 1276 498 840 1121 840 965 996 903 218 498 623 654 1121 1152 1650 1152 654 1556 1339
1577.2204379154 934 1370 716 840 623 1432 872 1152 1121 747 1027 1058 1152 1090 1588 1214 1183 1090 934 1090
1571.7175379154 623 1401 1463 996 685 747 872 1339 716 1339 1370 1339 1339 1588 1370 1214 778 840 654 467
1566.2146189577 654 374 872 1121 1027 1245 1463 1121 1276 1121 872 1058 1899 1090 1121 1152 1245 903 1774 1650
1560.7117189577 1276 1463 1121 1183 965 1432 1432 1152 934 1463 1681 1463 1214 1525 1152 1183 1121 1121 1463 1370
$$ packed form
1598.6819379154C42J87j24K80l43%l1L12L42l74l1L12R3Tk18j24M36j121J183G78
1593.1789379154A401n92L74J56n61N61k49m99P79l1l2l1o2j56O3j25M05n61A463
1587.9513A370k80K80r96M66M36l42j87O2M67j24r4q40N29l73L42L1r3A183
1582.7233568732A463j87p78L42K81k81J25L1r3o85K80J25L1M67L1M98m98TR02A339
1577.2204379154I34M36o54J24k17Q09n60K80l1l74K80L1R4o2M98l74l1r3j56A090
1571.7175379154F23P78O2m67l11O2J25M67o23O23L1l1%K49k18j56m36O2j86D67
1566.2146189577F54k80M98K49r4K18Tl42J55j55k49J86Q41q09L1TR3l42Q71A650
1560.7117189577A276J87l42O2k18M67%k80k18N29K18k18k49L11l73L1o2%L42A370
$$ plain form
1555.2088 1494 1027 1090 1152 1276 1712 623 498 1090 1307 1370 1183 1307 1152 1090 1370 1183 1183 1370
1549.9809568732 1556 1245 1525 965 996 1121 1339 405 1090 996 1681 1245 1401 1307 1276 996 1276 1183 1214
1544.7532379154 1868 1681 1712 1494 1432 591 1370 1619 1868 1432 1806 1774 1868 1712 1868 1121 1463 1401 1556 872
1539.2503189577 1214 1681 1307 1681 1214 1058 1930 2148 1650 1339 498 1370 2086 1961 1961 1743 1681 1681 1494
1534.0225 1245 1556 1774 1339 1525 1556 1245 1214 1588 1619 1307 1712 2086 1494 1712 1463 1992 1556 2179
1528.7946568732 1588 1432 1992 1556 2241 1525 2179 1806 2117 1588 1868 1743 1307 1868 1961 2584 2241 1401
1523.8421 1058 1650 2023 1806 1245 1307 1401 1307 1806 1619 1899 1899 1588 2086 2179 1463 654 1152 1401 1556
1518.3392 1494 1494 1774 1930 1370 1525 1961 1339 2677 1868 1868 1681 1930 1650 1370 1650 1712 2802 2397
$$ packed form
1555.2088A494m67O3O2J24M36j089j25N92K17O3j87J24j55o2K80j87%A370
1549.9809568732A556l11K80n60L1J25K18r34O85r4O85m36J56r4l1k80K80r3A214
1544.7532379154A868j87L1k18o2q41P79K49Tm36L74l2R4j56J56p47L42o2J55H72
1539.2503189577A214M67l74L74m67j56Q72K18m98l11q41Q72P16j25%k18o2%A494
1534.0225A245L11K18m35J86L1l11l1L74L1l12M05L74n92K18k49N29m36B179
1528.7946568732A588j56N60m36O85p16O54l73L11n29K80j25m36N61R3O23l43A401
1523.8421A058N92L73k17n61O2R4r4M99j87K80%l11M98R3p16q09M98K49A556
1518.3392A494%K80J56n60J55M36o22J338q09%j87K49k80TK80O2J090B397
$$ plain form
1513.1113379154 1992 1712 1588 2055 1494 1027 1339 1650 1868 1930 1650 1712 2304 1992 1837 2397 1806 1899
1508.1588 1650 1401 1245 2117 2272 1525 1930 840 2459 1837 934 1183 996 1027 2397 2708 1650
1503.4813 1401 1837 1868 1899 2055 2708 3860 2521 2926 2428 2833 2179 2490 2117 2117 2428 2646 2459 2708
1498.2533568732 2366 2117 1868 2802 2210 1774 1681 1868 2521 2397 2210 2366 2895 2895 2957 3362 2864 3455 3580 2584
1492.7505379154 2459 3020 2490 2459 3113 3237 2802 3113 3486 2988 2521 2117 2646 3237 2584 2553 3269 2957
1487.7979 3020 2802 2739 2553 2521 2988 3082 2335 2677 2428 2304 2335 2988 3424 3113 3455 2895 3300 3393
1482.5700568732 3704 3985 3704 2833 4109 3798 3985 4202 4514 4452 4763 4234 3891 4234 4202 3891 4420 4389
1477.6175 4825 5136 5043 4763 4981 4576 4576 4763 5572 5261 5136 5074 5728 5541 5697 5074 5448 5977 5199
$$ packed form
1513.1113379154A992k80j24M67n61m67L12L11K18O2k80O2N92l12j55N60n91A899
1508.1588A650k49j56Q72J55p47M05j090J619o22r03K49j87L1J370L11A650
1503.4813A401M36L1TJ56O53J152j339M05m98M05o54L11l73%L11K18j87B708
1498.2533568732B366k49TR34n92m36r3J87O53j24j87J56N29%O2M05m98N91J25B584
1492.7505379154B459N61n30l1O54J24m35L11L73m98m67m04N29N91o53l1P16B957
1487.7979C020k18o3j86l2M67R4p47L42k49j24L1O53M36l11L42n60M05C393
1482.5700568732C704K81k81q71J276l11J87K17L12o2L11n29l43L43l2l11N29D389
1477.6175D825L11r3k80K18m05%J87Q09l11j25o2O54j87J56o23L74N29E199
$$ plain form
1472.3896568732 5510 5199 5915 5541 5479 6506 5541 6101 6008 6506 6475 5915 6226 5852 5915 6132 5852 6195 5883
1467.1619189577 6568 6506 6568 6568 6599 6475 7253 6942 7066 7253 7004 7378 7160 7191 7129 7222 8187 8405 9121 10055
1461.6590189577 10771 12234 12296 13386 13728 14475 15689 16748 18460 20452 22600 23845 26460 28608 30351
1457.5317568732 32779 34242 36017 38227 40873 44079 47535 52079 56344 62196 65060 67520 67146 65372
1453.6797189577 64811 64469 65558 66835 70197 74399 77637 80127 80252 79691 79100 78571 77606 75738 72780
1449.5526 69138 63753 57963 52484 48344 45854 43861 43612 43301 43799 44173 45231 46040 45605 42056
1445.4253379154 34927 27051 21573 17899 15222 13323 12639 11767 10615 9432 10273 11113 10895 11020 11549
1441.2981189577 11580 11642 13074 13074 13012 13230 12670 12234 12452 13074 12981 12607 12639 12670 12670 11736 12234 11642 11518 11393
$$ packed form
1472.3896568732E510l11P16l74o2J027r65N60r3M98l1n60L11l74O3K17k80L43E883
1467.1619189577F568o2O2%L1j24P78l11J24J87k49L74k18L1o2R3R65K18P16A0055
1461.6590189577A0771J463O2J090L42P47J214J059J712J992K148J245K615K148C0351
1457.5317568732C2779J463J775K210K646L206L456M544M265N852K864K460l74F5372
1453.6797189577F4811l42J089J277L362M202L238K490J25n61n91n29r65j868G2780
1449.5526F9138n385n790n479m140k490j993k49l11M98L74J058Q09m35D2056
1445.4253379154C4927p876n478l674k677j899o84q72j152j183Q41Q40k18J25A1549
1441.2981189577A1580O2J432%o2K18n60m36K18O22r3l74L2L1%r34M98n92j24A1393
$$ plain form
1435.7953 11642 11269 10273 9121 8280 7409 7160 6880 6132 5728 5074 4825 4638 4202 3704 3518 3237
1431.1177189577 2926 2490 2864 2023 1806 2490 2926 2366 1588 2677 2771 3362 3393 3051 2521 3237 2771 3144
1426.1650568732 3424 3237 2895 2771 2335 2771 2802 3113 3051 3300 2739 2677 2895 3082 3611 3206 3051 2926 2802
1420.9373189577 3486 3580 2646 2210 2428 2335 2086 2055 2179 1588 1245 1868 1276 1650 1432 1245 1525 1961 1339
1415.7096 1619 1961 1650 2553 1494 1556 2241 1899 1930 1806 1588 1712 2023 1961 2739 1401 1525 1992
1410.7569189577 1961 1681 1588 2179 2086 1681 2428 2802 2272 2646 1930 1650 1619 1432 1619 1556 2148 1961 1121
1405.5291 1681 1525 1121 996 1650 934 1058 654 747 996 716 1183 1245 809 1152 778 716 1027 1339
1400.3013379154 965 1525 996 1245 1245 1463 1276 1058 903 1121 560 1152 1619 1681 623 1058 1774 2023 1588
$$ packed form
1435.7953A1642l73r96j152q41q71k49k80p48m04o54k49j87m36m98j86C237
1431.1177189577B926m36L74q41k17O84M36n60p78J089R4N91L1l42n30P16m66C144
1426.1650568732C424j87l42j24m36M36L1L11o2K49n61o2K18J87N29m05j55j25B802
1420.9373189577C486R4r34m36K18r3k49l1J24n91l43O23n92L74k18j87K80M36A339
1415.7096A619L42l11R03j059O2O85l42L1j24k18J24L11o2P78j338J24A992
1410.7569189577A961k80r3N91r3m05P47L74n30L74p16k80l1j87J87o3N92j87A121
1405.5291A681j56m04j25O54p16J24m04R3K49k80M67O2m36L43l74o2L11A339
1400.3013379154I65N60n29K49%K18j87k18j55K18n61N92M67O2j058M35P16K49A588
$$ plain form
1395.0735189577 1432 2304 2179 1992 1463 1992 2117 2086 1930 1650 1743 1992 1992 1774 1681 1339 1370 1774 1307 1090
1389.5706189577 591 1183 1058 1152 591 1121 1712 872 716 1432 934 1152 1183 1650 1681 1090 1556 1339 1339
1384.3427568732 1307 1339 1899 1494 1432 1463 1494 1401 1556 1152 1339 1090 1494 965 1152 1152 1058 1058 1307 1027 1276
1378.5648 1245 747 654 1058 840 840 1090 529 1027 1058 1588 1494 1556 1463 1525 1401 1121 374 1152 1121
1373.0617568732 1090 1090 1214 1058 1058 1494 872 1712 1463 1276 1619 1868 1307 872 1401 654 1556 1650 778
1367.8340379154 872 623 1152 1121 1307 623 1245 1276 1245 1650 1743 1681 2055 1774 2272 1712 1619 1743 1494 1930
1362.3311189577 1992 1370 1712 1930 1432 1463 1837 1712 1463 934 1463 2086 1650 1214 1899 872 1339 1121
1357.3783568732 1525 934 996 1183 872 1339 1214 872 1401 1681 1556 1245 1245 1868 1494 1058 1432 1152 996
$$ packed form
1395.0735189577A432Q72j25j87n29N29J25l1j56k80R3K49%k18r3l42L1M04m67A090
1389.5706189577E91N92j25R4n61N30N91q40j56P16m98K18L1M67L1n91M66k17A339
1384.3427568732A307L2N60m05o2L1Tr3J55m04J87k49M04n29J87%r4%K49k80A276
1378.5648A245m98r3M04k18%K50n61M98L1N30r4O2r3O2j24k80p47P78A121
1373.0617568732A090%J24j56%M36o22Q40k49j87L43K49n61m35N29p47R02R4G78
1367.8340379154H72k49N29l1J86o84O22L1l1M05R3o2L74k81M98n60r3J24k49A930
1362.3311189577A992o22L42K18m98L1L74j25k49n29N29O23m36TO85j027M67A121
1357.3783568732A525n91O2J87l11M67j25l42N29K80j25l11%O23l74m36L74k80I96
$$ plain form
1352.1507189577 996 342 996 623 2117 1183 1339 1183 1463 1152 716 1214 1339 1774 1183 1432 1214 1463
1347.1979568732 1276 903 342 1245 1401 1774 1152 809 903 809 1961 1463 1619 1370 1494 1245 1401 1463
1342.2454189577 716 1245 1152 1090 1370 1152 1245 1868 1556 747 405 1401 1027 1183 1152 342 934 965 1432 1619
1336.7425 1432 1058 1525 1463 1245 1401 1058 1121 1463 1339 934 1401 1339 1681 1370 1588 1058 498 840
1331.5146568732 1090 934 747 1276 1463 1370 1588 1370 1183 809 1339 1494 716 716 996 1432 1058 1152 965
1326.2869189577 1370 934 778 1183 1090 1619 1370 1307 685 1806 1588 1090 1058 1339 1463 1276 1494 1152
1321.3342568732 1152 1494 1276 1774 903 1152 996 1432 1556 1245 1401 1214 934 1619 934 778 405 1806
1316.3817 1556 1214 654 1525 1090 1525 965 934 685 1152 1121 1339 1619 1743 591 1339 809 1588
$$ packed form
1352.1507189577I96o54O54l73J494r34J56j56K80l11m36M98J25M35n91K49k18A463
1347.1979568732A276l73n61R03J56L73o22l43R4r4J152m98J56k49J24k49J56A463
1342.2454189577G16N29r3o2K80k18R3O23l12q09l42R96l74J56l1q10N92L1M67A619
1336.7425A432l74M67o2k18J56l43O3L42j24m05M67o2L42l11K18n30n60H40
1331.5146568732A090j56j87N29J87r3K18k18j87l74N30J55p78%K80M36l74R4I65
1326.2869189577A370m36j56M05r3N29k49o3o22J121k18m98l2K81J24j87K18A152
1321.3342568732A152L42k18M98q71K49j56M36J24l11J56j87k80O85o85j56l73A806
1316.3817A556l42n60Q71m35M35n60l1k49M67l1K18K80J24j152P48n30A588
$$ plain form
1311.4289379154 1152 1556 872 903 1276 1090 809 965 934 965 809 1276 1245 1650 1307 1121 996 872 1868
1306.2013 1463 1432 1339 996 1307 1183 1339 1276 1027 1058 1401 1432 1650 1525 1463 654 1339 1027 903 1152
1300.6983 436 187 498 1183 965 1027 1370 1214 1027 1276 1027 1837 1245 1027 1463 934 623 1027
1295.7456189577 996 1339 1245 778 623 1058 965 1245 1276 467 1152 1090 1339 1058 1027 809 716 934 1214 809
1290.2427189577 747 872 778 934 1307 809 1463 1868 1432 809 498 716 778 1152 872 311 840 1027 1650
1285.0148758309 1432 1090 809 1152 1214 1058 903 623 903 1090 1058 1401 965 342 747 1463 498 436
1280.0623189577 560 716 374 623 934 1307 1432 1276 903 560 405 529 498 1307 1058 560 654 903 872
1274.8346 872 654 498 747 996 809 1027 1214 560 1307 1370 685 1370 1027 872 1121 872 965 1027
$$ packed form
1311.4289379154A152M04o84L1L73j86k81J56l1L1j56M67l1M05l43j86j25j24A868
1306.2013A463l1r3l43L11j24J56o3k49L1L43L1K18j25o2q09O85l12j24A152
1300.6983D36k49L11O85k18O2L43j56j87K49k49Q10n92k18M36n29l11A027
1295.7456189577I96L43r4m67j55M35r3K80L1q09O85o2K49k81l1k18r3K18K80H09
1290.2427189577G47J25r4J56L73m98O54M05m36o23l11K18O2L74k80n61N29J87A650
1285.0148758309A432l42k81L43O2j56j55k80K80J87l2L43m36o23M05P16r65D36
1280.0623189577E60J56l42K49L11L73J25j56l73l43j55J24l1Q09k49m98R4K49H72
1274.8346H72k18j56K49Tj87K18J87o54P47O3o85O85l43j55K49k49R3A027
$$ plain form
1269.6067379154 685 934 1152 1027 872 1121 872 840 1370 1058 934 934 1650 1214 1370 934 747 1152 965
1264.3789189577 716 965 840 467 996 -249 249 311 187 498 903 125 934 934 809 1058 840 872 778
1259.1511568732 654 591 840 809 778 560 125 529 747 654 685 498 498 591 93 1027 1712 1183 809 872 840
1253.3731 872 654 809 1058 467 778 1121 747 405 965 280 342 405 1214 872 529 996 1027 840
1248.1452568732 840 529 809 1494 1183 778 467 809 591 623 872 436 809 342 591 747 623 529
1243.1927 623 903 591 685 934 840 809 1090 529 903 249 249 342 654 903 1307 1494 1183 809 156
1237.6898 -93 467 747 840 374 280 311 934 778 311 716 716 1245 218 436 125 93 560 1214 374
1232.1867568732 747 125 405 623 156 -156 405 311 280 809 342 187 311 903 498 560 778 716 467
$$ packed form
1269.6067379154F85K49K18j25j55K49k49l2N30l12j24%P16m36J56m36j87M05I65
1264.3789189577G16K49j25l73N29j245M98O2j24L11M05p78Q09%j25K49k18L2G78
1259.1511568732F54o3K49l1Tk18m35M04K18r3L1j87%R3m98R34O85n29l74O3H40
1253.3731H72k18J55K49n91L11L43l74l42N60o85O2O3Q09l42l43M67L1H40
1248.1452568732H40l11K80O85l11m05l11L42k18L2K49m36L73m67K49J56j24E29
1243.1927F23K80l12R4K49r4l1K81n61L74o54%R3L12K49M04J87l11l74A56
1237.6898i3N60K80R3m66r4L1O23j56m67M05%N29j027K18l11l2M67O54C74
1232.1867568732G47o22K80K18m67l12N61r4l1N29m67j55J24N92m05O2K18o2D67
$$ plain form
1226.9590379154 685 872 467 342 249 747 903 934 1152 560 560 716 93 -31 903 374 374 311 840 965
1221.4561189577 436 436 -218 249 498 996 467 93 903 342 1027 249 747 -156 187 280 187 156 249 529
1215.9532189577 716 1058 1183 374 809 965 93 809 1090 716 436 93 342 249 -654 0 342 187
1211.0005379154 467 436 0 249 249 342 374 311 249 249 685 529 623 218 311 498 280 156 62 560 125 125
1204.9474 156 -560 62 685 156 934 1058 1214 -125 -436 187 436 -125 31 374 62 280 311
1199.9947189577 280 311 311 809 187 187 529 311 280 685 623 374 280 156 1525 840 1183 747 311 809 716
1194.2165379154 778 1090 1961 -405 -342 623 218 0 249 156 436 156 125 560 -218 0 374 218 311
1188.9889 529 405 716 934 249 156 467 809 311 156 591 872 591 -249 125 -31 -156 0
$$ packed form
1226.9590379154F85J87m05j25r3M98J56L1K18n92%J56o23j24R34n29%o3N29I65
1221.4561189577D36%o54M67K49M98n29l74Q10n61O85p78M98r03L43R3r3l1R3E29
1215.9532189577G16L42J25q09M35J56q72P16K81l74k80l43K49r3r03O54L42A87
1211.0005379154D67l1m36K49%R3L2o3o2%M36j56R4m05R3J87k18j24r4M98m35A25
1204.9474A56p16O22O23n29P78J24J56j339l11O23K49n61J56L43l12K18C11
1199.9947189577B80L1%M98o22%L42k18l1M05o2k49r4j24J369o85L43m36TM98G16
1194.2165379154G78L12Q71k366O3R65m05k18K49r3K80k80l1M35p78K18L74j56C11
1188.9889E29j24L11K18o85r3L11L42m98j55M35K81k81q40L74j56j25@
$$ plain form
1184.0361379154 -436 -405 -311 -591 249 498 374 187 560 0 -560 125 405 280 125 623 467 840 342
1178.8084189577 498 342 0 -654 -31 -93 31 965 311 623 685 342 -280 591 529 125 -125 0 187
1173.5805568732 -125 125 342 -374 -218 31 -623 -218 -31 -125 -436 -436 -436 -156 342 591 747 591 218 -218
1168.0776568732 -218 -218 342 62 0 623 -436 62 156 93 -31 249 872 -31 -62 0 187 31 -31 560
1162.5747379154 716 62 93 -125 436 -218 -62 -311 -498 311 -156 374 249 -374 -342 -405 -218 -342 -405
1157.3470189577 -405 -374 -187 -311 93 560 280 405 62 62 -405 93 342 280 -249 62 218 218 -125 125
1151.8441 -249 -342 62 -374 -280 -467 -62 -156 -62 -654 -342 -31 62 685 560 31 374 872 654 529
1146.3412 436 1152 560 -498 498 -249 -280 342 62 -93 249 -187 156 280 -405 31 31 -93 280
$$ packed form
1184.0361379154d36L1R4k80Q40K49j24j87L73n60TO85K80j25j55M98j56L73C42
1178.8084189577D98j56l42o54O23o2J24R34o54L12O2l43o22Q71o2m04k50J25A87
1173.5805568732a25K50K17p16J56K49o54M05J87r4l11%TK80M98K49J56j56l73b18
1168.0776568732b18%N60k80o2O23j059M98R4o3j24K80O23r03l1O2J87j56o2E60
1162.5747379154G16o54L1k18N61o54J56k49j87Q09m67N30j25o23L2o3J87j24d05
1157.3470189577d05L1J87j24M04M67k80J25l43%m67M98K49o2n29L11J56%l43A25
1151.8441b49r3M04m36R4j87M05r4R4n92L12L11R3O23j25n29L43M98k18E29
1146.3412D36P16n92j058R96p47l1O22k80j55L42m36L43J24o85M36%j24B80
$$ plain form
1141.1133379154 311 -156 342 778 623 342 249 -125 -218 -156 -93 218 -529 93 280 -249 249 -93 560
1135.8855189577 623 342 249 125 -591 -311 467 62 840 840 965 996 187 -125 -249 -249 156 311 -467 -311
1130.3827 -249 31 -93 0 -187 -374 -623 -311 -467 -623 -623 -436 405 529 872 591 93 -125 -31 0 -778
1124.6045189577 -342 -125 -654 -280 -187 156 -280 280 280 31 -311 -436 -654 -93 -31 0 529 156 62 -591
1119.1017 125 218 62 156 93 342 -374 156 -218 187 -374 -498 0 -125 -685 -778 -249 -187 -560 -467
1113.5987 -125 62 -249 62 0 -187 93 -280 -93 280 -249 -623 -31 654 -249 -156 -374 -31 -31
1108.3708568732 623 -249 31 -156 -685 -342 -436 -311 -311 -342 31 -311 218 -62 -62 -529 -716 -187 -872 -31
1102.8679379154 93 -93 -654 -187 0 -342 -623 -747 -934 -374 -654 -125 -436 -778 62 249 -436 -342
$$ packed form
1141.1133379154C11m67M98M36j55k81r3l74r3O2O3L11p47O22J87n29M98l42E60
1135.8855189577F23k81r3j24p16K80P78m05P78%J25L1q09l12j24%M05J55p78c11
1130.3827b49K80j24R3j87Tk49L12j56T%J87Q41J24L43k81m98k18R4L1g78
1124.6045189577c42K17n29L74R3L43m36N60%k49l42j25k18N61O2L1N29l73r4e91
1119.1017A25R3j56R4o3K49p16N30l74M05n61j24M98j25n60r3N29O2l73d67
1113.5987a25J87l11L11o2j87K80l73J87L73n29l74N92O85r03R3k18L43c1
1108.3708568732F23q72K80j87n29L43r4J25%l1L73l42N29k80%m67j87N29o85c1
1102.8679379154I3j86n61M67J87l42k81j24j87N60k80N29l11l42Q40J87o85c42
$$ plain form
1097.9154 -31 31 -498 62 93 -249 -249 -498 -342 -623 -778 -125 218 -93 -125 -311 -591 -311 -218 -685
1092.4123568732 -187 -467 654 -218 -685 -342 -31 -436 0 -591 -809 -311 -342 -249 0 -280 -685 -809
1087.4598189577 -716 -623 -342 -249 -778 -280 -996 -809 -903 -218 -654 -996 -840 -809 -872 -1058 -965 -374 -280 -93
1081.9569 -623 -498 -716 -374 0 -374 -218 -498 0 -436 -778 -467 -374 -685 -623 -654 -436 -93 -498
1076.7289568732 -93 218 529 156 -62 -125 -498 -591 -654 -374 -156 -436 -996 -1027 -249 -436 -342 -1058 -1027 -654 -840
1070.9508758309 -374 -311 -467 -280 -654 -498 -156 -93 156 125 156 467 187 -716 -1152 -934 -965 -498 -498 -685
1065.4479568732 0 311 -872 -685 -498 -872 -934 -623 -903 -716 -1307 -1588 -934 -342 -747 -125 -778 -156 -467
1060.2202379154 -685 -1121 -872 -872 -778 249 -591 -778 -1214 -809 -778 -685 -934 -529 -560 -840 -467 -374 -903 -1058
$$ packed form
1097.9154c1O2n29N60L1l42%k49J56k81j55O53L43l11l2j86k80K80R3f85
1092.4123568732a87k80J121q72m67L43L11m05M36n91k18M98l1R3K49k80m05h09
1087.4598189577g16R3K81R3n29M98p16J87r4O85m36l42J56L1o3j86R3N91R4i3
1081.9569f23J25k18L42L74l74J56k80M98m36l42L11R3l11O2l1K18L43d98
1076.7289568732i3L11Tl73k18o3l73r3o3K80K18k80n60l1P78j87R4p16L1L73h40
1070.9508758309c74O3j56J87l74J56L42O3K49l1L1L11k80r03m36K18l1M67%f85
1065.4479568732@L11j183J87Tl74o2L11k80J87n91k81O54N92m05O22o53O22d67
1060.2202379154f85m36K49%R4J027q40j87m36M05L1R3k49M05l1k80L73R3n29a058
$$ plain form
1054.7173189577 -778 -716 -311 -125 -467 -872 -1183 -1027 -716 62 -747 -1027 -1183 -1214 -872 -934 -747 -747 -591 -436
1049.2144189577 -280 -249 -342 -654 -840 -591 -529 -996 -934 -1370 -529 -187 -560 -125 -280 -498 125 -560 -1183
1043.9865568732 -560 -623 -996 -1121 -809 -591 -374 -654 -249 -1027 -747 -778 -747 -1027 -1027 -249 529 -654 -529 -280
1038.4836568732 -778 -280 -685 -747 -1152 -1214 -872 -685 -498 -1090 -1556 -903 -716 -374 -529 -872 -125 62 -125
1033.2559189577 -31 -654 -218 -623 218 -156 -374 -249 -685 -778 -996 -685 -311 -529 -872 -623 156 -280 -218
1028.0282 187 125 -529 -716 -591 -436 -529 -903 -498 -560 -342 -591 -498 -1058 -996 -872 -716 -685 -1556 -840
1022.5249568732 -747 -716 -623 -1121 -498 -778 -654 -1027 -623 -840 -685 -654 -93 -249 -249 -872 -1432 -685 -872 -778
1017.0207568732 -778 -685 -436 -872 -1152 -809 -1152 -1307 -342 -872 -374 -436 -654 -187 -685 249 -1058 -1432
$$ packed form
1054.7173189577g78O2M05J86l42m05l11J56L11P78q09k80j56l1L42o2J87%J56d36
1049.2144189577b80L1r3l12j86K49O2m67O2m36Q41L42l73M35j55k18O23o85a183
1043.9865568732e60o3l73j25L12K18K17k80M05p78K80l1L1k80%P78Tj183J25b80
1038.4836568732g78M98m05o2m05o2L42J87Tn92m66O53J87L42j55l43P47J87a25
1033.2559189577c1o23M36m05Q41l74k18J25m36r3k18L11L74k18l43K49P79m36b18
1028.0282A87o2o54j87J25J55r3l74M05o2K18k49R3n60O2J24J56L1q71h40
1022.5249568732g47L1R3m98O23k80J24l73M04k17J55L1N61j56%o23n60P47j87g78
1017.0207568732g78R3K49m36k80L43l43j55R65n30M98o2k18M67m98R34j307a432
$$ plain form
1012.0670189577 -778 -934 -623 -529 -560 -591 -249 -405 -934 -623 -498 -623 -560 -249 -623 -405 -809 -311 -405 -374
1006.5628189577 -840 -405 -809 31 -591 -342 -591 -623 -778 -1090 -1401 -809 -623 -685 -311 -747 -654 -716 -560
1001.3339 -716 -1058 -591 -467 -498 -467 -903 -529 -436 -716 -747 -623 -560 -996 -1027 -1121 -809 -249 -156 -280 -311
995.5545 -872 -934 -872 -872 -591 -1214 -1183 -809 -374 -1121 -716 -591 -529 -996 -747 -498 -747 -809 -436 -716 -965
989.7752189577 -747 -747 -809 -498 -218 -778 0 -405 -405 -529 -591 -1214 -716 -1245 -1027 -1090 -965 -498 -778 -560
984.271 -623 -1432 -591 -311 -903 -809 -311 -218 -436 -1058 -1090 -654 -840 -747 -996 -840 -467 -187 -716
979.0421568732 -1432 -1214 -809 -529 -840 -809 -436 -1090 -1183 -685 -436 -747 187 -125 -93 -778 -809 -1152 -1370
973.8132379154 -1152 -1245 -1214 -778 -591 -872 -716 -342 -529 -747 -1183 -996 -1276 -623 -716 -1058 -1027 -1152 -778
$$ packed form
1012.0670189577g78j56L11R4l1TL42j56n29L11J25j25O3L11l74K18m04M98r4c74
1006.5628189577h40M35m04Q40o22K49k49l2j55l12l11N92J86o2L74m36R3o2e60
1001.3339g16l42M67J24l1L1m36L74R3k80l1J24O3m36l1r4L12N60R3j24c11
995.5545h72o2O2%K81o23L1L74M35p47M05J25O2m67K49Tk49o2L73k80i65
989.7752189577g47%o2L11K80n60P78m05%j24o2o23M98n29K18o3J25M67k80e60
984.271f23q09Q41K80n92R4M98R3k18o22l2M36j86R3k49J56L73K80g16
979.0421568732a432K18M05K80l11L1L73o54r3M98K49l11R34l12L2o85l1l43a370
973.8132379154a152r3L1M36J87k81J56L74j87k18m36J87k80O53r3l42L1j25g78
$$ plain form
968.5842 -934 -809 -809 -1152 -996 -778 -965 -529 -840 -872 -1214 -903 -747 -467 -529 -654 -716 -1463 31 -187
963.08 -405 -1681 -872 -903 -1463 -1307 -1681 -1027 -840 -1152 -1681 -1401 -1743 -1090 -498 -903 -872 -1090
958.1263189577 -1525 -1370 -1245 -1463 -685 -1245 -1183 -1245 -654 -747 -809 -498 -405 -623 -1339 -996 -1183 -1152 -1588 -965
952.6222189577 -498 -436 -1588 -1463 -716 -934 -965 -1619 -1494 -1090 -840 -778 -840 -1432 -1121 62 -1090 -934
947.6684568732 -809 -623 -280 -965 -685 -996 -560 -1090 -965 -1370 -965 -311 -716 -467 -840 -840 -1214 -1774 -996
942.4395189577 -1214 -716 -529 -498 -342 -747 -1276 -1401 -996 -716 -405 -591 -1152 -1556 -1307 -778 -1027 -903
937.4858568732 -840 -1619 -872 -1090 -1276 -934 -1152 -1525 -1774 -1121 -374 -1339 -560 -1401 -1214 -934 -1152 -778
932.5320189577 -623 -809 -591 -872 -1401 -778 -872 -1245 -965 -1681 -1245 -872 -1245 -1619 -1214 -1183 -1401 -1245 -529
$$ packed form
968.5842i34J25%l43J56K18j87M36l11l2l42L11J56K80o2j25o2p47J494a87
963.08d05j276Q09l1n60J56l74O54J87l12n29K80l42O53N92m05L1a090
958.1263189577a525J55J25k18P78n60O2o2N91r3o2L11R3k18p16L43j87L1m36i65
952.6222189577d98O2j152J25P47k18l1o54J25M04K50O2o2n92L11J183j152i34
947.6684568732h09J86L43o85K80l11M36n30J25m05M05O54m05K49l73%l74n60i96
942.4395189577a214M98J87L1J56m05n29j25M05K80L11j86n61m04K49N29k49i03
937.4858568732h40p79P47k18j86L42k18l73k49O53P47r65P79q41J87K80k18g78
932.5320189577f23j86K18k81n29O23r4l73K80p16M36L73l73l74M05L1k18J56e29
$$ plain form
927.3031568732 -280 -1027 -1121 -1058 -280 -1525 -1152 -591 -716 -934 218 31 -654 -809 -1245 -1090 -1307 -1276
922.3493189577 -840 -560 -1058 -311 -809 -840 -1152 -1494 -685 -996 -529 -778 -778 -872 -965 -903 -840 -1152 -1245 -778 -1245
916.5700379154 -1556 -1307 -1276 -1152 -623 -249 -187 -654 -809 -1214 -1556 -1370 -1930 -965 -1276 -1058 -840 -1090 -1525
911.341 -934 -405 -716 -1339 -1370 -623 -685 -934 -187 -1058 -747 -1183 -809 -187 -872 -529 -903 -1463 -1214
906.1121568732 -1806 -1556 -1276 -1058 -623 -1525 -996 -1525 -934 -872 -560 -903 -903 -498 -436 -623 -747 -1276 -1183
900.8832379154 -2148 -1463 -1058 -1307 -872 -1183 -872 -1152 -1214 -809 -1525 -405 -654 -1183 -747 -840 -965 -1121
895.9294568732 -996 -872 -965 -405 -467 -809 -996 -1463 -747 -560 -1090 -903 -374 -685 -498 -1463 -747 -1432 -1214
890.7005379154 -872 -560 -1183 -1058 -809 -498 -1027 -405 -809 -996 -1058 -1370 -1090 -872 -872 -1245 -872 -996 -529
$$ packed form
927.3031568732b80p47r4O3P78j245L73N61j25k18J152j87o85j55m36J55k17a276
922.3493189577h40K80m98P47m98l1l12l42Q09l11M67k49%r4r3O2O3l12r3M67a245
916.5700379154a556K49L1J24N29L74O2m67j55m05l42J86n60R65l11K18Tk50a525
911.341i34N29l11o23l1P47o2k49P47q71L11m36L74O22o85L43l74n60a214
906.1121568732a806K50K80K18M35r02N29n29N91O2L12l43%M05O2j87j24n29a183
900.8832379154b148O85M05k49M35l11L11k80o2M05p16J120k49n29M36r3j25a121
895.9294568732i96J24r3N60o2l42j87m67P16J87n30J87N29l11J87r65P16o85a214
890.7005379154h72L12o23J25K49L11n29O22m04j87o2l12K80K18%l73L73j24e29
$$ plain form
885.4715 -436 -1027 -1090 -747 -1058 -903 -872 -965 -467 -840 -1214 -1432 -1058 -1245 -560 -965 -1058 -934 -1214
880.2426568732 -1276 -903 -560 -903 -809 -591 -872 -1152 -1214 -1339 -934 -965 -498 -623 -623 -903 -1058 -529 -934
875.0137379154 -903 -934 -1494 -1650 -1556 -1121 -1463 -1307 -1027 -685 -809 -934 -1619 -1588 -1899 -1121 -1276 -654 -996
869.7847 -1121 -1058 -1152 -1806 -1339 -1058 -1525 -1339 -996 -1027 -965 -965 -1058 -903 -996 -1058 -1494 -1245 -1370 -1339 -996
864.0053189577 -872 -1525 -1463 -1868 -1401 -778 -1619 -1058 -1370 -1339 -1494 -747 -1058 -1152 -1370 -809 -809 -1307 -1121 -1588
858.5012189577 -1401 -1027 -1183 -872 -840 -996 -1525 -1027 -1401 -1525 -1121 -1588 -1494 -1619 -872 -1121 -1712 -1588
853.5475379154 -1214 -1463 -1121 -1556 -1494 -1743 -1556 -1370 -1339 -996 -1090 -1058 -125 -62 -778 -1307 -1712 -1121 -1370
848.3185189577 -1432 -996 -778 -467 -685 -872 -1432 -1339 -965 -778 -1339 -1090 -1556 -778 -1525 -1214 -560 -1245
$$ packed form
885.4715d36n91o3L43l11J55L1r3M98l73l74k18L74j87O85m05r3J24a214
880.2426568732a276L73L43l43R4K18k81k80o2j25M05l1M67j25%k80j55N29i34
875.0137379154i03l1n60j56R4M35l42J56K80L42j24j25o85L1l11P78j55O22i96
869.7847a121O3r4o54M67K81m67J86L43l1O2%r3J55r3o2m36K49j25L1i96
864.0053189577h72o53O2m05M67O23q41N61l12L1j55P47l11r4k18N61%m98J86a588
858.5012189577a401L74j56L11L2j56n29M98l74j24M04m67R4j25P47k49n91a588
853.5475379154a214k49L42m35O2k49J87J86L1L43r4L2R33O3p16n29m05N91a370
848.3185189577a432M36K18L11k18j87n60R3L74J87n61K49m66P78p47L11O54a245
$$ plain form
843.3648568732 -1339 -747 -1027 -591 -1058 -747 -1090 -1058 -1432 -1370 -1307 -1152 -1681 -1152 -809 -747 -623 -1152 -1837
838.1358189577 -1525 -1214 -1027 -965 -1525 -1339 -1058 -2055 -1401 -903 -872 -1619 -840 -1463 -1370 -1494 -1214 -1152 -840
832.9069 -1214 -1370 -1619 -1245 -1152 -1401 -654 -809 -872 -840 -996 -1214 -1463 -1027 -1307 -840 -872 -1307 -1712
827.6780568732 -1401 -1307 -1992 -1712 -311 -778 -934 -903 -1245 -1027 -1183 -996 -1090 -1494 -1463 -1090 -1370 -1463 -1463
822.4490189577 -1494 -1463 -1339 -872 -1556 -1525 -1463 -840 -1307 -467 -872 -778 -747 -1183 -1152 -1401 -1525 -1214 -1588 -1245
816.9449189577 -934 -1276 -1245 -1276 -1401 -1058 -1027 -965 -1183 -1619 -809 -1152 -840 -716 -1090 -1401 -1556 -934 -1307
811.7159568732 -1307 -872 -1245 -778 -498 -934 -872 -872 -903 -623 -436 -436 -903 -1588 -1401 -965 -747 -840 -1806 -809
806.2118568732 -872 -934 -934 -778 -778 -965 -1370 -996 -840 -1090 -903 -809 -809 -903 -996 -1494 -1619 -1556 -1899 -1432 -1307 -1556
$$ packed form
843.3648568732a339N92k80M36m67L11l43L2l74O2O3J55n29N29L43O2J24n29a837
838.1358189577a525L11J87O2n60J86K81r97O54M98L1p47P79o23R3j24K80O2h40
832.9069a214j56k49L74R3k49P47j55o3L2j56k18k49M36k80M67l2m35a712
827.6780568732a401R4o85K80J401m67j56L1l42K18j56J87r4m04L1L73k80r3a463
822.4490189577a494L1J24M67o84L1O2O23m67Q40m05R4L1m36L1k49j24L11l74a245
816.9449189577i34l42L1l1j25L43L1O2k18m36Q10l43L12J24l74l11j55O22a307
811.7159568732a307M35l73M67K80m36O2%l1K80J87%m67o85J87M36K18r3r66h09
806.2118568732h72o2%J56%j87m05L74J56k50J87R4%r4r3m98j25O3l43M67J25a556
$$ plain form
800.1572 -2023 -1276 -934 -840 -1401 -1183 -1121 -1152 -1276 -996 -436 -529 -1214 -965 -1432 -1774 -1090 -1276 -1121
794.9283568732 -1245 -1588 -1494 -1121 -1525 -1370 -1401 -591 -809 -1743 -996 -996 -1214 -1214 -1152 -1463 -1619 -1307 -1463 -934
789.4241379154 -685 -934 -1463 -840 -1370 -1152 -1494 -965 -1058 -1588 -1556 -1307 -1152 -1214 -1774 -934 -1152 -1121 -1121
784.1952189577 -1307 -1712 -840 -1837 -1588 -1214 -1307 -747 -1090 -1339 -809 -1463 -965 -903 -1183 -1588 -1121 -1058
779.2414568732 -1339 -716 -809 -840 -778 -1121 -1058 -934 -809 -1027 -1339 -747 -1121 -685 -467 -965 -1339 -1058 -1090
774.0125189577 -934 -872 -623 -1556 -1494 -1090 -934 -1152 -747 -747 -778 -311 -654 -405 -218 -529 -1090 -1121 -1619 -872
768.5083189577 -778 -529 -996 -747 -840 -840 -1183 -685 -1525 -840 -1432 -1027 -1276 -1339 -965 -342 -965 -156 -872
763.2794 -1090 -1214 -1868 -1370 -840 -996 -1183 -1712 -1152 -1556 -1370 -1774 -996 -1339 -685 -280 -747 -1152
$$ packed form
800.1572b023P47L42R4n61K18O2l1j24K80N60r3o85K49m67l42O84j86a121
794.9283568732a245l43R4L73m04J55l1Q10k18r34P47%k18%O2l11j56L12j56i34
789.4241379154f85k49n29O23n30K18l42N29r3n30L2K49J55o2n60Q40k18L1a121
784.1952189577a307m05Q72r97K49L74r3N60l43k49N30o54M98O2k80m05M67a058
779.2414568732a339O23r3l1O2l43O3J24J25k18l12N92l74M36K18m98l74K81a090
774.0125189577i34O2K49r33O2M04J56k18M05%l1M67l43K49J87l11n61l1m98h72
768.5083189577g78K49m67K49r3%l43M98q40O85n92M05k49o3L74O23o23Q09h72
763.2794a090j24o54M98N30j56j87n29N60m04J86m04P78l43O54M05m67a152
$$ plain form
758.3257189577 -872 -965 -903 -934 -436 -872 -1899 -934 -840 -1090 -965 -1245 -685 -1806 -1681 -1339 -872 -529 -405
753.0967 -654 -840 -31 -965 -1619 -809 -529 -560 -934 -1121 -1276 -1245 -996 -996 -1307 -1058 -1121 -1401 -934 -1214
747.5926 -467 -716 -623 -903 -965 -934 -1090 -1214 -778 -747 -125 -591 -872 -934 -1401 -778 -1121 -872 -1525 -1121
742.0884568732 -996 -996 -840 -809 -1494 -654 -591 -623 -1214 -1276 -716 -1058 -934 -1619 -934 -934 -591 -498 -280 -1090 -1027
736.309 -965 -903 -1152 -623 -965 -965 -778 -280 -467 -903 -374 -249 -93 -311 -965 -1432 -1152 -778 -903
731.0801379154 -716 -747 -31 -872 -1183 -529 -529 -529 -1276 -809 -840 -467 -31 685 311 374 93 93 93 -654 -623 -1090
725.0255 -1152 -840 -280 -156 187 -654 -1152 -591 -623 -498 -467 -623 -93 840 1992 2490 3300 3611
720.0718379154 3362 3020 2615 1806 1121 840 654 560 778 872 809 716 747 498 591 498 -778 -218 778 996
$$ packed form
758.3257189577h72r3O2l1M98m36j027R65R4k50J25k80N60j121J25L42M67L43d05
753.0967f54j86Q09r34o54Q10K80l1l74j87j55L1K49%l11K49o3k80M67a214
747.5926d67k49R3k80o2L1j56j24M36L1O22m66k81o2m67O23l43K49o53a121
742.0884568732i96%J56L1o85Q40O3l2n91o2N60l42J24o85O85%L43R3K18q10a027
736.309i65O2k49N29l42%J87M98j87m36N29J25J56k18o54m67K80L74i03
731.0801379154g16l1P16q41l11O54%Tp47M67l1L73M36P16l74O3k81%Tp47L1a090
725.0255a152L12N60J24L43q41m98N61l2J25L1j56N30R33J152M98Q10C611
720.0718379154C362l42m05q09o85k81j86r4K18R4o3r3L1k49R3r3j276N60R96I96
$$ plain form
714.5677189577 2086 3580 6413 14257 35145 51177 62321 62010 53978 26024 13355 8654 6724
710.9900379154 5261 4078 3486 4234 3798 3331 2335 2677 2708 2428 2241 2117 1183 1961 1619 1214 840 1525
706.0362 1712 1681 2335 1339 560 342 342 93 -93 218 -62 -156 -311 -872 -591 -654 -280 405 93
700.8073379154 125 0 654 529 187 872 529 872 623 747 187 -374 -778 -809 -934 -1058 -809 -840
695.8535 -1370 -747 -405 0 -591 -405 280 -31 218 -187 -529 -591 -342 342 498 747 654 529
690.8998379154 -405 -1058 -249 -1681 -1183 -1463 -1152 -1058 -934 -1058 -1463 -1401 -1058 -872 -560 -591 -1027 -1401 -1027
685.6709 -716 -62 1463 1121 934 311 -467 -249 -187 374 62 840 125 -62 -529 -374 685 1650
680.7171379154 1121 529 187 -311 -498 -374 125 467 560 778 747 1743 1463 1432 1058 872 1121 467 -280
$$ packed form
714.5677189577B086J494K833P844K0888J6032J1144l11q032k7954j2669m701F724
710.9900379154E261j183n92P48m36m67r96L42L1k80j87j24r34P78l42m05l74A525
706.0362A712l1O54r96p79k18%k49j86L11k80r4j55n61K81o3L74O85I3
700.8073379154A25j25O54j25l42O85l43L43k49J24n60n61m04l1j25j24K49h40
695.8535a370O23L42M05n91J86O85l11K49m05l42o2K49O84J56K49r3E29
690.8998379154d05o53Q09j432M98k80L11R4J24j24m05O2L43J86L12l1m36l74a027
685.6709g16O54J525l42j87o23p78K18O2N61l12P78p15j87m67J55J059A650
680.7171379154A121n92l42m98j87J24M99L42R3K18l1R96k80l1l74j86K49o54b80
$$ plain form
675.4882189577 -716 62 249 342 872 1401 872 1245 1152 1743 3362 5697 9743 12421 16467 17806 11798
670.8097189577 7315 7471 5603 4016 2864 2708 2957 2615 1930 2490 3331 3798 3922 3860 3237 4109 5199
666.1311379154 5043 3642 2584 1837 1214 1121 2521 4638 6475 6444 6506 6662 3798 2646 3985 5261
661.7278379154 4856 6039 6599 6039 8125 10273 8716 8436 13292 17152 23596 39348 65590 139024
657.8749568732 399608 751743 921678 996140 954800 462863 207571 133638 101077 84547
655.1228189577 74368 68983 68142 60516 54601 48904 41153 33775 32966 31534 28888 27363 27300 26834 25402
650.9947 24188 23721 25433 31659 37480 32810 27954 24219 19861 16281 12981 11487 11020 10428
647.1418379154 9868 10148 9494 7564 7658 7751 7813 7160 6288 5759 5946 5946 10615 16748 22849 24779 23472 17837
$$ packed form
675.4882189577g16P78J87R3N30N29n29L73r3N91J619K335M046K678M046J339A1798
670.8097189577G315J56j868j587j152j56K49l42o85N60Q41M67J24o2o23Q72E199
666.1311379154E043j401j058p47o23r3J400K117J837l1O2J56k864j152J339E261
661.7278379154D856J183N60n60K086K148j557k80M856L860O444J5752K6242A39024
657.8749568732C99608L52135J69935P4462m1340m91937k55292p3933l2561H4547
655.1228189577G4368n385q41p626n915n697p751p378q09j432k646j525o3m66B5402
650.9947B4188m67J712O226N821m670m856l735m358l580l300j494m67A0428
647.1418379154I868K80o54j930R4R3O2o53q72n29J87%M669O133O101J930j307A7837
$$ plain form
642.1881568732 13417 9557 6319 4327 3767 3237 2615 1930 2241 2210 1525 1681 2397 1027 1152 903
637.7848568732 405 -342 -1276 -1774 -840 -1494 -1401 -716 -436 -623 -405 -1058 -1090 -965 -1619 -2584 -2272 -1961 -2086
632.5558379154 -1276 -1370 -1152 -2023 -1992 -2179 -1961 -685 -560 -405 -934 -1806 -3331 -2646 -1058 -156 93
627.8773379154 -747 -1899 -1588 -1245 -1774 -2335 -2055 -1619 -1183 -1774 -1152 -1588 -1090 -934 -1090 -1401 -1494 -1276 -1650
622.6484189577 -2335 -1712 -1650 -1370 -1588 -2272 -2272 -1743 -1650 -1899 -2023 -1868 -1837 -1681 -1743 -2023 -1868 -1152 -1245 -1525
617.1442 -840 -1058 -934 -1245 -1899 -1774 -1899 -2584 -2335 -2117 -2459 -2086 -2117 -1899 -1432 -1339 -2210 -1930 -1806
611.9153568732 -2272 -1619 -1183 -1992 -1588 -1401 -1339 -1556 -1868 -1930 -1743 -1930 -1712 -1401 -1868 -2428 -2304 -2272
606.9615 -2428 -2055 -1370 -1401 -2272 -1090 -1276 -1774 -2335 -2490 -2304 -2490 -2304 -2023 -1588 -1650 -1525 -1121
$$ packed form
642.1881568732A3417l860l238j992n60n30o22o85L11l1o85J56P16j370J25I03
637.7848568732D05p47r34m98R34o54R3O85K80j87K18o53l2J25o54r65L12L11b086
632.5558379154a276r4K18q71L1j87K18J276J25J55n29q72j525O85J588R02I3
627.8773379154g47j152L11L43n29n61K80M36Tn91O22m36M98J56j56l11r3K18a650
622.6484189577b335O23O2K80k18o84%N29R3k49j24J55L1J56o2k80J55P16r3a525
617.1442h40k18J24l11o54J25j25o85K49K18l42L73l1K18M67R3q71K80a806
611.9153568732b272O53M36q09M04J87O2k17l12o2J87j87K18L11m67n60J24b272
606.9615b428L73O85l1q71J182j86m98n61j55J86j86J86K81M35o2J25a121
$$ plain form
602.0078379154 -1868 -1743 -1992 -1525 -1307 -1650 -1774 -1774 -1774 -996 -1121 -1650 -1681 -1837 -1868 -1619 -1432 -1743 -1961 -2459
596.5036379154 -2023 -1837 -1774 -1650 -1743 -2086 -1307 -1588 -1183 -311 -467 996 1027 1774 1525 1339 187 125
591.5499568732 -1245 -1992 -2490 -2272 -2335 -1930 -1961 -1494 -1650 -1619 -1556 -1774 -1930 -2521 -1930 -1961 -1090 -1152 -1245 -1463
586.0458568732 -2397 -1930 -1525 -1650 -2086 -1899 -2241 -2055 -2397 -2241 -2241 -2272 -2148 -1868 -2148 -2055 -2397 -2677 -2615
580.8168379154 -2397 -1556 -1214 -1307 -1370 -1899 -1899 -1339 -1463 -1992 -1494 -1712 -2055 -1992 -1868 -2304 -2241 -1868 -2023 -1899
575.3127189577 -2055 -2148 -2397 -1930 -2086 -2335 -2148 -1868 -2459 -2148 -2210 -1525 -1681 -1992 -1307 -1588 -1868 -1681
570.3589568732 -1307 -1868 -1806 -1806 -1525 -2117 -2179 -2210 -2272 -2055 -2490 -2521 -2926 -2117 -2179 -2023 -1058 -1214 -1588 -1992
564.8548568732 -2428 -2086 -2366 -2366 -2055 -1992 -2148 -2023 -1588 -1712 -1525 -1868 -1588 -1152 -1401 -2490 -1961 -2335
$$ packed form
602.0078379154a868J25k49M67K18l43j24%TP78j25n29l1j56l1K49J87l11k18b459
596.5036379154b023J86O3J24r3l43P79k81M05Q72j56J463L1P47k49j86j152A25
591.5499568732a245p47m98K18o3M05l1M67j56L1O3k18j56n91N91l1Q71o2r3a463
586.0458568732b397M67M05j25m36J87l42J86l42J56%l1J24K80k80R3l42k80b615
580.8168379154b397Q41L42r3o3n29%N60j24n29M98k18l43O3J24m36O3L73j55a899
575.3127189577b055r3k49M67j56k49J87K80n91L11o2O85j56l11O85k81k80a681
570.3589568732a307n61O2%K81n92o2l1o2K17m35l1m05Q09o2J56R65j56l74a992
564.8548568732b428L42k80%L11O3j56J25M35j24J87l43K80M36k49j089N29b335
$$ plain form
559.901 -2335 -1961 -1774 -1743 -2210 -1806 -1619 -1899 -1619 -1650 -1370 -1619 -1899 -1370 -1837 -2055 -2117 -1712 -1588
554.6721568732 -2023 -1837 -2428 -2304 -1806 -1743 -1650 -1992 -2272 -1650 -1774 -2086 -2366 -2428 -1899 -1619 -1930 -1806 -1774
549.4432379154 -1494 -1837 -1588 -1899 -2210 -1899 -1276 -1650 -1837 -1650 -1152 -1992 -2272 -2615 -1525 -1712 -1556 -1401
544.4894568732 -1619 -2023 -1930 -1588 -1276 -1619 -1681 -1837 -1712 -1245 -1556 -1276 -1837 -1712 -1307 -1712 -1276 -1494
539.5357189577 -872 -1556 -2148 -2210 -2055 -1837 -1712 -1868 -1619 -1930 -1307 -1276 -1556 -1681 -1619 -1930 -1712 -1588 -1837
534.3068758309 -1401 -1837 -1027 -1339 -1930 -1743 -1899 -1712 -2148 -2304 -2023 -2304 -1806 -1806 -2055 -1556 -1619 -1743 -1961
529.0778379154 -2086 -1712 -2055 -1992 -1899 -1276 -1650 -1712 -1307 -1463 -1837 -1961 -1650 -1494 -1806 -1401 -1432 -1339 -1712
523.8489189577 -1743 -1806 -1588 -1992 -1463 -1401 -1432 -1930 -1681 -1058 -1743 -1556 -1401 -1307 -1339 -1494 -1307 -1245 -1743 -1743
$$ packed form
559.901b335L74J87L1m67M04J87k80K80l1K80k49k80N29m67k18o2M05a588
554.6721568732b023J86n91J24M98O3R3l42k80O22j24l12k80o2N29K80l11J24a774
549.4432379154a494l43K49l11TL11O23l74j87J87M98q40k80l43J090j87J56a401
544.4894568732a619m04R3L42L12l43o2j56J25M67l11K80n61J25M05m05M36a494
539.5357189577h72o84n92o2J55K18J25j56K49l11O23L1k80j25O2l11K18J24a837
534.3068758309a401m36Q10l12n91J87j56J87m36j56K81k81M98%k49M99o3j24a961
529.0778379154b086L74l43O3R3O23l74o2M05j56l74j24L11J56l12M05l1R3a712
523.8489189577a743o3K18m04N29O2l1m98K49O23o85J87J55R4l2j55J87O2m98a743
$$ plain form
518.3447 -1619 -1401 -1650 -1712 -1806 -1432 -1712 -1556 -1837 -1619 -1899 -1899 -2428 -1837 -2241 -2210 -1401 -1556 -1090
513.1158568732 -996 -2117 -2148 -1432 -1432 -1463 -1806 -1494 -1058 -1556 -1090 -1868 -1463 -1588 -1837 -2210 -2272 -1930 -623
507.8872379154 -1027 -1650 -2023 -1712 -1712 -1619 -1650 -1276 -1307 -1588 -2086 -2148 -2584 -1650 -2055 -1588 -1837 -1401 -1214 -1930
502.3837 -1961 -1961 -2023 -1650 -1525 -934 -1712 -1214 -1307 -1619 -965 -1619 -1245 -1619 -1121 -1556 -1183 -1806 -1432
497.1553379154 -1681 -1650 -2023 -1463 -1712 -1837 -2117 -1899 -2179 -1961 -1525 -1183 -2023 -1463 -1650 -1837 -1370 -1463 -1276
491.927 -1463 -1681 -2023 -1712 -1619 -1650 -1556 -1556 -1556 -1930 -1494 -1961 -1712 -1930 -1992 -1650 -1307 -934 -934 -1276 -2117
486.1483 -2272 -1650 -1837 -1183 -1401 -1556 -1432 -934 -1588 -1899 -1463 -1774 -1090 -778 -840 -1276 -1121 -1463
481.1951189577 -934 -1650 -1090 -778 -965 -903 -1774 -1681 -2055 -1774 -1650 -1152 -1743 -1712 -1432 -1307 -1588 -1121 -1339
$$ packed form
518.3447a619K18k49o2r4L74k80J56k81K18k80%n29N91m04L1Q09j55a090
513.1158568732i96j121l1P16%l1l43L12M36m98M66p78M05j25k49l73o2L42f23
507.8872379154a027o23l73L11%R3l1L74l1k81m98o2m36R34m05M67k49M36J87a930
502.3837a961%o2L73J25N91p78M98r3l12O54o54L74l74M98m35L73o23a432
497.1553379154a681L1l73N60k49j25k80K18k80K18M36L42q40N60j87TM67r3a276
491.927a463k18l42L11R3l1R4%Tl74M36m67K49k18o2L42L43L73%l42b117
486.1483b272O22j87O54k18j55J24M98o54l11M36l11O84L12o2m36J55a463
481.1951189577i34p16N60L12j87O2q71R3l74K81J24M98n91L1K80J25k81M67a339
$$ plain form
475.9667568732 -1401 -1307 -965 -872 -1183 -1494 -1681 -1214 -1588 -1276 -1743 -2272 -1806 -2397 -1058 -1183 -934 -1245 -1837
470.7383189577 -1930 -1712 -1837 -903 -1774 -1058 -1525 -1121 -840 31 -1121 -1058 -1370 -1556 -1058 -1245 -1152 -1183
465.7851568732 -1370 -996 -1806 -1525 -1214 -1276 -1058 -809 -591 -467 -1027 -1152 -1806 -1245 -1868 -1276 -1650 -872
460.832 -467 -249 -747 -1152 -716 -1432 -716 -903 -1090 -1307 -809 -1525 -1401 -1245 -778 -1401 -1183 -560 -903
455.6036379154 -1930 -1650 -1276 -1121 -809 -1307 -1152 -560 -623 -840 -218 -934 -654 -685 -934 -934 -1214 -1152 -747
450.3753 -1588 -1494 -436 -747 -1401 -1183 -1058 -1556 -1276 -560 -965 -1058 -2179 -934 -1619 -1121 -1432
445.6973 -1525 -1370 -1588 -1463 -1992 -1712 -1307 -1401 -1090 -1494 -2210 -2241 -1401 -934 -903 -903 -996 -1837 -1276 -778
440.1937568732 -1121 -1370 -1712 -1432 -1121 -1152 -1370 -1370 -1339 -1058 -934 -1027 -1027 -1401 -1090 -1245 -1214 -965 -809 -1152
$$ packed form
475.9667568732a401R4L42R3l11Tj87M67l74L12m67n29M66n91J339j25K49l11a837
470.7383189577a930K18j25R34q71P16m67M04K81Q71j152O3l12j86M98j87R3a183
465.7851568732a370L74q10K81L11o2K18K49K18J24n60j25o54N61o23N92l74h72
460.832d67K18m98m05M36p16P16j87Tk17M98p16J24J56M67o23K18O23i03
455.6036379154a930K80L74J55L12m98J55N92o3k17O22p16K80l1k49%k80O2g47
450.3753a588R4J058l11o54K18J25m98K80P16m05r3j121J245o85M98a432
445.6973a525J55k18J25n29K80M05r4L11m04p16l1Q40M67L1%r3q41N61g78
440.1937568732a121k49l42K80L11l1k18%L1K81J24r3%l74L11j55L1K49J56a152
$$ plain form
434.6901568732 -1930 -1650 -1556 -1214 -872 -1276 -1245 -1276 -1525 -1650 -716 -778 -1339 -1307 -1868 -1743 -1588 -1774 -1619 -1121
429.1866379154 -1183 -1463 -1245 -1152 -1432 -1556 -903 -1525 -1370 -1432 -1432 -1494 -1152 -1339 -1525 -1619 -623 -1183 -1370 -1961
423.6831189577 -1619 -1245 -1245 -1152 -996 -1152 -1245 -872 -1058 -1152 -1027 -1774 -1619 -1463 -1432 -1027 -1121 -1588 -1370 -1058
418.1796 -1556 -1370 -1463 -1463 -1525 -1712 -1214 -903 -1245 -840 -1339 -1868 -1650 -1214 -1588 -2210 -1276 -1307 -1494
412.9512379154 -1525 -2023 -1432 -1121 -1214 -1027 -872 -591 -965 -1525 -1463 -1339 -1899 -1556 -1650 -1806 -1868 -1276 -1619
407.7228 -1619 -1401 -1463 -1681 -1245 -1494 -1401 -1681 -1432 -1556 -1650 -1090 -1525 -2210 -1619 -1432 -1619 -2086 -2335
402.4944568732 -1992 -1712 -1307 -1370 -1463 -1152 -1868 -1961 -2086 -2117 -1588 -1806 -1494 -1743 -1245 -1463 -1619 -1930 -934
397.2661189577 -1090 -1245 -2148 -1681 -1152 -1463 -1774 -1214 -1276 -996 -1339 -996 -996 -1556 -1339 -2055 -1525 -1245 -1588
$$ packed form
434.6901568732a930K80R4L42Tm04L1l1k49j25R34o2n61L2n61J25J55j86J55a121
429.1866379154a183k80K18R3k80j24O53o22J55o2%o2L42j87j86r4R96n60j87a961
423.6831189577a619L74%R3J56j56r3L73j86r4J25p47J55J56L1M05r4m67K18a058
418.1796a556J86r3%o2j87M98L11l42M05m99n29K18M36l74o22R34l1a494
412.9512379154a525m98N91L11r3J87J55K81l74n60O2J24n60L43r4j56o2N92a619
407.7228a619K18o2k18M36k49R3k80K49j24r4N60m35o85N91J87j87m67b335
402.4944568732a992K80M05o3r3L11p16r3j25l1N29k18L12k49M98k18j56l11i34
397.2661189577a090j55r03M67N29l11TN60o2K80l43L43%n60K17p16N30K80a588
$$ plain form
392.0377568732 -1650 -996 -1525 -1183 -1121 -1307 -1276 -1121 -1370 -1463 -840 -934 -1121 -965 -1152 -872 -1868 -1556 -1712
386.8094189577 -1276 -342 -249 -498 -405 -654 -809 -1245 -1276 -1370 -903 -1183 -1027 -1307 -809 -1183 -685 -996 -1121
381.5810568732 -1556 -342 -436 -467 -903 -1183 -747 405 342 529 840 280 -93 -125 -249 -311 -934 187 0
376.3526189577 591 1276 1152 2272 2739 2366 2366 2677 1992 2241 1494 747 467 529 467 560 187 -249 -591 -965
370.8491189577 -623 -1307 -1276 -840 -685 -591 -529 -1214 -1214 -1214 -1463 -965 -1588 -1401 -1463 -903 -716 -1027 -1681 -1806 -1245
365.0704189577 -809 -747 -591 -654 -840 -1743 -1339 -1245 -1339 -1090 -1307 -965 -903 -1152 -311 -1214 -1121 -1245 -1837 -1370
359.5668758309 -1152 -1121 -1370 -1152 -623 -872 -1339 -1245 -1619 -1961 -2366 -1556 -1525 -1868 -1868 -1837 -1868 -996 -1806 -1556
354.0633379154 -1650 -1774 -1401 -1432 -1276 -1152 -1463 -1868 -1961 -1681 -1588 -1837 -1588 -1525 -1339 -1307 -1090 -1401 -1961
$$ packed form
392.0377568732a650O54n29L42O2j86L1J55k49r3O23r4j87J56j87K80r96L12a712
386.8094189577a276R34R3k49R3k49j55m36l1r4M67k80J56k80M98l74M98l11a121
381.5810568732a556J214r4l1m36k80M36J152o3J87L11n60l73l2j24o2o23J121@
376.3526189577E91O85j24J120M67l73%L11o85K49p47Tk80O2o2R3l73m36l42i65
370.8491189577f23o84L1M36J55R4O2o85%Tk49M98o23J87o2N60J87l11o54j25a245
365.0704189577h09O2J56o3j86r03M04R4r4K49k17L42O2k49Q41r03R3j24n92a370
359.5668758309a152L1k49K18N29k49m67R4l74l42m05Q10L1l43%L1l1Q72q10a556
354.0633379154a650j24L73l1J56J24l11m05r3K80R3k49K49O3J86L2K17l11a961
$$ plain form
348.835 -1432 -1588 -1588 -1494 -1806 -1401 -1494 -778 -1774 -1525 -1245 -1183 -1370 -1307 -1370 -1307 -1588 -1339 -1463 -2086
343.3314 -1432 -1183 -1681 -1961 -2615 -1494 -1650 -1806 -1588 -1525 -1588 -1588 -2023 -1463 -1183 -1027 -1681 -1774 -1619 -1027
337.8278758309 -1743 -2117 -1245 -1961 -872 -965 -1619 -1992 -1806 -1619 -1401 -1868 -1743 -1245 -1588 -1868 -1370 -1121
332.8747 -1650 -1245 -1432 -934 -1463 -1525 -1930 -1183 -1837 -965 -1463 -1556 -1899 -2117 -1681 -1619 -1681 -1899 -1774
327.6463379154 -2055 -2086 -2023 -1774 -1370 -1494 -1992 -1307 -778 -1401 -1432 -1961 -2366 -2615 -1588 -1712 -1339 -1276
322.6931568732 -965 -1588 -1899 -1806 -1463 -1681 -2055 -1868 -2272 -2957 -2055 -1681 -1525 -1930 -2771 -1774 -2148 -2272
317.7399189577 -1183 -1214 -1650 -2335 -996 -560 -2521 -3082 -2117 -2055 -3082 -1774 -1743 -1681 -1868 -1432 -1712 -2179
312.7867568732 -2055 -1276 -2023 -1961 -1774 -1806 -1961 -1650 -591 -1183 -1401 -1992 -2459 -1681 -1774 -2148 -2428 -1525
$$ packed form
348.835a432j56%R4l12M05r3P16r96K49K80O2j87O3o3O3k81K49j24b086
343.3314a432K49m98k80o54J121j56TK18O3o3%m35N60K80J56o54r3J55a027
337.8278758309a743l74Q72p16J089r3o54l73J86J87K18m67J25M98l43k80M98a121
332.8747a650M05j87M98n29o2m05P47o54Q72m98r3l43k18M36O2o2k18a774
327.6463379154b055l1O3K49M04j24m98O85N29o23l1n29m05k49J027j24L73a276
322.6931568732i65o23l11R3L43k18l74J87m04o85R02L74J56m05q41R97l74b272
317.7399189577a183l1m36o85J339M36j961n61R65O2j027J308L1O2j87M36k80b179
312.7867568732b055P79p47O2J87l2j55L11J059n92k18n91m67P78r3l74k80a525
$$ plain form
307.8336 -1774 -1525 -1276 -2148 -2210 -2055 -1245 -1588 -1525 -1090 -1058 -1183 -1712 -1307 -996 -840 -1837 -2428 -2521
302.6052379154 -2490 -1401 -1370 -872 -1307 -1619 -2023 -1619 -1774 -1961 -1370 -1058 -1556 -1961 -1743 -1090 -1992 -2490
297.6520568732 -2397 -1992 -2148 -1494 -1463 -1712 -1774 -1681 -1650 -1806 -2366 -1463 -1650 -2210 -1837 -1899 -1712 -1401 -1930
292.4237 -1837 -1992 -1432 -1681 -2023 -1868 -1339 -1868 -2117 -2055 -1650 -1774 -1556 -2428 -1432 -2397 -1743 -1650
287.4704379154 -1712 -1837 -1619 -1650 -1339 -2335 -1743 -2055 -1899 -1992 -1619 -1806 -1837 -1992 -2304 -1806 -1837 -2272 -2148
282.2421189577 -1307 -1837 -1837 -2179 -1868 -1899 -1806 -1556 -2055 -1401 -1027 -2117 -2366 -2179 -2148 -1961 -1494 -1619 -1806
277.0137568732 -1806 -1556 -1961 -1525 -1525 -1463 -1494 -2241 -1339 -1214 -1276 -1525 -1245 -1494 -1494 -1307 -1058 -1774 -2023 -1806
271.5102379154 -1806 -1899 -1121 -1401 -1588 -2210 -1743 -1806 -2086 -1806 -1992 -2023 -1930 -2366 -1494 -1961 -1743 -2055 -1899
$$ packed form
307.8336a774K49Tq72o2J55Q10l43O3M35L2j25n29M05L11J56r97n91b521
302.6052379154b490J089L1M98m35l12m04M04j55j87N91L12m98m05K18O53r02b490
297.6520568732b397M05j56O54L1k49o2R3L1j56n60R03j87n60L73o2J87L11a930
292.4237a837j55N60k49l42J55N29n29k49O2M05j24K18q72R96r65O54a650
287.4704379154a712j25K18l1L11r96N92l12J56r3L73j87l1j55l12M98l1m35b148
282.2421189577a307n30%l42L11l1R3K50m99O54L74j090k49J87L1J87M67j25a806
277.0137568732a806K50m05M36%O2l1p47R02J25o2k49K80k49%J87K49p16k49a806
271.5102379154a806r3P78k80j87o22M67o3k80K80j86l1R3m36Q72m67K18l12a899
$$ plain form
266.2818758309 -1152 -747 -1339 -1712 -1650 -2179 -2148 -1650 -1681 -2210 -1619 -1868 -1806 -1090 -840 -1152 -1339 -1743 -2055
261.0535189577 -1494 -1494 -1090 -1370 -1588 -1961 -2428 -2366 -2335 -1961 -2553 -2210 -1494 -2023 -1183 -1650 -1307 -1276 -1339
255.8251 -872 -1681 -1370 -1619 -1961 -1743 -654 -1432 -1432 -1899 -1837 -623 -903 -1556 -1276 -1494 -1899 -2055
250.8719379154 -1058 -1401 -1370 -1712 -1307 -1681 -1463 -1681 -2117 -1806 -2055 -1837 -1401 -1214 -1806 -1276 -1681 -1556
245.9187568732 -1401 -2023 -1401 -2023 -2335 -2117 -1930 -1214 -1588 -1307 -1121 -1214 -1619 -1588 -1743 -2210 -2148 -1899 -2086
240.6904189577 -2210 -2210 -1183 -872 -1152 -1556 -1868 -1650 -2023 -1743 -1837 -1868 -1930 -2397 -2023 -1837 -2148 -1806 -2148
235.4620568732 -2272 -2023 -1899 -2677 -2521 -1525 -1183 -2272 -1837 -1588 -1774 -2397 -2366 -2521 -2584 -1650 -2366 -1961
230.5088758309 -1183 -1743 -1961 -1961 -1712 -1743 -2272 -2148 -1899 -1992 -1307 -1525 -1868 -2179 -2304 -2615 -1837 -1401 -1930
$$ packed form
266.2818758309a152M05n92l73O2n29L1M98l1n29N91k49O2P16K50l12j87m04b055
261.0535189577a494%M04k80k18l73m67O2L1L74n92L43P16n29Q40m67L43L1a339
255.8251h72q09L11k49l42K18J089p78%m67O2J214k80o53K80k18m05b055
250.8719379154a058l43L1l42M05l74K18k18m36L11k49K18M36J87n92N30m05a556
245.9187568732a401o22O22o22l12K18J87P16l74K81J86r3m05L1j55m67O2K49b086
240.6904189577b210%J027L11k80m04l12K18l73K80r4l1o2m67L74J86l11L42b148
235.4620568732b272K49J24p78J56R96L42j089M35K49j86o23L1j55o3R34p16a961
230.5088758309a183n60k18%K49l1n29J24K49r3O85k18l43l11j25l11P78M36a930
$$ plain form
225.2804379154 -1650 -1961 -1837 -1339 -2117 -2335 -1899 -1276 -2086 -1992 -1556 -2241 -1992 -2148 -2117 -2304 -2335 -2055 -2086
220.0521189577 -1681 -1743 -1339 -1494 -1619 -2023 -2023 -1307 -2210 -2708 -2304 -2739 -1837 -1930 -2117 -2210 -2366 -2677 -2086
214.8237568732 -2490 -2148 -1899 -1650 -1588 -2179 -2397 -1930 -2833 -1774 -2086 -1463 -1868 -1276 -1370 -1806 -1992 -2086 -2148
209.5954189577 -1681 -2117 -2086 -1899 -1681 -2086 -2179 -2335 -2335 -2553 -2086 -2055 -1774 -1806 -2272 -1743 -2428 -2210 -1681 -1930
204.0918758309 -1681 -1930 -2023 -1463 -1930 -1152 -2055 -2304 -1899 -2210 -1992 -2428 -1992 -2272 -1494 -2117 -2739 -1899
199.1387 -1806 -1743 -1619 -1868 -1992 -2117 -2055 -1899 -2086 -1681 -1837 -1525 -1712 -2179 -1806 -2428 -1961 -2086
194.1854379154 -2335 -2086 -2117 -2272 -1774 -1837 -1650 -2023 -2086 -1494 -1806 -1930 -2086 -2553 -2584 -2086 -2023 -1681 -1712
188.9571189577 -2086 -1245 -2335 -2428 -2179 -2304 -1774 -2117 -2646 -2210 -1152 -1743 -1992 -1774 -2304 -1650 -2023
$$ packed form
225.2804379154a650l11J24M98p78k18M36O23q10R4M36o85K49j56L1j87l1K80b086
220.0521189577a681o2M04j55j25m04%P16r03m98M04m35R02r3j87r3j56l11b086
214.8237568732b490L42K49TO2n91k18M67r03J059l12O23m05N92r4m36j86r4b148
209.5954189577a681m36L1J87K18m05r3j56%k18M67L1K81l2m66N29o85K18N29a930
204.0918758309a681k49r3N60m67P78r03k49M05l11K18m36M36k80P78o23o22a899
199.1387a806O3J24k49j24j25O2J56j87M05j56L12j87m67L73o22M67b086
194.1854379154b335K49l1j55M98o3J87l73o3N92l12j24j56m67l1M98O3L42a712
188.9571189577b086Q41j090r3K49j25N30l43n29M36J058n91k49K18n30O54b023
$$ plain form
184.2791189577 -1588 -1992 -1743 -1463 -1930 -1774 -1712 -1961 -1868 -1619 -2023 -1619 -2023 -1712 -1556 -1276 -2023 -2148
179.3259379154 -1930 -2335 -2366 -1556 -2584 -1868 -2117 -1588 -1681 -2490 -2179 -2366 -2179 -2023 -1619 -2148 -2335 -1837
174.3727568732 -1961 -2210 -1961 -1339 -1992 -1712 -2304 -2864 -2833 -2366 -2055 -1806 -2148 -2179 -2428 -1992 -1619 -2148
169.4196 -1806 -2148 -1837 -2148 -1992 -1650 -2023 -2055 -2584 -2304 -2023 -2179 -1837 -2055 -2335 -2521 -1930 -1868
164.4663189577 -2241 -2521 -2272 -2615 -2428 -2521 -1743 -2802 -2646 -2428 -2148 -2210 -2086 -1837 -2117 -2055 -1681 -1899
159.5131568732 -2646 -2335 -1992 -2335 -1619 -2148 -1806 -1619 -1992 -1774 -2584 -2241 -1837 -1930 -2023 -2117 -2148 -1992 -2304
154.2848189577 -2553 -1556 -1401 -1650 -1650 -1806 -2521 -2397 -2397 -2646 -1806 -2771 -2272 -2521 -2148 -1743 -934 -1090 -1961
149.0564568732 -1837 -2490 -2117 -1899 -1868 -2366 -1743 -1743 -2428 -2023 -1681 -1339 -2148 -2179 -2521 -2459 -2553 -2210 -1930 -1183
$$ packed form
184.2791189577a588m04K49K80m67J56O2k49R3K49m04M04m04L11J56K80p47b148
179.3259379154a930m05l1Q10j028P16k49N29r3q09L11j87J87J56M04n29j87a837
174.3727568732a961k49K49O22o53K80n92n60L1M67L11K49l42l1k49M36L73b148
169.4196a806l42L11l11J56L42l73l2n29K80K81j56L42k18k80j86N91a868
164.4663189577b241k80K49l43J87r3P78j059J56K18K80o2J24K49k80O2L74a899
159.5131568732b646L11L43l43P16n29L42J87l73K18q10L43M04r3Tr4l1J56b304
154.2848189577b553R97J55k49%j56p15J24%k49Q40r65M99k49L73M05Q09j56a961
149.0564568732a837o53L73K18L1m98O23%o85M05L42Tq09l1l42O2r4L43K80a183
$$ plain form
143.5529379154 -1463 -1806 -1774 -1806 -1681 -1961 -2148 -2241 -2397 -1899 -1961 -2055 -2086 -2335 -2055 -2459 -1930 -1899 -1992 -2117
138.0494189577 -1681 -1930 -2428 -2272 -1961 -2117 -2366 -2210 -2241 -1463 -2023 -2397 -2148 -2335 -2397 -2086 -1588 -1588
133.0961379154 -1370 -1712 -1494 -1588 -2490 -1681 -1899 -2055 -2459 -2272 -1992 -1588 -1681 -2148 -1681 -2490 -2086 -2490
128.143 -1899 -1806 -2179 -2366 -2490 -2335 -2771 -2304 -1837 -2241 -1899 -1961 -2272 -2148 -1899 -1899 -1930 -1992 -1650 -1650
122.6393 -1774 -1370 -1992 -1992 -2055 -2117 -1650 -1152 -1650 -2366 -1712 -2366 -2086 -1806 -2553 -1992 -1743 -2023 -2428 -2584
117.1356379154 -2521 -2179 -1899 -1837 -2055 -1650 -2241 -2272 -2366 -2210 -2490 -2459 -2739 -1774 -2833 -3082 -1681 -1370
112.1823 -1712 -2148 -2459 -2272 -1961 -1183 -1712 -2241 -2615 -2055 -1588 -2241 -2055 -2148 -2179 -2771 -2272 -1183 -2055
106.9538189577 -2241 -2179 -2304 -2397 -1899 -1525 -1961 -1961 -2553 -1992 -1774 -1494 -2148 -1774 -1837 -1214 -1868 -1806 -1494 -1837
$$ packed form
143.5529379154a463l43L2l2J25k80j87r3j56M98o2r4l1k49K80m04N29L1r3b117
138.0494189577a681k49m98J56L11j56k49J56l1P78n60l74K49j87o2L11M98a588
133.0961379154a370l42K18r4r02Q09k18j56m04J87K80M04r3m67M67q09M04b490
128.143a899R3l73j87j24J55m36M67Tm04L42o2l11J24K49%l1o2L42a650
122.6393a774M04o22%o3o2M67M98m98p16O54o54K80Tp47N61K49k80m05b584
117.1356379154b521L42K80O2k18M05n91l1r4J56k80L1k80R65j059k49J401a370
112.1823a712m36l11J87L11P78n29Tl74N60M67o53J86r3l1n92M99J089b055
106.9538189577b241O2j25r3M98L74m36%n92N61K18K80o54L74o3O23o54O2L12a837
$$ plain form
101.4501189577 -2272 -1961 -2304 -1619 -2148 -1930 -1961 -1619 -1868 -1837 -1992 -2241 -1525 -1930 -2023 -2272 -2023 -1837 -2397
96.2216 -2304 -2553 -1992 -1588 -2055 -1992 -1961 -1992 -2117 -2553 -2023 -2055 -2086 -2459 -2055 -1774 -1276 -1681 -1868
90.9930379154 -1837 -1806 -1868 -1806 -1152 -1370 -1588 -1432 -2459 -2117 -2210 -1899 -1930 -1743 -2023 -2148 -1930 -1774 -2210 -2272
85.4894379154 -1930 -2055 -1681 -1899 -2241 -2210 -1245 -1650 -1681 -1743 -2148 -2055 -1961 -1027 -1245 -1556 -2304 -2428 -2023
80.2609189577 -1588 -1774 -1339 -1992 -2335 -2148 -1868 -2304 -2148 -1837 -1370 -1339 -1276 -2023 -2490 -1494 -1432 -1806 -1806
75.0323568732 -2086 -1712 -1588 -1619 -1556 -1961 -2521 -2584 -2335 -1868 -1837 -1868 -1432 -1992 -1743 -2553 -2055 -1774 -1370
69.8038379154 -2179 -2179 -1743 -2148 -2459 -2615 -2459 -2055 -2615 -1930 -2335 -1806 -1837 -1868 -1774 -2241 -1183 -1712 -1930
64.5753189577 -1619 -1307 -1619 -1276 -1961 -1899 -1899 -1121 -1556 -1650 -1152 -1650 -2304 -1899 -1370 -1868 -1961 -2117 -1837
$$ packed form
101.4501189577b272L11l43O85n29K18l1L42k49L1j55k49P16m05r3k49K49J86b397
96.2216b304k49N61M04m67O3L1l1j25m36N30l2l1l73M04K81M98m05a868
90.9930379154a837L1o2O2O54k18TJ56j027L42r3L11l1J87k80j25K18J56m36b272
85.4894379154a930j25L74k18l42L1R65m05l1o2m05R3R4R34k18l11p48j24b023
80.2609189577a588j86M35o53l43J87K80m36J56L11M67L1O3p47m67R96O2l74a806
75.0323568732b086L74J24l1O3m05n60o3K49M67L1l1M36n60K49q10M98K81a370
69.8038379154b179%M36m05l11j56J56M04n60O85m05N29l1TR4m67J058n29a930
64.5753189577a619L12l12L43o85O2%P78m35r4M98m98o54M05N29m98r3j56a837
$$ plain form
59.3468758309 -1743 -1743 -1743 -1806 -2304 -2148 -2366 -2117 -2148 -1961 -1899 -2179 -2615 -1401 -1588 -1307 -1961 -2304 -2771 -2584
53.8433379154 -2055 -1930 -1868 -1806 -1837 -2055 -2272 -2210 -1650 -2117 -1806 -2459 -2117 -2086 -2802 -2397 -2802 -2459 -3020 -2646
48.3396379154 -2272 -2179 -2428 -2241 -1588 -2241 -2210 -1525 -2148 -2366 -1743 -2117 -1930 -2086 -1619 -2179 -2366 -2086
43.3864568732 -2210 -2023 -2023 -1339 -1992 -2397 -2335 -2272 -1868 -1992 -1681 -1806 -2241 -1774 -2428 -2304 -2055 -2304 -2366
38.1579379154 -2241 -2771 -2086 -1494 -1401 -1992 -2086 -1961 -1681 -1494 -2179 -1681 -1494 -1245 -1899 -1401 -1650 -2148
33.2047568732 -1930 -2210 -1556 -1525 -2335 -2708 -1992 -1339 -1245 -1307 -1401 -2241 -2117 -1837 -1432 -1837 -1899 -1806 -1619 -1339
27.7011189577 -1650 -2397 -1432 -1588 -1899 -2241 -1556 -2272 -2646 -1712 -1899 -1712 -1930 -2023 -1899 -1712 -1152 -1245
22.7478379154 -1027 -1090 -1245 -747 -529 -654 0 1432 2490 5385 6755 6911 5915 4078 1588 125
$$ packed form
59.3468758309a743%To3m98J56k18K49l1J87O2k80m36J214j87K81o54l43m67b584
53.8433379154b055J25O2Tl1k18k17O2N60m67L11o53L42L1p16M05m05L43n61b646
48.3396379154b272R3k49J87O53o53L1O85o23k18O23l74J87j56M67n60j87b086
43.3864568732b210J87%O84o53m05O2O3M04j24L11j25m35M67o54J24K49k49b366
38.1579379154b241n30O85N92R3n91r4J25K80J87o85M98J87K49o54M98k49b148
33.2047568732a930k80O54L1q10l73P16O53R4o2r4q40J24K80M05m05o2R3J87a339
27.7011189577a650p47R65j56l11l42O85p16l74R34j87J87k18r3J24J87N60a245
22.7478379154a027o3j55M98K18j25O54J432J058K895J370J56r96j837k490A25
$$ plain form
18.3449379154 -872 -498 -840 -1027 -1494 -1307 -1806 -1214 -1494 -1588 -1774 -2055 -1432 -1806 -1152 -1245 -1961 -1588 -1774
13.1165 -1868 -2055 -1432 -1183 -1525 -1121 -1619 -1619 -2086 -2210 -1806 -1619 -2023 -2148 -1837 -2086 -2304 -2023
8.1632379154 -1588 -1307 -2179 -1899 -2366 -2148 -1992 -2397 -2086 -1556 -1245 -1307 -1307 -1650 -1307 -1525 -1743 -1806 -2646 -2179
2.6597 -1961 -2148 -2210 -1370 -1556 -2086 -2335 -1961 -2335 -2023 -1650 -1930 -2553 -2833 -2677 -2117 -2304 -1245
-2.2935620846 -1899 -2708 -2833 -1930 -1837 -2459 -2584 -2023 -2335 -1806 -2055 -1525 -2055 -2086 -2615 -2366 -2148 -1868
-7.2468431268 -2055 -2366 -2490 -2023 -1837 -2366 -2490 -2148 -1525 -2210 -2366 -2521 -2708 -2148 -2241 -2428 -1868 -2210
-12.2000810423 -2241 -2397 -2335 -2335 -2397 -2397 -2086 -1806 -1743 -1961 -1930 -2428 -2708 -2708 -2459 -2335 -1992 -2304 -2086 -2771 -2086
-17.9788810423 -2459 -2459 -1650 -2086 -1868 -2304 -1681 -1899 -1743 -2148 -2459 -2179 -2335 -2023 -1650 -1992 -2086 -1930 -2335
$$ packed form
18.3449379154h72L74l42j87m67J87m99N92k80r4j86k81O23l74O54r3p16L73a774
13.1165a868j87O23K49l42M04m98%m67j24M04J87m04j25L11k49k18b023
8.1632379154a588K81q72K80m67K18J56m05L11N30L11o2%l43L43k18To3q40b179
2.6597a961j87o2Q40j86n30k49L74l74L12L73k80o23k80J56N60j87a245
-2.2935620846a899q09j25R03R3o22j25N61l12N29k49N30n30l1n29K49K18a868
-7.2468431268b055l11j24M67J86n29j24L42O23o85j56j55j87N60r3j87N60b210
-12.2000810423b241j56O2%o2%L11K80O3k18L1m98k80%K49J24L43l12K18o85b086
-17.9788810423b459%Q09m36K18m36O23k18J56m05l11K80j56L12L73l42r4J56b335
$$ plain form
-23.2073 -2833 -2366 -1899 -1556 -1494 -2086 -2179 -2117 -1806 -2055 -2366 -2241 -2241 -1837 -2055 -1370 -2272 -2210 -2366 -1090
-28.711 -1712 -2023 -1743 -1837 -1650 -2521 -2397 -1992 -1992 -2086 -2055 -2459 -1743 -2304 -2677 -2117 -2304 -2055 -1774
-33.9393620846 -2055 -2241 -2055 -1681 -1837 -2366 -2148 -1868 -1681 -1339 -2428 -1650 -1868 -1868 -2179 -2086 -2615 -1992
-38.8927 -2553 -1712 -2553 -2459 -2739 -2521 -2397 -1899 -2086 -2148 -2148 -1961 -2055 -2584 -2272 -1899 -2490 -2179 -2304
-44.1210620846 -2210 -1868 -2210 -1961 -2023 -1899 -2553 -2086 -2366 -1712 -1868 -1525 -1432 -1525 -1650 -1837 -2459 -2335 -2397
-49.3495431268 -2366 -2553 -2459 -2833 -2241 -1992 -1868 -2055 -1899 -2055 -2210 -1837 -1992 -1245 -1463 -2272 -2179 -2086
-54.3028 -2304 -2366 -2055 -2459 -2428 -2490 -2117 -2086 -2086 -1619 -1899 -2086 -2615 -2179 -2023 -1961 -2023 -2428 -2086 -2117
-59.8064 -2117 -2210 -2428 -2304 -2055 -2055 -2148 -2179 -2023 -2210 -2210 -2272 -1837 -2086 -1899 -2023 -2086 -2055 -1961 -2117 -2304
$$ packed form
-23.2073b833M67TL43O2n92r3O2L11k49l11J25%M04k18O85r02O2j56a090
-28.711a712l11K80r4J87q71J24M05%r4L1m04P16n61l73N60j87K49a774
-33.9393620846b055j86J86L74j56n29K18K80J87L42j089P78k18%l11R3n29a992
-38.8927b553Q41q41R4k80K18J24M98j87o2%J87r4n29L12L73n91L11b304
-44.1210620846b210L42l42K49o2J24o54M67k80O54j56L43R3r3j25j87o22J24b397
-49.3495431268b366j87R4l74N92K49J24j87J56j56j55L73j55P47k18q09R3b086
-54.3028b304o2L11m04L1o2L73L1%M67k80j87n29M36J56O2o2m05L42b117
-59.8064b117r3k18J24K49%r3l1J56j87%o2M35k49J87j24o3L1R4j56b304
$$ plain form
-65.5852 -2117 -2397 -2272 -1930 -2366 -2179 -2926 -2366 -2584 -2366 -2210 -2615 -2677 -2428 -2584 -2397 -2708 -2179
-70.5384810423 -1743 -2304 -2553 -1992 -2335 -1961 -2086 -1743 -2148 -2055 -2179 -2055 -2366 -2117 -2210 -2272 -2023 -2117 -1681
-75.767 -2117 -2117 -1992 -1868 -2241 -2086 -2304 -2615 -2615 -1930 -2241 -2397 -2023 -1712 -1743 -1650 -2459 -2957 -2553 -2179
-81.2707 -2459 -1930 -2272 -1774 -1432 -2366 -2553 -1992 -1806 -2366 -2304 -2397 -2335 -1930 -1961 -1370 -1837 -1556 -1401
-86.4992431268 -1743 -1494 -1121 -1743 -2428 -2117 -1899 -1525 -1619 -2802 -2926 -2615 -2739 -2957 -2521 -1899 -1712 -1868
-91.4526 -2802 -2490 -1525 -1619 -1774 -2428 -1961 -1961 -1992 -2366 -2615 -2677 -2304 -2241 -1961 -2241 -1774 -1619 -1183 -1463
-96.9563 -1837 -2148 -2584 -2086 -1930 -2210 -1743 -2833 -2023 -1899 -2553 -2335 -1899 -2086 -1868 -2584 -2397
-101.6343810423 -2397 -1899 -2086 -2086 -2366 -1992 -2023 -1899 -2272 -1868 -2055 -2086 -1681 -1556 -1930 -2335 -2833 -2521 -2771
$$ packed form
-65.5852b117k80J25L42m36J87p47N60k18K18J56m05o2K49j56J87l11b179
-70.5384810423a743n61k49N61l43L74j25L43m05R3j24J24l11K49r3o2K49r4a681
-75.767b117%J25J24l73J55k18l11%O85l11j56L74L11l1R3q09m98M04b179
-81.2707b459N29l42M98L42r34j87N61J86n60O2r3O2M05l1N91m67K81a401
-86.4992431268a743K49L73o22o85L11K18L74r4j183j24L11j24k18M36O22J87a868
-91.4526b802L12R65r4j55o54M67%l1l74k49o2L73O3K80k80M67J55M36a463
-96.9563a837l11m36M98J56k80M67j090Q10J24o54K18M36j87K18p16b397
-101.6343810423b397M98j87%k80L74l1J24l73M04j87l1M05J25l74m05m98L12b771
$$ plain form
-106.8628431268 -2490 -1992 -2241 -3175 -2086 -1868 -1837 -1619 -2241 -1463 -1463 -1681 -2086 -2086 -2521 -2023 -2179 -1619 -2428
-112.0913620846 -2366 -1619 -2148 -1868 -2304 -2926 -2179 -1712 -1743 -2304 -1743 -1681 -2117 -2366 -2428 -2459 -1712 -2241 -1961
-117.3198810423 -1743 -2055 -2304 -2241 -2023 -2397 -2988 -2179 -1899 -2117 -2086 -1806 -1494 -996 -1525 -1899 -2148 -2272
-122.2732431268 -1650 -1774 -2117 -2335 -2366 -2335 -2397 -1868 -1681 -2677 -2117 -1806 -1743 -1774 -1992 -2117 -1401 -1650 -1930
-127.5018 -1899 -1930 -1370 -1774 -1992 -2397 -2739 -2055 -2023 -2677 -2210 -1494 -1339 -1525 -2553 -1774 -1961 -1650
-132.4549620846 -1681 -2895 -2646 -2023 -2148 -1961 -1899 -1837 -1899 -1868 -1868 -1681 -2179 -1930 -2304 -1743 -1992 -1681 -2117 -1556
-137.9584810423 -2397 -2521 -1339 -1401 -1837 -1712 -1806 -1930 -1961 -2304 -2055 -1806 -2895 -2615 -2553 -2553 -1961 -1930 -2988 -2584
-143.462 -2957 -2677 -1899 -1681 -2148 -2055 -1432 -2117 -2490 -2210 -1619 -1401 -1712 -2397 -2086 -1650 -1463 -1556
$$ packed form
-106.8628431268b490M98k49r34J089K18L1K18o22P78%k18m05%m35M98j56N60b428
-112.0913620846b366P47n29K80m36o22P47M67l1n61N61O2m36k49o2l1P47n29a961
-117.3198810423a743l12k49O3K18l74n91Q09K80k18L1K80L12M98n29l74k49b272
-122.2732431268a650j24l43k18l1L1o2N29J87r96N60L11O3l1k18j25P16k49a930
-127.5018a899l1N60m04k18m05l42O84L2o54M67P16J55j86j028P79j87a650
-132.4549620846a681j214K49O23j25J87O2To2L1%J87m98K49l74N61k49L11m36a556
-137.9584810423b397j24J182o2m36J25r4j24l1l43K49Tj089K80O2%N92L1j058b584
-143.462b957K80P78K18m67R3O23o85l73K80N91K18l11o85L11M36J87a556
$$ plain form
-148.4151810423 -2366 -1743 -2210 -2210 -2241 -2241 -2335 -2428 -2179 -2490 -2335 -2179 -2771 -2459 -2304 -2708 -2366 -2615 -1837 -1961
-153.9188 -2241 -2428 -2677 -3206 -2428 -1837 -1837 -1494 -1743 -2397 -2210 -2148 -1743 -1806 -2553 -2708 -2490 -2708 -1992
-159.1471431268 -1868 -1868 -2521 -2241 -1556 -2615 -1681 -2272 -2802 -2397 -2397 -1930 -2023 -1930 -1650 -1774 -1525 -2117 -2428
-164.3754810423 -2055 -2023 -1370 -1992 -2521 -2584 -2304 -2210 -2584 -1992 -2241 -1992 -1681 -2117 -2179 -1712 -2272 -2708 -2086
-169.6038431268 -1743 -2304 -2864 -2615 -1806 -2210 -2739 -2739 -2646 -2335 -2335 -1992 -2397 -2584 -1774 -1619 -1494 -2055 -2241
-174.8321810423 -1837 -2521 -1868 -1868 -1868 -2739 -2646 -2335 -2210 -1806 -1743 -2241 -1712 -2521 -1930 -2086 -1899 -1961 -2428 -2272
-180.3357 -2210 -2646 -1961 -2397 -2739 -1868 -1650 -2023 -2086 -2117 -1992 -2459 -1245 -1992 -2366 -2272 -2148 -2241
-185.2889620846 -2335 -2553 -2428 -1992 -2241 -2335 -2304 -2615 -2117 -2335 -2086 -2459 -2615 -1899 -1650 -2428 -2428 -2802 -2272
$$ packed form
-148.4151810423b366O23m67%l1%r4r3K49l11J55J56n92L12J55m04L42k49P78a961
-153.9188b241j87k49n29P78N91%L43k49o54J87O2M05o3p47j55K18k18a992
-159.1471431268a868%o53K80O85j059R34n91n30M05%M67r3R3K80j24K49n92b428
-164.3754810423b055L2O53o22n29o3K80R4l74N92k49K49L11m36o2M67n60m36b086
-169.6038431268a743n61n60K49Q09m04n29%R3L11%L43m05j87Q10J55J25n61b241
-174.8321810423a837o84O53%Tq71R3L11J25M04O3m98N29q09N91j56J87o2m67b272
-180.3357b210m36O85m36l42Q71K18l73o3l1J25m67J214p47l74R4J24b241
-185.2889620846b335k18J25M36k49r4L1l11M98k18K49l73j56P16K49p78%l74b272
$$ plain form
-190.5173 -2615 -2366 -2148 -2179 -2366 -2179 -1930 -2677 -2023 -1899 -2304 -2553 -2366 -2304 -2117 -1930 -2210 -2584 -3860
-195.7456620846 -2708 -2926 -2304 -2428 -1868 -1743 -2677 -2023 -1743 -1650 -2023 -2055 -1930 -1961 -1588 -2086 -2335 -2179 -2553
-200.974 -2428 -2241 -2366 -2521 -2366 -1837 -1837 -1525 -1806 -2272 -2459 -2584 -2459 -2459 -1899 -1930 -2553 -2397 -2023
-206.2023620846 -2179 -2708 -2241 -2241 -2490 -2521 -1930 -2397 -1712 -1992 -2055 -2304 -1930 -1868 -1837 -1961 -2210 -2304 -1992 -2335
-211.7058810423 -1930 -2148 -1681 -1868 -2615 -2210 -1650 -1525 -1370 -2615 -1992 -1868 -1463 -2117 -1961 -1806
$$ packed form
-190.5173b615K49K18l1j87J87K49p47O54J24m05k49J87O2J87Tk80l74c860
-195.7456620846b708k18O22j24N60J25r34O54K80R3l73l2J25l1L73m98k49J56b553
-200.974b428J87j25j55J55N29%L12k81m66j87j25J25%N60l1o23J56b023
-206.2023620846b179n29M67%k49l1N91m67O85k80o3k49L74O2L1j24k49r4L12b335
-211.7058810423a930k18M67j87p47M05N60J25J55j245O23J24M05o54J56a806
-216.1085032727b459  $$checkpoint
##END=  $$end of H NMR
##TITLE= aspirin (Acetone-D6)
##JCAMP-DX= 5.01
##DATA TYPE= NMR SPECTRUM
##DATA CLASS= XYDATA
##BLOCK ID=3
##ORIGIN= rbadger-aspirin-Acetone PROTON-UWSP
##OWNER= public domain
##LONGDATE= 2012/03/24 19:42:13.0970 -0500 $$ export date from JSpecView
##.ACQUISITION TIME= 3.985
##.ZERO FILL= 0
##$.SHIFT REFERENCE= INTERNAL,  ,1, -4.1286
##.ACQUISITION MODE= SIMULTANEOUS
##SPECTROMETER/DATA SYSTEM= Bruker BioSpin GmbH 400 MHz
##SOLVENT NAME= ACETONE-D6
##.OBSERVE FREQUENCY= 400.132
##.OBSERVE NUCLEUS= ^1H
##XUNITS= HZ
##YUNITS= ARBITRARY UNITS
##XFACTOR= 1
##YFACTOR= 0.1012375
##FIRSTX= 5.801907E+03
##FIRSTY= 0
##LASTX= -1.999418E+02
##NPOINTS= 23915
##MINY= -6.326948
##MAXY= 1.012312E+05
##XYDATA= (X++(Y..Y))
$$ plain form
5801.9072716324 0 -31 0 0 0 0 0 31 0 0 0 0 0 0 0 0 0 0 -31 -31 0 0 0 -31 0 0 0 0 0 0 0 0 0 0 0 0 0 0 0 0 0 0 0 0 0 -31 0 0 0 31 0 0 0 0 0 0 0 0 0 0 0 0 0 0 0 0 0 0 0 0 0 -31 0 0 0 -31 0 -31
5782.3248144853 0 0 0 0 0 0 0 0 0 0 0 31 0 0 0 0 -31 0 0 0 0 0 0 0 0 0 0 0 0 -31 0 -31 0 0 0 0 -31 31 0 0 0 0 -31 0 0 0 -31 0 0 0 0 0 0 -31 0 0
5768.3014240148 0 0 0 -31 0 0 0 0 0 0 0 0 0 -31 0 0 0 0 0 0 0 0 0 0 0 0 0 0 0 0 0 -31 0 0 0 0 0 0 31 0 -31 -31 0 31 0 0 0 0 0 0 0 0 0 0 0 0 -31 0 0 0 0 0 0 -31 0 0 0 0 0 0 0 -31 0
5749.9738398824 -31 -31 0 0 0 -31 0 0 0 0 0 0 0 31 0 -31 0 -31 -31 0 0 0 0 0 0 -31 0 0 0 0 0 0 0 0 0 0 -31 0 31 0 0 0 0 0 0 0 0 0 0 31 0 0 0 0 0 0 0 0 0 0 0 0 0 0 31 0
5733.3718906765 0 0 -31 0 0 0 0 0 0 0 0 0 0 0 0 0 0 0 0 0 0 0 0 0 0 31 0 -31 0 0 0 0 0 0 0 0 0 -31 0 0 0 -31 0 -31 0 0 0 0 0 31 0 -31 0 0 0 0 0 0 0 0 0 0 0 0 0 -31 0 0 0 0 0 0 0 0 0 0 0 0 0 0 0 0 -31 0
5712.3523986178 0 0 0 -31 0 0 0 0 0 0 0 0 0 0 0 -31 0 0 0 0 0 0 0 -31 -31 0 0 0 0 -31 0 0 0 0 0 0 0 0 0 0 0 -31 0 0 -31 0 0 0 0 0 0 0 0 0 0 0 0 0 0 0 0 0 0 -31 0 0 0 0 0 0 -31 0
5694.2757890883 0 0 0 0 -31 0 0 0 0 0 0 0 0 0 0 0 0 -31 0 0 0 0 0 0 0 0 0 0 0 0 0 -31 0 0 0 0 0 0 0 0 -31 0 0 0 -31 -31 0 0 0 -31 0 0 0 0 0 0 0 0 0 0 0 0 0 0 0 0 0 0 0 0 -31 0 -31 0 0
5675.4150684559 0 0 0 0 0 0 0 0 0 0 0 0 0 0 0 0 0 0 -31 0 0 0 -31 0 -31 0 0 -31 0 -31 0 0 -31 0 0 0 0 0 0 0 -31 0 0 0 0 -31 0 0 0 0 31 0 -31
$$ packed form
5801.9072716324@l1L1%VL1l1%sl1%L1%Tl1L1%T0l1L1%TL1l1%T0l1L1%Tl1L1c1
5782.3248144853@%S0L1l1%Ul1L1%S1l1L1l1L1%Ul1O2l1%Ul1L1%Tl1L1%Wl1L1@
5768.3014240148@%Tl1L1%Zl1L1%S6l1L1%WL1l1T%L1Tl1%S1l1L1%Wl1L1%Xl1@
5749.9738398824c1%L1%Tl1L1%XL1l1TL1l1%L1%Wl1L1%sl1L1Tl1%sL1l1%S3L1@
5733.3718906765@%l1L1%T1L1l1TL1%Zl1L1%Tl1L1l1L1%VL1l1TL1%S2l1L1%S5l1@
5712.3523986178@%Tl1L1%S0l1L1%Xl1%L1%Ul1L1%S0l1L1%l1L1%S7l1L1%Wl1@
5694.2757890883@%Ul1L1%S1l1L1%S2l1L1%Yl1L1%Tl1%L1%Tl1L1%S9l1L1l1L1@
5675.4150684559@%S7l1L1%Tl1L1l1L1%l1L1l1L1%l1L1%Xl1L1%Ul1L1%UL1l1c1
$$ plain form
5662.0757890883 31 0 -31 0 0 0 0 0 0 0 0 0 0 31 0 0 0 0 0 0 0 0 0 -31 31 0 0 0 0 0 0 0 0 0 0 0 0 0 31 0 31 0 0 0 0 0 0 0 0 0 0 0 0 0 -31 0 0 0 -31 0 0 31 31 0 0
5645.8248144853 0 0 0 0 -31 0 0 0 -31 0 0 0 0 0 0 0 0 0 0 0 0 0 0 0 31 0 0 0 0 0 31 0 0 0 0 0 0 0 0 0 -31 0 0 0 0 0 -31 0 0 -31 -31 0 0 0 0 0 31 0 0
5630.9796875 0 0 0 0 -31 0 0 0 0 0 0 0 0 0 0 0 0 0 0 -31 0 0 -31 0 0 -31 0 0 0 0 0 0 0 0 0 0 0 0 0 0 0 0 0 -31 0 0 0 0 0 0 0 0 0 0 0 0 0 0 0 0 31 0 0 0 0 0 0 0 0 0 0 0 0 0 0 0 0 0 0 0 0 0 0 -31 31 0 0 0 0 0 0 0 -31 0
5607.4014240148 0 0 0 0 31 0 -31 0 0 0 0 0 0 0 0 0 0 -31 0 0 0 0 0 0 -31 0 0 0 0 31 31 0 0 0 0 0 0 0 0 0 -31 0 0 0 0 0 0 0 -31 0 0 0 -31 0 31 0 -31
5593.0582462354 0 0 0 0 0 31 0 0 0 0 -31 0 0 0 0 0 0 -31 0 0 0 -31 0 0 0 0 0 0 0 0 -31 0 0 0 0 0 0 31 -31 -31 0 -31 0 0 0 0 0 -31 0 -31
5580.5718906765 0 0 0 0 -31 0 0 -31 0 0 0 31 0 0 0 0 0 0 0 0 0 0 0 0 0 0 31 0 31 0 0 0 0 -31 0 -31 -31 0 0 31 0 0 0 31 0 0
5568.9582462354 0 0 0 0 0 -31 0 0 -31 0 0 0 0 0 0 -31 0 0 0 0 0 0 0 -31 0 0 0 -31 0 0 0 0 0 0 0 0 0 0 0 0 0 0 0 0 -31 -31 0 0 0 0 0 0 0 0 0 -31 0 0 0 0 0 0 0 0 0 0 0 0 0 0 0 0 0 0 0 0 0 -31 0 0
5548.9738398824 -31 -31 0 -31 0 -31 0 0 31 0 0 0 0 0 0 0 0 0 0 0 0 0 0 0 0 0 0 -31 0 0 0 0 0 0 0 0 31 0 0 0 0 0 0 0 0 0 0 31 0 0 0 0 0 0 0 0 0 0 0 0 0 31 0 0 -31 0 -31 0
$$ packed form
5662.0757890883C1l1TL1%sL1l1%Zl1O2l1%S2L1l1L1l1%S2l1L1%Tl1L1%L1%l1@
5645.8248144853@%Ul1L1%Tl1L1%S4L1l1%VL1l1%Zl1L1%Vl1L1%l1%L1%VL1l1@
5630.9796875@%Ul1L1%S3l1L1%l1L1%l1L1%S6l1L1%S5L1l1%T1l1O2l1%Xl1@
5607.4014240148@%UL1l1TL1%sl1L1%Wl1L1%UL1%l1%Zl1L1%Xl1L1%Tl1L1Tl1c1
5593.0582462354@%VL1l1%Ul1L1%Wl1L1%Tl1L1%Yl1L1%WL1o2%L1l1L1%Vl1L1c1
5580.5718906765@%Ul1L1%l1L1%TL1l1%S3L1l1L1l1%Ul1L1l1%L1%L1l1%TL1l1@
5568.9582462354@%Vl1L1%l1L1%Wl1L1%Xl1L1%Tl1L1%S5l1%L1%Zl1L1%T0l1L1@
5548.9738398824c1%L1l1L1l1L1%L1l1%S7l1L1%YL1l1%sL1l1%S2L1l1%l1L1l1@
$$ plain form
5531.8699414706 0 0 0 0 0 0 -31 0 0 0 0 0 0 0 0 0 0 0 0 0 0 0 0 0 0 0 0 0 0 31 0 -31 0 0 31 0 0 0 0 0 31 0 -31 0 0 0 0 0 0 31 0 0 0 0 0 0 0 0 0 0 0 0 0 0 -31 0 0 0 0 -31 0 0
5513.7621446471 -31 0 0 0 0 0 0 -31 0 0 0 0 31 0 0 0 0 0 31 0 0 0 0 0 31 -31 0 0 0 0 0 0 0 0 0 0 0 0 0 0 0 0 0 0 0 0 0 0 0 0 0 0 31 0 0 0 0 0 0 0 0 0 -31 0 0 0 31 0 0 0
5496.2562970295 0 0 0 0 31 0 0 -31 0 0 0 0 0 0 0 0 0 0 0 0 0 0 31 0 0 0 0 0 0 0 0 0 0 0 0 -31 0 0 0 31 0 0 -31 -31 0 0 0 0 0 0 0 0 0 0 0 0 0 0 0 31 0 0 0 0 0 0 0 0 0 0 0 0 0 0 0 0 31 -31
5476.6738398824 0 0 0 0 -31 0 0 0 0 0 0 31 0 0 0 0 0 0 0 31 0 0 0 0 0 0 0 0 0 0 0 0 0 0 -31 0 0 0 0 0 0 0 0 0 -31 0 -31 0 0 0 0 0 31 0 0 31 0 0 0 0 0 0 0 0 0 0 -31 0
5459.5699414706 31 31 0 0 0 0 0 0 0 0 0 0 0 -31 -31 0 0 0 0 0 0 0 31 0 31 0 0 31 0 0 0 0 0 0 0 0 0 0 0 0 0 31 -31 -31 0 0 0 0 0 0 0 -31 -31 0 -31 0 0 0
5444.9757890883 -31 0 0 0 0 0 0 0 0 0 0 0 0 0 0 0 0 0 -31 0 0 0 0 0 0 0 0 0 0 0 0 0 0 0 0 0 0 0 0 0 0 0 0 -31 0 0 0 0 0 0 0 0 0 31 0 0 0 -31 0 0 0 0 -31 0 0 0 0 0 0 0 0 0 0 31 0 -31 0 0 0 0 0 0 0 0 0 0 0 0 0 0 0 -31 0
5421.6796875 31 0 0 0 0 0 31 -31 0 0 31 0 0 0 -31 0 0 0 0 0 0 0 0 0 0 0 0 -31 0 0 0 31 0 0 0 0 0 0 0 0 31 0 0 0 0 0 0 -31 0 0 0 0 0 0 0 0 0 0 0 0 0 0 -31 0
5405.5796875 0 0 0 0 0 0 0 0 0 0 0 0 0 0 0 31 0 0 0 0 0 0 -31 31 0 -31 0 0 0 0 0 0 0 0 0 0 0 0 0 0 0 0 0 0 0 0 0 0 0 0 0 31 -31 0 0 0 0 0 0 31 0 0 0 0 0 0 0 0 0 -31 0 0 0 0 0 0 0 0 0 0 0 0 0 0 0 0 0 0 0 0 0 -31 0 0 0 0 0 0 -31 0
$$ packed form
5531.8699414706@%Wl1L1%T1L1l1TL1%L1l1%VL1l1TL1%WL1l1%S3l1L1%Ul1L1@
5513.7621446471c1L1%Wl1L1%UL1l1%VL1l1%VL1o2L1%T5L1l1%Zl1L1%TL1l1%@
5496.2562970295@%UL1l1%l1L1%S3L1l1%S1l1L1%TL1l1%l1%L1%S4L1l1%S5L1c1
5476.6738398824@%Ul1L1%WL1l1%XL1l1%S3l1L1%Zl1L1l1L1%VL1l1%L1l1%sl1@
5459.5699414706C1%l1%S0l1%L1%XL1l1L1l1%L1l1%S2L1o2%L1%Xl1%L1l1L1%@
5444.9757890883c1L1%S6l1L1%T3l1L1%ZL1l1%Tl1L1%Ul1L1%sL1l1TL1%S4l1@
5421.6796875C1l1%VL1o2L1%L1l1%Tl1L1%S1l1L1%TL1l1%YL1l1%Wl1L1%S3l1@
5405.5796875@%S4L1l1%Wl1O2l1TL1%T4L1o2L1%WL1l1%Zl1L1%T0l1L1%Wl1@
$$ plain form
5380.4757890882 0 0 0 0 0 0 0 31 0 0 0 0 0 0 0 0 0 0 0 -31 31 0 31 0 0 0 0 -31 31 0 0 0 0 0 0 0 0 0 0 0 0 0 0 0 0 0 0 0 -31 0 0 -31 0 0 0 0 0 0 0 0 0 -31 0 0 0 0 0 0 0 0 0 0 0 0 0 0 0 0 0 0 0 0 0 0 0 0 0 0 0 0 -31 -31
5357.4796875 0 0 0 0 31 0 0 0 0 0 0 0 0 0 0 -31 0 0 0 -31 0 0 0 0 0 0 -31 0 0 0 0 0 0 0 0 31 0 0 0 0 0 -31 0 0 31 0 0 0 0 0 0 0 0 0 -31 0 0 0 0 0 0 0 0 0 0 0 0 0 0 0 0 -31 0
5339.1209160736 0 0 0 0 0 0 0 -31 0 0 0 0 0 0 31 0 -31 0 0 0 31 0 -31 -31 0 0 0 0 0 -31 0 0 0 0 0 0 0 0 0 0 0 0 0 0 0 0 0 0 31 0 0 0 0 0 0 0 0 0 0 0 0 0 0 0 0 0 0 0 0 0 0 0 0 0 0 0 0 0 -31 0 0 0 0 -31 0
5317.7504494119 0 0 0 0 0 0 0 -31 0 0 -31 0 0 31 0 31 0 -31 0 0 0 0 0 -31 31 0 0 0 0 0 0 0 0 0 0 0 0 0 0 0 0 0 0 31 0 0 0 0 0 0 0 0 0 0 0 0 0 0 0 0 0 31 0 0 0 0 0 0 0 0 0 0 0 0 31 0
5298.6699414706 0 0 0 31 0 0 0 0 0 0 0 0 31 0 0 0 0 0 0 0 0 31 0 0 0 0 0 0 0 0 0 0 0 0 0 0 0 0 0 0 0 0 0 31 0 0 0 0 0 0 0 0 0 0 0 0 0 0 0 0 0 0 0 0 0 0 0 0 31 0 0 0 0 0 0 0 0 0 0 31 0 31 0 0 0 0 0 0 0 0 0 0 31 -31 0 0
5274.5699414706 0 0 0 0 31 0 -31 0 0 0 0 0 0 0 31 0 0 0 31 0 0 0 0 0 0 0 0 0 0 0 0 0 0 0 0 31 0 0 0 0 0 0 0 0 0 0 31 0 0 0 0 0 0 31 0 0 0 0 31 0 0 0 31 0
5258.5699414706 0 0 0 0 0 0 0 0 -31 31 0 0 0 0 0 0 0 0 0 0 0 0 0 0 0 0 0 0 -31 0 0 0 0 31 -31 0 31 0 0 31 0 31 0 31 0 0 0 0 0 0 31 0 0 31 -31 0
5244.5287128971 0 0 0 0 0 0 0 0 0 0 0 0 0 -31 0 -31 0 0 0 0 0 31 0 0 0 0 0 0 0 31 0 0 0 0 0 0 31 0 -31 0 31 0 0 0 0 0 0 0 0 0 0 0 0 0 0 0 0 0 31 0 0 0 0 0 31 0 31 31
$$ packed form
5380.4757890882@%XL1l1%S0l1O2l1L1l1%Ul1O2l1%S8l1L1%l1L1%Zl1L1%T7l1c1
5357.4796875@%UL1l1%sl1L1%Tl1L1%Wl1L1%YL1l1%Vl1L1%L1l1%Zl1L1%S5l1@
5339.1209160736@%Xl1L1%WL1l1TL1%TL1l1T%L1%Vl1L1%S7L1l1%T8l1L1%Ul1@
5317.7504494119@%Xl1L1%l1L1%L1l1L1l1TL1%Vl1O2l1%S7L1l1%S6L1l1%S1L1@
5298.6699414706@%TL1l1%YL1l1%YL1l1%T0L1l1%T3L1l1%sL1l1L1l1%sL1o2L1@
5274.5699414706@%UL1l1TL1%XL1l1%TL1l1%S5L1l1%sL1l1%WL1l1%UL1l1%TL1@
5258.5699414706@%Yl1O2l1%S7l1L1%UL1o2L1Tl1%L1l1L1l1L1l1%WL1l1%L1o2@
5244.5287128971@%S2l1L1l1L1%VL1l1%XL1l1%WL1l1TL1Tl1%S6L1l1%VL1l1L1C1
$$ plain form
5227.4248144853 0 0 0 0 0 0 0 0 0 0 0 0 0 0 0 31 0 0 0 0 0 0 0 0 0 0 0 0 0 31 0 0 31 0 0 0 0 0 -31 0 0 0 0 0 0 0 31 31 -31 0 0 0 0 0 31 0 0 0 0 -31 0 0 0 0 0 31 0
5210.5718906765 -31 0 0 31 0 0 0 0 0 0 0 0 0 0 0 0 0 0 0 0 0 0 0 0 0 0 0 31 0 0 0 0 0 0 0 0 0 0 0 0 0 0 0 0 0 0 0 -31 0 31 0 0 31 0 0 0 0 0 0 0 0 31 0 0 0 0 0 0 0 0 31 -31 0 0 0 31 0 0
5191.0582462354 0 0 0 0 0 -31 0 0 0 -31 0 0 0 31 0 31 0 0 0 -31 31 0 0 0 0 0 0 0 31 0 0 0 31 0 0 0 0 0 0 0 0 0 0 0 0 0 -31 0 0
5178.7228652794 0 0 0 0 0 31 0 31 0 0 0 0 31 31 31 0 0 31 0 0 0 0 0 0 0 0 0 0 0 31 0 0 0 0 0 0 0 0 0 -31 0 0 0 0 0 0 31 0 0 31 0 0 0 0 0 31 0
5164.4796875 0 -31 0 0 0 31 0 0 0 0 0 0 31 31 0 0 0 0 0 0 0 0 0 0 0 0 31 0 0 0 0 0 31 31 0 0 0 0 31 0 0 0 0 0 0 0 0 31 0 0 0 0 0 0 0 0 0 0 0 0 0 0 31 0 0
5148.1287128971 0 0 0 31 0 0 31 31 0 0 0 0 0 0 0 0 0 0 0 0 0 0 0 -31 0 0 0 0 0 0 0 0 0 0 0 0 0 31 0 0 0 0 0 0 0 0 0 31 0 0 0 31 31 0 0 0 0 31 0 0 0 0 0 0 -31 0
5131.5267636912 0 0 0 0 0 -31 0 0 31 0 0 0 0 0 0 0 0 0 0 0 0 0 31 0 0 0 0 31 0 0 0 0 0 0 0 0 0 0 0 0 0 31 31 0 0 0 0 0 0 0 0 0 31 0 0 0 31 0 -31 0 0 0 0 0 0 0 0 0 0 0 0 0 0 0 0 31 0
5112.264093853 0 0 31 31 0 0 0 0 0 0 0 0 0 0 -31 0 0 31 0 31 0 0 0 0 0 0 0 0 0 0 0 0 0 0 0 31 0 0 0 31 0 0 0 0 -31 0 0 0 31 0 0 0 0 0 -31 0
$$ packed form
5227.4248144853@%S4L1l1%S2L1l1%L1l1%Vl1L1%XL1%o2L1%VL1l1%Ul1L1%VL1@
5210.5718906765c1L1%L1l1%T2L1l1%S8l1L1Tl1%L1l1%YL1l1%YL1o2L1%TL1l1@
5191.0582462354@%Vl1L1%Tl1L1%TL1l1L1l1%Tl1O2l1%XL1l1%TL1l1%S2l1L1@
5178.7228652794@%VL1l1L1l1%UL1%Tl1%L1l1%S0L1l1%Zl1L1%WL1l1%L1l1%VL1@
5164.4796875@l1L1%TL1l1%WL1%l1%S1L1l1%VL1%l1%UL1l1%YL1l1%S3L1l1@
5148.1287128971@%TL1l1%L1%l1%S4l1L1%S2L1l1%ZL1l1%TL1%l1%UL1l1%Wl1@
5131.5267636912@%Vl1L1%L1l1%S2L1l1%UL1l1%S2L1%l1%ZL1l1%TL1l1TL1%S5L1@
5112.264093853@%L1%l1%sl1L1%L1l1L1l1%S4L1l1%TL1l1%Ul1L1%TL1l1%Vl1@
$$ plain form
5098.1718906765 0 31 -31 31 0 31 0 0 0 0 31 31 0 0 0 31 0 0 0 0 0 0 0 31 0 0 -31 31 31 31 0 31 31 0 0 0 0 31 0
5088.4150684559 0 0 0 0 0 0 0 0 0 31 0 0 0 31 0 0 0 0 0 0 0 0 31 0 0 0 0 -31 31 0 31 0 0 0 0 0 0 0 31 0 0 0 0 0 0 31 31 0 0 0 0 31 0 0
5074.8248144853 0 31 0 31 0 0 0 0 0 0 0 0 0 0 31 0 0 0 31 0 0 31 0 0 31 31 -31 0 0 31 0 31 0 0 31 0 31 0
5065.3189668677 0 0 0 0 0 0 31 31 31 -31 0 0 0 31 0 0 0 0 31 0 0 31 0 0 0 0 0 31 31 31 31 31 0 0 31 0 0 -31 0 0 0 0 0 0 0 31 0
5053.4543478236 0 31 0 0 0 0 0 0 31 31 0 0 0 0 0 0 0 0 31 0 0 0 0 0 0 0 31 0 0 0 0 31 31 31 0 0 0 31 0 0 0 0 31 0 0 0 0 0 31 0 0
5040.6679922648 0 31 0 0 0 0 0 0 31 0 0 0 0 0 0 0 0 0 0 0 0 0 0 0 0 0 0 31 31 31 0 31 0 0 0 31 0 0 0 0 0 0 0 0 31 0 0 0 0 31 31 0 0 0 0 0 0 0 0 31 0 0 31
5024.9189668677 0 0 0 0 31 0 0 0 0 0 31 0 31 0 0 0 0 0 31 0 31 0 0 31 0 0 31 0 0 0 0 0 31 0 31 0 0 31 0
5015.0621446471 0 0 31 31 0 31 0 -31 0 0 0 31 0 31 0 0 0 31 0 0 0 31 0 0 0 0 31 31 0 0 0 0 0 0 0 0 0 0 31 31 31 0 0
$$ packed form
5098.1718906765@L1o2O2l1L1l1%UL1%l1%TL1l1%XL1l1%l1O2%Tl1L1%l1%UL1@
5088.4150684559@%ZL1l1%TL1l1%YL1l1%Ul1O2l1L1l1%XL1l1%WL1%l1%UL1l1@
5074.8248144853@L1l1L1l1%sL1l1%TL1l1%L1l1%L1%o2L1%L1l1L1l1%L1l1L1@
5065.3189668677@%WL1%To2L1%TL1l1%UL1l1%L1l1%VL1%Vl1%L1l1%l1L1%XL1@
5053.4543478236@L1l1%WL1%l1%YL1l1%XL1l1%UL1%Tl1%TL1l1%UL1l1%VL1l1@
5040.6679922648@L1l1%WL1l1%S7L1%Tl1L1l1%TL1l1%YL1l1%UL1%l1%YL1l1%C1
5024.9189668677@%UL1l1%VL1l1L1l1%VL1l1L1l1%L1l1%L1l1%VL1l1L1l1%L1@
5015.0621446471@%L1%l1L1l1TL1%TL1l1L1l1%TL1l1%TL1l1%UL1%l1%sL1%Tl1@
$$ plain form
5004.3014240148 31 0 0 0 31 31 0 0 0 0 -31 0 0 0 31 0 31 0 0 0 0 0 0 0 31 0 31 31 31 0 0 0 0 31 0 0 0 0 31 0 0
4993.9738398824 0 0 0 0 31 0 0 0 0 0 31 0 0 31 0 0 0 0 0 0 31 0 0 0 31 0 0 0 31 31 0 0 0 31 0 0 0 31 31 0 31
4983.7150684559 31 0 31 31 0 31 0 31 0 0 0 0 0 31 0 0 0 0 0 0 31 0 0 0 31 31 0 31 0 0 31 31 0 31 0 0
4974.7111700442 31 0 0 0 31 31 0 0 0 31 0 31 0 0 0 0 0 0 31 0 0 0 0 0 0 0 0 0 0 31 0 0 0 31 31 31 31 0 0 31 0 0 31 31 0
4963.3796875 31 0 31 0 0 0 31 0 31 0 31 31 31 31 0 31 31 0 0 31 0 0 0 31 0 0 0 0 31 31 0 0 0 0 0 0 0 0 0 31 0
4953.1209160736 0 0 0 0 31 0 0 0 0 0 0 0 31 0 0 31 0 31 0 0 0 0 31 0 0 0 0 0 0 0 0 0 31 0 0 0 0 31 0 0 0 31 0 0 0 0 31 0
4941.1053224266 0 0 0 0 0 0 31 0 0 0 31 0 0 0 0 0 0 0 31 0 31 31 0 31 0 0 0 31 0 31 0 0 0 0 0 31 0 0 31 31 31 31 31 0 0
4929.7738398824 31 0 0 31 0 0 31 0 0 31 0 0 0 0 0 0 31 31 31 31 31 0 0 0 31 31 0 0 0 31 0 0 31 0 0 31 0 0
$$ packed form
5004.3014240148C1l1%TL1%l1%Ul1L1%TL1l1L1l1%XL1l1L1%Tl1%UL1l1%UL1l1@
4993.9738398824@%UL1l1%VL1l1%L1l1%WL1l1%TL1l1%TL1%l1%TL1l1%TL1%l1C1
4983.7150684559C1l1L1%l1L1l1L1l1%VL1l1%WL1l1%TL1%l1L1l1%L1%l1L1l1@
4974.7111700442C1l1%TL1%l1%TL1l1L1l1%WL1l1%sL1l1%TL1%Ul1%L1l1%L1%@
4963.3796875C1l1L1l1%TL1l1L1l1L1%Ul1L1%l1%L1l1%TL1l1%UL1%l1%ZL1@
4953.1209160736@%UL1l1%XL1l1%L1l1L1l1%UL1l1%ZL1l1%UL1l1%TL1l1%UL1@
4941.1053224266@%WL1l1%TL1l1%XL1l1L1%l1L1l1%TL1l1L1l1%VL1l1%L1%Vl1@
4929.7738398824C1l1%L1l1%L1l1%L1l1%WL1%Vl1%TL1%l1%TL1l1%L1l1%L1l1@
$$ plain form
4920.2679922648 31 0 31 0 0 0 31 0 0 0 0 31 0 31 0 0 0 0 0 0 0 0 31 0 31 0 0 0 0 31 0 31 31 0 0 0 0 31 0 31
4910.1601954413 31 0 0 0 31 0 31 0 0 31 31 0 31 0 0 0 0 0 0 0 31 0 31 0 0 0 0 0 0 31 31 0 31 31 31 31 31 31 0 0 0 0 0 0 0 31 31
4898.4267636912 0 0 31 0 31 0 0 31 31 0 0 0 31 31 0 0 0 31 0 31 31 31 0 0 31 31 31 31 0 31 31 0 0 31 0
4889.5738398824 31 0 31 31 0 31 0 31 31 0 0 0 31 0 31 31 0 31 0 0 0 0 31 31 0 31 31 0 31 0 31 31
4881.5738398824 31 0 0 31 0 31 31 31 31 31 31 0 31 31 31 0 31 31 31 0 31 0 31 31 0 31 0 0 31 0 0 0 31 31 0
4872.8209160736 31 31 0 0 0 31 31 0 31 31 0 31 0 0 0 31 0 0 0 31 0 0 0 0 31 31 31 31 31 31 0 0 31 31 31 31 0 31 0
4862.964093853 31 31 0 0 0 0 0 31 0 0 0 31 31 31 31 31 0 0 0 31 0 0 0 31 31 0 31 31 0 0 31 31 0 0 0 31 0 31 31
4853.2582462354 0 0 31 31 31 31 31 0 31 31 31 0 31 31 0 0 31 0 31 0 31 0 31 0 31 31 31 0 31 31 0 0 0 31 0
$$ packed form
4920.2679922648C1l1L1l1%TL1l1%UL1l1L1l1%YL1l1L1l1%UL1l1L1%l1%UL1l1C1
4910.1601954413C1l1%TL1l1L1l1%L1%l1L1l1%XL1l1L1l1%WL1%l1L1%Wl1%XL1C1
4898.4267636912@%L1l1L1l1%L1%l1%TL1%l1%TL1l1L1%Tl1%L1%Ul1L1%l1%L1@
4889.5738398824C1l1L1%l1L1l1L1%l1%TL1l1L1%l1L1l1%UL1%l1L1%l1L1l1L1C1
4881.5738398824C1l1%L1l1L1%Wl1L1%Tl1L1%Tl1L1l1L1%l1L1l1%L1l1%TL1%@
4872.8209160736C1%l1%TL1%l1L1%l1L1l1%TL1l1%TL1l1%UL1%Wl1%L1%Ul1L1@
4862.964093853C1%l1%VL1l1%TL1%Vl1%TL1l1%TL1%l1L1%l1%L1%l1%TL1l1L1C1
4853.2582462354@%L1%Vl1L1%Tl1L1%l1%L1l1L1l1L1l1L1l1L1%Tl1L1%l1%TL1@
$$ plain form
4844.4053224266 0 31 31 0 0 0 0 0 31 0 31 0 31 31 31 31 0 0 0 31 31 0 31 0 31 0 0 31 0 31 31 31 0 31 0
4835.6523986178 31 0 0 0 31 0 31 0 31 31 0 0 31 0 31 0 31 31 0 31 0 0 31 0 31 0 31 0 31
4828.4053224266 31 31 31 0 31 31 0 31 0 31 31 0 31 31 31 31 0 31 0 31 31 31 0 31 0 0 0 31 0 31 0 0
4820.3053224266 31 31 31 31 31 31 31 0 0 31 0 0 31 31 31 31 31 31 31 31 31 31 31 31 31 0 0 0 62 31 31 0 31 0 31 31 31 0 31 31 0 31 31 31 31 31 31 31 31 31 31 0 31 0
4806.8150684559 31 31 31 0 31 0 0 31 31 31 0 0 31 0 0 31 0 0 0 31 31 31 31 0 31 31 0 31 0 31 0 31 31
4798.464093853 0 0 31 31 31 31 31 31 31 31 31 31 31 31 31 0 31 31 31 31 31 0 0 31 31 31 31 31 31 31 0 0 31 0 0 31 31 0 31 31 31 31 31 31 31 31 0 31 0 0 31 0 31 31
4784.9738398824 31 31 31 31 0 31 0 31 31 0 0 0 62 31 31 31 31 31 0 0 31 31 31 31 31 31 31 31 31 0 31 0 31 0 31 31 0 31 0 31 31
4774.7150684559 31 31 31 31 0 31 31 0 31 31 0 31 0 31 0 31 0 31 31 0 31 31 0 31 0 31 31 31 31 31 31 31 31 31 0 31 31
$$ packed form
4844.4053224266@L1%l1%VL1l1L1l1L1%Ul1%TL1%l1L1l1L1l1%L1l1L1%Tl1L1@
4835.6523986178C1l1%TL1l1L1l1L1%l1%L1l1L1l1L1%l1L1l1%L1l1L1l1L1l1C1
4828.4053224266C1%Tl1L1%l1L1l1L1%l1L1%Ul1L1l1L1%Tl1L1l1%TL1l1L1l1@
4820.3053224266C1%Xl1%L1l1%L1%S2l1%TO2l1%l1L1l1L1%Tl1L1%l1L1%sl1L1@
4806.8150684559C1%Tl1L1l1%L1%Tl1%L1l1%L1l1%TL1%Ul1L1%l1L1l1L1l1L1C1
4798.464093853@%L1%S2l1L1%Vl1%L1%Xl1%L1l1%L1%l1L1%Yl1L1l1%L1l1L1C1
4784.9738398824C1%Ul1L1l1L1%l1%TO2l1%Vl1%L1%Zl1L1l1L1l1L1%l1L1l1L1C1
4774.7150684559C1%Ul1L1%l1L1%l1L1l1L1l1L1l1L1%l1L1%l1L1l1L1%Zl1L1C1
$$ plain form
4765.3601954413 31 31 31 31 31 0 31 31 31 31 31 31 31 0 0 0 0 31 31 31 31 0 0 31 31 31 0 31 31 0 31 31 0 31 31 31 0 31 31 31 31 31 31 31 31 31 31 31 62 31
4752.8738398824 31 31 31 31 31 31 31 31 31 31 0 31 31 31 31 0 0 31 31 0 31 31 31 0 31 31 0 31 0 0 31 0 0 31 31 31 31 31 31 31 31 0 0 0 31 31 0
4741.0092208383 31 31 31 31 31 31 31 0 31 0 31 31 31 31 31 31 31 31 31 31 31 31 0 31 31 31 31 31 31 31 31 31 31 31 31 0 31 31 31 31 31 31 31 31 31 31 31 62 31 31 31 31 31 31 31 31 31 31 31 31 31 31 31 31 31 31 31 31 31 31 31 31 31 31 31 31 31 31 31 31 31 31 31 31 31 31 31 31 31 31 31 31 31 31 31 31 31 31 31 31 31 0 31 62 31 31 31 62 31 31 31
4713.1757890882 31 31 31 31 31 31 31 31 31 31 31 31 31 31 31 31 31 31 0 31 0 31 31 31 31 31 31 31 31 62 31 31 31 31 31 31 31 31 31 62 31 31 31 31 62 31 31 31 31 31 31 31 0 31 31 31 31 31 31 31 31 31 31 31 31 31 31 31 31 31 31 31 31 31 62 31 31 31 31 31 31 31 31 31 31 31 31 31 31 31 31 0 31 31
4689.5777382941 62 31 31 31 31 31 0 0 62 31 31 31 62 31 31 62 31 31 31 31 31 31 62 62 31 31 62 31 31 31 31 31 62 62 31 31 0 62 31 0
4679.5699414706 31 31 31 31 31 31 62 31 31 31 31 62 31 31 31 31 31 31 31 31 31 31 31 31 31 62 31 31 31 62 62 31 31 31 62 31 31 31 62 31 31 31 31 31 31 31 31 31 31 31 62 31 0 31 31
4665.7796875 31 31 31 31 31 31 31 62 31 31 31 31 62 31 31 31 31 62 31 62 62 62 31 31 31 31 31 31 31 62 31 62 31 62 0 62 62 31 31 62 62 31 31
4654.9189668677 31 31 62 31 62 62 31 31 31 31 31 31 62 31 31 31 31 31 31 31 62 31 31 31 31 31 31 31 31 62 31 62 31 62 62 62 31 31 31 31 62 62 0 62 62 31
$$ packed form
4765.3601954413C1%Vl1L1%Xl1%UL1%Ul1%L1%Tl1L1%l1L1%l1L1%Tl1L1%S0L1C1
4752.8738398824C1%sl1L1%Ul1%L1%l1L1%Tl1L1%l1L1l1%L1l1%L1%Yl1%TL1%@
4741.0092208383C1%Xl1L1l1L1%S1l1L1%S1l1L1%S0L1l1%W2l1L1Tl1%TL1l1%C1
4713.1757890882C1%S7l1L1l1L1%YL1l1%ZL1l1%UL1l1%Xl1L1%T0L1l1%S5l1L1C1
4689.5777382941F2l1%Vl1%O2l1%TL1l1%L1l1%WL1%l1%L1l1%VL1%l1%l1O2l1@
4679.5699414706C1%WL1l1%UL1l1%S2L1l1%TL1%l1%TL1l1%TL1l1%S0L1l1TL1C1
4665.7796875C1%XL1l1%UL1l1%UL1l1L1%Tl1%XL1l1L1l1L1o2O2%l1%L1%l1C1
4654.9189668677C1%L1l1L1%l1%WL1l1%XL1l1%YL1l1L1l1L1%Tl1%UL1%o2O2%C1
$$ plain form
4643.4053224266 31 31 31 31 31 31 31 62 31 62 62 31 31 31 31 31 0 31 31 62 62 62 31 31 31 31 31 62 31 31 31 62 62 31 31 31 31 31 62 0 31 62 62 31 31
4632.0738398824 31 31 31 31 31 31 31 31 31 31 62 31 31 31 31 31 31 31 62 31 31 31 31 31 31 31 31 31 62 31 62 62 31 62 62 62 62 62 31 62 31 31 62 31 62 62 62 31 31 31 62 31
4619.0543478236 62 62 31 31 31 31 31 31 31 31 62 62 62 62 62 31 62 31 62 62 31 62 62 31 31 62 31 31 31 62 31 31 62 62 31 31 62 62 31 62
4608.9777382941 31 31 31 62 31 31 31 62 62 31 62 31 62 31 62 62 62 62 62 62 31 62 31 31 31 62 31 62 31 31 31 62 62 62 31 62
4599.9738398824 62 31 62 31 31 62 62 62 31 62 31 62 31 31 62 62 31 62 31 62 31 62 31 62 62 62 31 62 31 31
4592.4757890883 31 62 31 31 31 62 62 62 31 31 31 31 62 62 62 94 62 31 62 62 62 62 31 62 31 31 62 62 62 62 62 31 31 94 62 62 62 62 62 62 62 62 31 94
4581.464093853 31 62 62 62 62 62 62 62 62 31 31 62 31 62 31 62 62 62 62 62 62 31 62 62 62 62 62 62 31 62 94 31 62 62 62 31 62 62 62 31 31 31 62 62
4570.3523986178 31 62 62 62 62 62 62 62 62 31 62 62 62 62 31 62 62 62 62 62 62 62 62 62 31 62 62 31 62 62 62 31 62 31 62 62 62 62 62 94 62 62 62 62 62 62 62 62 62 62 31 62 62 62
$$ packed form
4643.4053224266C1%XL1l1L1%l1%Vl1L1%L1%Tl1%VL1l1%TL1%l1%VL1o2L1T%l1C1
4632.0738398824C1%sL1l1%XL1l1%ZL1l1L1%l1L1%Vl1L1l1%L1l1L1%Tl1%TL1C1
4619.0543478236F2%l1%YL1%Vl1L1l1L1%l1L1%l1%L1l1%TL1l1%L1%l1%L1%l1F2
4608.9777382941C1%TL1l1%TL1%l1L1l1L1l1L1%Wl1L1l1%TL1l1L1l1%TL1%Tl1F2
4599.9738398824F2l1L1l1%L1%Tl1L1l1L1l1%L1%l1L1l1L1l1L1l1L1%Tl1L1l1C1
4592.4757890883C1L1l1%TL1%Tl1%UL1%TL2l2l1L1%Ul1L1l1%L1%Vl1%O3l2%Yl1I4
4581.464093853C1L1%Yl1%L1l1L1l1L1%Wl1L1%Wl1L1L2o3L1%Tl1L1%Tl1%TL1F2
4570.3523986178C1L1%Yl1L1%Ul1L1%Zl1L1%l1L1%Tl1L1l1L1%VL2l2%sl1L1%F2
$$ plain form
4556.8621446471 62 62 62 62 62 31 62 31 62 62 62 62 62 31 31 62 62 62 62 62 62 62 31 62 62 62 62 31 62 62 62 62 62 62 62 62 62 94 62 62 94 62 62 62 94 62 62 62 62 62 62 62 62 62 62 62 62 62 62 62 31 94
4541.264093853 94 62 62 94 62 62 62 62 62 62 62 62 62 62 94 62 62 94 62 62 94 62 62 62 62 62 62 62 94 62 62 62 62 62 31 94 62 62 62 62 62 62 62 62 62 62 62 62 94 94 62 62 94 62
4527.6738398824 62 94 94 62 62 62 94 62 62 62 94 62 62 62 62 62 62 94 62 94 94 94 62 62 62 62 62 62 94 62 94 62 62 62 62 62 94 62 62 62 62 94 94
4516.9131192501 62 94 94 62 62 62 94 62 62 62 94 62 94 62 94 62 62 62 62 94 94 62 94 62 62 94 94 94 62 62 62 62 62 62 62 62 62 62 94 94 94
4506.6543478236 62 94 62 62 94 62 62 62 62 62 62 94 62 62 94 62 62 94 62 94 94 94 94 94 94 62 62 62 94 62 62 62 94 94 94 62 94 62 62
4496.8287128971 62 62 62 125 94 94 94 94 94 62 94 94 94 62 94 62 62 94 94 94 94 94 94 94 62 62 62 62 62 94 94 94 94 94 94 94 94 94 94 62 94 94 94 94 94 94 94 94 94 94 62 94 94 94 94 94 94 94 94 94 94 94 94 94 94 94 94 94 94 94 94 94 94 94 94 94 62 94
4477.2150684559 62 94 94 125 94 94 125 94 94 94 94 94 94 94 94 94 94 94 94 94 94 94 94 94 94 62 94 94 94 94 94 94 94 94 94 94 125 94 94 94 125 94 94 94 94 94 62 94 94 94 94 94 94 94 125 94 125 94 94 94
4462.1699414706 94 94 125 125 94 94 94 125 94 94 94 94 94 125 94 125 94 94 94 94 94 125 125 94 94 94 94 94 94 94 125 125 94 125 125 94 94 94 94 94 94 125 94 125 94
$$ packed form
4556.8621446471F2%Vl1L1l1L1%Vl1%L1%Xl1L1%Ul1L1%ZL2l2%L2l2%TL2l2%S4l1I4
4541.264093853I4l2%L2l2%sL2l2%L2l2%L2l2%XL2l2%Vl1O3l2%S1L2%l2%L2F2
4527.6738398824F2L2%l2%TL2l2%TL2l2%WL2l2L2%Tl2%WL2l2L2l2%VL2l2%UL2I4
4516.9131192501F2L2%l2%TL2l2%TL2l2L2l2L2l2%UL2%l2L2l2%L2%Tl2%sL2%I4
4506.6543478236F2L2l2%L2l2%WL2l2%L2l2%L2l2L2%Wl2%TL2l2%TL2%Tl2L2l2F2
4496.8287128971F2%TO3l1%Vl2L2%Tl2L2l2%L2%Xl2%VL2%sl2L2%sl2L2%T4l2I4
4477.2150684559F2L2%L1l1%L1l1%S7l2L2%sL1l1%TL1l1%Vl2L2%XL1l1L1l1%I4
4462.1699414706I4%L1%l1%TL1l1%VL1l1L1l1%VL1%l1%XL1%l1L1%l1%WL1l1L1I4
$$ plain form
4450.9072716324 94 94 125 94 125 94 125 94 94 125 94 125 94 125 125 94 94 94 125 125 125 94 125 94 125 94 94 125 125 94 94
4443.1582462354 125 94 94 94 94 94 125 125 125 125 125 94 125 94 125 125 94 125 94 125 94 125 125 125 125 94 125 94 94 125 125 94 125 125 94 94
4434.0543478236 125 94 125 125 125 125 125 94 125 125 94 125 125 125 125 125 94 94 125 125 125 125 125 125 125 125 125 125 125 125 125 94 125 125 94 125 94 125 125 125 94 125 156 125 125
4422.8228652794 125 125 125 125 125 125 94 125 125 125 125 125 125 125 125 125 156 125 125 125 125 125 125 125 156 125 125 125 156 156 156 125 156 125 125 125 125 125 125 156 125 125 156 125 125 125 125 156 156 125 125
4409.9543478236 125 125 125 156 125 94 125 156 125 125 94 125 156 125 125 156 125 125 156 156 156 156 125 125 125 156 156 156 156 125 125 125 156 125 125 156
4400.9504494119 156 125 125 156 125 125 125 125 156 125 156 125 125 156 125 125 125 156 156 125 156 125 125 156 156 125 156 156 156 156 156 156 156 156 156 125 125 156 156
4391.2248144853 125 156 156 125 156 156 156 156 156 156 156 125 156 156 156 156 125 156 125 156 125 156 156 156 156 156 156 125 156 156 156 156 156 156 156 156 125 156 156 156 156 156 156 156 156 156 156 156 156 156 156 156 156 156 156 156 156 156 156 187 156 156 156
4375.3757890883 156 156 156 156 156 187 156 187 125 187 187 156 187 156 187 156 156 156 156 156 156 156 156 156 156 187 156 156 156 156 187 187 156 156 156 156 156 156 156 187 156 187 187 187 156 156
$$ packed form
4450.9072716324I4%L1l1L1l1L1l1%L1l1L1l1L1%l1%TL1%Tl1L1l1L1l1%L1%l1I4
4443.1582462354A25l1%VL1%Vl1L1l1L1%l1L1l1L1l1L1%Ul1L1l1%L1%l1L1%l1I4
4434.0543478236A25l1L1%Vl1L1%l1L1%Vl1%L1%S2l1L1%l1L1l1L1%Tl1L1Tl1A25
4422.8228652794A25%Wl1L1%ZL1l1%XL1l1%TL1%Tl1L1l1%WL1l1%L1l1%UL1%l1A25
4409.9543478236A25%TL1l1TL1Tl1%l1L1Tl1%L1l1%L1%Ul1%TL1%Ul1%TL1l1%A56
4400.9504494119A56l1%L1l1%UL1l1L1l1%L1l1%TL1%l1L1l1%L1%l1L1%Zl1%L1A56
4391.2248144853A25L1%l1L1%Xl1L1%Ul1L1l1L1l1L1%Wl1L1%Yl1L1%T1L1l1%A56
4375.3757890883A56%VL1l1L1o2O2%l1L1l1L1l1%sL1l1%UL1%l1%XL1l1L1%Tl1A56
$$ plain form
4363.8621446471 156 156 187 187 125 156 156 156 187 156 187 187 156 156 156 187 156 156 187 156 187 187 187 156 187 156 187 187 187 187 156 187 156
4355.5111700442 187 187 156 156 156 187 187 156 156 187 156 187 156 187 187 187 187 187 187 187 187 156 187 187 187 187 187 156 187 187 187 219 187 187 187 187 187 187 187 156 187 187 187 187 187 187 187 187 187 187 187 187 219 187
4342.0209160736 187 219 219 187 187 187 187 219 187 219 187 187 219 187 187 219 187 219 187 187 187 219 219 187 187 187 187 219 219 187 219 187 219
4333.6699414706 187 187 219 187 187 219 187 187 187 187 219 187 219 187 187 187 187 187 219 187 219 219 219 187 187 187 219 219 219 219 219 219 219 219 219 219 219 187 219 219 219 219 219 219 219 219 219 219 219 219 219 219 219 219 219 219 219 250 219
4318.9248144853 219 250 250 219 219 250 219 187 219 219 187 219 250 219 219 219 219 219 219 219 219 219 219 219 187 219 219 219 250 219 219 219 219 219 219 219 219 219 219 219 219 250 250 250 250 219 219 219 219 219 219 250 219
4305.5543478236 219 219 219 219 219 219 250 250 219 219 250 250 219 250 250 250 219 219 219 219 250 219 250 250 219 250 250 281 250 250 250 250 250 250 219 250 281 250 250 250
4295.5777382941 219 250 250 250 250 250 281 219 250 250 250 219 281 250 250 250 219 281 250 250 250 281 250 250 250 250 250 250 250 281 250 250 250 281 250 250 250 250 281 281
4285.4699414706 250 250 250 250 250 250 250 250 250 250 250 250 250 281 250 281 250 250 281 250 250 250 250 250 250 281 281 281 250 250 250 250 281 250 250 281 250 250 281 250 250 250 281 281 281 250 281
$$ packed form
4363.8621446471A56%L1%o2L1%TL1l1L1%l1%TL1l1%L1l1L1%Tl1L1l1L1%Ul1L1A56
4355.5111700442A87%l1%TL1%l1%L1l1L1l1L1%Yl1L1%Vl1L1%TL2l2%Xl1L1%S1L2A87
4342.0209160736A87L2%l2%UL2l2L2l2%L2l2%L2l2L2l2%TL2%l2%UL2%l2L2l2B19
4333.6699414706A87%L2l2%L2l2%UL2l2L2l2%VL2l2L2%Tl2%TL2%S0l2L2%S8L1B19
4318.9248144853B19L1%l1%L1l1l2L2%l2L2L1l1%S0l2L2%TL1l1%S1L1%Ul1%WL1B19
4305.5543478236B19%WL1%l1%L1%l1L1%Tl1%UL1l1L1%l1L1%L1l1%Wl1L1Tl1%B50
4295.5777382941B19L1%VL1o2L1%Tl1O2l1%Tl1O2l1%TL1l1%XL1l1%TL1l1%UL1B81
4285.4699414706B50%S2L1l1L1l1%L1l1%WL1%Tl1%UL1l1%L1l1%L1l1%TL1%Tl1B81
$$ plain form
4273.7562970295 281 250 281 281 281 281 250 250 250 250 250 281 281 250 281 281 250 250 281 281 250 250 250 281 281 281 281 250 281 281 281 281 281 281 281 281 281 281 281 250 281 281 250 281 281
4262.4248144853 281 281 281 250 250 250 281 281 281 281 281 281 281 281 281 250 281 281 281 281 281 281 312 250 281 281 281 250 281 281 281 281 281 281 281 281 281 281 281 312 312 281 281 281 281 281 281 281 281 281 281 281 281 281 281 312 281 281 281 281 312 312
4246.8757890883 312 281 281 281 312 281 281 281 312 312 281 312 312 281 312 312 281 281 281 312 281 312 312 312 312 281 281 312 312 281 312 312 312 281 312
4238.1170176618 281 281 281 281 281 281 281 312 312 312 281 312 281 281 344 312 312 281 281 312 312 281 312 312 312 312 312 281 281 281 281 312 312 281 312 312 312 312 312 312 281 281 281 312 281
4226.8228652794 312 312 312 312 312 312 281 312 312 281 312 312 312 312 312 281 312 312 312 312 312 312 312 312 312 312 312 312 312 312 312 312 281 281 312 312 312 312 312 312 312 312 344 312 312 312 312 312 312 312 312 312 312 312 312 281 312 312 281 312 312 312 312 312 312 312 312 312 312 312 312 312 312 281 312
4207.9170176618 281 312 312 312 281 312 312 312 312 344 312 312 312 312 312 312 312 312 312 312 312 281 312 312 312 312 312 312 312 312 312 312 312 312 312 312 312 312 312 312 281 312 344 281 312 312 312 344 312 344 281 281 281 312 312
4194.2072716324 312 312 312 281 312 312 312 312 312 312 312 312 312 312 312 312 312 281 312 312 312 312 312 312 344 312 281 312 312 312 312 312 312 312 312 312 312 312 312 312 312 312 312 312 312 312 312 312 312 312 281 312 312 312 312 312 312 312 281 312 312 312 312 312 312 312 312 281 312 281 281 312 312
4175.8738398824 312 312 312 281 281 312 312 281 312 312 312 312 312 312 312 312 312 312 312 312 312 312 312 250 312 312 312 312 281 312 312 281 312 281 281 312 312 281 312 281 312 312 281 312
$$ packed form
4273.7562970295B81l1L1%Ul1%VL1%l1L1%l1%L1%l1%TL1%Ul1L1%S0l1L1%l1L1B81
4262.4248144853B81%Tl1%TL1%Zl1L1%WL1o2L1%Tl1L1%S0L1%l1%S3L1l1%UL1C12
4246.8757890883C12l1%TL1l1%TL1%l1L1%l1L1%l1%TL1l1L1%Ul1%L1%l1L1%Tl1C12
4238.1170176618B81%XL1%Tl1L1l1%O3l2%l1%L1%l1L1%Vl1%UL1%l1L1%Wl1%TL1B81
4226.8228652794C12%Wl1L1%l1L1%Vl1L1%S5l1%L1%YL2l2%S1l1L1%l1L1%S3l1C12
4207.9170176618B81L1%Tl1L1%UL2l2%S0l1L1%S7l1L1L2o3L1%TL2l2L2o3%TL1C12
4194.2072716324C12%Tl1L1%S2l1L1%WL2l2l1L1%T2l1L1%Xl1L1%Yl1L1l1%L1C12
4175.8738398824C12%Tl1%L1%l1L1%S4o2O2%Ul1L1%l1L1l1%L1%l1L1l1L1%l1C12
$$ plain form
4164.7777382941 312 312 281 312 312 281 281 281 312 312 312 281 312 281 312 312 312 281 312 312 312 312 312 281 281 281 281 312 312 281 281 281 281 281 281 281 281 312 312 312 281 312
4154.2601954413 312 281 281 281 312 312 312 281 281 281 312 281 312 281 312 281 312 281 281 281 281 281 312 312 281 281 281 281 281 281 281 281 281 281 281 281 281 281 281 281 281 281 312 281 281 281 312 281 281
4141.9170176618 281 312 312 281 312 281 312 281 281 312 281 281 281 281 281 250 281 281 281 281 281 281 281 281 281 281 281 281 250 281 281 250 281 281 281 281 281 250 281 281 281 250 281 281
4130.9523986178 250 281 250 281 281 250 281 281 250 281 281 281 281 312 281 281 281 281 312 281 250 250 281 250 250 281 281 250 281 281 281 250 281 250
4122.4014240148 281 281 281 281 250 250 281 250 281 281 250 281 281 281 281 250 250 250 250 250 281 250 250 281 250 250 281 250 250 250 281 250 250 281 250 250
4113.3777382941 250 250 281 250 281 250 250 250 250 250 250 250 250 250 250 219 250 250 250 250 250 281 250 250 250 250 250 281 250 250 281 250 250 250 250 250 250 219 250 250 250 250 250 250 250 250 250 250 250 250 219 219 250 250 250
4099.5053224266 250 250 250 250 219 250 250 250 219 219 219 250 219 250 250 250 250 250 219 250 219 219 219 250 250 250 250 250 219 250 250 219 250 219 219 250 250 250
4089.9994748089 250 250 250 250 250 250 250 219 219 250 219 250 219 219 219 219 219 219 219 219 250 250 219 219 219 219 219 250 219 219 219 219 219 250 219 219 219 219 219 219 219 219 219 219 219 219 187 250 219 219 219 219 219 219 250 219 219
$$ packed form
4164.7777382941C12%l1L1%l1%TL1%Tl1L1l1L1%Tl1L1%Vl1%UL1%l1%YL1%Tl1C12
4154.2601954413C12l1%TL1%Tl1%TL1l1L1l1L1l1L1l1%VL1%l1%S7L1l1%TL1l1B81
4141.9170176618B81L1%l1L1l1L1l1%L1l1%Vl1L1%S1l1L1%l1L1%Vl1L1%Tl1L1B81
4130.9523986178B50L1l1L1%l1L1%l1L1%UL1l1%UL1l1T%L1l1%L1%l1L1%Tl1L1B50
4122.4014240148B81%Ul1%L1l1L1%l1L1%Ul1%VL1l1%L1l1%L1l1%TL1l1%L1l1B50
4113.3777382941B50%L1l1L1l1%sl1L1%VL1l1%VL1l1%L1l1%Wl1L1%S1l1%L1%B50
4099.5053224266B50%Ul1L1%Tl1%TL1l1L1%Vl1L1l1%TL1%Vl1L1%l1L1l1%L1%B50
4089.9994748089B50%Xl1%L1l1L1l1%YL1%l1%VL1l1%VL1l1%S1l2O3l1%WL1l1B19
$$ plain form
4075.6562970295 219 219 219 219 219 219 187 219 219 219 219 219 219 219 219 219 219 219 219 187 219 219 219 219 219 219 219 219 219 219 219 187 219 187 187 219 219 219 187 219 187 187 219 219 219 187 187 219 219 187 219 187
4062.6679922648 219 187 187 219 187 187 219 187 187 187 219 187 219 219 187 187 187 187 187 187 219 187 187 187 187 187 187 219 219 187 187 219 187 219 187 187 187 219 219
4052.8111700442 187 219 187 219 187 219 219 219 187 187 187 219 187 187 187 187 187 187 187 187 187 187 187 187 187 187 187 187 219 187 187 219 187 187 187 187 187 187 187 187 187 187 187 187 187 187 187 187 187 187 156 187 187 187 187 187 156 187 156 156
4037.8150684559 156 156 156 187 125 187 156 156 156 156 187 187 187 187 187 156 156 187 187 187 187 187 156 156 187 156 156 156 187 156 156 156 156 156 187 156 156 156 187 187 156
4027.5562970295 156 156 187 156 156 156 187 156 156 156 187 156 156 156 156 156 187 187 156 156 156 156 156 156 156 156 187 125 156 156 156 156 156 125 156 156 156 156 156 156 156 156 156 187 187 187 156 156 156
4015.2209160736 156 156 156 156 156 156 156 156 156 156 156 156 156 156 156 187 187 156 156 125 156 156 156 187 125 156 156 125 156 156 125 156 125 125 125 156 156 156 156 156 156 156 156 156 125 156 156 125 156 156
4002.7033732207 125 156 125 125 125 156 125 156 156 156 125 156 156 156 156 156 125 156 156 125 156 156 125 156 156 156 156 156 156 125 156 156 156 156 125 125 156 156
3993.1287128971 125 125 156 125 156 156 156 125 125 125 125 125 125 125 125 156 156 125 125 125 156 94 125 125 125 156 156 125 125 156 125 125 125 156 125 125 125 125 125 156 156
$$ packed form
4075.6562970295B19%Wl2L2%S1l2L2%S0l2L2l2%L2%Tl2L2l2%L2%Tl2%L2%l2L2A87
4062.6679922648B19l2%L2l2%L2l2%TL2l2L2%l2%WL2l2%WL2%l2%L2l2L2l2%TL2B19
4052.8111700442A87L2l2L2l2L2%Tl2%TL2l2%S5L2l2%L2l2%S7l1L1%Vl1L1l1A56
4037.8150684559A56%TL1o2O2l1%UL1%Vl1%L1%Vl1%L1l1%TL1l1%VL1l1%TL1%A56
4027.5562970295A56%L1l1%TL1l1%TL1l1%VL1%l1%YL1o2L1%Vl1L1%ZL1%Tl1%A56
4015.2209160736A56%S4L1%l1%l1L1%TL1o2L1%l1L1%l1L1l1%TL1%Zl1L1%l1L1A56
4002.7033732207A25L1l1%TL1l1L1%Tl1L1%Vl1L1%l1L1%l1L1%Wl1L1%Ul1%L1A56
3993.1287128971A25%L1l1L1%Tl1%YL1%l1%TL1o2L1%TL1%l1%L1l1%TL1l1%VL1A56
$$ plain form
3982.8699414706 125 125 125 125 125 125 125 156 125 125 156 125 125 125 125 125 156 125 125 125 125 125 125 94 125 94 125 125 125 125 125 125 125 125 125 125 94 125 125 125 125 125 125 94 125 156 125 125 125 125 125 125 125 125 94 125 125
3968.5267636912 156 125 125 125 125 125 125 125 125 125 125 125 125 125 125 125 125 125 125 94 125 125 125 125 94 125 125 125 94 125 125 94 125 125 125 94 94 94 125 125 125 94 125 125 94 94 125 94 125
3956.2601954413 125 125 94 125 156 125 125 94 125 94 94 125 94 125 125 125 125 125 94 94 125 94 125 94 125 125 94 125 94 125 125 125
3948.1601954413 94 94 125 125 125 125 125 94 94 125 125 94 125 94 125 125 125 94 94 125 94 125 94 94 125 125 94 94 94 125 94 125 94 125
3939.6582462354 94 94 125 94 94 94 94 125 125 94 125 94 94 94 125 94 94 94 94 94 125 62 125 94 125 125 94 94 94 94 94 94 94 94 125 94 94 94 94 125 94 94
3929.0796875 94 94 94 94 94 94 94 94 94 94 94 94 94 94 94 94 125 94 125 94 94 94 94 125 94 94 94 94 94 62 94 94 94 94 94 94 94 94 94 94 94 94 94 94 94 94 94 94 94 62 94 94 94 94 94 94 94 94 94 125 94 94 94 94 94 94 94 94 94 94 94 94 94 94 94 62 94 94 94 94 94 62 94 62
3908.0601954413 94 62 94 94 94 94 94 94 94 94 94 94 94 94 94 62 94 62 62 62 62 94 94 62 94 62 94 94 62 94 94 94 94 94 94 94 94 62 94 94 62 62 94 94 94 62 94 94
3895.9757890883 94 94 94 62 94 62 94 62 94 94 94 94 94 94 62 62 94 62 62 94 94 94 62 62 62 62 62 94 94 62 62 62 94 62 62 62 94 94 62
$$ packed form
3982.8699414706A25%XL1l1%L1l1%VL1l1%Wl1L1l1L1%sl1L1%Wl1L1Tl1%Yl1L1A25
3968.5267636912A56l1%S7l1L1%Ul1L1%Tl1L1%l1L1%Tl1%TL1%Tl1L1%l1%L1l1A25
3956.2601954413A25%l1L1Tl1%l1L1l1%L1l1L1%Vl1%L1l1L1l1L1%l1L1l1L1%A25
3948.1601954413I4%L1%Vl1%L1%l1L1l1L1%Tl1%L1l1L1l1%L1%l1%TL1l1L1l1A25
3939.6582462354I4%L1l1%UL1%l1L1l1%TL1l1%VL1o3O3l1L1%l1%YL1l1%UL1l1I4
3929.0796875I4%S5L1l1L1l1%UL1l1%Vl2L2%S8l2L2%ZL1l1%S4l2L2%Vl2L2F2
3908.0601954413I4l2L2%S2l2L2l2%UL2%l2L2l2L2%l2L2%Yl2L2%l2%L2%Tl2L2I4
3895.9757890883I4%Tl2L2l2L2l2L2%Wl2%L2l2%L2%Tl2%VL2%l2%TL2l2%TL2%F2
$$ plain form
3886.1699414706 94 62 94 62 94 94 94 62 94 94 94 62 62 62 62 62 94 94 62 94 62 94 62 62 94 94 62 62 62 94 94 62 62 62 94 94
3877.1660430589 62 62 62 62 62 94 94 62 62 94 94 62 62 62 62 62 62 94 62 62 94 94 94 62 62 62 62 94 62 62 94 62 62 62 62 62 94 62 62 62 62 62 94 62 62
3865.9033732207 94 62 94 62 94 94 62 94 62 62 62 62 62 94 62 94 94 62 62 31 62 62 62 62 94 94 62 62 94 62 62 62 62 94 62 62
3856.7994748089 94 62 62 62 62 62 62 62 62 62 62 94 62 62 62 94 62 62 62 62 62 62 62 94 62 62 62 94 94 62 62 62 62 62 62 62 62 31 62 62 94 62 62 62 62 62 62 62 62 62 62 62 62 62 62 62 62 62 62 62 31 62 62 94 62
3840.5796875 62 62 31 94 62 62 62 62 62 62 62 62 62 62 62 62 62 62 62 62 62 62 62 62 62 62 62 62 62 62 62 62 62 62 62 62 62 62 62 62 62 62 62 62 62 62 62 62 62 62 62 62 62 62 62 62 31 62 62 62 62 94 62 62 62 62 31 62 31 62 62 62 62 62 62 62 62 31 31 62 62 31 31 62 62 31 62 62
3818.4562970295 31 62 31 31 62 31 31 62 62 62 62 62 62 62 62 62 62 62 62 31 62 31 62 62 62 62 31 62 31 31 31 62 62 62 62 62 31 62 62 94 31 62 31
3807.6267636912 62 62 62 62 31 62 94 62 62 31 62 62 62 62 62 31 31 62 31 62 31 62 31 62 62 62 62 62 62 62 62 62 62 62 31 62 62 31 62 31 62
3797.3679922648 62 62 62 31 31 31 62 31 31 62 31 62 62 62 62 62 31 62 31 62 31 62 62 62 31 62 62 62 31 62 62 31 62 62
$$ packed form
3886.1699414706I4l2L2l2L2%Tl2L2%Tl2%VL2%l2L2l2L2l2%L2%l2%TL2%l2%TL2I4
3877.1660430589F2%VL2%l2%L2%l2%WL2l2%L2%Tl2%UL2l2%L2l2%VL2l2%VL2l2F2
3865.9033732207I4l2L2l2L2%l2L2l2%VL2l2L2%l2%l1L1%UL2%l2%L2l2%UL2l2F2
3856.7994748089I4l2%sL2l2%TL2l2%XL2l2%TL2%l2%Yl1L1%L2l2%S8l1L1%L2F2
3840.5796875F2%l1O3l2%W1l1L1%UL2l2%Ul1L1l1L1%Yl1%L1%l1%L1%l1L1F2
3818.4562970295C1L1l1%L1l1%L1%S1l1L1l1L1%Ul1L1l1%TL1%Vl1L1%L2o3L1C1
3807.6267636912F2%Ul1L1L2l2%l1L1%Vl1%L1l1L1l1L1l1L1%S0l1L1%l1L1l1F2
3797.3679922648F2%Tl1%TL1l1%L1l1L1%Vl1L1l1L1l1L1%Tl1L1%Tl1L1%l1L1F2
$$ plain form
3788.8660430589 31 62 62 31 31 31 62 62 31 31 62 31 62 62 62 31 62 31 62 31 62 62 62 62 31 31 31 31 62 62 31 62 31 62
3780.264093853 62 31 62 31 31 31 31 62 31 31 31 31 62 31 62 31 31 62 31 31 62 62 62 31 31 31 62 62 31 62 31 31 31 62 31
3771.5111700442 62 62 62 31 31 0 31 62 62 31 31 31 31 31 62 31 62 31 31 62 31 62 62 31 31 62 31 62 62 62 31 31 31 31 62 31
3762.5072716324 31 62 62 62 31 31 62 62 31 31 62 31 31 31 31 31 31 31 31 31 31 31 62 31 31 31 31 31 31 62 31 62 31 31 62 62 31 31 31 62 62 62 31 62
3751.4267636912 31 31 31 62 62 62 62 31 62 62 31 31 62 31 62 31 31 31 62 62 62 62 62 31 31 31 62 31 62 31 31 62 31 31 31 31 31 31 31 62 31
3741.1679922648 31 62 62 31 31 31 62 62 62 62 31 62 31 31 62 31 62 62 31 31 31 31 62 31 62 31 31 62 31 31 31 31 31 31 31 31 31 62 31 31
3731.0601954413 62 31 31 31 62 31 31 31 0 62 31 31 62 31 62 31 31 31 62 62 31 31 31 31 31 62 31 31 31 31 31 31 31 31 31 31 62 62 62 31 31 31 62 62
3720.0796875 31 31 31 31 31 31 31 31 31 31 31 31 31 31 31 31 62 31 31 31 31 31 62 31 31 31 31 31 31 31 31 31 31 31 31 31 31 62 31 31 31 31 62 31 31 31 31 31 31 31 31 62 31 31 31 62 31 31 31 31 31 31 31 62 31 31 31 31 31 31 31 31 31 31 31 62 31
$$ packed form
3788.8660430589C1L1%l1%TL1%l1%L1l1L1%Tl1L1l1L1l1L1%Ul1%UL1%l1L1l1F2
3780.264093853F2l1L1l1%UL1l1%UL1l1L1l1%L1l1%L1%Tl1%TL1%l1L1l1%TL1C1
3771.5111700442F2%Tl1%l1L1T%l1%VL1l1L1l1%L1l1L1%l1%L1l1L1%Tl1%UL1C1
3762.5072716324C1L1%Tl1%L1%l1%L1l1%S0L1l1%WL1l1L1l1%L1%l1%TL1%Tl1F2
3751.4267636912C1%TL1%Ul1L1%l1%L1l1L1l1%TL1%Vl1%TL1l1L1l1%L1l1%XL1C1
3741.1679922648C1L1%l1%TL1%Ul1L1l1%L1l1L1%l1%UL1l1L1l1%L1l1%ZL1l1C1
3731.0601954413F2l1%TL1l1%Tl1O2l1%L1l1L1l1%TL1%l1%VL1l1%sL1%Tl1%TL1F2
3720.0796875C1%S5L1l1%VL1l1%S3L1l1%UL1l1%YL1l1%TL1l1%XL1l1%S0L1C1
$$ plain form
3700.7170176618 31 31 31 31 31 31 62 62 62 31 62 31 31 31 31 31 31 31 31 31 31 0 31 31 62 31 31 31 31 31 31 31 31 31 31 31 31 31 31 31 31 31 31 62 31 31 31 31 31 31 62 31 31 31 31 31 62 31 31 0 31 31 31
3684.9189668677 31 31 31 31 62 31 31 31 31 31 31 31 31 31 31 31 31 31 31 31 31 31 31 31 31 0 31 31 62 31 31 31 31 31 31 31 31 31 31 31 0 0 31 0 0 31 31 31 31 62 31 31 31 0 31 31 0 31 62
3670.0738398824 31 31 31 31 31 31 31 31 31 62 31 31 31 31 0 31 31 31 31 31 31 31 31 31 0 31 31 0 31 31 31 31 31 31 0 31 31 0 31 31 31 31 31 31 31 31 31 31 31 31 31 31 31 31 31 31 31 31 31 31 31 31 31 31 31 31 31 31 31 31 31 31 31 31 31 31 31 31 31 31 31 31 31 31 31 31 31 31 31 31 0 31 31 31 31 31 31 31 31 31 62 31 31 31
3644.0660430589 31 31 0 31 31 31 31 31 31 62 31 31 31 31 62 31 31 31 31 31 62 31 31 31 31 31 31 0 31 31 0 31 0 31 31 31 31 31 31 31 31 31 31 31 0 31 31 31 31 31 31 0 0
3630.7267636912 0 31 31 31 0 31 31 0 31 31 31 31 31 31 31 31 31 31 31 31 31 31 0 31 62 31 31 31 31 31 31 31 31 0 0 31 31 31 31 31 62 31 31 31 31 31 0 0 31 31 31 31 31 31 31 31 31 31 31 31 31 31 31 0 31 31
3614.1248144853 31 0 0 31 31 31 31 31 31 31 31 31 31 31 0 31 31 0 31 31 31 31 0 31 0 0 31 31 31 31 0 31 31 31 31 31 31 0 31 31 31 31 31 0 31 31 31 31 31 0 31
3601.3562970295 0 31 31 31 0 31 31 31 31 31 31 31 31 31 31 31 31 0 62 31 31 31 0 31 31 31 31 0 0 31 0 31 31 31 31 0 31 31 31 31 31 0 31 31 31 31 0 0
3589.2718906765 31 31 31 31 0 31 31 31 0 31 31 31 31 0 0 31 31 31 31 0 0 31 31 31 31 31 31 31 0 31 0 31 31 0 31 0 31 31 0 31
$$ packed form
3700.7170176618C1%WL1%Tl1L1l1%sl1L1%L1l1%S7L1l1%WL1l1%VL1l1%l1L1%C1
3684.9189668677C1%UL1l1%S9l1L1%L1l1%S0l1%L1l1%L1%UL1l1%Tl1L1%l1L1F2
3670.0738398824C1%ZL1l1%Ul1L1%Zl1L1%l1L1%Wl1L1%l1L1%W1l1L1%ZL1l1%C1
3644.0660430589C1%l1L1%WL1l1%UL1l1%VL1l1%Wl1L1%l1L1l1L1%S0l1L1%Wl1@
3630.7267636912@L1%Tl1L1%l1L1%S3l1L1Tl1%Yl1%L1%VL1l1%Vl1%L1%S4l1L1C1
3614.1248144853C1l1%L1%S0l1L1%l1L1%Ul1L1l1%L1%Ul1L1%Wl1L1%Vl1L1%Vl1C1
3601.3562970295@L1%Tl1L1%S1l1O2l1%Tl1L1%Ul1%L1l1L1%Ul1L1%Vl1L1%Ul1@
3589.2718906765C1%Ul1L1%Tl1L1%Ul1%L1%Ul1%L1%Xl1L1l1L1%l1L1l1L1%l1C1
$$ plain form
3579.264093853 31 31 0 0 0 31 31 31 31 31 31 31 31 31 0 0 31 31 31 31 62 31 31 31 31 31 0 0 0 0 31 31 31 31 0 31 0 0 31 0 31 31 0 0 31 0
3567.7504494119 31 31 31 31 0 31 0 31 31 0 0 0 31 31 0 31 31 31 0 31 31 31 0 0 0 0 31 31 31 31 31 31 31 0 0 31 31 31 31 31 31 31 31 31 31 0 31 0
3555.6660430589 0 31 0 31 0 0 31 -31 31 0 31 0 31 31 31 31 0 31 0 31 31 0 31 0 0 31 31 0 31 0 0
3547.9170176618 31 0 0 0 31 31 0 31 31 0 0 31 0 31 31 31 0 31 31 31 31 0 31 31 0 31 31 0 31 0 31 0 0
3539.5660430589 0 0 31 31 0 0 31 31 31 31 0 0 0 0 0 0 0 0 31 0 0 0 31 0 31 31 0 0 31 0 0 31 31 31 31 31 0 31 0 31 0 0
3529.0562970295 31 0 31 0 0 31 31 31 31 0 0 31 31 0 31 31 0 31 31 31 31 31 0 31 31 0 0 31 31 31 31 31 31 31 31 31 31 0 0 31 31 31 0 0
3518.0757890883 0 31 31 31 31 0 31 0 0 31 31 31 31 31 31 31 0 0 0 31 31 0 31 31 31 0 0 31 31 31 31 31 0 31 31 31 0 0 0 31 31 31 31 0 0
3506.7131192501 31 0 0 31 0 31 31 0 31 0 0 0 0 31 31 31 31 31 31 0 31 0 0 0 31 31 31 0 0 31 31 0 31 0 31 31
$$ packed form
3579.264093853C1%l1%TL1%Zl1%L1%UL1l1%Vl1%UL1%Ul1L1l1%L1l1L1%l1%L1@
3567.7504494119C1%Ul1L1l1L1%l1%TL1%l1L1%Tl1L1%Tl1%UL1%Xl1%L1%sl1L1@
3555.6660430589@L1l1L1l1%L1o2O2l1L1l1L1%Ul1L1l1L1%l1L1l1%L1%l1L1l1@
3547.9170176618C1l1%TL1%l1L1%l1%L1l1L1%Tl1L1%Ul1L1%l1L1%l1L1l1L1l1@
3539.5660430589@%L1%l1%L1%Ul1%YL1l1%TL1l1L1%l1%L1l1%L1%Vl1L1l1L1l1@
3529.0562970295C1l1L1l1%L1%Ul1%L1%l1L1%l1L1%Vl1L1%l1%L1%sl1%L1%Tl1@
3518.0757890883@L1%Ul1L1l1%L1%Xl1%TL1%l1L1%Tl1%L1%Vl1L1%Tl1%TL1%Ul1@
3506.7131192501C1l1%L1l1L1%l1L1l1%UL1%Wl1L1l1%TL1%Tl1%L1%l1L1l1L1C1
$$ plain form
3497.6601954413 0 31 31 0 31 31 31 31 0 31 0 0 31 0 0 31 0 31 0 0 0 0 0 0 31 31 31 31 0 0 0 0 0 0 0 31 31 31 31 0 31 31 0 31
3486.6796875 0 0 31 0 0 0 0 31 0 31 0 0 0 0 0 31 0 0 0 0 31 31 31 31 0 31 0 0 31 31 0 0 31 31 31 0 0 31 31
3476.8228652794 31 0 0 0 31 0 0 31 0 0 31 31 31 31 0 31 0 31 31 31 31 0 31 31 0 0 0 0 31 0 31 31 0 31 0
3468.0699414706 0 31 31 0 0 62 31 0 31 0 31 0 0 0 0 -31 0 0 0 31 0 31 0 0 31 0 0 0 31 31 31 31 31 0 31 0
3459.0660430589 0 0 31 0 31 0 0 31 0 0 0 0 31 31 31 0 0 31 0 0 31 31 0 31 0 0 0 0 0 0 0 31 31 31 0 31 31 0 0
3449.3092208383 31 31 31 31 0 0 0 0 0 0 31 31 31 0 0 31 0 0 31 0 0 0 31 31 0 31 0 0 0 0 0 31 0 0 0 0 0 31 0 31 0 0
3438.6994748089 0 31 31 0 0 0 0 0 31 0 0 31 0 0 0 31 0 0 0 0 31 0 0 31 0 0 31 0 0 0 31 0 0 31 0 0
3429.7267636912 0 0 0 0 0 0 0 31 0 0 31 0 0 0 0 0 0 0 0 31 31 0 31 0 0 0 0 31 0 0 0 0 31 0 0 0 31 0 0 0 0 0 31 0 0 0 0 0 0 0 31 31
$$ packed form
3497.6601954413@L1%l1L1%Ul1L1l1%L1l1%L1l1L1l1%WL1%Ul1%XL1%Ul1L1%l1C1
3486.6796875@%L1l1%UL1l1L1l1%VL1l1%UL1%Ul1L1l1%L1%l1%L1%Tl1%L1C1
3476.8228652794C1l1%TL1l1%L1l1%L1%Ul1L1l1L1%Ul1L1%l1%UL1l1L1%l1L1@
3468.0699414706@L1%l1%O2l1TL1l1L1l1%Ul1L1%TL1l1L1l1%L1l1%TL1%Vl1L1@
3459.0660430589@%L1l1L1l1%L1l1%UL1%Tl1%L1l1%L1%l1L1l1%XL1%Tl1L1%l1@
3449.3092208383C1%Ul1%WL1%Tl1%L1l1%L1l1%TL1%l1L1l1%VL1l1%VL1l1L1l1@
3438.6994748089@L1%l1%VL1l1%L1l1%TL1l1%UL1l1%L1l1%L1l1%TL1l1%L1l1@
3429.7267636912@%XL1l1%L1l1%YL1%l1L1l1%UL1l1%UL1l1%TL1l1%VL1l1%XL1C1
$$ plain form
3416.6072716324 0 31 0 0 0 0 0 0 31 0 31 0 31 31 0 31 0 0 0 0 31 0 0 0 0 31 0 0 0 31 0 -31 0 0 0 31 31 0
3407.1014240148 0 31 0 31 0 0 31 0 0 31 0 0 0 31 31 0 0 0 0 0 0 0 31 -31 0 0 0 31 0 31 0 0 0 0 -31 0 0
3397.7777382941 0 0 0 0 0 31 0 0 31 0 31 0 0 0 0 0 0 0 31 0 31 31 0 0 0 0 31 0 0 0 0 31 0 0 0 0 31 0 0 0 0 0 0 0 0 31 0 0
3385.7621446471 0 0 31 0 0 0 31 0 0 0 31 0 0 0 31 0 31 0 0 31 0 31 0 31 0 0 0 0 0 0 0 0 31 0 0 0 0 0 0 0 0 0 31 0
3374.7504494119 31 31 0 0 0 0 0 0 0 0 31 31 0 0 0 0 31 0 0 31 0 0 0 0 31 31 0 0 0 31 0 0 0 0 0 0 0 0 0 31 0 0 0 31 0 0 31 0
3362.6660430589 0 31 -31 0 0 0 0 0 0 0 0 0 0 0 0 31 0 0 0 0 0 31 0 -31 0 31 0 0 0 0 0 0 0 31 -31 31 31 -31 31 31 0 0 0 0 0 0 0 0 0 0 0 31 31 0 0
3348.8248144853 0 0 0 0 0 0 31 0 0 0 0 0 0 31 0 0 31 0 0 0 0 31 0 0 0 0 31 0 0 0 31 31 31 0 0 0 0 0 0 31 31 31 31 31 31 62 62 125 156 125
3336.3072716324 94 62 62 62 125 156 156 62 62 31 31 0 0 31 31 0 0 31 31 31 31 0 0 31 0 31 31 62 125 156 187 125 62 31
$$ packed form
3416.6072716324@L1l1%WL1l1L1l1L1%l1L1l1%UL1l1%UL1l1%TL1l1TL1%TL1%@
3407.1014240148@L1l1L1l1%L1l1%L1l1%TL1%l1%XL1o2L1%TL1l1L1l1%Ul1L1@
3397.7777382941@%VL1l1%L1l1L1l1%XL1l1L1%l1%UL1l1%UL1l1%UL1l1%YL1l1@
3385.7621446471@%L1l1%TL1l1%TL1l1%TL1l1L1l1%L1l1L1l1L1l1%YL1l1%ZL1@
3374.7504494119C1%l1%YL1%l1%UL1l1%L1l1%UL1%l1%TL1l1%ZL1l1%TL1l1%L1@
3362.6660430589@L1o2L1%S1L1l1%VL1l1TL1Tl1%XL1o2O2%o2O2%l1%S0L1%l1@
3348.8248144853@%WL1l1%WL1l1%L1l1%UL1l1%UL1l1%TL1%Tl1%WL1%WL1%O3L1A25
3336.3072716324I4l2%TO3L1%r4%l1%l1%L1%l1%L1%Ul1%L1l1L1%L1O3L1To2o3C1
$$ plain form
3327.8053224266 94 125 156 156 94 62 31 31 0 31 31 0 31 31 31 0 0 0 0 31 31 0 0 0 0 0 0 0 0 0 0 0 0 0 0 31 0 0 0 0 0 -31 0 0 31 0 0
3315.9718906765 0 0 31 0 -31 0 0 0 0 31 0 0 0 0 0 0 0 0 -31 0 0 0 0 0 0 0 0 -31 0 0 0 0 0 0 0 0 0 0 0 0 0 0 0 0 0 0 0 0 31 0 0 0 0 0 0 0 0 -31 0 31 0 0 0 0 0 0 0 0 31 0 0 0
3297.9150684559 0 0 0 0 0 0 0 0 0 0 0 31 31 31 0 31 31 31 31 0 31 31 31 0 0 0 0 0 0 0 0 0 0 0 31 31 0 31 31 0 0 31 31 62 0 0 0 31 0 31 31
3285.0777382941 31 31 0 0 0 31 0 0 0 0 0 0 0 0 31 0 0 0 31 0 0 0 0 31 31 0 0 0 0 -31 0 0 0 0 31 31 0 31 31 0 31 62
3274.5679922648 62 31 31 31 31 62 62 62 31 0 31 31 0 0 0 0 31 31 0 31 31 31 31 31 31 31 31 31 31 94 62 62 62 62 62 62 94 94 94 62 62 62 62 62 62 62 62 94 94 94 94 125 94 94
3260.9777382941 125 125 156 187 281 406 469 500 375 344 375 437 687 844 1031 1000 1094 1125 1281 1656 2625 4812 10187
3255.2287128971 25998 29248 30623 14312 7687 7531 12155 29592 29811 30217 12374 5125 3031 2219
3251.7150684559 1750 1406 1187 1156 1187 1219 1250 1312 1406 1437 1562 1594 1750 1906 2562 4281 8156 20999 32842 34467
$$ packed form
3327.8053224266I4L1T%o2l2l1%l1L1%l1L1%Tl1%UL1%l1%S3L1l1%Vl1L1%L1l1@
3315.9718906765@%L1l1TL1%UL1l1%Yl1L1%Yl1L1%S9L1l1%Yl1L1Tl1%YL1l1%@
3297.9150684559@%S0L1%Tl1L1%Ul1L1%Tl1%S0L1%l1L1%l1%L1%L1o2%TL1l1L1C1
3285.0777382941C1%l1%TL1l1%YL1l1%TL1l1%UL1%l1%Ul1L1%UL1%l1L1%l1L1F2
3274.5679922648F2l1%UL1%Tl1TL1%l1%UL1%l1L1%sO3l2%WL2%Tl2%YL2%UL1l1I4
3260.9777382941A25%L1TR4J25O3L1j25l1L1O2K50J57J87l1R4L1J56L75R69K187A0187
3255.2287128971B5998L250J375j6311o625j56M624J7437K19M06j7843p249k094B219
3251.7150684559A750l44k19l1L1L2L1O2R4L1J25L2J56TO56J719L875J2843J1843C4467
$$ plain form
3246.7621446471 20342 8937 7437 10468 23374 33185 32779 18155 6718 3469 2219 1500 1031
3243.4679922648 812 844 906 875 687 531 469 437 469 531 531 469 344 250 219 187 156 156 125 125 125 125 94 94 125 125 125 125 125 94 94
3235.7053224266 94 94 94 62 94 94 94 94 94 62 62 94 62 62 62 62 62 62 31 62 31 62 62 31 62 31 31 31 62 31 31 31 62 62 62 62 31 31 62 31
3225.6267636912 31 62 62 31 31 31 31 31 31 31 31 31 31 62 62 31 31 31 62 31 31 62 31 31 31 0 31 31 31 31 31 62 31 31 0 0 0 31 31 31 0 31 31
3214.8660430589 31 31 31 62 31 31 31 31 31 62 31 31 31 31 31 31 31 0 31 31 31 31 0 31 31 31 0 31 31 31 31 31 31 0 0 0 0 31 31 0 31 31 0 31 0
3203.6033732207 31 31 31 31 31 31 0 31 31 31 31 31 0 0 31 31 0 31 0 0 31 31 31 0 31 0 31 0 0 31 0 31 31 31 0 31 0
3194.2796875 31 31 0 31 31 31 0 0 0 31 0 31 0 0 31 0 31 0 0 0 31 0 31 31 0 0 0 31 0 31 0 0
3186.2796875 31 31 0 31 0 31 31 31 31 31 31 31 31 31 0 0 0 31 0 0 31 0 31 0 31 0 31 31 31 31 0 31 31 31 0 31 0 0
$$ packed form
3246.7621446471B0342j1405j500L031J2906R811m06j4624j1437l249j250p19A031
3243.4679922648H12L2O2l1j88j56o2l2L2O2%o2j25r4l1l2l1%l1%Ul1%L1%Vl1I4
3235.7053224266I4%Tl2L2%Vl2%L2l2%Wl1L1l1L1%l1L1l1%TL1l1%TL1%Ul1%L1C1
3225.6267636912C1L1%l1%sL1%l1%TL1l1%L1l1%Tl1L1%VL1l1%l1%TL1%Tl1L1C1
3214.8660430589C1%TL1l1%VL1l1%Xl1L1%Ul1L1%Tl1L1%Wl1%UL1%l1L1%l1L1@
3203.6033732207C1%Wl1L1%Vl1%L1%l1L1l1%L1%Tl1L1l1L1l1%L1l1L1%Tl1L1@
3194.2796875C1%l1L1%Tl1%TL1l1L1l1%L1l1L1l1%TL1l1L1%l1%TL1l1L1l1@
3186.2796875C1%l1L1l1L1%Zl1%TL1l1%L1l1L1l1L1l1L1%Ul1L1%Tl1L1l1@
$$ plain form
3176.6738398824 31 0 31 62 0 0 0 31 31 31 31 0 31 31 31 31 31 31 94 156 156 125 94 62 62 125 156 156 156 62 62 31 31 31 31 31 31 31 0 31 0 31
3166.164093853 31 31 31 31 31 31 31 94 125 156 156 94 62 62 94 156 156 125 94 62 31 31 31 31 31 0 31 0 0 31 0 0 0 0 0 0 0 0 0 0 0 0 0 0 31 0 0 0 0 0 0 0 31 31
3152.5738398824 31 0 0 0 0 0 0 31 0 0 0 0 0 0 0 31 31 0 0 31 0 31 0 0 0 31 0 0 0 0 31 0 0 0 31 0 0 0 0 0 0 0 0 31 0 0
3141.0601954413 0 0 0 31 31 31 31 94 94 62 31 31 31 94 94 31 31 31 31 31 0 31 31 0 31 0 31 0 31 31 31 31 0 0 31 62 125 125
3131.5543478236 125 125 94 94 94 125 125 125 125 94 31 31 31 31 31 0 0 31 0 31 31 31 0 0 31 0 0 0 31 31 94 125 125 156 94 125
3122.4504494119 62 125 125 94 125 94 125 62 0 0 31 31 0 0 0 0 31 0 0 -31 0 0 0 0 31 0 0 0 31 125 94 94 31 31
3113.9994748089 31 31 125 94 94 31 31 31 31 0 0 31 0 0 0 31 0 0 0 31 0 0 0 0 0 0 0 0 0 0 31 0 0 0 0 0 31 0 0 31 31 0 0 31
3102.9189668677 0 0 0 0 0 0 0 0 0 0 0 0 0 0 31 0 0 31 31 -31 0 0 31 0 0 31 0 31 0 31 0 0 0 31 0 0 0 0 0 0 0 0 0 0 31 0 31 31 31 0 0
$$ packed form
3176.6738398824C1l1L1To2%TL1%Ul1L1%WO3O2%l1Tl2%O3L1%Tr4%l1%Xl1L1l1C1
3166.164093853C1%XO3L1T%o2l2%L2O2%l1Tl2l1%Vl1L1l1%L1l1%S3L1l1%XL1C1
3152.5738398824C1l1%WL1l1%XL1%l1%L1l1L1l1%TL1l1%UL1l1%TL1l1%YL1l1@
3141.0601954413@%TL1%UO3%l2l1%TO3%o3%Vl1L1%l1L1l1L1l1L1%Ul1%L1TO3A25
3131.5543478236A25%l1%TL1%Ul1o3%Vl1%L1l1L1%Tl1%L1l1%TL1%O3L1%L1o2A25
3122.4504494119F2O3%l1L1l1L1o3o2%L1%l1%UL1l1%l1L1%UL1l1%TL1R4l1%o3C1
3113.9994748089C1%R4l1%o3%Ul1%L1l1%TL1l1%TL1l1%sL1l1%VL1l1%L1%l1%C1
3102.9189668677@%S3L1l1%L1%o2L1%L1l1%L1l1L1l1L1l1%TL1l1%sL1l1L1%Tl1@
$$ [...]
-505.5C4 $$ checkpoint
##END= $$ end of C NMR
##END= $$ end of file