##TITLE= P(CN)3
##JCAMP-DX=5.01
##DATA TYPE= LINK
##BLOCKS= 2
##TITLE= P(CN)3
##JCAMP-DX= 5.01
##DATA TYPE= INFRARED SPECTRUM
##DATA CLASS= XYDATA
##BLOCK ID=1
##ORIGIN= WebMO Gaussian HF Simulation
##OWNER= public domain
##LONGDATE= Fri, 2 Mar 2018 15:27:14 -0500 $$ export date from JSpecView
##SPECTROMETER/DATA SYSTEM= simulation
##$MODELS=
<Models>
<ModelData id="IRP" type="MOL">
P(CN)3.mol
__Jmol-14_03021815443D 1   1.00000     0.00000     0
Jmol version 14.29.4  2018-02-08 00:40 EXTRACT: ({0:6})
  7  6  0  0  0  0            999 V2000
    0.0000   -0.0000    0.8014 P   0  0  0  0  0  0
    0.0000    1.5688   -0.0668 C   0  0  0  0  0  0
    0.0000    2.6118   -0.5152 N   0  0  0  0  0  0
   -1.3587   -0.7844   -0.0668 C   0  0  0  0  0  0
   -2.2618   -1.3059   -0.5152 N   0  0  0  0  0  0
    1.3587   -0.7844   -0.0668 C   0  0  0  0  0  0
    2.2618   -1.3059   -0.5152 N   0  0  0  0  0  0
  1  6  1  0  0  0
  1  2  1  0  0  0
  2  3  1  0  0  0
  4  1  1  0  0  0
  5  4  1  0  0  0
  6  7  1  0  0  0
M  END
</ModelData>
<ModelData id="Mi" type="XYZVIB" baseModel="IRP" vibrationScale=".5">
7
Model[1]: PATH=Calculation 1;Standard;Energy=-617.6208;PATH=Calculation 1;Standard
P       0.00000     -0.00000      0.80145
C       0.00000      1.56884     -0.06678
N       0.00000      2.61175     -0.51523
C      -1.35866     -0.78442     -0.06678
N      -2.26184     -1.30587     -0.51523
C       1.35866     -0.78442     -0.06678
N       2.26184     -1.30587     -0.51523
7
Model[2]: PATH=Calculation 2;Input;Energy=-617.6208;Range=M.O.s;NFock==Conv=0.14D-08;E(RHF)=-617.620791770 A.U.;PATH=Calculation 2;Input
P      -0.05896     -0.23961      0.01652
C       1.20912      0.41919      1.09959
N       2.02141      0.73241      1.82818
C      -1.32941      0.98976      0.31598
N      -2.20465      1.68228      0.52364
C       0.56435      0.39583     -1.54001
N       0.94802      0.69353     -2.56613
7
Model[3]: PATH=Calculation 2;Standard;Energy=-617.6208;Range=M.O.s;NFock==Conv=0.14D-08;E(RHF)=-617.620791770 A.U.;PATH=Calculation 2;Standard
P      -0.00000     -0.00000      0.80145
C      -0.00000      1.56884     -0.06678
N      -0.00000      2.61175     -0.51523
C      -1.35866     -0.78442     -0.06678
N      -2.26184     -1.30587     -0.51523
C       1.35866     -0.78442     -0.06678
N       2.26184     -1.30587     -0.51523
7
Model[4]: IRIntensity=6.8710 KM/Mole;PATH=Calculation 2;FrequenciesFrequencies;ReducedMass=14.5585 AMU;ForceConstant=0.1218 mDyne/A;FreqValue=119.1868;Frequency=119.1868 cm^-1;FrequencyLabel=E;PATH=Calculation 2;FrequenciesFrequencies
P      -0.00000     -0.00000      0.80145     -0.00000     -0.20001     -0.00000
C      -0.00000      1.56884     -0.06678      0.00000     -0.21000     -0.01000
N      -0.00000      2.61175     -0.51523      0.00000     -0.28000     -0.17000
C      -1.35866     -0.78442     -0.06678     -0.12000      0.00000      0.00000
$$ [...]
N      -0.00000      2.61175     -0.51523     -0.00000     -0.46001      0.20001
C      -1.35866     -0.78442     -0.06678      0.26000      0.14000      0.13000
N      -2.26184     -1.30587     -0.51523     -0.20001     -0.12000     -0.10000
C       1.35866     -0.78442     -0.06678     -0.26000      0.14000      0.13000
N       2.26184     -1.30587     -0.51523      0.20001     -0.12000     -0.10000
7
Model[17]: IRIntensity=15.3452 KM/Mole;PATH=Calculation 2;FrequenciesFrequencies;ReducedMass=12.7750 AMU;ForceConstant=50.2640 mDyne/A;FreqValue=2584.1783;Frequency=2584.1783 cm^-1;FrequencyLabel=E;PATH=Calculation 2;FrequenciesFrequencies
P      -0.00000     -0.00000      0.80145     -0.03000     -0.00000      0.00000
C      -0.00000      1.56884     -0.06678     -0.00000      0.00000     -0.00000
N      -0.00000      2.61175     -0.51523      0.00000     -0.00000      0.00000
C      -1.35866     -0.78442     -0.06678      0.44000      0.26000      0.23001
N      -2.26184     -1.30587     -0.51523     -0.35000     -0.20001     -0.17000
C       1.35866     -0.78442     -0.06678      0.44000     -0.26000     -0.23001
N       2.26184     -1.30587     -0.51523     -0.35000      0.20001      0.17000
7
Model[18]: IRIntensity=2.6725 KM/Mole;PATH=Calculation 2;FrequenciesFrequencies;ReducedMass=12.7634 AMU;ForceConstant=50.3291 mDyne/A;FreqValue=2587.0231;Frequency=2587.0231 cm^-1;FrequencyLabel=A1;PATH=Calculation 2;FrequenciesFrequencies
P      -0.00000     -0.00000      0.80145      0.00000     -0.00000      0.02000
C      -0.00000      1.56884     -0.06678      0.00000      0.42000     -0.18001
N      -0.00000      2.61175     -0.51523     -0.00000     -0.33001      0.14000
C      -1.35866     -0.78442     -0.06678     -0.36001     -0.21000     -0.18001
N      -2.26184     -1.30587     -0.51523      0.28000      0.16000      0.14000
C       1.35866     -0.78442     -0.06678      0.36001     -0.21000     -0.18001
N       2.26184     -1.30587     -0.51523     -0.28000      0.16000      0.14000
</ModelData>
</Models>
##$PEAKS=
<Peaks type="IR" xUnitsExpected="1/cm"  >
<PeakData id="1" title="1 E (2590~ cm-1)" peakShape="broad" model="Mi.18" xMax="2625" xMin="2540"    />
<PeakData id="3" title="3 E (~710 cm-1)" peakShape="broad" model="Mi.15" xMax="730" xMin="680"    />
<PeakData id="4" title="4 A1 (~660 cm-1)" peakShape="broad" model="Mi.13" xMax="670" xMin="655"    />
<PeakData id="8" title="8 E (~350 cm-1)" peakShape="broad" model="Mi.8" xMax="370" xMin="330"    />
<PeakData id="9" title="9 A1 (~150 cm-1)" peakShape="broad" model="Mi.6" xMax="160" xMin="130"    />
<PeakData id="10" title="10 E (~120 cm-1)" peakShape="broad" model="Mi.4" xMax="130" xMin="100"    />
</Peaks>
##XUNITS= 1/CM
##YUNITS= TRANSMITTANCE
##XFACTOR= 1
##YFACTOR= 9.999000E-07
##FIRSTX= 2.900901E+03
##FIRSTY= 1
##LASTX= 3.918680E+01
##NPOINTS= 2179
##MINY= 10.000000E-05
##MAXY= 1
##XYDATA= (X++(Y..Y))
2900.9006A000100%S18l883o4m03p3p5p7p9q1q3q5q8r0r2r5r7j01j03I94425
2720.8938I94316j12j15j19j23j26j30j34j38j43j47j52j56j62j67j73I92040
2698.5571I91855j91j98k05k12k20k29k36k46k55k65k75k86k98l09l23I87771
2676.2205I87421l65l82l98m16m35m55m76m32n20n46n73o02o33o66p02I79080
2653.884I78299q24q72r23r78j038j101j171j247j328j418j515j621I62525
2635.489I60660k005k160k329k518k726k958l216l504l826m188m596I21578
2618.4082I16000o170o845p618q504r523j0702j2064j3648j5489j7633G87671
2602.641G64632k6409l0282l4678l9560m4789n0064n4845n8289n9300C09660
2588.188B59700l9089k5182r574O680K2721L7363M9043N6522N9544N8817E32059
$$ y = [994316, 994204, 994089, 993970, 993847, 993721, 993591, 993457, 993319, 993176, 993029, 992877, 992721, 992559, 992392, 992219, 992040, 991855, 991664, 991466, 991261, 991049, 990829, 990600, 990364, 990118, 989863, 989598, 989323, 989037, 988739, 988430, 988107, 987771, 987421, 987056, 986674, 986276, 985860, 985425, 984970, 984494, 984062, 983542, 982996, 982423, 981821, 981188, 980522, 979820, 979080, 978299, 977475, 976603, 975680, 974702, 973664, 972563, 971392, 970145, 968817, 967399, 965884, 964263, 962525, 960660, 958655, 956495, 954166, 951648, 948922, 945964, 942748, 939244, 935418, 931230, 926634, 921578, 916000, 909830, 902985, 895367, 886863, 877340, 866638, 854574, 840926, 825437, 807804, 787671, 764632, 738223, 707941, 673263, 633703, 588914, 538850, 484005, 425716, 366416, 309660, 259700, 220611, 195429, 185855, 192535, 215256, 252619, 301662, 358184, 417728, 476545, 532059]
2572.421E82837M5487M0210L5266L0802K6863K3434K0473J7927J5741H52906
2557.9678H65158J0864R665Q626P725O939O252N650N120M652M239L871I42305
2540.887I45556K990K755K544K353K181K025J882J754J636J528J431I69974
2523.806I71231J181J110J046R85R30Q79Q31P86P45P07O71O37O06N77I83471
2502.7834I83994N00M76M55M35M16L98L82L65L50L36L23L09K98K86K75I89863
2480.4468I90118K46K36K29K20K12K05J98J91J85J79J73J67J62J56J52I93176
2458.11I93319J38J34J30J26J23J19J15J12J09J06J03J01R7R5R2R0I95197
$$ y = [582837, 628324, 668534, 703800, 734602, 761465, 784899, 805372, 823299, 839040, 852906, 865158, 876022, 885687, 894313, 902038, 908977, 915229, 920879, 925999, 930651, 934890, 938761, 942305, 945556, 948546, 951301, 953845, 956198, 958379, 960404, 962286, 964040, 965676, 967204, 968635, 969974, 971231, 972412, 973522, 974568, 975553, 976483, 977362, 978193, 978979, 979724, 980431, 981102, 981739, 982345, 982922, 983471, 983994, 984494, 984970, 985425, 985860, 986276, 986674, 987056, 987421, 987771, 988107, 988430, 988739, 989037, 989323, 989598, 989863, 990118, 990364, 990600, 990829, 991049, 991261, 991466, 991664, 991855, 992040, 992219, 992392, 992559, 992721, 992877, 993029, 993176, 993319, 993457, 993591, 993721, 993847, 993970, 994089, 994204, 994316, 994425, 994531, 994634, 994735, 994832, 994927, 995019, 995109, 995197]
2434.4595I95282Q3Q1P9P7P5P3M03O4L883%S184k2791l75l85l94m04m15I74911
856.4439I74475m47m59m71m84m97n11n24n39n54n70n85o03o20o39o57I65639
834.1073I64941p18p40p64p87q12q38q66q93n480j024j059j094j131I47566
814.3985I46357j252j295j342j390j441j493j550j608j669j734j802I27907
797.31757I25959k029k111k201k293k392k496k606k723k846k977l117H94904
780.23663H91483l588l766l955m157m373m603m850n113n395n698o023H33589
763.1557H26842p152p586q056q562r109r699j0339j1030j1779j2590G17472
747.3887G03051j5451j6566j7773j9075k0476k1981k3590k5297k7098D86769
732.9356D55867l2840l4734l6501l8032l9190l9795l9648l8529l6247H7660
$$ y = [974475, 974028, 973569, 973098, 972614, 972117, 971606, 971082, 970543, 969989, 969419, 968834, 968231, 967611, 966972, 966315, 965639, 964941, 964223, 963483, 962719, 961932, 961120, 960282, 959416, 958523, 953043, 952019, 950960, 949866, 948735, 947566, 946357, 945105, 943810, 942468, 941078, 939637, 938144, 936594, 934986, 933317, 931583, 929781, 927907, 925959, 923930, 921819, 919618, 917325, 914933, 912437, 909831, 907108, 904262, 901285, 898168, 894904, 891483, 887895, 884129, 880174, 876017, 871644, 867041, 862191, 857078, 851683, 845985, 839962, 833589, 826842, 819690, 812104, 804048, 795486, 786377, 776678, 766339, 755309, 743530, 730940, 717472, 703051, 687600, 671034, 653261, 634186, 613710, 591729, 568139, 542842, 515744, 486769, 455867, 423027, 388293, 351792, 313760, 274570, 234775, 195127, 156598, 120351, 87660]
718.4825E9744k2213j6159j0510n976k919j224m50j51m2J4Q7K70P62C156
698.7737G340P786J2532J7813K2863K7027K9915L1393L1515L0439K8351B72403
683.0067B94218J7616J2897P700K059l982j0321j6751k2902k8171l1737A87945
667.2397A57633k4564j6111n979N076J6638K8098L8320M6036N0525N1880C98319
651.47266D46341M4394M0431L6485L2754K9338K6269K3544K1140J9027G36896
637.01953G52441J4112J2851J1738J0750R875R094Q397P772P211O704H57191
621.25256H63022N455N110M797M510M246M004L781L574L384L207L044I11025
604.17163I13774K617K493K378K270K168K073J983J900J819J746J674I38503
$$ y = [59744, 37531, 21372, 10862, 4886, 1967, 743, 293, 142, 100, 114, 201, 471, 1233, 3156, 7340, 15126, 27658, 45471, 68334, 95361, 125276, 156669, 188184, 218623, 246974, 272403, 294218, 311834, 324731, 332431, 334490, 330508, 320187, 303436, 280534, 252363, 220626, 187945, 157633, 133069, 116958, 110979, 116055, 132693, 160791, 199111, 245147, 295672, 347552, 398319, 446341, 490735, 531166, 567651, 600405, 629743, 656012, 679556, 700696, 719723, 736896, 752441, 766553, 779404, 791142, 801892, 811767, 820861, 829258, 837030, 844241, 850945, 857191, 863022, 868477, 873587, 878384, 882894, 887140, 891144, 894925, 898499, 901883, 905090, 908134, 911025, 913774, 916391, 918884, 921262, 923532, 925700, 927773, 929756, 931656, 933475, 935221, 936895, 938503]
587.0907I40047J485J428J374J324J275J229J185J143J104J066J029I54684
570.0097I55646R30R00Q71Q43Q17P91P66P43P20O98O77O57O36O18N99I67493
547.6731I68057N46K2560J67J59J51J43J34J25J16J06R6Q4P2N7M2K3I92639
524.0226I92616n5r1j35j90k56l33m24n19o07o56o26j628k00J64M99I88276
501.68597I93687P10O36N43M50L68K98K42J94J57J26J01Q1O4M9L8K8J9I97802
476.72156I97807joj1j6j9k3k6l0l3l5l9m2m5m7n1n3n7n9o3o5o9p3p6I96789
443.8736I96705q7r2r6j00j05j11j16j21j28j34j41j48j55j64j73j82I94461
420.22305I94258k14k26k40k54k69k86l04l23l45l68l92m21m50m83n20I88604
$$ y = [940047, 941532, 942960, 944334, 945658, 946933, 948162, 949347, 950490, 951594, 952660, 953689, 954684, 955646, 956576, 957476, 958347, 959190, 960007, 960798, 961564, 962307, 963027, 963725, 964402, 965059, 965695, 966313, 966912, 967493, 968057, 968603, 991163, 991330, 991489, 991640, 991783, 991917, 992042, 992158, 992264, 992360, 992444, 992516, 992573, 992615, 992638, 992639, 992616, 992561, 992470, 992335, 992145, 991889, 991556, 991132, 990613, 990006, 989350, 988724, 987096, 986896, 987060, 987559, 988276, 993687, 994397, 995033, 995576, 996026, 996394, 996692, 996934, 997128, 997285, 997411, 997512, 997593, 997657, 997706, 997744, 997772, 997791, 997802, 997807, 997806, 997800, 997789, 997773, 997754, 997731, 997705, 997675, 997642, 997607, 997568, 997526, 997481, 997434, 997383, 997330, 997273, 997214, 997151, 997086, 997017, 996944, 996868, 996789, 996705, 996618, 996526, 996430, 996330, 996225, 996114, 995998, 995877, 995749, 995615, 995474, 995326, 995171, 995007, 994834, 994652, 994461, 994258, 994044, 993818, 993578, 993324, 993055, 992769, 992465, 992142, 991797, 991429, 991037, 990616, 990166, 989683, 989163, 988604]
397.88644I88002o52p05p65q31r06r89j082j188j308j443j598j774j978I70571
378.17767I68088k800l169l603m117m726n454o325p375q645j0184j2050H85336
361.09674H68326k0199k3847k7787l1603l4487l5153l2036k3945j1104F32417
346.64365F51037K9025L4301L5157L3094K9572K5617K1803J8397J5473I06497
332.19055I17484R307P922O778N830N040M381L826L358K960K622K330I73919
315.10962I75783J675J512J367J241J130J031R43j733P50O86O29N76N30I86607
295.40085I87055M13L80L50L23K97K74K51K32K12J95J78J63j592J05R1I89004
273.06424I89069N3M0L0J8Qlj4k3l3m3n3o3p3q2r2j02j12j22j33j43j53I87809
$$ y = [988002, 987350, 986645, 985880, 985049, 984143, 983154, 982072, 980884, 979576, 978133, 976535, 974761, 972783, 970571, 968088, 965288, 962119, 958516, 954399, 949673, 944219, 937894, 930519, 921874, 911690, 899640, 885336, 868326, 848127, 824280, 796493, 764890, 730403, 695250, 663214, 639269, 628165, 632417, 651037, 680062, 714363, 749520, 782614, 812186, 837803, 859606, 878003, 893476, 906497, 917484, 926791, 934713, 941491, 947321, 952361, 956742, 960568, 963926, 966886, 969508, 971838, 973919, 975783, 977458, 978970, 980337, 981578, 982708, 983739, 984682, 982949, 983699, 984385, 985014, 985590, 986120, 986607, 987055, 987468, 987848, 988198, 988521, 988818, 989092, 989343, 989575, 989787, 989982, 990160, 990323, 988731, 988836, 988927, 989004, 989069, 989122, 989162, 989192, 989210, 989218, 989215, 989201, 989178, 989145, 989102, 989049, 988986, 988913, 988831, 988739, 988637, 988525, 988403, 988270, 988127, 987974, 987809]
242.84412I87633j88k00k12k26k38k53k67k82k98l15l32l51l70l91m12I82863
220.5075I82404m84n12n41n72o05o41o78p19p62q10q60r14r74j038j107I70004
198.1709I68739j356j453j562j680j811j955k115j201k510k730k976I44137
181.08997I40572l918m318m773n295n892o580p376q300r378j0638j2119H48125
164.00902H32208j8343k1204k4558k8456l2904l7827m2999m7939n1806D72805
149.55592D21653m3952l1525j5033L181K0281L3683M1772M4333M2325E53923
135.10283E84231K2570J4520O400j705r717j7438k4376k9613l1772k9301D62595
119.33581D54664Q247K3942L6079M3106M5227M3738M0150L5681L1102G88767
$$ y = [987633, 987445, 987245, 987033, 986807, 986569, 986316, 986049, 985767, 985469, 985154, 984822, 984471, 984101, 983710, 983298, 982863, 982404, 981920, 981408, 980867, 980295, 979690, 979049, 978371, 977652, 976890, 976080, 975220, 974306, 973332, 972294, 971187, 970004, 968739, 967383, 965930, 964368, 962688, 960877, 958922, 956807, 955606, 953096, 950366, 947390, 944137, 940572, 936654, 932336, 927563, 922268, 916376, 909796, 902420, 894120, 884742, 874104, 861985, 848125, 832208, 813865, 792661, 768103, 739647, 706743, 668916, 625917, 577978, 526172, 472805, 421653, 377701, 346176, 331143, 334324, 354605, 388288, 430060, 474393, 516718, 553923, 584231, 606801, 621321, 627721, 626016, 616299, 598861, 574485, 544872, 513100, 483799, 462595, 454664, 462911, 486853, 522932, 566038, 611265, 655003, 695153, 730834, 761936, 788767]
104.882706H11808J9770J6990J4649J2679J1024R631Q453P454O603N875I30185
89.11569I34893M239L831L473L158K882K636K418K223K050J894J753I67077
72.03475I68589J409J314J228J149J078J011R51Q95Q44P96P53P11O74I82040
52.32598I82646N75N47N20M96M72M50M30M11I86940
$$ y = [811808, 831578, 848568, 863217, 875896, 886920, 896551, 905004, 912458, 919061, 924936, 930185, 934893, 939132, 942963, 946436, 949594, 952476, 955112, 957530, 959753, 961803, 963697, 965450, 967077, 968589, 969998, 971312, 972540, 973689, 974767, 975778, 976729, 977624, 978468, 979264, 980017, 980728, 981402, 982040, 982646, 983221, 983768, 984288, 984784, 985256, 985706, 986136, 986547, 986940]
39.1868I87315  $$checkpoint
##END= $$ end of P(CN)3 IR
##TITLE=Raman of P(CN)3 $$ Begin of the data block
##JCAMP-DX=5.01 $$
##DATA TYPE=RAMAN SPECTRUM
##DATA CLASS=XYDATA
##BLOCK ID=2
##DATE=19 Feb 2012 10:29:22
##ORIGIN= WebMO Gaussian HF calculation
##OWNER= public domain
##SPECTROMETER/DATA SYSTEM= simulation
##$MODELS=
<Models>
<ModelData id="RP" type="MOL">
P(CN)3.mol
__Jmol-14_03021815443D 1   1.00000     0.00000     0
Jmol version 14.29.4  2018-02-08 00:40 EXTRACT: ({0:6})
  7  6  0  0  0  0            999 V2000
    0.0000   -0.0000    0.8014 P   0  0  0  0  0  0
    0.0000    1.5688   -0.0668 C   0  0  0  0  0  0
    0.0000    2.6118   -0.5152 N   0  0  0  0  0  0
   -1.3587   -0.7844   -0.0668 C   0  0  0  0  0  0
   -2.2618   -1.3059   -0.5152 N   0  0  0  0  0  0
    1.3587   -0.7844   -0.0668 C   0  0  0  0  0  0
    2.2618   -1.3059   -0.5152 N   0  0  0  0  0  0
  1  6  1  0  0  0
  1  2  1  0  0  0
  2  3  1  0  0  0
  4  1  1  0  0  0
  5  4  1  0  0  0
  6  7  1  0  0  0
M  END
</ModelData>
<ModelData id="MR" type="XYZVIB" baseModel="RP" vibrationScale=".5">
7
Model[1]: PATH=Calculation 1;Standard;Energy=-617.6208;PATH=Calculation 1;Standard
P       0.00000     -0.00000      0.80145
C       0.00000      1.56884     -0.06678
N       0.00000      2.61175     -0.51523
C      -1.35866     -0.78442     -0.06678
N      -2.26184     -1.30587     -0.51523
C       1.35866     -0.78442     -0.06678
N       2.26184     -1.30587     -0.51523
7
Model[2]: PATH=Calculation 2;Input;Energy=-617.6208;Range=M.O.s;NFock==Conv=0.14D-08;E(RHF)=-617.620791770 A.U.;PATH=Calculation 2;Input
P      -0.05896     -0.23961      0.01652
C       1.20912      0.41919      1.09959
N       2.02141      0.73241      1.82818
C      -1.32941      0.98976      0.31598
N      -2.20465      1.68228      0.52364
C       0.56435      0.39583     -1.54001
N       0.94802      0.69353     -2.56613
7
Model[3]: PATH=Calculation 2;Standard;Energy=-617.6208;Range=M.O.s;NFock==Conv=0.14D-08;E(RHF)=-617.620791770 A.U.;PATH=Calculation 2;Standard
P      -0.00000     -0.00000      0.80145
C      -0.00000      1.56884     -0.06678
N      -0.00000      2.61175     -0.51523
C      -1.35866     -0.78442     -0.06678
N      -2.26184     -1.30587     -0.51523
C       1.35866     -0.78442     -0.06678
N       2.26184     -1.30587     -0.51523
7
Model[4]: IRIntensity=6.8710 KM/Mole;PATH=Calculation 2;FrequenciesFrequencies;ReducedMass=14.5585 AMU;ForceConstant=0.1218 mDyne/A;FreqValue=119.1868;Frequency=119.1868 cm^-1;FrequencyLabel=E;PATH=Calculation 2;FrequenciesFrequencies
P      -0.00000     -0.00000      0.80145     -0.00000     -0.20001     -0.00000
C      -0.00000      1.56884     -0.06678      0.00000     -0.21000     -0.01000
N      -0.00000      2.61175     -0.51523      0.00000     -0.28000     -0.17000
C      -1.35866     -0.78442     -0.06678     -0.12000      0.00000      0.00000
N      -2.26184     -1.30587     -0.51523     -0.42000      0.45000      0.08000
C       1.35866     -0.78442     -0.06678      0.12000      0.00000      0.00000
N       2.26184     -1.30587     -0.51523      0.42000      0.45000      0.08000
7
Model[5]: IRIntensity=6.8710 KM/Mole;PATH=Calculation 2;FrequenciesFrequencies;ReducedMass=14.5585 AMU;ForceConstant=0.1218 mDyne/A;FreqValue=119.1868;Frequency=119.1868 cm^-1;FrequencyLabel=E;PATH=Calculation 2;FrequenciesFrequencies
P      -0.00000     -0.00000      0.80145     -0.20001      0.00000      0.00000
C      -0.00000      1.56884     -0.06678      0.07000      0.00000      0.00000
N      -0.00000      2.61175     -0.51523      0.70000      0.00000      0.00000
C      -1.35866     -0.78442     -0.06678     -0.14000     -0.12000      0.01000
N      -2.26184     -1.30587     -0.51523     -0.04000     -0.42000      0.15001
C       1.35866     -0.78442     -0.06678     -0.14000      0.12000     -0.01000
N       2.26184     -1.30587     -0.51523     -0.04000      0.42000     -0.15001
7
Model[6]: IRIntensity=20.6341 KM/Mole;PATH=Calculation 2;FrequenciesFrequencies;ReducedMass=16.0182 AMU;ForceConstant=0.2010 mDyne/A;FreqValue=145.9227;Frequency=145.9227 cm^-1;FrequencyLabel=A1;PATH=Calculation 2;FrequenciesFrequencies
P      -0.00000     -0.00000      0.80145      0.00000     -0.00000      0.36001
C      -0.00000      1.56884     -0.06678     -0.00000     -0.11000      0.14000
N      -0.00000      2.61175     -0.51523     -0.00000     -0.34000     -0.38000
C      -1.35866     -0.78442     -0.06678      0.10000      0.06000      0.14000
N      -2.26184     -1.30587     -0.51523      0.29000      0.17000     -0.38000
C       1.35866     -0.78442     -0.06678     -0.10000      0.06000      0.14000
N       2.26184     -1.30587     -0.51523     -0.29000      0.17000     -0.38000
7
Model[7]: IRIntensity=0.0000 KM/Mole;PATH=Calculation 2;FrequenciesFrequencies;ReducedMass=12.4196 AMU;ForceConstant=0.7877 mDyne/A;FreqValue=328.1049;Frequency=328.1049 cm^-1;FrequencyLabel=A2;PATH=Calculation 2;FrequenciesFrequencies
P      -0.00000     -0.00000      0.80145      0.00000      0.00000     -0.00000
C      -0.00000      1.56884     -0.06678      0.51000     -0.00000     -0.00000
N      -0.00000      2.61175     -0.51523     -0.26000      0.00000      0.00000
C      -1.35866     -0.78442     -0.06678     -0.26000      0.44000      0.00000
N      -2.26184     -1.30587     -0.51523      0.13000     -0.23001     -0.00000
C       1.35866     -0.78442     -0.06678     -0.26000     -0.44000     -0.00000
N       2.26184     -1.30587     -0.51523      0.13000      0.23001      0.00000
7
Model[8]: IRIntensity=4.5812 KM/Mole;PATH=Calculation 2;FrequenciesFrequencies;ReducedMass=12.6461 AMU;ForceConstant=0.9056 mDyne/A;FreqValue=348.6227;Frequency=348.6227 cm^-1;FrequencyLabel=E;PATH=Calculation 2;FrequenciesFrequencies
P      -0.00000     -0.00000      0.80145     -0.11000      0.00000      0.00000
C      -0.00000      1.56884     -0.06678      0.32000     -0.00000     -0.00000
N      -0.00000      2.61175     -0.51523     -0.15001      0.00000      0.00000
C      -1.35866     -0.78442     -0.06678      0.25000     -0.04000     -0.52000
N      -2.26184     -1.30587     -0.51523     -0.16000     -0.01000      0.26000
C       1.35866     -0.78442     -0.06678      0.25000      0.04000      0.52000
N       2.26184     -1.30587     -0.51523     -0.16000      0.01000     -0.26000
7
Model[9]: IRIntensity=4.5812 KM/Mole;PATH=Calculation 2;FrequenciesFrequencies;ReducedMass=12.6461 AMU;ForceConstant=0.9056 mDyne/A;FreqValue=348.6228;Frequency=348.6228 cm^-1;FrequencyLabel=E;PATH=Calculation 2;FrequenciesFrequencies
P      -0.00000     -0.00000      0.80145     -0.00000     -0.11000      0.00000
C      -0.00000      1.56884     -0.06678      0.00000      0.23001      0.60001
N      -0.00000      2.61175     -0.51523     -0.00000     -0.17000     -0.31000
C      -1.35866     -0.78442     -0.06678     -0.04000      0.30001     -0.30001
N      -2.26184     -1.30587     -0.51523     -0.01000     -0.15001      0.15001
C       1.35866     -0.78442     -0.06678      0.04000      0.30001     -0.30001
N       2.26184     -1.30587     -0.51523      0.01000     -0.15001      0.15001
7
Model[10]: IRIntensity=0.0702 KM/Mole;PATH=Calculation 2;FrequenciesFrequencies;ReducedMass=12.2403 AMU;ForceConstant=1.8502 mDyne/A;FreqValue=506.5137;Frequency=506.5137 cm^-1;FrequencyLabel=E;PATH=Calculation 2;FrequenciesFrequencies
P      -0.00000     -0.00000      0.80145     -0.00000     -0.01000     -0.00000
C      -0.00000      1.56884     -0.06678     -0.00000      0.31000      0.23001
N      -0.00000      2.61175     -0.51523      0.00000      0.15001     -0.18001
C      -1.35866     -0.78442     -0.06678      0.42000     -0.42000     -0.12000
N      -2.26184     -1.30587     -0.51523     -0.00000      0.16000      0.09000
C       1.35866     -0.78442     -0.06678     -0.42000     -0.42000     -0.11000
N       2.26184     -1.30587     -0.51523      0.00000      0.16000      0.09000
7
Model[11]: IRIntensity=0.0702 KM/Mole;PATH=Calculation 2;FrequenciesFrequencies;ReducedMass=12.2403 AMU;ForceConstant=1.8502 mDyne/A;FreqValue=506.5137;Frequency=506.5137 cm^-1;FrequencyLabel=E;PATH=Calculation 2;FrequenciesFrequencies
P      -0.00000     -0.00000      0.80145      0.01000     -0.00000     -0.00000
C      -0.00000      1.56884     -0.06678      0.66001      0.00000      0.00000
N      -0.00000      2.61175     -0.51523     -0.16000      0.00000     -0.00000
C      -1.35866     -0.78442     -0.06678     -0.07000     -0.42000      0.20001
N      -2.26184     -1.30587     -0.51523     -0.16000      0.00000     -0.15001
C       1.35866     -0.78442     -0.06678     -0.07000      0.42000     -0.20001
N       2.26184     -1.30587     -0.51523     -0.16000     -0.00000      0.15001
7
Model[12]: IRIntensity=0.0002 KM/Mole;PATH=Calculation 2;FrequenciesFrequencies;ReducedMass=12.5733 AMU;ForceConstant=1.9592 mDyne/A;FreqValue=514.2732;Frequency=514.2732 cm^-1;FrequencyLabel=A1;PATH=Calculation 2;FrequenciesFrequencies
P      -0.00000     -0.00000      0.80145     -0.00000      0.00000     -0.03000
C      -0.00000      1.56884     -0.06678      0.00000      0.40000      0.28000
N      -0.00000      2.61175     -0.51523     -0.00000      0.21000     -0.22000
C      -1.35866     -0.78442     -0.06678     -0.35000     -0.20001      0.28000
N      -2.26184     -1.30587     -0.51523     -0.18001     -0.10000     -0.22000
C       1.35866     -0.78442     -0.06678      0.35000     -0.20001      0.28000
N       2.26184     -1.30587     -0.51523      0.18001     -0.10000     -0.22000
7
Model[13]: IRIntensity=37.2939 KM/Mole;PATH=Calculation 2;FrequenciesFrequencies;ReducedMass=17.4714 AMU;ForceConstant=4.5296 mDyne/A;FreqValue=663.3505;Frequency=663.3505 cm^-1;FrequencyLabel=A1;PATH=Calculation 2;FrequenciesFrequencies
P      -0.00000     -0.00000      0.80145     -0.00000     -0.00000      0.51000
C      -0.00000      1.56884     -0.06678      0.00000      0.10000     -0.39000
N      -0.00000      2.61175     -0.51523      0.00000      0.29000     -0.05000
C      -1.35866     -0.78442     -0.06678     -0.09000     -0.05000     -0.39000
N      -2.26184     -1.30587     -0.51523     -0.25000     -0.15001     -0.05000
C       1.35866     -0.78442     -0.06678      0.09000     -0.05000     -0.39000
N       2.26184     -1.30587     -0.51523      0.25000     -0.15001     -0.05000
7
Model[14]: IRIntensity=90.1274 KM/Mole;PATH=Calculation 2;FrequenciesFrequencies;ReducedMass=18.4460 AMU;ForceConstant=5.4289 mDyne/A;FreqValue=706.7721;Frequency=706.7721 cm^-1;FrequencyLabel=E;PATH=Calculation 2;FrequenciesFrequencies
P      -0.00000     -0.00000      0.80145      0.55000     -0.00000     -0.00000
C      -0.00000      1.56884     -0.06678     -0.19000      0.00000     -0.00000
N      -0.00000      2.61175     -0.51523      0.04000      0.00000     -0.00000
C      -1.35866     -0.78442     -0.06678     -0.26000     -0.04000     -0.30001
N      -2.26184     -1.30587     -0.51523     -0.33001     -0.21000     -0.14000
C       1.35866     -0.78442     -0.06678     -0.26000      0.04000      0.30001
N       2.26184     -1.30587     -0.51523     -0.33001      0.21000      0.14000
7
Model[15]: IRIntensity=90.1274 KM/Mole;PATH=Calculation 2;FrequenciesFrequencies;ReducedMass=18.4460 AMU;ForceConstant=5.4289 mDyne/A;FreqValue=706.7721;Frequency=706.7721 cm^-1;FrequencyLabel=E;PATH=Calculation 2;FrequenciesFrequencies
P      -0.00000     -0.00000      0.80145      0.00000      0.55000      0.00000
C      -0.00000      1.56884     -0.06678     -0.00000     -0.29000      0.34000
N      -0.00000      2.61175     -0.51523      0.00000     -0.45000      0.16000
C      -1.35866     -0.78442     -0.06678     -0.04000     -0.21000     -0.17000
N      -2.26184     -1.30587     -0.51523     -0.21000     -0.08000     -0.08000
C       1.35866     -0.78442     -0.06678      0.04000     -0.21000     -0.17000
N       2.26184     -1.30587     -0.51523      0.21000     -0.08000     -0.08000
7
Model[16]: IRIntensity=15.3452 KM/Mole;PATH=Calculation 2;FrequenciesFrequencies;ReducedMass=12.7750 AMU;ForceConstant=50.2640 mDyne/A;FreqValue=2584.1783;Frequency=2584.1783 cm^-1;FrequencyLabel=E;PATH=Calculation 2;FrequenciesFrequencies
P      -0.00000     -0.00000      0.80145      0.00000     -0.03000     -0.00000
C      -0.00000      1.56884     -0.06678      0.00000      0.59000     -0.26000
N      -0.00000      2.61175     -0.51523     -0.00000     -0.46001      0.20001
C      -1.35866     -0.78442     -0.06678      0.26000      0.14000      0.13000
N      -2.26184     -1.30587     -0.51523     -0.20001     -0.12000     -0.10000
C       1.35866     -0.78442     -0.06678     -0.26000      0.14000      0.13000
N       2.26184     -1.30587     -0.51523      0.20001     -0.12000     -0.10000
7
Model[17]: IRIntensity=15.3452 KM/Mole;PATH=Calculation 2;FrequenciesFrequencies;ReducedMass=12.7750 AMU;ForceConstant=50.2640 mDyne/A;FreqValue=2584.1783;Frequency=2584.1783 cm^-1;FrequencyLabel=E;PATH=Calculation 2;FrequenciesFrequencies
P      -0.00000     -0.00000      0.80145     -0.03000     -0.00000      0.00000
C      -0.00000      1.56884     -0.06678     -0.00000      0.00000     -0.00000
N      -0.00000      2.61175     -0.51523      0.00000     -0.00000      0.00000
C      -1.35866     -0.78442     -0.06678      0.44000      0.26000      0.23001
N      -2.26184     -1.30587     -0.51523     -0.35000     -0.20001     -0.17000
C       1.35866     -0.78442     -0.06678      0.44000     -0.26000     -0.23001
N       2.26184     -1.30587     -0.51523     -0.35000      0.20001      0.17000
7
Model[18]: IRIntensity=2.6725 KM/Mole;PATH=Calculation 2;FrequenciesFrequencies;ReducedMass=12.7634 AMU;ForceConstant=50.3291 mDyne/A;FreqValue=2587.0231;Frequency=2587.0231 cm^-1;FrequencyLabel=A1;PATH=Calculation 2;FrequenciesFrequencies
P      -0.00000     -0.00000      0.80145      0.00000     -0.00000      0.02000
C      -0.00000      1.56884     -0.06678      0.00000      0.42000     -0.18001
N      -0.00000      2.61175     -0.51523     -0.00000     -0.33001      0.14000
C      -1.35866     -0.78442     -0.06678     -0.36001     -0.21000     -0.18001
N      -2.26184     -1.30587     -0.51523      0.28000      0.16000      0.14000
C       1.35866     -0.78442     -0.06678      0.36001     -0.21000     -0.18001
N       2.26184     -1.30587     -0.51523     -0.28000      0.16000      0.14000
</ModelData>
</Models>
##$PEAKS=
<Peaks type="RAMAN" xUnitsExpected="1/cm"  >
<PeakData id="1" title="1 E (2590~ cm-1)" peakShape="broad" model="MR.18" xMax="2625" xMin="2540"    />
<PeakData id="3" title="3 E (~710 cm-1)" peakShape="broad" model="MR.15" xMax="730" xMin="680"    />
<PeakData id="4" title="4 A1 (~660 cm-1)" peakShape="broad" model="MR.13" xMax="670" xMin="655"    />
<PeakData id="8" title="8 E (~510 cm-1)" peakShape="broad" model="MR.10" xMax="530" xMin="490"    />
<PeakData id="8" title="8 E (~350 cm-1)" peakShape="broad" model="MR.8" xMax="370" xMin="330"    />
<PeakData id="9" title="9 A1 (~150 cm-1)" peakShape="broad" model="MR.6" xMax="160" xMin="130"    />
<PeakData id="10" title="10 E (~120 cm-1)" peakShape="broad" model="MR.4" xMax="130" xMin="100"    />
</Peaks>
##XUNITS= 1/CM
##YUNITS=RAMAN INTENSITY
##XFACTOR= 1
##YFACTOR= 1.006694E-06
##FIRSTX= 2.900901E+03
##FIRSTY= 0
##LASTX= 3.918680E+01
##NPOINTS= 2179
##MINY= 0
##MAXY= 1.006694
##XYDATA= (X++(Y..Y))
2900.9006@%S08M47K24K23K48J9J438M4TM6M7M8M9N1N2N3N5N6N8N9O2C385
2730.091C450O7O8P1P2P5P7P9Q2Q5Q7R0R2R6R9J02J06J09J14J17J21E384
2701.185E514J35J40J45J51J56J63J68J76J83J90J98K07K15K25K35K45H702
2677.5344H971K80K94L09L23L39L57L75L95j544L35L53L71L90M10M33A2848
2655.1978A3331N10N39N72O07O43O85P28P77Q28Q86R48J016J090J173B5597
2634.175B6961J474J598J735J889K059K253K469K715K993L311L673M091F1792
2615.7803F6921N778O539P433Q494R757J1270J3095J5311J8016K1337B09388
2600.0132B39896L6788M4522N3925O5047P7516R0092J00083J03004R3429I72093
2585.56A000000j8235n9912q8661j01573j01176r2556q0425o7860n6405B86590
$$ y = [3450, 3517, 3585, 3656, 3728, 3803, 3880, 3959, 4041, 4126, 4213, 4303, 4395, 4491, 4590, 4692, 4798, 4907, 5021, 5138, 5259, 5384, 5514, 5649, 5789, 5934, 6085, 6241, 6404, 6572, 6748, 6931, 7121, 7319, 7526, 7741, 7966, 8201, 8446, 8702, 8971, 9251, 9545, 9854, 10177, 10516, 10873, 11248, 11643, 10099, 10434, 10787, 11158, 11548, 11958, 12391, 12848, 13331, 13841, 14380, 14952, 15559, 16202, 16887, 17615, 18392, 19220, 20106, 21054, 22070, 23160, 24333, 25597, 26961, 28435, 30033, 31768, 33657, 35716, 37969, 40438, 43153, 46146, 49457, 53130, 57221, 61792, 66921, 72699, 79238, 86671, 95165, 104922, 116192, 129287, 144598, 162614, 183951, 209388, 239896, 276684, 321206, 375131, 440178, 517694, 607786, 707869, 810873, 904302, 972093, 1000000, 981765, 921853, 833192, 731619, 630443, 537887, 457462, 389602, 333197, 286590]
2571.1072B48092l1897k6558k2244j8752j5911j3588j1677j0095q776H0923
2556.654G4184n949n275m697m199l768l393l065k778k525k302k103j928C0432
2538.259B8803j503j389j286j194j110j033r63r00q41p89p39o95o53A5093
2518.5503A4513n47n17m89m63m38m16l95l75l57l39l23l09k94k80k69H446
2496.2136H201k35k25k15k07j98j90j83j76j68j63j56j51j45j40j35j30E259
2472.5632E138j17j14j09j06j02r9r6r2r0q7q5q2p9p7p5p2p1o8o7o5o2C261
$$ y = [248092, 216195, 189637, 167393, 148641, 132730, 119142, 107465, 97370, 88594, 80923, 74184, 68235, 62960, 58263, 54064, 50296, 46903, 43838, 41060, 38535, 36233, 34130, 32202, 30432, 28803, 27300, 25911, 24625, 23431, 22321, 21288, 20325, 19425, 18584, 17795, 17056, 16361, 15708, 15093, 14513, 13966, 13449, 12960, 12497, 12059, 11643, 11248, 10873, 10516, 10177, 9854, 9545, 9251, 8971, 8702, 8446, 8201, 7966, 7741, 7526, 7319, 7121, 6931, 6748, 6572, 6404, 6241, 6085, 5934, 5789, 5649, 5514, 5384, 5259, 5138, 5021, 4907, 4798, 4692, 4590, 4491, 4395, 4303, 4213, 4126, 4041, 3959, 3880, 3803, 3728, 3656, 3585, 3517, 3450, 3385, 3323, 3261]
2442.343C202n8n6n5n3n2n1m9m8m7m6m4Tj438j9k48k23k24m47%S181N8E9
863.0135F0JXKJUKJTKJKJKTJKsLQ7MTNMTNXOVPOPTQURQJ0RJ0J1UJ2J3D37
777.6088D51J4J6TJ7J8TK0K1K3TK6TK9L0L3L4L7M0M3M7N0N4N9O4P0P6A439
740.8191A531J02J13J26J41J58J79K02K30K64L04L54M12M85N74O85Q21G670
717.1686H866J445J732K042K324K485K383J873R27k66j360k074k343A5758
698.7737A3730j713j402j121q81o76n04l56k25j07NJ14K27L49M82O37I376
676.4371A0410J294J628J983K413K873L291L530L472K628J231n33k150B8860
658.04224B5245l528l173k725k284j892j561j290j069q93p48o33n38m60D055
638.3335C712k99k61k30k04j80j60j44j29j15j05r4q5p8p0o4n9n3m9A288
$$ y = [60, 61, 62, 63, 64, 65, 66, 68, 69, 70, 71, 73, 74, 75, 77, 78, 80, 81, 83, 85, 86, 88, 90, 92, 94, 96, 98, 100, 102, 104, 107, 194, 198, 202, 207, 211, 215, 220, 225, 230, 235, 240, 245, 251, 257, 263, 269, 276, 282, 289, 296, 304, 312, 320, 329, 337, 347, 356, 366, 377, 388, 399, 411, 424, 437, 451, 465, 481, 497, 514, 532, 550, 570, 591, 614, 637, 663, 689, 718, 748, 781, 815, 852, 892, 935, 982, 1032, 1086, 1145, 1209, 1279, 1355, 1439, 1531, 1633, 1746, 1872, 2013, 2171, 2350, 2552, 2782, 3046, 3350, 3704, 4116, 4601, 5175, 5860, 6681, 7670, 8866, 10311, 12043, 14085, 16409, 18894, 21277, 23150, 24077, 23811, 22451, 20377, 18034, 15758, 13730, 12017, 10615, 9494, 8613, 7937, 7433, 7077, 6852, 6745, 6750, 6864, 7091, 7440, 7922, 8559, 9376, 10410, 11704, 13332, 15315, 17728, 20601, 23892, 27422, 30894, 33522, 34753, 34220, 32070, 28860, 25245, 21717, 18544, 15819, 13535, 11643, 10082, 8792, 7723, 6830, 6082, 5449, 4911, 4451, 4055, 3712, 3413, 3152, 2922, 2718, 2538, 2378, 2234, 2105, 1990, 1885, 1791, 1706, 1628, 1558, 1494, 1435, 1382, 1333, 1288]
612.0551A248l8l4l1k8k5k4k1j8j7j5j3j2rTonmk%JKMOPRJ0J2J4J5J8A055
570.0097A076K5K6K9L2L6L8M2M7N0N5O1O6P3Q0Q8R7J07J19P5J48J64B719
539.7896B926K34K65L02L45L97M59N34O25P35Q71J036J237J479J763A5285
518.7669A7687K697K914L044L120L186L190K920K126O53j182k859l932B9178
500.37207B5035l706l174k658k201j818j504j248j043q75p41o30n40m66D028
480.6633C676l08k72k40k13j91j70j53j39j24j14j03r4q6p9p2o7o2n6A080
454.38495A031m5m2l9l7l4l2k9k8k6k5k3k1k0j9j8j7j6j4Tj3j2j1Tj0D66
420.22305D58qpTnomUkUj%JTKMTNOPQJ0J2J3J5J7K0K2K6K9L4L8M4N1N9I03
$$ y = [1248, 1210, 1176, 1145, 1117, 1092, 1068, 1047, 1029, 1012, 997, 984, 972, 963, 954, 948, 943, 939, 937, 937, 938, 940, 944, 950, 957, 966, 976, 988, 1002, 1017, 1035, 1055, 1076, 1101, 1127, 1156, 1188, 1224, 1262, 1304, 1351, 1401, 1456, 1517, 1583, 1656, 1736, 1824, 1921, 2028, 2147, 2222, 2370, 2534, 2719, 2926, 3160, 3425, 3727, 4072, 4469, 4928, 5462, 6087, 6822, 7693, 8729, 9966, 11445, 13208, 15285, 17687, 20384, 23298, 26342, 29462, 32648, 35838, 38758, 40884, 41537, 40355, 37496, 33564, 29178, 25035, 21329, 18155, 15497, 13296, 11478, 9974, 8726, 7683, 6808, 6067, 5437, 4897, 4431, 4028, 3676, 3368, 3096, 2856, 2643, 2452, 2282, 2129, 1990, 1866, 1752, 1649, 1555, 1469, 1390, 1318, 1251, 1189, 1133, 1080, 1031, 986, 944, 905, 868, 834, 802, 773, 745, 719, 694, 671, 650, 630, 611, 593, 576, 560, 546, 532, 519, 507, 496, 485, 475, 466, 458, 450, 443, 436, 431, 425, 421, 417, 413, 411, 409, 407, 406, 406, 407, 408, 410, 414, 418, 423, 429, 436, 444, 454, 466, 479, 494, 511, 531, 553, 579, 608, 642, 680, 724, 775, 834, 903]
370.29416I84R4J11J33J58J89K30K78L38M10M93N84O65O91O81N30K51F721
346.64365F300p23p12o94o25n37m49l71l06k53k09j74j46j23j05q9p7F41
322.99313E83n0m5l9l4l1k8k5k2k0j9j6j5j4N3j1j0qUoUnmVlklkTjJ65C48
275.69208C50KLKLMLMUNVOUPUQPRQRJ0RJ1J0J1J2TJ3TJ4TJ5J6TJ7J8J9G28
219.19359G49K2TK4K5K6K8K9L1L2L5L6L8M1M3M6M8N2N5N9O3O8P2P8O8A881
185.03171A979J07J16J27J38J52J66J85K04K27K54K85L22L66M16M79N53F719
161.3812G473Q89J055J259J509J808K154K528K874L088L008K473J450C1726
142.98633C0715j734j935j732j293p46j54M59J101J789K548L394M328D2039
$$ y = [984, 1078, 1189, 1322, 1480, 1669, 1899, 2177, 2515, 2925, 3418, 4002, 4667, 5358, 6039, 6569, 6820, 6721, 6300, 5577, 4865, 4171, 3546, 3009, 2560, 2189, 1883, 1630, 1421, 1247, 1101, 978, 873, 784, 707, 641, 583, 533, 488, 449, 415, 384, 356, 331, 309, 289, 270, 254, 239, 225, 278, 267, 257, 249, 241, 233, 227, 221, 215, 210, 206, 202, 198, 194, 191, 189, 186, 184, 182, 181, 346, 348, 350, 352, 355, 357, 360, 364, 367, 371, 375, 379, 384, 389, 394, 399, 405, 411, 417, 424, 431, 438, 446, 453, 462, 470, 479, 489, 498, 509, 519, 530, 542, 554, 567, 580, 594, 608, 623, 639, 655, 672, 690, 709, 728, 749, 771, 793, 817, 842, 868, 896, 925, 956, 988, 1023, 1059, 1097, 1138, 1181, 1227, 1275, 1327, 1382, 1441, 1504, 1572, 1644, 1722, 1790, 1881, 1979, 2086, 2202, 2329, 2467, 2619, 2785, 2970, 3174, 3401, 3655, 3940, 4262, 4628, 5044, 5523, 6076, 6719, 7473, 8362, 9417, 10676, 12185, 13993, 16147, 18675, 21549, 24637, 27645, 30118, 31568, 31726, 30715, 28981, 27046, 25314, 24021, 23275, 23121, 23580, 24681, 26470, 29018, 32412, 36740, 42039]
124.59148D8217O692O433M990K276j157m312o373p155o974o272n388m517B2716
106.196625A9624k557k123j772j489j260j072r19p93o88n99n27m64m10D585
86.487854D258k92k64k38k16j96j79j64j50j37j27j17j09j00r3q7q0p6A563
61.523407A497o2n8n5n1m9m5m3m1l9l6l5l3l1l0k9H33
$$ y = [48217, 54909, 61342, 66332, 68608, 67451, 63139, 56766, 49611, 42637, 36365, 30977, 26460, 22716, 19624, 17067, 14944, 13172, 11683, 10423, 9351, 8432, 7639, 6951, 6352, 5825, 5361, 4951, 4585, 4258, 3966, 3702, 3464, 3248, 3052, 2873, 2709, 2559, 2422, 2295, 2178, 2069, 1969, 1876, 1789, 1709, 1633, 1563, 1497, 1435, 1377, 1322, 1271, 1222, 1177, 1134, 1093, 1054, 1018, 983, 950, 919, 889, 860, 833]
39.1868H08  $$checkpoint
##END=$$ End of the RAMAN for P(CN)3
##END= $$ end of file