##TITLE= P(CN)3
##JCAMP-DX=5.01
##DATA TYPE= LINK
##BLOCKS= 2
##TITLE= P(CN)3
##JCAMP-DX= 5.01
##DATA TYPE= INFRARED SPECTRUM
##DATA CLASS= XYDATA
##BLOCK ID=1
##ORIGIN= WebMO Gaussian HF Simulation
##OWNER= public domain
##LONGDATE= Fri, 2 Mar 2018 15:27:14 -0500 $$ export date from JSpecView
##SPECTROMETER/DATA SYSTEM= simulation
##$MODELS=
<Models>
<ModelData id="IRP" type="MOL">
P(CN)3.mol
__Jmol-14_03021815443D 1   1.00000     0.00000     0
Jmol version 14.29.4  2018-02-08 00:40 EXTRACT: ({0:6})
  7  6  0  0  0  0            999 V2000
    0.0000   -0.0000    0.8014 P   0  0  0  0  0  0
    0.0000    1.5688   -0.0668 C   0  0  0  0  0  0
    0.0000    2.6118   -0.5152 N   0  0  0  0  0  0
   -1.3587   -0.7844   -0.0668 C   0  0  0  0  0  0
   -2.2618   -1.3059   -0.5152 N   0  0  0  0  0  0
    1.3587   -0.7844   -0.0668 C   0  0  0  0  0  0
    2.2618   -1.3059   -0.5152 N   0  0  0  0  0  0
  1  6  1  0  0  0
  1  2  1  0  0  0
  2  3  1  0  0  0
  4  1  1  0  0  0
  5  4  1  0  0  0
  6  7  1  0  0  0
M  END
</ModelData>
<ModelData id="Mi" type="XYZVIB" baseModel="IRP" vibrationScale=".5">
7
Model[1]: PATH=Calculation 1;Standard;Energy=-617.6208;PATH=Calculation 1;Standard
P       0.00000     -0.00000      0.80145
C       0.00000      1.56884     -0.06678
N       0.00000      2.61175     -0.51523
C      -1.35866     -0.78442     -0.06678
N      -2.26184     -1.30587     -0.51523
C       1.35866     -0.78442     -0.06678
N       2.26184     -1.30587     -0.51523
7
Model[2]: PATH=Calculation 2;Input;Energy=-617.6208;Range=M.O.s;NFock==Conv=0.14D-08;E(RHF)=-617.620791770 A.U.;PATH=Calculation 2;Input
P      -0.05896     -0.23961      0.01652
C       1.20912      0.41919      1.09959
N       2.02141      0.73241      1.82818
C      -1.32941      0.98976      0.31598
N      -2.20465      1.68228      0.52364
C       0.56435      0.39583     -1.54001
N       0.94802      0.69353     -2.56613
7
Model[3]: PATH=Calculation 2;Standard;Energy=-617.6208;Range=M.O.s;NFock==Conv=0.14D-08;E(RHF)=-617.620791770 A.U.;PATH=Calculation 2;Standard
P      -0.00000     -0.00000      0.80145
C      -0.00000      1.56884     -0.06678
N      -0.00000      2.61175     -0.51523
C      -1.35866     -0.78442     -0.06678
N      -2.26184     -1.30587     -0.51523
C       1.35866     -0.78442     -0.06678
N       2.26184     -1.30587     -0.51523
7
Model[4]: IRIntensity=6.8710 KM/Mole;PATH=Calculation 2;FrequenciesFrequencies;ReducedMass=14.5585 AMU;ForceConstant=0.1218 mDyne/A;FreqValue=119.1868;Frequency=119.1868 cm^-1;FrequencyLabel=E;PATH=Calculation 2;FrequenciesFrequencies
P      -0.00000     -0.00000      0.80145     -0.00000     -0.20001     -0.00000
C      -0.00000      1.56884     -0.06678      0.00000     -0.21000     -0.01000
N      -0.00000      2.61175     -0.51523      0.00000     -0.28000     -0.17000
C      -1.35866     -0.78442     -0.06678     -0.12000      0.00000      0.00000
$$ [...]
P      -0.00000     -0.00000      0.80145     -0.03000     -0.00000      0.00000
C      -0.00000      1.56884     -0.06678     -0.00000      0.00000     -0.00000
N      -0.00000      2.61175     -0.51523      0.00000     -0.00000      0.00000
C      -1.35866     -0.78442     -0.06678      0.44000      0.26000      0.23001
N      -2.26184     -1.30587     -0.51523     -0.35000     -0.20001     -0.17000
C       1.35866     -0.78442     -0.06678      0.44000     -0.26000     -0.23001
N       2.26184     -1.30587     -0.51523     -0.35000      0.20001      0.17000
7
Model[18]: IRIntensity=2.6725 KM/Mole;PATH=Calculation 2;FrequenciesFrequencies;ReducedMass=12.7634 AMU;ForceConstant=50.3291 mDyne/A;FreqValue=2587.0231;Frequency=2587.0231 cm^-1;FrequencyLabel=A1;PATH=Calculation 2;FrequenciesFrequencies
P      -0.00000     -0.00000      0.80145      0.00000     -0.00000      0.02000
C      -0.00000      1.56884     -0.06678      0.00000      0.42000     -0.18001
N      -0.00000      2.61175     -0.51523     -0.00000     -0.33001      0.14000
C      -1.35866     -0.78442     -0.06678     -0.36001     -0.21000     -0.18001
N      -2.26184     -1.30587     -0.51523      0.28000      0.16000      0.14000
C       1.35866     -0.78442     -0.06678      0.36001     -0.21000     -0.18001
N       2.26184     -1.30587     -0.51523     -0.28000      0.16000      0.14000
</ModelData>
</Models>
##$PEAKS=
<Peaks type="IR" xUnitsExpected="1/cm"  >
<PeakData id="1" title="1 (~3160 cm-1)" peakShape="broad" model="Mi1.14" xMax="3195" xMin="3165"    />
<PeakData id="2" title="2 (~3160 cm-1)" peakShape="broad" model="Mi1.13" xMax="3125" xMin="3085"    />
<PeakData id="3" title="3 (~1740 cm-1)" peakShape="broad" model="Mi1.12" xMax="1785" xMin="1750"    />
<PeakData id="4" title="4 (~1510 cm-1)" peakShape="broad" model="Mi1.10" xMax="1560" xMin="1530"    />
<PeakData id="5" title="5 (~1510 cm-1)" peakShape="broad" model="Mi1.11" xMax="1290" xMin="1260"    />
<PeakData id="6" title="6 (~1360 cm-1)" peakShape="broad" model="Mi1.9" xMax="1180" xMin="1150"    />
<PeakData id="7" title="7 (~960 cm-1)" peakShape="broad" model="Mi1.7" xMax="955" xMin="925"    />
<PeakData id="8" title="8 (~960 cm-1)" peakShape="broad" model="Mi1.6" xMax="915" xMin="885"    />
<PeakData id="9" title="9 (~765 cm-1)" peakShape="broad" model="Mi1.8" xMax="675" xMin="645"    />
<PeakData id="10" title="10 (~615 cm-1)" peakShape="broad" model="Mi1.4" xMax="570" xMin="540"    />
<PeakData id="11" title="11 (~510 cm-1)" peakShape="broad" model="Mi1.5" xMax="470" xMin="440"    />
<PeakData id="12" title="12 (~173 cm-1)" peakShape="broad" model="Mi1.3" xMax="340" xMin="310"    />
</Peaks>
##XUNITS= 1/CM
##YUNITS= TRANSMITTANCE
##XFACTOR= 1
##YFACTOR= 9.999000E-07
##FIRSTX= 2.665709E+03
##FIRSTY= 9.839637E-01
##LASTX= 3.918680E+01
##NPOINTS= 2000
##MINY= 10.000000E-05
##MAXY= 1
##XYDATA= (X++(Y..Y))
2665.7092I84062n20n46n73o02o33o66p02p40p81q24q72r23r78j038j101I71392
2643.3726I70145j328j418j515j621j738j865k005k160k329k518k726I45964
2626.2917I42748l504l826m188m596n056n578o170o845p618q504r523H66638
2609.2107H54574j3648j5489j7633k0133k3039k6409l0282l4678l9560E88914
2594.7576E38850n4845n8289n9300n6756m9960l9089k5182r574O680K2721B52619
2578.9905C01662N6522N9544N8817N5514N0778M5487M0210L5266L0802G61465
2564.5376G84899K0473J7927J5741J3866J2252J0864R665Q626P725O939I15229
2548.7705I20879N120M652M239L871L544L251K990K755K544K353K181I60404
$$ plain form
2665.7092 984062 983542 982996 982423 981821 981188 980522 979820 979080 978299 977475 976603 975680 974702 973664 972563 971392
2643.3726 970145 968817 967399 965884 964263 962525 960660 958655 956495 954166 951648 948922 945964
2626.2917 942748 939244 935418 931230 926634 921578 916000 909830 902985 895367 886863 877340 866638
2609.2107 854574 840926 825437 807804 787671 764632 738223 707941 673263 633703 588914
2594.7576 538850 484005 425716 366416 309660 259700 220611 195429 185855 192535 215256 252619
2578.9905 301662 358184 417728 476545 532059 582837 628324 668534 703800 734602 761465
2564.5376 784899 805372 823299 839040 852906 865158 876022 885687 894313 902038 908977 915229
2548.7705 920879 925999 930651 934890 938761 942305 945556 948546 951301 953845 956198 958379 960404
2531.6895I62286J754J636J528J431J339J257J181J110J046R85R30Q79I78193
2513.2947I78979P45P07O71O37O06N77N49N23N00M76M55M35M16L98L82I87421
2490.958I87771L36L23L09K98K86K75K65K55K46K36K29K20K12K05J98I91855
2468.6213I92040J79J73J67J62J56J52J47J43J38J34J30J26J23J19J15I94316
$$ plain form
2531.6895 962286 964040 965676 967204 968635 969974 971231 972412 973522 974568 975553 976483 977362 978193
2513.2947 978979 979724 980431 981102 981739 982345 982922 983471 983994 984494 984970 985425 985860 986276 986674 987056 987421
2490.958 987771 988107 988430 988739 989037 989323 989598 989863 990118 990364 990600 990829 991049 991261 991466 991664 991855
2468.6213 992040 992219 992392 992559 992721 992877 993029 993176 993319 993457 993591 993721 993847 993970 994089 994204 994316
2446.285I94425J06J03J01R7R5R2R0Q8Q5Q3Q1P9P7P5P3M03O4L883%S184k2791I76934
863.0135I76549l94m04m15m25m36m47m59m71m84m97n11n24n39n54n70I68834
840.6769I68231o20o39o57o76o98p18p40p64p87q12q38q66q93n480j024I50960
818.3403I49866j131j169j209j252j295j342j390j441j493j550j608I33317
801.25934I31583j802j874j948k029k111k201k293k392k496k606k723I04262
784.1784I01285l117l264l421l588l766l955m157m373m603m850n113H51683
767.0975H45985o023o373o747p152p586q056q562r109r699j0339j1030G43530
750.01654G30940j3468j4421j5451j6566j7773j9075k0476k1981k3590E42842
735.5634E15744k8975l0902l2840l4734l6501l8032l9190l9795l9648A56598
$$ plain form
863.0135 976549 976155 975751 975336 974911 974475 974028 973569 973098 972614 972117 971606 971082 970543 969989 969419 968834
840.6769 968231 967611 966972 966315 965639 964941 964223 963483 962719 961932 961120 960282 959416 958523 953043 952019 950960
818.3403 949866 948735 947566 946357 945105 943810 942468 941078 939637 938144 936594 934986 933317
801.25934 931583 929781 927907 925959 923930 921819 919618 917325 914933 912437 909831 907108 904262
784.1784 901285 898168 894904 891483 887895 884129 880174 876017 871644 867041 862191 857078 851683
767.0975 845985 839962 833589 826842 819690 812104 804048 795486 786377 776678 766339 755309 743530
750.01654 730940 717472 703051 687600 671034 653261 634186 613710 591729 568139 542842
735.5634 515744 486769 455867 423027 388293 351792 313760 274570 234775 195127 156598
721.1103A20351l2691k7916k2213j6159j0510n976k919j224m50j51m2A14
704.02936B01K70P62J923M184P786J2532J7813K2863K7027K9915L1393A88184
686.9484B18623K8351K5429K1815J7616J2897P700K059l982j0321j6751B80534
671.18146B52363l1737l2681l0312k4564j6111n979N076J6638K8098L8320B45147
655.4144B95672N1880N0767M8022M4394M0431L6485L2754K9338K6269F79556
640.9613G00696J9027J7173J5545J4112J2851J1738J0750R875R094Q397H37030
625.1943H44241O704O246N831N455N110M797M510M246M004L781L574I01883
608.11334I05090L044K891K749K617K493K378K270K168K073J983J900I33475
$$ plain form
721.1103 120351 87660 59744 37531 21372 10862 4886 1967 743 293 142 100 114
704.02936 201 471 1233 3156 7340 15126 27658 45471 68334 95361 125276 156669 188184
686.9484 218623 246974 272403 294218 311834 324731 332431 334490 330508 320187 303436 280534
671.18146 252363 220626 187945 157633 133069 116958 110979 116055 132693 160791 199111 245147
655.4144 295672 347552 398319 446341 490735 531166 567651 600405 629743 656012 679556
640.9613 700696 719723 736896 752441 766553 779404 791142 801892 811767 820861 829258 837030
625.1943 844241 850945 857191 863022 868477 873587 878384 882894 887140 891144 894925 898499 901883
608.11334 905090 908134 911025 913774 916391 918884 921262 923532 925700 927773 929756 931656 933475
591.0324I35221J674J608J544J485J428J374J324J275J229J185J143I51594
573.9515I52660J029R95R62R30R00Q71Q43Q17P91P66P43P20O98O77O57I65695
551.61487I66313N99N81N64N46K2560J67J59J51J43J34J25J16J06R6Q4I92516
529.27826I92573M2K3Jk3n5r1j35j90k56l33m24n19o07o56o26j628k00I87060
504.3138I87559P17N411P10O36N43M50L68K98K42J94J57J26J01Q1O4I97706
481.9772I97744K8J9J1Njoj1j6j9k3k6l0l3l5l9m2m5m7n1n3n7n9o3o5I97017
447.81534I96944p6p9q4q7r2r6j00j05j11j16j21j28j34j41j48j55j64I94834
422.8509I94652j91k03k14k26k40k54k69k86l04l23l45l68l92m21m50I89683
$$ plain form
591.0324 935221 936895 938503 940047 941532 942960 944334 945658 946933 948162 949347 950490 951594
573.9515 952660 953689 954684 955646 956576 957476 958347 959190 960007 960798 961564 962307 963027 963725 964402 965059 965695
551.61487 966313 966912 967493 968057 968603 991163 991330 991489 991640 991783 991917 992042 992158 992264 992360 992444 992516
529.27826 992573 992615 992638 992639 992616 992561 992470 992335 992145 991889 991556 991132 990613 990006 989350 988724 987096 986896 987060
504.3138 987559 988276 993687 994397 995033 995576 996026 996394 996692 996934 997128 997285 997411 997512 997593 997657 997706
481.9772 997744 997772 997791 997802 997807 997806 997800 997789 997773 997754 997731 997705 997675 997642 997607 997568 997526 997481 997434 997383 997330 997273 997214 997151 997086 997017
447.81534 996944 996868 996789 996705 996618 996526 996430 996330 996225 996114 995998 995877 995749 995615 995474 995326 995171 995007 994834
422.8509 994652 994461 994258 994044 993818 993578 993324 993055 992769 992465 992142 991797 991429 991037 990616 990166 989683
400.51428I89163n59o02o52p05p65q31r06r89j082j188j308j443j598I74761
380.8055I72783k212k483k800l169l603m117m726n454o325p375q645I11690
363.72458H99640j4304j7010k0199k3847k7787l1603l4487l5153l2036F39269
349.27148F28165M252J8620K9025L4301L5157L3094K9572K5617K1803H78003
334.8184H93476J3021J0987R307P922O778N830N040M381L826L358K960I69508
317.73746I71838K081J864J675J512J367J241J130J031R43j733P50O86I85014
299.3426I85590N30M87M48M13L80L50L23K97K74K51K32K12J95J78J63I88731
277.00598I88836R1P7O5N3M0L0J8Qlj4k3l3m3n3o3p3q2r2j02j12j22j33I88127
$$ plain form
400.51428 989163 988604 988002 987350 986645 985880 985049 984143 983154 982072 980884 979576 978133 976535 974761
380.8055 972783 970571 968088 965288 962119 958516 954399 949673 944219 937894 930519 921874 911690
363.72458 899640 885336 868326 848127 824280 796493 764890 730403 695250 663214 639269
349.27148 628165 632417 651037 680062 714363 749520 782614 812186 837803 859606 878003
334.8184 893476 906497 917484 926791 934713 941491 947321 952361 956742 960568 963926 966886 969508
317.73746 971838 973919 975783 977458 978970 980337 981578 982708 983739 984682 982949 983699 984385 985014
299.3426 985590 986120 986607 987055 987468 987848 988198 988521 988818 989092 989343 989575 989787 989982 990160 990323 988731
277.00598 988836 988927 989004 989069 989122 989162 989192 989210 989218 989215 989201 989178 989145 989102 989049 988986 988913 988831 988739 988637 988525 988403 988270 988127
245.47195I87974j65j76j88k00k12k26k38k53k67k82k98l15l32l51l70I83710
223.13535I83298m35m59m84n12n41n72o05o41o78p19p62q10q60r14r74I72294
200.79874I71187j183j265j356j453j562j680j811j955k115j201k510I50366
183.7178I47390l253l565l918m318m773n295n892o580p376q300r378H74104
166.63686H61985j3860j5917j8343k1204k4558k8456l2904l7827m2999E77978
152.18376E26172n3367n1152m3952l1525j5033L181K0281L3683M1772D74393
137.73067E16718L7205L0308K2570J4520O400j705r717j7438k4376k9613E13100
121.963646D83799k1204p931Q247K3942L6079M3106M5227M3738M0150L5681G61936
$$ plain form
245.47195 987974 987809 987633 987445 987245 987033 986807 986569 986316 986049 985767 985469 985154 984822 984471 984101 983710
223.13535 983298 982863 982404 981920 981408 980867 980295 979690 979049 978371 977652 976890 976080 975220 974306 973332 972294
200.79874 971187 970004 968739 967383 965930 964368 962688 960877 958922 956807 955606 953096 950366
183.7178 947390 944137 940572 936654 932336 927563 922268 916376 909796 902420 894120 884742 874104
166.63686 861985 848125 832208 813865 792661 768103 739647 706743 668916 625917 577978
152.18376 526172 472805 421653 377701 346176 331143 334324 354605 388288 430060 474393
137.73067 516718 553923 584231 606801 621321 627721 626016 616299 598861 574485 544872 513100
121.963646 483799 462595 454664 462911 486853 522932 566038 611265 655003 695153 730834 761936
106.196625G88767K3041J9770J6990J4649J2679J1024R631Q453P454O603I24936
90.42961I30185M708M239L831L473L158K882K636K418K223K050J894I65450
73.34867I67077J512J409J314J228J149J078J011R51Q95Q44P96P53P11I81402
53.6399I82040O06N75N47N20M96M72M50M30M11I86940
$$ plain form
106.196625 788767 811808 831578 848568 863217 875896 886920 896551 905004 912458 919061 924936
90.42961 930185 934893 939132 942963 946436 949594 952476 955112 957530 959753 961803 963697 965450
73.34867 967077 968589 969998 971312 972540 973689 974767 975778 976729 977624 978468 979264 980017 980728 981402
53.6399 982040 982646 983221 983768 984288 984784 985256 985706 986136 986547 986940
39.1868I87315  $$checkpoint
##END= $$ end of P(CN)3 IR
##TITLE=Raman of P(CN)3 $$ Begin of the data block
##JCAMP-DX=5.01 $$
##DATA TYPE=RAMAN SPECTRUM
##DATA CLASS=XYDATA
##BLOCK ID=2
##DATE=19 Feb 2012 10:29:22
##ORIGIN= WebMO Gaussian HF calculation
##OWNER= public domain
##SPECTROMETER/DATA SYSTEM= simulation
##$MODELS=
<Models>
<ModelData id="RP" type="MOL">
P(CN)3.mol
__Jmol-14_03021815443D 1   1.00000     0.00000     0
Jmol version 14.29.4  2018-02-08 00:40 EXTRACT: ({0:6})
  7  6  0  0  0  0            999 V2000
    0.0000   -0.0000    0.8014 P   0  0  0  0  0  0
    0.0000    1.5688   -0.0668 C   0  0  0  0  0  0
    0.0000    2.6118   -0.5152 N   0  0  0  0  0  0
   -1.3587   -0.7844   -0.0668 C   0  0  0  0  0  0
   -2.2618   -1.3059   -0.5152 N   0  0  0  0  0  0
    1.3587   -0.7844   -0.0668 C   0  0  0  0  0  0
    2.2618   -1.3059   -0.5152 N   0  0  0  0  0  0
  1  6  1  0  0  0
  1  2  1  0  0  0
  2  3  1  0  0  0
  4  1  1  0  0  0
  5  4  1  0  0  0
  6  7  1  0  0  0
M  END
</ModelData>
<ModelData id="MR" type="XYZVIB" baseModel="RP" vibrationScale=".5">
7
Model[1]: PATH=Calculation 1;Standard;Energy=-617.6208;PATH=Calculation 1;Standard
P       0.00000     -0.00000      0.80145
C       0.00000      1.56884     -0.06678
N       0.00000      2.61175     -0.51523
C      -1.35866     -0.78442     -0.06678
N      -2.26184     -1.30587     -0.51523
C       1.35866     -0.78442     -0.06678
N       2.26184     -1.30587     -0.51523
7
Model[2]: PATH=Calculation 2;Input;Energy=-617.6208;Range=M.O.s;NFock==Conv=0.14D-08;E(RHF)=-617.620791770 A.U.;PATH=Calculation 2;Input
P      -0.05896     -0.23961      0.01652
C       1.20912      0.41919      1.09959
N       2.02141      0.73241      1.82818
C      -1.32941      0.98976      0.31598
N      -2.20465      1.68228      0.52364
C       0.56435      0.39583     -1.54001
N       0.94802      0.69353     -2.56613
7
Model[3]: PATH=Calculation 2;Standard;Energy=-617.6208;Range=M.O.s;NFock==Conv=0.14D-08;E(RHF)=-617.620791770 A.U.;PATH=Calculation 2;Standard
P      -0.00000     -0.00000      0.80145
C      -0.00000      1.56884     -0.06678
N      -0.00000      2.61175     -0.51523
C      -1.35866     -0.78442     -0.06678
N      -2.26184     -1.30587     -0.51523
C       1.35866     -0.78442     -0.06678
N       2.26184     -1.30587     -0.51523
7
Model[4]: IRIntensity=6.8710 KM/Mole;PATH=Calculation 2;FrequenciesFrequencies;ReducedMass=14.5585 AMU;ForceConstant=0.1218 mDyne/A;FreqValue=119.1868;Frequency=119.1868 cm^-1;FrequencyLabel=E;PATH=Calculation 2;FrequenciesFrequencies
P      -0.00000     -0.00000      0.80145     -0.00000     -0.20001     -0.00000
C      -0.00000      1.56884     -0.06678      0.00000     -0.21000     -0.01000
N      -0.00000      2.61175     -0.51523      0.00000     -0.28000     -0.17000
C      -1.35866     -0.78442     -0.06678     -0.12000      0.00000      0.00000
N      -2.26184     -1.30587     -0.51523     -0.42000      0.45000      0.08000
C       1.35866     -0.78442     -0.06678      0.12000      0.00000      0.00000
N       2.26184     -1.30587     -0.51523      0.42000      0.45000      0.08000
7
Model[5]: IRIntensity=6.8710 KM/Mole;PATH=Calculation 2;FrequenciesFrequencies;ReducedMass=14.5585 AMU;ForceConstant=0.1218 mDyne/A;FreqValue=119.1868;Frequency=119.1868 cm^-1;FrequencyLabel=E;PATH=Calculation 2;FrequenciesFrequencies
P      -0.00000     -0.00000      0.80145     -0.20001      0.00000      0.00000
C      -0.00000      1.56884     -0.06678      0.07000      0.00000      0.00000
N      -0.00000      2.61175     -0.51523      0.70000      0.00000      0.00000
C      -1.35866     -0.78442     -0.06678     -0.14000     -0.12000      0.01000
N      -2.26184     -1.30587     -0.51523     -0.04000     -0.42000      0.15001
C       1.35866     -0.78442     -0.06678     -0.14000      0.12000     -0.01000
N       2.26184     -1.30587     -0.51523     -0.04000      0.42000     -0.15001
7
Model[6]: IRIntensity=20.6341 KM/Mole;PATH=Calculation 2;FrequenciesFrequencies;ReducedMass=16.0182 AMU;ForceConstant=0.2010 mDyne/A;FreqValue=145.9227;Frequency=145.9227 cm^-1;FrequencyLabel=A1;PATH=Calculation 2;FrequenciesFrequencies
P      -0.00000     -0.00000      0.80145      0.00000     -0.00000      0.36001
C      -0.00000      1.56884     -0.06678     -0.00000     -0.11000      0.14000
N      -0.00000      2.61175     -0.51523     -0.00000     -0.34000     -0.38000
C      -1.35866     -0.78442     -0.06678      0.10000      0.06000      0.14000
N      -2.26184     -1.30587     -0.51523      0.29000      0.17000     -0.38000
C       1.35866     -0.78442     -0.06678     -0.10000      0.06000      0.14000
N       2.26184     -1.30587     -0.51523     -0.29000      0.17000     -0.38000
7
Model[7]: IRIntensity=0.0000 KM/Mole;PATH=Calculation 2;FrequenciesFrequencies;ReducedMass=12.4196 AMU;ForceConstant=0.7877 mDyne/A;FreqValue=328.1049;Frequency=328.1049 cm^-1;FrequencyLabel=A2;PATH=Calculation 2;FrequenciesFrequencies
P      -0.00000     -0.00000      0.80145      0.00000      0.00000     -0.00000
C      -0.00000      1.56884     -0.06678      0.51000     -0.00000     -0.00000
N      -0.00000      2.61175     -0.51523     -0.26000      0.00000      0.00000
C      -1.35866     -0.78442     -0.06678     -0.26000      0.44000      0.00000
N      -2.26184     -1.30587     -0.51523      0.13000     -0.23001     -0.00000
C       1.35866     -0.78442     -0.06678     -0.26000     -0.44000     -0.00000
N       2.26184     -1.30587     -0.51523      0.13000      0.23001      0.00000
7
Model[8]: IRIntensity=4.5812 KM/Mole;PATH=Calculation 2;FrequenciesFrequencies;ReducedMass=12.6461 AMU;ForceConstant=0.9056 mDyne/A;FreqValue=348.6227;Frequency=348.6227 cm^-1;FrequencyLabel=E;PATH=Calculation 2;FrequenciesFrequencies
P      -0.00000     -0.00000      0.80145     -0.11000      0.00000      0.00000
C      -0.00000      1.56884     -0.06678      0.32000     -0.00000     -0.00000
N      -0.00000      2.61175     -0.51523     -0.15001      0.00000      0.00000
C      -1.35866     -0.78442     -0.06678      0.25000     -0.04000     -0.52000
N      -2.26184     -1.30587     -0.51523     -0.16000     -0.01000      0.26000
C       1.35866     -0.78442     -0.06678      0.25000      0.04000      0.52000
N       2.26184     -1.30587     -0.51523     -0.16000      0.01000     -0.26000
7
Model[9]: IRIntensity=4.5812 KM/Mole;PATH=Calculation 2;FrequenciesFrequencies;ReducedMass=12.6461 AMU;ForceConstant=0.9056 mDyne/A;FreqValue=348.6228;Frequency=348.6228 cm^-1;FrequencyLabel=E;PATH=Calculation 2;FrequenciesFrequencies
P      -0.00000     -0.00000      0.80145     -0.00000     -0.11000      0.00000
C      -0.00000      1.56884     -0.06678      0.00000      0.23001      0.60001
N      -0.00000      2.61175     -0.51523     -0.00000     -0.17000     -0.31000
C      -1.35866     -0.78442     -0.06678     -0.04000      0.30001     -0.30001
N      -2.26184     -1.30587     -0.51523     -0.01000     -0.15001      0.15001
C       1.35866     -0.78442     -0.06678      0.04000      0.30001     -0.30001
N       2.26184     -1.30587     -0.51523      0.01000     -0.15001      0.15001
7
Model[10]: IRIntensity=0.0702 KM/Mole;PATH=Calculation 2;FrequenciesFrequencies;ReducedMass=12.2403 AMU;ForceConstant=1.8502 mDyne/A;FreqValue=506.5137;Frequency=506.5137 cm^-1;FrequencyLabel=E;PATH=Calculation 2;FrequenciesFrequencies
P      -0.00000     -0.00000      0.80145     -0.00000     -0.01000     -0.00000
C      -0.00000      1.56884     -0.06678     -0.00000      0.31000      0.23001
N      -0.00000      2.61175     -0.51523      0.00000      0.15001     -0.18001
C      -1.35866     -0.78442     -0.06678      0.42000     -0.42000     -0.12000
N      -2.26184     -1.30587     -0.51523     -0.00000      0.16000      0.09000
C       1.35866     -0.78442     -0.06678     -0.42000     -0.42000     -0.11000
N       2.26184     -1.30587     -0.51523      0.00000      0.16000      0.09000
7
Model[11]: IRIntensity=0.0702 KM/Mole;PATH=Calculation 2;FrequenciesFrequencies;ReducedMass=12.2403 AMU;ForceConstant=1.8502 mDyne/A;FreqValue=506.5137;Frequency=506.5137 cm^-1;FrequencyLabel=E;PATH=Calculation 2;FrequenciesFrequencies
P      -0.00000     -0.00000      0.80145      0.01000     -0.00000     -0.00000
C      -0.00000      1.56884     -0.06678      0.66001      0.00000      0.00000
N      -0.00000      2.61175     -0.51523     -0.16000      0.00000     -0.00000
C      -1.35866     -0.78442     -0.06678     -0.07000     -0.42000      0.20001
N      -2.26184     -1.30587     -0.51523     -0.16000      0.00000     -0.15001
C       1.35866     -0.78442     -0.06678     -0.07000      0.42000     -0.20001
N       2.26184     -1.30587     -0.51523     -0.16000     -0.00000      0.15001
7
Model[12]: IRIntensity=0.0002 KM/Mole;PATH=Calculation 2;FrequenciesFrequencies;ReducedMass=12.5733 AMU;ForceConstant=1.9592 mDyne/A;FreqValue=514.2732;Frequency=514.2732 cm^-1;FrequencyLabel=A1;PATH=Calculation 2;FrequenciesFrequencies
P      -0.00000     -0.00000      0.80145     -0.00000      0.00000     -0.03000
C      -0.00000      1.56884     -0.06678      0.00000      0.40000      0.28000
N      -0.00000      2.61175     -0.51523     -0.00000      0.21000     -0.22000
C      -1.35866     -0.78442     -0.06678     -0.35000     -0.20001      0.28000
N      -2.26184     -1.30587     -0.51523     -0.18001     -0.10000     -0.22000
C       1.35866     -0.78442     -0.06678      0.35000     -0.20001      0.28000
N       2.26184     -1.30587     -0.51523      0.18001     -0.10000     -0.22000
7
Model[13]: IRIntensity=37.2939 KM/Mole;PATH=Calculation 2;FrequenciesFrequencies;ReducedMass=17.4714 AMU;ForceConstant=4.5296 mDyne/A;FreqValue=663.3505;Frequency=663.3505 cm^-1;FrequencyLabel=A1;PATH=Calculation 2;FrequenciesFrequencies
P      -0.00000     -0.00000      0.80145     -0.00000     -0.00000      0.51000
C      -0.00000      1.56884     -0.06678      0.00000      0.10000     -0.39000
N      -0.00000      2.61175     -0.51523      0.00000      0.29000     -0.05000
C      -1.35866     -0.78442     -0.06678     -0.09000     -0.05000     -0.39000
N      -2.26184     -1.30587     -0.51523     -0.25000     -0.15001     -0.05000
C       1.35866     -0.78442     -0.06678      0.09000     -0.05000     -0.39000
N       2.26184     -1.30587     -0.51523      0.25000     -0.15001     -0.05000
7
Model[14]: IRIntensity=90.1274 KM/Mole;PATH=Calculation 2;FrequenciesFrequencies;ReducedMass=18.4460 AMU;ForceConstant=5.4289 mDyne/A;FreqValue=706.7721;Frequency=706.7721 cm^-1;FrequencyLabel=E;PATH=Calculation 2;FrequenciesFrequencies
P      -0.00000     -0.00000      0.80145      0.55000     -0.00000     -0.00000
C      -0.00000      1.56884     -0.06678     -0.19000      0.00000     -0.00000
N      -0.00000      2.61175     -0.51523      0.04000      0.00000     -0.00000
C      -1.35866     -0.78442     -0.06678     -0.26000     -0.04000     -0.30001
N      -2.26184     -1.30587     -0.51523     -0.33001     -0.21000     -0.14000
C       1.35866     -0.78442     -0.06678     -0.26000      0.04000      0.30001
N       2.26184     -1.30587     -0.51523     -0.33001      0.21000      0.14000
7
Model[15]: IRIntensity=90.1274 KM/Mole;PATH=Calculation 2;FrequenciesFrequencies;ReducedMass=18.4460 AMU;ForceConstant=5.4289 mDyne/A;FreqValue=706.7721;Frequency=706.7721 cm^-1;FrequencyLabel=E;PATH=Calculation 2;FrequenciesFrequencies
P      -0.00000     -0.00000      0.80145      0.00000      0.55000      0.00000
C      -0.00000      1.56884     -0.06678     -0.00000     -0.29000      0.34000
N      -0.00000      2.61175     -0.51523      0.00000     -0.45000      0.16000
C      -1.35866     -0.78442     -0.06678     -0.04000     -0.21000     -0.17000
N      -2.26184     -1.30587     -0.51523     -0.21000     -0.08000     -0.08000
C       1.35866     -0.78442     -0.06678      0.04000     -0.21000     -0.17000
N       2.26184     -1.30587     -0.51523      0.21000     -0.08000     -0.08000
7
Model[16]: IRIntensity=15.3452 KM/Mole;PATH=Calculation 2;FrequenciesFrequencies;ReducedMass=12.7750 AMU;ForceConstant=50.2640 mDyne/A;FreqValue=2584.1783;Frequency=2584.1783 cm^-1;FrequencyLabel=E;PATH=Calculation 2;FrequenciesFrequencies
P      -0.00000     -0.00000      0.80145      0.00000     -0.03000     -0.00000
C      -0.00000      1.56884     -0.06678      0.00000      0.59000     -0.26000
N      -0.00000      2.61175     -0.51523     -0.00000     -0.46001      0.20001
C      -1.35866     -0.78442     -0.06678      0.26000      0.14000      0.13000
N      -2.26184     -1.30587     -0.51523     -0.20001     -0.12000     -0.10000
C       1.35866     -0.78442     -0.06678     -0.26000      0.14000      0.13000
N       2.26184     -1.30587     -0.51523      0.20001     -0.12000     -0.10000
7
Model[17]: IRIntensity=15.3452 KM/Mole;PATH=Calculation 2;FrequenciesFrequencies;ReducedMass=12.7750 AMU;ForceConstant=50.2640 mDyne/A;FreqValue=2584.1783;Frequency=2584.1783 cm^-1;FrequencyLabel=E;PATH=Calculation 2;FrequenciesFrequencies
P      -0.00000     -0.00000      0.80145     -0.03000     -0.00000      0.00000
C      -0.00000      1.56884     -0.06678     -0.00000      0.00000     -0.00000
N      -0.00000      2.61175     -0.51523      0.00000     -0.00000      0.00000
C      -1.35866     -0.78442     -0.06678      0.44000      0.26000      0.23001
N      -2.26184     -1.30587     -0.51523     -0.35000     -0.20001     -0.17000
C       1.35866     -0.78442     -0.06678      0.44000     -0.26000     -0.23001
N       2.26184     -1.30587     -0.51523     -0.35000      0.20001      0.17000
7
Model[18]: IRIntensity=2.6725 KM/Mole;PATH=Calculation 2;FrequenciesFrequencies;ReducedMass=12.7634 AMU;ForceConstant=50.3291 mDyne/A;FreqValue=2587.0231;Frequency=2587.0231 cm^-1;FrequencyLabel=A1;PATH=Calculation 2;FrequenciesFrequencies
P      -0.00000     -0.00000      0.80145      0.00000     -0.00000      0.02000
C      -0.00000      1.56884     -0.06678      0.00000      0.42000     -0.18001
N      -0.00000      2.61175     -0.51523     -0.00000     -0.33001      0.14000
C      -1.35866     -0.78442     -0.06678     -0.36001     -0.21000     -0.18001
N      -2.26184     -1.30587     -0.51523      0.28000      0.16000      0.14000
C       1.35866     -0.78442     -0.06678      0.36001     -0.21000     -0.18001
N       2.26184     -1.30587     -0.51523     -0.28000      0.16000      0.14000
</ModelData>
</Models>
##$PEAKS=
<Peaks type="RAMAN" xUnitsExpected="1/cm"  >
<PeakData id="1" title="1 (~3160 cm-1)" peakShape="broad" model="MR2.14" xMax="3195" xMin="3165"    />
<PeakData id="2" title="2 (~3160 cm-1)" peakShape="broad" model="MR2.13" xMax="3125" xMin="3085"    />
<PeakData id="3" title="3 (~1740 cm-1)" peakShape="broad" model="MR2.12" xMax="1785" xMin="1750"    />
<PeakData id="4" title="4 (~1510 cm-1)" peakShape="broad" model="MR2.11" xMax="1560" xMin="1530"    />
<PeakData id="5" title="5 (~1510 cm-1)" peakShape="broad" model="MR2.10" xMax="1290" xMin="1260"    />
<PeakData id="6" title="6 (~1360 cm-1)" peakShape="broad" model="MR2.10" xMax="1180" xMin="1150"    />
<PeakData id="7" title="7 (~960 cm-1)" peakShape="broad" model="MR2.9" xMax="955" xMin="925"    />
<PeakData id="8" title="8 (~960 cm-1)" peakShape="broad" model="MR2.6" xMax="915" xMin="885"    />
<PeakData id="9" title="9 (~765 cm-1)" peakShape="broad" model="MR2.7" xMax="675" xMin="645"    />
<PeakData id="10" title="10 (~615 cm-1)" peakShape="broad" model="MR2.4" xMax="570" xMin="540"    />
<PeakData id="11" title="11 (~510 cm-1)" peakShape="broad" model="MR2.5" xMax="470" xMin="440"    />
<PeakData id="12" title="12 (~173 cm-1)" peakShape="broad" model="MR2.3" xMax="340" xMin="310"    />
</Peaks>
##XUNITS= 1/CM
##YUNITS=RAMAN INTENSITY
##XFACTOR= 1
##YFACTOR= 1.006694E-06
##FIRSTX= 2.665709E+03
##FIRSTY= 1.016641E-02
##LASTX= 3.918680E+01
##NPOINTS= 2000
##MINY= 0
##MAXY= 1.006694
##XYDATA= (X++(Y..Y))
2665.7092A0099L35L53L71L90M10M33M57M83N10N39N72O07O43O85P28A8392
2643.3726A9220Q86R48J016J090J173J264J364J474J598J735J889K059C7969
2624.9778D0438K715K993L311L673M091M571N129N778O539P433Q494R757A16192
2606.5828A29287J5311J8016K1337K5437L0508L6788M4522N3925O5047E17694
2592.13F07786J00083J03004R3429O7791K7907j8235n9912q8661j01573F30443
2577.6768E37887q0425o7860n6405m6607l8498l1897k6558k2244j8752A32730
2563.2236A19142j1677j0095q776p671o739n949n275m697m199l768l393D3838
2546.1426D1060k525k302k103j928j770j629j503j389j286j194j110j033B0325
$$ plain form
2665.7092 10099 10434 10787 11158 11548 11958 12391 12848 13331 13841 14380 14952 15559 16202 16887 17615 18392
2643.3726 19220 20106 21054 22070 23160 24333 25597 26961 28435 30033 31768 33657 35716 37969
2624.9778 40438 43153 46146 49457 53130 57221 61792 66921 72699 79238 86671 95165 104922 116192
2606.5828 129287 144598 162614 183951 209388 239896 276684 321206 375131 440178 517694
2592.13 607786 707869 810873 904302 972093 1000000 981765 921853 833192 731619 630443
2577.6768 537887 457462 389602 333197 286590 248092 216195 189637 167393 148641 132730
2563.2236 119142 107465 97370 88594 80923 74184 68235 62960 58263 54064 50296 46903 43838
2546.1426 41060 38535 36233 34130 32202 30432 28803 27300 25911 24625 23431 22321 21288 20325
2527.7478A9425q41p89p39o95o53o15n80n47n17m89m63m38m16l95l75A0516
2505.4111A0177l23l09k94k80k69k56k45k35k25k15k07j98j90j83j76F404
2483.0745F241j56j51j45j40j35j30j25j21j17j14j09j06j02r9r6r2r0D126
2458.11D041q2p9p7p5p2p1o8o7o5o2Tn9n8n6n5n3n2n1m9m8m7m6m4Tj438A142
$$ plain form
2527.7478 19425 18584 17795 17056 16361 15708 15093 14513 13966 13449 12960 12497 12059 11643 11248 10873 10516
2505.4111 10177 9854 9545 9251 8971 8702 8446 8201 7966 7741 7526 7319 7121 6931 6748 6572 6404
2483.0745 6241 6085 5934 5789 5649 5514 5384 5259 5138 5021 4907 4798 4692 4590 4491 4395 4303 4213 4126
2458.11 4041 3959 3880 3803 3728 3656 3585 3517 3450 3385 3323 3261 3202 3144 3088 3033 2980 2928 2877 2828 2780 2733 2687 2643 2599 1161 1142
2422.6343@%S184N8JZKJUKJTKJKJKTJKsLQ7MTNMTNXOVPOPTQURQJ0RJ0C77
784.1784C88J1J2J3TJ4TJ6TJ7J8TK0K1K3TK6TK9L0L3L4L7M0M3M7N0N4A145
746.07477A209P0P6Q4R2J02J13J26J41J58J79K02K30K64L04L54M12M85E175
721.1103E860Q21R89J196J445J732K042K324K485K383J873R27k66j360B0377
701.40155A8034k276k028j713j402j121q81o76n04l56k25j07NJ14K27G440
680.37885G922O37Q17J034J294J628J983K413K873L291L530L472K628C4753
661.984C4220k150l210l615l528l173k725k284j892j561j290j069q93F082
643.5892E449n38m60l96l43k99k61k30k04j80j60j44j29j15j05r4q5A628
619.9386A558o4n9n3m9m5m0l8l4l1k8k5k4k1j8j7j5j3j2rTonmk%JKMI50
$$ plain form
784.1784 388 399 411 424 437 451 465 481 497 514 532 550 570 591 614 637 663 689 718 748 781 815 852 892 935 982 1032 1086 1145
746.07477 1209 1279 1355 1439 1531 1633 1746 1872 2013 2171 2350 2552 2782 3046 3350 3704 4116 4601 5175
721.1103 5860 6681 7670 8866 10311 12043 14085 16409 18894 21277 23150 24077 23811 22451 20377
701.40155 18034 15758 13730 12017 10615 9494 8613 7937 7433 7077 6852 6745 6750 6864 7091 7440
680.37885 7922 8559 9376 10410 11704 13332 15315 17728 20601 23892 27422 30894 33522 34753
661.984 34220 32070 28860 25245 21717 18544 15819 13535 11643 10082 8792 7723 6830 6082
643.5892 5449 4911 4451 4055 3712 3413 3152 2922 2718 2538 2378 2234 2105 1990 1885 1791 1706 1628
619.9386 1558 1494 1435 1382 1333 1288 1248 1210 1176 1145 1117 1092 1068 1047 1029 1012 997 984 972 963 954 948 943 939 937 937 938 940 944 950
580.52106I57RJ0J2J4J5J8K0K1K5K6K9L2L6L8M2M7N0N5O1O6P3Q0Q8R7B028
546.3592B147P5J48J64J85K07K34K65L02L45L97M59N34O25P35Q71J036I966
522.7087A1445J763K077K402K697K914L044L120L186L190K920K126O53D0355
504.3138C7496l932m386m143l706l174k658k201j818j504j248j043q75F067
485.91898E437n40m66m03l52l08k72k40k13j91j70j53j39j24j14j03r4A469
462.26843A390p2o7o2n6n3m9m5m2l9l7l4l2k9k8k6k5k3k1k0j9j8j7j6E46
429.4205E32j3j2j1Tj0rqTpTnomUkUj%JTKMTNOPQJ0J2J3J5J7K0K2K6F08
378.17767F42L8M4N1N9O9Q1R4J11J33J58J89K30K78L38M10M93N84O65E358
$$ plain form
580.52106 957 966 976 988 1002 1017 1035 1055 1076 1101 1127 1156 1188 1224 1262 1304 1351 1401 1456 1517 1583 1656 1736 1824 1921 2028
546.3592 2147 2222 2370 2534 2719 2926 3160 3425 3727 4072 4469 4928 5462 6087 6822 7693 8729 9966
522.7087 11445 13208 15285 17687 20384 23298 26342 29462 32648 35838 38758 40884 41537 40355
504.3138 37496 33564 29178 25035 21329 18155 15497 13296 11478 9974 8726 7683 6808 6067
485.91898 5437 4897 4431 4028 3676 3368 3096 2856 2643 2452 2282 2129 1990 1866 1752 1649 1555 1469
462.26843 1390 1318 1251 1189 1133 1080 1031 986 944 905 868 834 802 773 745 719 694 671 650 630 611 593 576 560 546
429.4205 532 519 507 496 485 475 466 458 450 443 436 431 425 421 417 413 411 409 407 406 406 407 408 410 414 418 423 429 436 444 454 466 479 494 511 531 553 579 608
378.17767 642 680 724 775 834 903 984 1078 1189 1322 1480 1669 1899 2177 2515 2925 3418 4002 4667 5358
351.89932F039N30K51r9m21p23p12o94o25n37m49l71l06k53k09j74j46I78
328.24878H73q9p7o6n8n0m5l9l4l1k8k5k2k0j9j6j5j4N3j1j0qUoUnmVlA89
283.57556A86kTjJ65KULKLMLMUNVOUPUQPRQRJ0RJ1J0J1J2TJ3TJ4TJ5J6F55
224.44926F72J8J9TK1K2TK4K5K6K8K9L1L2L5L6L8M1M3M6M8N2N5N9O3O8A644
188.97346A722O8R1R8J07J16J27J38J52J66J85K04K27K54K85L22L66M16E523
164.00902F076O43P54Q89J055J259J509J808K154K528K874L088L008K473C1568
144.30025C1726j011j734j935j732j293p46j54M59J101J789K548L394C6740
125.905396D2039O178O692O433M990K276j157m312o373p155o974o272n388B6460
$$ plain form
351.89932 6039 6569 6820 6721 6300 5577 4865 4171 3546 3009 2560 2189 1883 1630 1421 1247 1101 978
328.24878 873 784 707 641 583 533 488 449 415 384 356 331 309 289 270 254 239 225 278 267 257 249 241 233 227 221 215 210 206 202 198 194 191 189
283.57556 186 184 182 181 346 348 350 352 355 357 360 364 367 371 375 379 384 389 394 399 405 411 417 424 431 438 446 453 462 470 479 489 498 509 519 530 542 554 567 580 594 608 623 639 655
224.44926 672 690 709 728 749 771 793 817 842 868 896 925 956 988 1023 1059 1097 1138 1181 1227 1275 1327 1382 1441 1504 1572 1644
188.97346 1722 1790 1881 1979 2086 2202 2329 2467 2619 2785 2970 3174 3401 3655 3940 4262 4628 5044 5523
164.00902 6076 6719 7473 8362 9417 10676 12185 13993 16147 18675 21549 24637 27645 30118 31568
144.30025 31726 30715 28981 27046 25314 24021 23275 23121 23580 24681 26470 29018 32412 36740
125.905396 42039 48217 54909 61342 66332 68608 67451 63139 56766 49611 42637 36365 30977 26460
107.510544B2716l092k557k123j772j489j260j072r19p93o88n99n27m64D951
87.80177D585l27k92k64k38k16j96j79j64j50j37j27j17j09j00r3q7A709
64.151245A633p0o6o2n8n5n1m9m5m3m1l9l6l5l3l1l0k9H33
$$ plain form
107.510544 22716 19624 17067 14944 13172 11683 10423 9351 8432 7639 6951 6352 5825 5361 4951
87.80177 4585 4258 3966 3702 3464 3248 3052 2873 2709 2559 2422 2295 2178 2069 1969 1876 1789 1709
64.151245 1633 1563 1497 1435 1377 1322 1271 1222 1177 1134 1093 1054 1018 983 950 919 889 860 833
39.1868H08  $$checkpoint
##END=$$ End of the RAMAN for P(CN)3
##END= $$ end of file