##TITLE= ammonia borane
##JCAMP-DX=4.24
##DATA TYPE=LINK
##BLOCKS =4
##ORIGIN= Department of Chemistry, UWI, JAMAICA
##OWNER= public domain
##LONGDATE= 2011/04/21 09:47:11.0754 -0500 $$ export date from JSpecView
##TITLE= ammonia borane (simulated IR)
##JCAMP-DX= 5.01
##DATA TYPE= INFRARED SPECTRUM
##DATA CLASS= XYDATA
##BLOCK ID=1
##ORIGIN= Department of Chemistry, UWI, JAMAICA
##OWNER= public domain
##LONGDATE= 2011/04/21 09:47:11.0754 -0500 $$ export date from JSpecView
##$MODELS=
<Models>
<ModelData id="AB" type="MOL">
ammonia borane
RLDSViewer          3D                             0

  8  7  0  0  0  0  0  0  0  0999 V2000
    0.0000    0.0000   -0.8583 B   0  0  0  0  0  0  0  0  0  1
    0.0000   -1.0560   -1.2317 H   0  0  0  0  0  0  0  0  0  2
    0.9145    0.5280   -1.2317 H   0  0  0  0  0  0  0  0  0  3
   -0.9145    0.5280   -1.2317 H   0  0  0  0  0  0  0  0  0  4
    0.0000    0.0000    0.6917 N   0  0  0  0  0  0  0  0  0  5
    0.0000    1.0088    1.0483 H   0  0  0  0  0  0  0  0  0  6
   -0.8737   -0.5044    1.0483 H   0  0  0  0  0  0  0  0  0  7
    0.8737   -0.5044    1.0483 H   0  0  0  0  0  0  0  0  0  8
  1  2  1  0  0  0
  1  3  1  0  0  0
  1  4  1  0  0  0
  1  5  1  0  0  0
  5  7  1  0  0  0
  5  8  1  0  0  0
  5  6  1  0  0  0
M  END
</ModelData>
<ModelData id="1" type="XYZVIB" baseModel="AB" vibrationScale=".5">
8
Model[1]: Convg=0.1196D-08;-V/T=1.9996;Energy=NaN;Range=M.O.s;E(RHF)=-82.5817937015 A.U.;PATH=Calculation 1;Input
B     0.00000    0.00000    0.00000
H     0.00000    0.00000    1.12000
H     1.05595    0.00000   -0.37333
H    -0.52797   -0.91448   -0.37333
N    -0.73068    1.26557   -0.51667
H    -0.73068    1.26557   -1.58667
H    -1.73948    1.26557   -0.16000
H    -0.22627    2.13922   -0.16000
8
Model[2]: Convg=0.1196D-08;-V/T=1.9996;Energy=-82.581795;Range=M.O.s;E(RHF)=-82.5817937015 A.U.;PATH=Calculation 1;Standard
B     0.00000    0.00000   -0.85833
H     0.00000   -1.05595   -1.23167
H     0.91448    0.52797   -1.23167
H    -0.91448    0.52797   -1.23167
N     0.00000    0.00000    0.69167
H     0.00000    1.00881    1.04833
H    -0.87365   -0.50440    1.04833
H     0.87365   -0.50440    1.04833
8
Model[3]: IRIntensity=0.0000 KM/Mole;ReducedMass=1.0078 AMU;ForceConstant=0.0794 mDyne/A;Frequency=365.7628 cm^-1;FrequencyLabel=A2;PATH=Calculation 1;FrequenciesFrequencies
B     0.00000    0.00000   -0.85833    0.00000    0.00000    0.00000
H     0.00000   -1.05595   -1.23167    0.40000    0.00000    0.00000
H     0.91448    0.52797   -1.23167   -0.20000    0.35000    0.00000
H    -0.91448    0.52797   -1.23167   -0.20000   -0.35000    0.00000
N     0.00000    0.00000    0.69167    0.00000    0.00000    0.00000
H     0.00000    1.00881    1.04833    0.42000    0.00000    0.00000
H    -0.87365   -0.50440    1.04833   -0.21000    0.36000    0.00000
H     0.87365   -0.50440    1.04833   -0.21000   -0.36000    0.00000
8
$$ [...]
<PeakData id="1" title="E asymmetric stretch of the B-H group (~3234 cm-1)" peakShape="broad" model="1.20" xMax="3255" xMin="3210"    />
<PeakData id="2" title="A1 symmetric stretch of the B-H group (~3153 cm-1)" peakShape="broad" model="1.18" xMax="3175" xMin="3125"    />
<PeakData id="3" title="E asymmetric stretch of the N-H group (~3076 cm-1)" peakShape="broad" model="1.17" xMax="3100" xMin="3050"    />
<PeakData id="4" title="A1 symmetric stretch of the N-H group (~2985 cm-1)" peakShape="broad" model="1.15" xMax="3015" xMin="2965"    />
<PeakData id="5" title="E scissors bend of N-H group (~1875 cm-1)" peakShape="broad" model="1.14" xMax="1900" xMin="1850"    />
<PeakData id="6" title="A1 (~1642 cm-1)" peakShape="broad" model="1.12" xMax="1665" xMin="1620"    />
<PeakData id="7" title="E (~1290 cm-1)" peakShape="broad" model="1.11" xMax="1310" xMin="1270"    />
<PeakData id="8" title="E scissors bend of B-H group (~1169 cm-1)" peakShape="broad" model="1.9" xMax="1190" xMin="1150"    />
<PeakData id="9" title="A1 (~1131 cm-1)" peakShape="broad" model="1.7" xMax="1150" xMin="1105"    />
<PeakData id="10" title="A1 stretch of the B-N group (~920 cm-1)" peakShape="broad" model="1.6" xMax="940" xMin="900"    />
<PeakData id="11" title="E (~633 cm-1)" peakShape="broad" model="1.5" xMax="655" xMin="610"    />
<PeakData id="12" title="A2 (~365 cm-1)" peakShape="broad" model="1.3" xMax="385" xMin="345"    />
<Peaks type="RAMAN" xUnitsExpected="1/cm"  >
<PeakData id="1" title="E (~3234 cm-1)" peakShape="broad" model="2.20" xMax="3255" xMin="3210"    />
<PeakData id="2" title="A1 (~3153 cm-1)" peakShape="broad" model="2.18" xMax="3175" xMin="3125"    />
<PeakData id="3" title="E (~3076 cm-1)" peakShape="broad" model="2.17" xMax="3100" xMin="3050"    />
<PeakData id="4" title="A1 (~2985 cm-1)" peakShape="broad" model="2.15" xMax="3015" xMin="2965"    />
<PeakData id="5" title="E (~1875 cm-1)" peakShape="broad" model="2.14" xMax="1900" xMin="1850"    />
<PeakData id="6" title="A1 (~1642 cm-1)" peakShape="broad" model="2.12" xMax="1665" xMin="1620"    />
<PeakData id="7" title="E (~1290 cm-1)" peakShape="broad" model="2.11" xMax="1310" xMin="1270"    />
<PeakData id="8" title="E (~1169 cm-1)" peakShape="broad" model="2.9" xMax="1190" xMin="1150"    />
<PeakData id="9" title="A1 (~1131 cm-1)" peakShape="broad" model="2.7" xMax="1150" xMin="1105"    />
<PeakData id="10" title="A1 (~920 cm-1)" peakShape="broad" model="2.6" xMax="940" xMin="900"    />
<PeakData id="11" title="E (~633 cm-1)" peakShape="broad" model="2.5" xMax="655" xMin="610"    />
<PeakData id="12" title="A2 (~365 cm-1)" peakShape="broad" model="2.3" xMax="385" xMin="345"    />
H     0.00000   -1.05595   -1.23167    0.02000    0.00000    0.00000
H     0.91448    0.52797   -1.23167   -0.57000   -0.34000    0.23000
H    -0.91448    0.52797   -1.23167   -0.57000    0.34000   -0.23000
N     0.00000    0.00000    0.69167    0.01000    0.00000    0.00000
H     0.00000    1.00881    1.04833    0.00000    0.00000    0.00000
H    -0.87365   -0.50440    1.04833   -0.04000   -0.02000    0.02000
H     0.87365   -0.50440    1.04833   -0.04000    0.02000   -0.02000
8
Model[20]: IRIntensity=260.4320 KM/Mole;ReducedMass=1.1141 AMU;ForceConstant=6.8671 mDyne/A;Frequency=3234.5035 cm^-1;FrequencyLabel=E;PATH=Calculation 1;FrequenciesFrequencies
B     0.00000    0.00000   -0.85833    0.00000   -0.10000    0.00000
H     0.00000   -1.05595   -1.23167    0.00000    0.76000    0.27000
H     0.91448    0.52797   -1.23167    0.34000    0.18000   -0.13000
H    -0.91448    0.52797   -1.23167   -0.34000    0.18000   -0.13000
N     0.00000    0.00000    0.69167    0.00000   -0.01000    0.00000
H     0.00000    1.00881    1.04833    0.00000    0.05000    0.02000
H    -0.87365   -0.50440    1.04833    0.02000    0.01000   -0.01000
H     0.87365   -0.50440    1.04833   -0.02000    0.01000   -0.01000
</ModelData>
</Models>
##$PEAKS=
<Peaks type="IR" xUnitsExpected="1/cm"  >
<PeakData id="1" title="E asymmetric stretch of the N-H group (~3307 cm-1)" peakShape="broad" model="3.17" xMax="3340" xMin="3280"    />
<PeakData id="2" title="A1 symmetric stretch of the N-H group (~3244 cm-1)" peakShape="broad" model="3.15" xMax="3270" xMin="3215"    />
<PeakData id="3" title="E asymmetric stretch of the B-H group (~2350 cm-1)" peakShape="broad" model="3.20" xMax="2370" xMin="2320"    />
<PeakData id="4" title="A1 symmetric stretch of the B-H group (~2279 cm-1)" peakShape="broad" model="3.18" xMax="2300" xMin="2250"    />
<PeakData id="5" title="E NH3 deformation (~1588 cm-1)" peakShape="broad" model="3.14" xMax="1640" xMin="1570"    />
<PeakData id="6" title="A1 NH3 deformation (~1373 cm-1)" peakShape="broad" model="3.12" xMax="1420" xMin="1350"    />
<PeakData id="7" title="E BH3 deformation (~1213 cm-1)" peakShape="broad" model="3.9" xMax="1235" xMin="1195"    />
<PeakData id="8" title="A1 BH3 deformation (~1173 cm-1)" peakShape="broad" model="3.7" xMax="1190" xMin="1150"    />
<PeakData id="9" title="E NBH rock (~1078 cm-1)" peakShape="broad" model="3.11" xMax="1100" xMin="1035"    />
<PeakData id="10" title="A1 stretch of the B-N group (~810 cm-1)" peakShape="broad" model="3.6" xMax="820" xMin="760"    />
<PeakData id="11" title="E NBH rock (~730 cm-1)" peakShape="broad" model="3.5" xMax="750" xMin="710"    />
<PeakData id="12" title="A2 (~365 cm-1)" peakShape="broad" model="3.3" xMax="385" xMin="345"    />
</Peaks>
##XUNITS= 1/CM
##YUNITS= TRANSMITTANCE
##XFACTOR= 1
##YFACTOR= 3.055240E-05
##FIRSTX= 3.999986E+03
##FIRSTY= 9.772491E-01
##LASTX= 600
##NPOINTS= 868
##MINY= 5.694967E-02
##MAXY= 9.776768E-01
##XYDATA= (X++(Y..Y))
$$ plain form
3999.9862745098 31986 31983 31977 31973 31974 31977 31979 31984 31988 31986 31973 31955 31935 31916 31895 31874 31853 31833 31812 31790 31768 31746 31723 31700 31681 31668 31659 31650 31642 31634 31626 31618 31610 31602 31594 31586 31578 31570 31562 31554 31546 31537 31529 31520 31512 31503 31494 31486 31477
3807.8156862745 31469 31461 31453 31447 31440 31429 31411 31388 31361 31331 31297 31264 31233 31201 31167 31126 31082 31039 30997 30955 30920 30895 30877 30859 30840 30821 30799 30774
3698.0862745098 30746 30716 30682 30646 30609 30574 30538 30503 30468 30434 30399 30367 30335 30295 30241 30178 30113 30046 29977 29908 29840 29772 29703 29638 29573 29499 29414
3592.1156862745 29321 29222 29113 28997 28889 28792 28703 28615 28531 28449 28365 28275 28183 28089 27995 27900 27796 27681 27557 27426 27278 27122
3505.9156862745 26984 26876 26785 26695 26602 26509 26420 26336 26256 26175 26097 26018 25930 25826 25713 25600 25491 25382 25278 25183 25094 25002 24908 24811
3411.7725490196 24711 24608 24501 24384 24259 24124 23967 23796 23603 23355 23037 22668 22262 21846 21397 20857 20231
3345.1431372549 19531 18717 17722 16658 15731 14947 14269 13789 13536 13451 13491 13691 14025 14354 14634 14906 15152 15371
3274.5294117647 15561 15690 15703 15654 15678 15794 15986 16344 16971 17801 18653 19519 20404 21089 21425 21521 21527 21453 21289 21156
$$ packed form
3999.9862745098C1986lomJLKNMkj3j8k0j9k1Uk0k1k2Uk3Tj9j3rTqS3rqrqrTqC1477
3807.8156862745C1469qTopj1j8k3k7l0l4l3l1l2l4m1m4m3m2Tl5k5j8Tj9Tk2C0774
3698.0862745098C0746l0l4l6l7l5l6l5Tl4l5l2Tm0n4o3o5o7o9To8To9o5Tp4B9414
3592.1156862745B9321r9j09j16j08r7q9q8q4q2q4r0r2r4Tr5j04j15j24j31j48B7122
3505.9156862745B6984j08r1r0r3Tq9q4q0q1p8p9q8j04j13Tj09Tj04r5q9r2r4B4811
3411.7725490196B4711j03j07j17j25j35j57j71j93k48l18l69m06m16m49n40B0231
3345.1431372549A9531q14r95j064r27p84o78m80k53q5M0K00L34L29K80K72K46A5371
3274.5294117647A5561J29J3m9K4J16J92L58O27Q30Q52Q66Q85O85L36R6Op4j64B1156
$$ plain form
3196.0725490196 21071 21016 21054 21229 21501 21804 22112 22454 22848 23317 23844 24383 24922 25472 26012 26537 27050 27540 28006
3121.6 28446 28855 29236 29582 29876 30100 30268 30416 30551 30664 30769 30871 30964 31047 31116 31175 31232 31294 31356
3047.0647058824 31402 31431 31445 31446 31427 31394 31363 31340 31320 31304 31293 31286 31286 31296 31314 31329 31341 31351 31355 31351 31341 31331 31326 31321 31307 31279 31243 31205 31165
2933.3509803922 31125 31092 31072 31059 31049 31040 31033 31025 31016 31006 30986 30950 30904 30858 30813 30769 30731 30700 30676 30657 30646 30640 30634 30629 30624 30611 30585 30552 30517
2819.6 30484 30451 30415 30377 30337 30294 30250 30204 30157 30110 30062 30006 29940 29866 29792 29715 29638 29578 29545 29529 29517 29509 29506 29494 29469 29435 29388
2713.7294117647 29323 29246 29169 29097 29025 28954 28882 28810 28739 28670 28602 28540 28486 28437 28390 28340 28290 28247 28213 28185 28157 28129 28100 28067 28029 27985 27937 27883
2603.9 27825 27765 27707 27648 27579 27494 27399 27303 27213 27122 27027 26926 26820 26713 26607 26499 26381 26252 26114 25965 25807
2521.5215686275 25639 25462 25276 25081 24881 24678 24470 24254 24025 23789 23561 23358 23162 22942 22684 22404 22113
$$ packed form
3196.0725490196B1071n5L8J75K72L03L08L42L94M69N27N39TN50N40N25N13M90B8006
3121.6B8446M09L81L46K94K24J68J48J35J13J05J02R3Q3O9N9N7O2C1356
3047.0647058824C1402K9J4Jj9l3l1k3k0j6j1p%J0J8J5J2J0Mmj0TnTj4k8l6l8C1165
2933.3509803922C1125l3k0j3j0rpqrj0k0l6m6Tm5m4l8l1k4j9j1oTnTj3k6l3C0517
2819.6C0484l3l6l8m0m3m4m6m7Tm8n6o6p4Tp7To0l3j6j2qlj2k5l4B9388
2713.7294117647B9323p7Tp2Tp1p2Tp1o9o8o2n4m9m7n0Tm3l4k8Uk9l3l8m4m8B7883
2603.9B7825o0n8n9o9q5r5r6r0r1r5j01j06j07j06j08j18j29j38j49B5807
2521.5215686275B5639j77j86j95k00k03k08k16k29k36k28k03j96k20k58k80B2113
$$ plain form
2454.9294117647 21836 21549 21188 20714 20178 19656 19191 18737 18236 17689 17104 16439 15661 14831 14038 13334 12660
2388.2 11933 11517 11035 9510 6665 4202 2918 2450 2266 2143 1977 1864 1922 2262 2910 3837
2325.4941176471 5231 7309 9563 11239 12368 13194 13661 13711 13757 13898 14037 14314 14826 15504 16232 17010 17846
2258.7647058824 18601 19209 19709 20104 20354 20488 20621 20774 20926 21137 21437 21801 22208 22656 23150 23684 24293
2192.1725490196 24946 25533 25987 26363 26717 27075 27410 27705 27952 28157 28327 28459 28555 28636 28709 28766 28806 28810 28798 28825
2113.7156862745 28903 29020 29201 29488 29841 30167 30434 30671 30869 31016 31124 31221 31316 31400 31477 31545 31605 31665 31730 31794
2035.3215686275 31846 31878 31898 31915 31931 31944 31956 31968 31978 31986 31988 31987 31986 31986 31986 31986 31986 31986 31986 31987 31988 31986 31980 31971 31959 31941 31920 31899 31880 31861 31843 31826 31809 31793 31771 31749
1894.0941176471 31742 31755 31782 31815 31855 31901 31938 31964 31981 31986 31974 31949 31925 31905 31885 31865 31844 31824 31803 31784 31765 31741 31712 31677 31641 31598 31552
$$ packed form
2454.9294117647B1836k87l61m74n36n22m65m54n01n47n85o65p78q30p93p04A2660
2388.2A1933m16m82j525k845k463j284m68j84j23j66j13N8L40O48C837
2325.4941176471E231K078K254J676J129Q26M67N0M6J41J39K77N12O78P28P78A7846
2258.7647058824A8601O08N00L95K50J34J33J53J52K11L00L64M07M48M94N34B4293
2192.1725490196B4946N87M54L76L54L58L35K95K47K05J70J32R6Q1P3N7M0Mj2B8825
2113.7156862745B8903J17J81K87L53L26K67K37J98J47J08R7R5Q4P7O8O0TO5C1794
2035.3215686275C1846L2K0J7J6J3J2TJ0QKjT%XJTkorj2j8k1Tj9Tj8j7Tj6k2C1749
1894.0941176471C1742J3K7L3M0M6L7K6J7Nj2k5k4k0Uk1k0k1j9Tk4k9l5l6m3C1552
$$ plain form
1788.1862745098 31514 31488 31469 31458 31456 31462 31469 31473 31477 31484 31497 31513 31528 31544 31560 31568 31564 31553 31541 31535 31529 31512 31479 31436 31387 31336 31279 31214 31136 31049
1670.5509803922 30955 30874 30785 30632 30390 30087 29742 29388 28995 28488 27833 27080 26285 25322 24337 23742 23715 24043
1600 24519 25114 25875 26691 27583 28538 29364 29950 30380 30731 31012 31210 31371 31508 31607 31680 31730 31753
1529.3862745098 31740 31679 31583 31486 31402 31316 31224 31122 31012 30898 30783 30663 30530 30375 30209 30047 29898 29753 29607
1454.8509803922 29470 29330 29157 28968 28746 28400 27898 27283 26588 25804 24955 24101 23347 22587 21589 20107 18501
1388.2215686275 17342 16607 16201 16464 17879 20226 22580 24430 26083 27489 28510 29188 29773 30347 30819
1329.3725490196 31196 31454 31611 31735 31861 31954 31986 31926 31806 31685 31609 31532 31386 31127 30801 30473 30155 29835 29528
1254.9 29265 29015 28708 28316 27872 27399 26927 26430 25841 25174 24429 23545 22523 21399 20173 18798
$$ packed form
1788.1862745098C1514k6j9j1kOPMTPJ3J6J5J6TQmj1j2oTj7l3m3m9n1n7o5p8C1049
1670.5509803922C0955q1q9j53k42l03l45l54l93n07o55p53p95r63r85n95k7B4043
1600B4519N95P61Q16Q92R55Q26N86M30L51K81J98J61J37R9P3N0C1753
1529.3862745098C1740o1r6r7q4q6r2j02j10j14j15j20j33j55j66j62j49j45B9607
1454.8509803922B9470j40j73j89k22l46n02o15o95p84q49q54p54p60r98j482A8501
1388.2215686275A7342p35m06K63J415K347K354J850J653J406J021O78N85N74C0819
1329.3725490196C1196K58J57J24J26R3L2o0j20j21p6p7j46k59l26l28l18l20B9528
1254.9B9265k50l07l92m44m73m72m97n89o67p45q84j022j124j226A8798
$$ plain form
1192.1294117647 17380 16116 14954 13916 13216 12802 12657 13017 14267 16267 18300 19964 21490 22800 23775
1133.3431372549 24436 24944 25339 25565 25658 25622 25452 25168 24839 24403 23699 22694 21483 20110 18343 16545 15428
1066.6509803922 15155 15390 15967 17031 18560 20048 21230 22283 23233 24055 24741 25356 25886 26333 26800 27360
1003.9431372549 27944 28442 28786 29033 29252 29460 29639 29814 29997 30175 30343 30499 30644 30778 30901 31014 31115
937.2725490196 31200 31273 31341 31411 31475 31529 31566 31591 31615 31641 31665 31691 31720 31752 31785 31819 31853 31884 31910 31933 31951 31963 31971 31977 31990 32000
835.2862745098 31986 31931 31851 31771 31725 31678 31558 31331 31033 30693 30253 29776 29465 29400 29492 29682 30017 30454 30794 30958
756.8294117647 31019 30988 30875 30672 30370 29839 29221 28894 29070 29532 29999 30398 30800 31121 31308 31409 31482 31543
686.3156862745 31577 31600 31614 31617 31620 31626 31632 31643 31659 31680 31701 31720 31740 31760 31779 31798 31817 31833 31850 31873 31915 31963
$$ packed form
1192.1294117647A7380j264j162j038p00m14j45L60J250K000K033J664J526J310B3775
1133.3431372549B4436N08L95K26R3l6j70k84l29m36p04j005j211j373j767j798A5428
1066.6509803922A5155K35N77J064J529J488J182J053R50Q22O86O15N30M47M67B7360
1003.9431372549B7944M98L44K47K19K08J79J75J83J78J68J56J45J34J23J13C1115
937.2725490196C1200P3O8P0O4N4L7K5K4K6K4K6K9L2L3L4TL1K6K3J8J2QOJ3C2000
835.2862745098C1986n5q0Tm6m7j20k27k98l40m40m77l11o5R2J90L35M37L40C0958
756.8294117647C1019l1j13k03l02n31o18l27J76M62M67L99M02L21J87J01P3C1543
686.3156862745C1577K3J4LTOTJ1J6K1TJ9K0TJ9UJ6J7K3M2C1963
600C1986  $$checkpoint
##END= $$end of IR
##TITLE=ammonia borane $$ Begin of the data block
##JCAMP-DX=5.00 $$
##DATA TYPE=RAMAN SPECTRUM
##DATA CLASS=XYDATA
##BLOCK ID=4
##ORIGIN=Department of Chemistry, UWI, Jamaica
##OWNER=public domain
##DATE=13 Mar 2012 10:53:10
##SPECTROMETER/DATA SYSTEM=from scan
##$MODELS=
<Models>
<ModelData id="AB4" type="MOL">
ammonia borane
RLDSViewer          3D                             0

  8  7  0  0  0  0  0  0  0  0999 V2000
    0.0000    0.0000   -0.8583 B   0  0  0  0  0  0  0  0  0  1
    0.0000   -1.0560   -1.2317 H   0  0  0  0  0  0  0  0  0  2
    0.9145    0.5280   -1.2317 H   0  0  0  0  0  0  0  0  0  3
   -0.9145    0.5280   -1.2317 H   0  0  0  0  0  0  0  0  0  4
    0.0000    0.0000    0.6917 N   0  0  0  0  0  0  0  0  0  5
    0.0000    1.0088    1.0483 H   0  0  0  0  0  0  0  0  0  6
   -0.8737   -0.5044    1.0483 H   0  0  0  0  0  0  0  0  0  7
    0.8737   -0.5044    1.0483 H   0  0  0  0  0  0  0  0  0  8
  1  2  1  0  0  0
  1  3  1  0  0  0
  1  4  1  0  0  0
  1  5  1  0  0  0
  5  7  1  0  0  0
  5  8  1  0  0  0
  5  6  1  0  0  0
M  END
</ModelData>
<ModelData id="4" type="XYZVIB" baseModel="AB4" vibrationScale=".5">
8
Model[1]: Convg=0.1196D-08;-V/T=1.9996;Energy=NaN;Range=M.O.s;E(RHF)=-82.5817937015 A.U.;PATH=Calculation 1;Input
B     0.00000    0.00000    0.00000
H     0.00000    0.00000    1.12000
H     1.05595    0.00000   -0.37333
H    -0.52797   -0.91448   -0.37333
N    -0.73068    1.26557   -0.51667
H    -0.73068    1.26557   -1.58667
H    -1.73948    1.26557   -0.16000
H    -0.22627    2.13922   -0.16000
8
Model[2]: Convg=0.1196D-08;-V/T=1.9996;Energy=-82.581795;Range=M.O.s;E(RHF)=-82.5817937015 A.U.;PATH=Calculation 1;Standard
B     0.00000    0.00000   -0.85833
H     0.00000   -1.05595   -1.23167
H     0.91448    0.52797   -1.23167
H    -0.91448    0.52797   -1.23167
N     0.00000    0.00000    0.69167
H     0.00000    1.00881    1.04833
H    -0.87365   -0.50440    1.04833
H     0.87365   -0.50440    1.04833
8
Model[3]: IRIntensity=0.0000 KM/Mole;ReducedMass=1.0078 AMU;ForceConstant=0.0794 mDyne/A;Frequency=365.7628 cm^-1;FrequencyLabel=A2;PATH=Calculation 1;FrequenciesFrequencies
B     0.00000    0.00000   -0.85833    0.00000    0.00000    0.00000
H     0.00000   -1.05595   -1.23167    0.40000    0.00000    0.00000
H     0.91448    0.52797   -1.23167   -0.20000    0.35000    0.00000
H    -0.91448    0.52797   -1.23167   -0.20000   -0.35000    0.00000
N     0.00000    0.00000    0.69167    0.00000    0.00000    0.00000
H     0.00000    1.00881    1.04833    0.42000    0.00000    0.00000
H    -0.87365   -0.50440    1.04833   -0.21000    0.36000    0.00000
H     0.87365   -0.50440    1.04833   -0.21000   -0.36000    0.00000
8
Model[4]: IRIntensity=4.4594 KM/Mole;ReducedMass=1.1027 AMU;ForceConstant=0.2609 mDyne/A;Frequency=633.7281 cm^-1;FrequencyLabel=E;PATH=Calculation 1;FrequenciesFrequencies
B     0.00000    0.00000   -0.85833    0.00000    0.10000    0.00000
H     0.00000   -1.05595   -1.23167    0.00000   -0.15000    0.67000
H     0.91448    0.52797   -1.23167    0.05000   -0.24000   -0.34000
H    -0.91448    0.52797   -1.23167   -0.05000   -0.24000   -0.33000
N     0.00000    0.00000    0.69167    0.00000   -0.01000    0.00000
H     0.00000    1.00881    1.04833    0.00000   -0.11000    0.31000
H    -0.87365   -0.50440    1.04833    0.01000   -0.12000   -0.16000
H     0.87365   -0.50440    1.04833   -0.01000   -0.12000   -0.15000
8
Model[5]: IRIntensity=4.4594 KM/Mole;ReducedMass=1.1027 AMU;ForceConstant=0.2609 mDyne/A;Frequency=633.7281 cm^-1;FrequencyLabel=E;PATH=Calculation 1;FrequenciesFrequencies
B     0.00000    0.00000   -0.85833    0.10000    0.00000    0.00000
H     0.00000   -1.05595   -1.23167   -0.27000    0.00000   -0.01000
H     0.91448    0.52797   -1.23167   -0.18000    0.06000   -0.57000
H    -0.91448    0.52797   -1.23167   -0.18000   -0.05000    0.58000
N     0.00000    0.00000    0.69167   -0.01000    0.00000    0.00000
H     0.00000    1.00881    1.04833   -0.13000    0.00000    0.00000
H    -0.87365   -0.50440    1.04833   -0.12000    0.01000   -0.27000
H     0.87365   -0.50440    1.04833   -0.12000    0.00000    0.27000
8
Model[6]: IRIntensity=5.1841 KM/Mole;ReducedMass=4.2730 AMU;ForceConstant=2.1336 mDyne/A;Frequency=920.5950 cm^-1;FrequencyLabel=A1;PATH=Calculation 1;FrequenciesFrequencies
B     0.00000    0.00000   -0.85833    0.00000    0.00000    0.44000
H     0.00000   -1.05595   -1.23167    0.00000    0.05000    0.28000
H     0.91448    0.52797   -1.23167   -0.04000   -0.02000    0.28000
H    -0.91448    0.52797   -1.23167    0.04000   -0.02000    0.28000
N     0.00000    0.00000    0.69167    0.00000    0.00000   -0.32000
H     0.00000    1.00881    1.04833    0.00000    0.02000   -0.39000
H    -0.87365   -0.50440    1.04833   -0.02000   -0.01000   -0.39000
H     0.87365   -0.50440    1.04833    0.02000   -0.01000   -0.39000
8
Model[7]: IRIntensity=106.8518 KM/Mole;ReducedMass=1.1418 AMU;ForceConstant=0.8614 mDyne/A;Frequency=1131.5657 cm^-1;FrequencyLabel=A1;PATH=Calculation 1;FrequenciesFrequencies
B     0.00000    0.00000   -0.85833    0.00000    0.00000   -0.11000
H     0.00000   -1.05595   -1.23167    0.00000   -0.22000    0.53000
H     0.91448    0.52797   -1.23167    0.19000    0.11000    0.53000
H    -0.91448    0.52797   -1.23167   -0.19000    0.11000    0.53000
N     0.00000    0.00000    0.69167    0.00000    0.00000   -0.02000
H     0.00000    1.00881    1.04833    0.00000   -0.01000   -0.02000
H    -0.87365   -0.50440    1.04833    0.00000    0.00000   -0.02000
H     0.87365   -0.50440    1.04833    0.00000    0.00000   -0.02000
8
Model[8]: IRIntensity=6.5125 KM/Mole;ReducedMass=1.0839 AMU;ForceConstant=0.8732 mDyne/A;Frequency=1169.3310 cm^-1;FrequencyLabel=E;PATH=Calculation 1;FrequenciesFrequencies
B     0.00000    0.00000   -0.85833   -0.09000    0.00000    0.00000
H     0.00000   -1.05595   -1.23167    0.73000    0.00000    0.00000
H     0.91448    0.52797   -1.23167    0.06000   -0.39000   -0.24000
H    -0.91448    0.52797   -1.23167    0.06000    0.39000    0.24000
N     0.00000    0.00000    0.69167    0.02000    0.00000    0.00000
H     0.00000    1.00881    1.04833   -0.06000    0.00000    0.00000
H    -0.87365   -0.50440    1.04833   -0.04000    0.01000   -0.11000
H     0.87365   -0.50440    1.04833   -0.04000   -0.01000    0.11000
8
Model[9]: IRIntensity=6.5125 KM/Mole;ReducedMass=1.0839 AMU;ForceConstant=0.8732 mDyne/A;Frequency=1169.3310 cm^-1;FrequencyLabel=E;PATH=Calculation 1;FrequenciesFrequencies
B     0.00000    0.00000   -0.85833    0.00000    0.09000    0.00000
H     0.00000   -1.05595   -1.23167    0.00000    0.16000   -0.27000
H     0.91448    0.52797   -1.23167    0.39000   -0.51000    0.14000
H    -0.91448    0.52797   -1.23167   -0.39000   -0.51000    0.14000
N     0.00000    0.00000    0.69167    0.00000   -0.02000    0.00000
H     0.00000    1.00881    1.04833    0.00000    0.03000   -0.13000
H    -0.87365   -0.50440    1.04833   -0.01000    0.05000    0.06000
H     0.87365   -0.50440    1.04833    0.01000    0.05000    0.06000
8
Model[10]: IRIntensity=31.8944 KM/Mole;ReducedMass=1.2547 AMU;ForceConstant=1.2309 mDyne/A;Frequency=1290.3662 cm^-1;FrequencyLabel=E;PATH=Calculation 1;FrequenciesFrequencies
B     0.00000    0.00000   -0.85833    0.00000    0.09000    0.00000
H     0.00000   -1.05595   -1.23167    0.00000   -0.02000    0.32000
H     0.91448    0.52797   -1.23167   -0.06000    0.08000   -0.16000
H    -0.91448    0.52797   -1.23167    0.06000    0.08000   -0.16000
N     0.00000    0.00000    0.69167    0.00000   -0.11000    0.00000
H     0.00000    1.00881    1.04833    0.00000    0.14000   -0.69000
H    -0.87365   -0.50440    1.04833   -0.03000    0.19000    0.35000
H     0.87365   -0.50440    1.04833    0.03000    0.19000    0.35000
8
Model[11]: IRIntensity=31.8944 KM/Mole;ReducedMass=1.2547 AMU;ForceConstant=1.2309 mDyne/A;Frequency=1290.3662 cm^-1;FrequencyLabel=E;PATH=Calculation 1;FrequenciesFrequencies
B     0.00000    0.00000   -0.85833    0.09000    0.00000    0.00000
H     0.00000   -1.05595   -1.23167    0.11000    0.00000    0.00000
H     0.91448    0.52797   -1.23167    0.01000   -0.06000   -0.28000
H    -0.91448    0.52797   -1.23167    0.01000    0.06000    0.28000
N     0.00000    0.00000    0.69167   -0.11000    0.00000    0.00000
H     0.00000    1.00881    1.04833    0.20000    0.00000    0.00000
H    -0.87365   -0.50440    1.04833    0.15000   -0.03000    0.60000
H     0.87365   -0.50440    1.04833    0.15000    0.03000   -0.60000
8
Model[12]: IRIntensity=171.0074 KM/Mole;ReducedMass=1.2165 AMU;ForceConstant=1.9331 mDyne/A;Frequency=1642.3197 cm^-1;FrequencyLabel=A1;PATH=Calculation 1;FrequenciesFrequencies
B     0.00000    0.00000   -0.85833    0.00000    0.00000   -0.01000
H     0.00000   -1.05595   -1.23167    0.00000   -0.01000    0.00000
H     0.91448    0.52797   -1.23167    0.01000    0.00000    0.00000
H    -0.91448    0.52797   -1.23167   -0.01000    0.00000    0.00000
N     0.00000    0.00000    0.69167    0.00000    0.00000    0.13000
H     0.00000    1.00881    1.04833    0.00000    0.21000   -0.53000
H    -0.87365   -0.50440    1.04833   -0.18000   -0.11000   -0.53000
H     0.87365   -0.50440    1.04833    0.18000   -0.11000   -0.53000
8
Model[13]: IRIntensity=33.1211 KM/Mole;ReducedMass=1.0547 AMU;ForceConstant=2.1854 mDyne/A;Frequency=1875.3503 cm^-1;FrequencyLabel=E;PATH=Calculation 1;FrequenciesFrequencies
B     0.00000    0.00000   -0.85833    0.00000    0.01000    0.00000
H     0.00000   -1.05595   -1.23167    0.00000    0.01000    0.00000
H     0.91448    0.52797   -1.23167    0.01000   -0.01000    0.00000
H    -0.91448    0.52797   -1.23167   -0.01000   -0.01000    0.00000
N     0.00000    0.00000    0.69167    0.00000    0.06000    0.00000
H     0.00000    1.00881    1.04833    0.00000    0.15000   -0.28000
H    -0.87365   -0.50440    1.04833    0.39000   -0.52000    0.14000
H     0.87365   -0.50440    1.04833   -0.39000   -0.53000    0.14000
8
Model[14]: IRIntensity=33.1211 KM/Mole;ReducedMass=1.0547 AMU;ForceConstant=2.1854 mDyne/A;Frequency=1875.3503 cm^-1;FrequencyLabel=E;PATH=Calculation 1;FrequenciesFrequencies
B     0.00000    0.00000   -0.85833   -0.01000    0.00000    0.00000
H     0.00000   -1.05595   -1.23167    0.01000    0.00000    0.00000
H     0.91448    0.52797   -1.23167    0.00000   -0.01000    0.00000
H    -0.91448    0.52797   -1.23167    0.00000    0.01000    0.00000
N     0.00000    0.00000    0.69167   -0.06000    0.00000    0.00000
H     0.00000    1.00881    1.04833    0.75000    0.00000    0.00000
H    -0.87365   -0.50440    1.04833    0.07000   -0.39000   -0.24000
H     0.87365   -0.50440    1.04833    0.07000    0.39000    0.24000
8
Model[15]: IRIntensity=9.5743 KM/Mole;ReducedMass=1.0272 AMU;ForceConstant=5.3938 mDyne/A;Frequency=2985.3795 cm^-1;FrequencyLabel=A1;PATH=Calculation 1;FrequenciesFrequencies
B     0.00000    0.00000   -0.85833    0.00000    0.00000    0.00000
H     0.00000   -1.05595   -1.23167    0.00000   -0.03000   -0.01000
H     0.91448    0.52797   -1.23167    0.03000    0.01000   -0.01000
H    -0.91448    0.52797   -1.23167   -0.03000    0.01000   -0.01000
N     0.00000    0.00000    0.69167    0.00000    0.00000   -0.04000
H     0.00000    1.00881    1.04833    0.00000    0.55000    0.18000
H    -0.87365   -0.50440    1.04833   -0.47000   -0.27000    0.18000
H     0.87365   -0.50440    1.04833    0.47000   -0.27000    0.18000
8
Model[16]: IRIntensity=58.5501 KM/Mole;ReducedMass=1.0945 AMU;ForceConstant=6.1053 mDyne/A;Frequency=3076.9030 cm^-1;FrequencyLabel=E;PATH=Calculation 1;FrequenciesFrequencies
B     0.00000    0.00000   -0.85833   -0.01000    0.00000    0.00000
H     0.00000   -1.05595   -1.23167    0.00000    0.00000    0.00000
H     0.91448    0.52797   -1.23167    0.04000    0.02000   -0.02000
H    -0.91448    0.52797   -1.23167    0.04000   -0.02000    0.02000
N     0.00000    0.00000    0.69167    0.08000    0.00000    0.00000
H     0.00000    1.00881    1.04833    0.00000    0.00000    0.00000
H    -0.87365   -0.50440    1.04833   -0.57000   -0.33000    0.24000
H     0.87365   -0.50440    1.04833   -0.57000    0.33000   -0.24000
8
Model[17]: IRIntensity=58.5501 KM/Mole;ReducedMass=1.0945 AMU;ForceConstant=6.1053 mDyne/A;Frequency=3076.9030 cm^-1;FrequencyLabel=E;PATH=Calculation 1;FrequenciesFrequencies
B     0.00000    0.00000   -0.85833    0.00000   -0.01000    0.00000
H     0.00000   -1.05595   -1.23167    0.00000    0.05000    0.02000
H     0.91448    0.52797   -1.23167    0.02000    0.01000   -0.01000
H    -0.91448    0.52797   -1.23167   -0.02000    0.01000   -0.01000
N     0.00000    0.00000    0.69167    0.00000    0.08000    0.00000
H     0.00000    1.00881    1.04833    0.00000   -0.76000   -0.27000
H    -0.87365   -0.50440    1.04833   -0.33000   -0.19000    0.14000
H     0.87365   -0.50440    1.04833    0.33000   -0.19000    0.14000
8
Model[18]: IRIntensity=108.9425 KM/Mole;ReducedMass=1.0329 AMU;ForceConstant=6.0504 mDyne/A;Frequency=3153.1068 cm^-1;FrequencyLabel=A1;PATH=Calculation 1;FrequenciesFrequencies
B     0.00000    0.00000   -0.85833    0.00000    0.00000   -0.05000
H     0.00000   -1.05595   -1.23167    0.00000    0.55000    0.18000
H     0.91448    0.52797   -1.23167   -0.47000   -0.27000    0.18000
H    -0.91448    0.52797   -1.23167    0.47000   -0.27000    0.18000
N     0.00000    0.00000    0.69167    0.00000    0.00000    0.00000
H     0.00000    1.00881    1.04833    0.00000    0.03000    0.01000
H    -0.87365   -0.50440    1.04833   -0.03000   -0.02000    0.01000
H     0.87365   -0.50440    1.04833    0.03000   -0.02000    0.01000
8
Model[19]: IRIntensity=260.4320 KM/Mole;ReducedMass=1.1141 AMU;ForceConstant=6.8671 mDyne/A;Frequency=3234.5035 cm^-1;FrequencyLabel=E;PATH=Calculation 1;FrequenciesFrequencies
B     0.00000    0.00000   -0.85833    0.10000    0.00000    0.00000
H     0.00000   -1.05595   -1.23167    0.02000    0.00000    0.00000
H     0.91448    0.52797   -1.23167   -0.57000   -0.34000    0.23000
H    -0.91448    0.52797   -1.23167   -0.57000    0.34000   -0.23000
N     0.00000    0.00000    0.69167    0.01000    0.00000    0.00000
H     0.00000    1.00881    1.04833    0.00000    0.00000    0.00000
H    -0.87365   -0.50440    1.04833   -0.04000   -0.02000    0.02000
H     0.87365   -0.50440    1.04833   -0.04000    0.02000   -0.02000
8
Model[20]: IRIntensity=260.4320 KM/Mole;ReducedMass=1.1141 AMU;ForceConstant=6.8671 mDyne/A;Frequency=3234.5035 cm^-1;FrequencyLabel=E;PATH=Calculation 1;FrequenciesFrequencies
B     0.00000    0.00000   -0.85833    0.00000   -0.10000    0.00000
H     0.00000   -1.05595   -1.23167    0.00000    0.76000    0.27000
H     0.91448    0.52797   -1.23167    0.34000    0.18000   -0.13000
H    -0.91448    0.52797   -1.23167   -0.34000    0.18000   -0.13000
N     0.00000    0.00000    0.69167    0.00000   -0.01000    0.00000
H     0.00000    1.00881    1.04833    0.00000    0.05000    0.02000
H    -0.87365   -0.50440    1.04833    0.02000    0.01000   -0.01000
H     0.87365   -0.50440    1.04833   -0.02000    0.01000   -0.01000
</ModelData>
</Models>
##$PEAKS=
<Peaks type="RAMAN" xUnitsExpected="1/cm"  >
<PeakData id="1" title="E asymmetric stretch of the N-H group (~3307 cm-1)" peakShape="broad" model="4.17" xMax="3340" xMin="3280"    />
<PeakData id="2" title="A1 symmetric stretch of the N-H group (~3244 cm-1)" peakShape="broad" model="4.15" xMax="3270" xMin="3215"    />
<PeakData id="3" title="E asymmetric stretch of the B-H group (~2350 cm-1)" peakShape="broad" model="4.20" xMax="2400" xMin="2340"    />
<PeakData id="4" title="A1 symmetric stretch of the B-H group (~2279 cm-1)" peakShape="broad" model="4.18" xMax="2300" xMin="2250"    />
<PeakData id="5" title="E NH3 deformation (~1588 cm-1)" peakShape="broad" model="4.14" xMax="1640" xMin="1570"    />
<PeakData id="6" title="A1 NH3 deformation (~1373 cm-1)" peakShape="broad" model="4.12" xMax="1420" xMin="1350"    />
<PeakData id="7" title="E BH3 deformation (~1213 cm-1)" peakShape="broad" model="4.9" xMax="1235" xMin="1195"    />
<PeakData id="8" title="A1 BH3 deformation (~1173 cm-1)" peakShape="broad" model="4.7" xMax="1190" xMin="1150"    />
<PeakData id="9" title="E NBH rock (~1078 cm-1)" peakShape="broad" model="4.11" xMax="1100" xMin="1035"    />
<PeakData id="10" title="A1 stretch of the B-N group (~810 cm-1)" peakShape="broad" model="4.6" xMax="820" xMin="760"    />
<PeakData id="11" title="E NBH rock (~730 cm-1)" peakShape="broad" model="4.5" xMax="750" xMin="710"    />
<PeakData id="12" title="A2 (~365 cm-1)" peakShape="broad" model="4.3" xMax="385" xMin="345"    />
</Peaks>
##XUNITS=1/CM
##YUNITS= RAMAN INTENSITY
##XFACTOR=1.0000000000
##YFACTOR=0.0000368962
##FIRSTX=50.00000000
##LASTX=3999.98193359
##FIRSTY=0.03641655
##DELTAX=4.34541464
##NPOINTS=910
##XYDATA=(X++(Y..Y))
$$ plain form
50 987 1050 1292 1787 2700 3867 4875 5690 6345 6526 5873 4745 3908 3738 3858 3908 3734 3490 3272 3121 2997 2880 2762
145.6 2762 2651 2553 2470 2399 2341 2295 2261 2239 2231 2235 2239 2242 2245 2239 2217 2186 2150 2112 2069 2027 1982 1937 1903 1886 1879 1873 1863 1853 1843 1833 1823 1814 1804 1795 1786 1776 1766 1757 1748 1740 1735 1733 1734
332.5 1734 1735 1735 1736 1735 1731 1727 1720 1711 1701 1690 1678 1665 1660 1666 1680 1695 1712 1731 1750 1770 1791 1805 1808 1805 1799 1791 1779 1768 1758 1747 1736 1721 1705 1689 1673 1657 1641 1629 1617 1593 1551 1497 1433
519.3 1433 1352 1262 1185 1130 1087 1055 1040 1036 1032 1024 1016 1008 1000 992 982 971 958 946 933 920 910 904 901 900 899 899 900 899 898 900 905 912 926 949 979 1008 1033 1058 1089 1125 1166 1225
701.8 1225 1313 1418 1510 1591 1659 1681 1605 1482 1436 1500 1641 1884 2271 2761 3253 3797 4344 4649 4584 4278 3874 3358 2745 2218
806.1 2218 1849 1568 1345 1182 1078 1001 945 917 900 892 896 900 900 899 900 901 903 907 915 924 933 941 950 958 969 979 984 979 969 958 947 936 926 917 908 906 914 928 943 957
979.9 957 971 979 978 970 962 952 940 930 916 903 910 948 1005 1062 1116 1169 1216 1255 1288 1307 1306 1292 1277 1263 1249 1247 1264 1293 1330 1375 1429 1483 1515 1547 1636 1777
1136.4 1777 1975 2304 2884 3595 4150 4397 4488 4588 4824 5070 5106 4770 4225 3740 3423 3166 2914 2632 2354 2131 2000
$$ packed form
50I87O3K42M95R13J167J008Q15O55J81o53j128q37j70J20N0j74k44k18j51j24j17j18
145.6B762j11r8q3p1n8m6l4k2qMTLTok2l1l6l8m3m2m5Tl4j7poj0Wrj0rTj0TrTqnkJ
332.5A734J%JjmTprj0j1j2j3nOJ4J5J7J9TK0K1J4Lloqj2j1j0j1Tj5j6Wj2Tk4m2n4o4
519.3A433q1r0p7n5m3l2j5mTqWj0j1j3j2j3Tj0oljT%JjTKNPJ4K3L0K9K5TL1L6M1N9
701.8A225Q8J05R2Q1O8K2p6j23m6O4J41K43L87M90M92N44N47L05o5l06m04n16o13n27
806.1B218l69k81k23j63j04p7n6k8j7qMT%jJTKMQRTQRQJ1J0Nnj0j1Uj0rTkQJ4J5J4
979.9I57J4QjqTj0j2j0j4j3PL8N7TN4N3M7L9L3J9jj4j5j4TkJ7K9L7M5N4TL2TQ9J41
1136.4A777J98L29N80P11N55K47R1J00K36K46L6l36n45m85l17k57k52k82k78k23j31
$$ plain form
1227.6 2000 1923 1847 1750 1652 1566 1499 1444 1389 1327 1264 1211 1171 1140 1114 1094 1077 1061 1041 1021 1008 1006 1011 1022 1038 1060 1081 1080 1078 1141 1340 1604 1782
1366.7 1782 1799 1729 1646 1567 1473 1386 1311 1242 1176 1104 1035 991 992 1018 1045 1062 1080 1098 1117 1136 1149 1153 1151 1149 1149 1149 1149 1149 1149 1149 1149 1149 1149 1143 1137 1149 1191 1251 1312 1365 1420 1490
1549.2 1490 1580 1686 1806 1939 2085 2244 2448 2664 2792 2777 2674 2550 2417 2261 2111 1974 1843 1719 1603 1496 1400
1640.4 1400 1322 1256 1191 1116 1041 986 964 961 958 948 939 929 918 906 901 905 914 924 933 941 950 959 969 975 977 975 971 963 953 943 934 925 914 901 886 869 850 829 808 785
1814.2 785 763 746 738 734 732 731 731 732 731 730 733 740 751 761 771 780 790 801 813 818 812 800 788 777 766 756 746 738 732 730 731 732 732 732 732 733 733 732 727 719 712 704 696 688 679 670 664 661 660 662 669 679
2040.2 679 689 695 701 715 738 768 811 873 948 1022 1092 1161 1234 1312 1395 1477 1564 1651 1721 1763 1788 1813 1841 1869 1896 1909 1921 1979 2107 2279 2469 2667
2179.3 2667 2882 3111 3331 3564 3884 4312 4826 5427 6113 6888 7762 8743 9824 10997 12046 13188 15060 18281
2257.5 18281 22233 25702 28903 31622 32000 28219 22097 17234 15032 14088 13794 14131 15118 16197 17184 18263 19434
$$ packed form
1227.6B000p7p6r7r8q6o7n5To2o3n3m0l1k6k0j7j6k0Tj3kNJ1J6K2K1jkO3J99K64J78
1366.7A782J7p0q3p9r4q7p5o9o6p2o9m4JK6K7J7J8TJ9TJ3MkT%soTJ2M2O0O1N3N5P0
1549.2A490R0J06J20J33J46J59K04K16J28j5j03j24j33j56j50j37j31j24j16j07r6
1640.4A400p8o6o5p5Tn5k2lTj0rj0j1j2nMRJ0RQRTJ0OKkmqj0TrTj1j3j5j7j9k1Tk3
1814.2G85k2j7qmkj%JjTLPJ1J0TRJ0J1J2Noj2Tj1Tj0TqokJT%UJ%jnqpqUrToljKPJ0
2040.2F79J0OTJ4K3L0M3O2P5P4P0O9P3P8Q3Q2Q7TP0M2K5TK8TK7J3J2N8J28J72J90J98
2179.3B667K15K29K20K33L20M28N14O01O86P75Q74R81J081J173J049J142J872L221
2257.5A8281L952L469L201K719L78l781o122m863k202r44k94L37R87J079R87J079J171
$$ plain form
2331.4 19434 20726 22109 23492 24894 26296 27556 28721 29744 30341 30441 30114 29291 28001 26215 23775 20108 15786 12364
2409.6 12364 10610 9755 9046 8272 7644 7040 6397 5776 5241 4841 4526 4207 3828 3446 3144 2975 2886 2800 2689 2580
2496.5 2580 2475 2375 2280 2190 2104 2024 1957 1912 1879 1847 1811 1775 1738 1700 1661 1618 1569 1517 1465 1411 1358 1311 1273 1242 1217 1201 1191 1181 1169 1157 1146
2631.2 1146 1136 1128 1119 1111 1102 1093 1086 1078 1060 1026 982 937 893 850 814 785 765 759 778 813 842 862 876 879 864 836 809 785 761 738 719 701 684 666 648 630 611
2792 611 592 577 571 570 569 569 569 569 567 565 569 582 601 622 645 670 691 706 717 723 719 708 698 690 682 674 665 655 650 656 666 677 686 694 703 714 725 730 724 713 700 688 675 666 663
2987.5 663 663 667 675 686 697 707 718 726 730 731 732 732 731 732 731 731 739 762 792 823 850 878 906 930 954 992 1051 1123 1196 1245 1294 1400 1572 1801 2119 2551 3072
3148.3 3072 3638 4322 5052 5571 5766 5749 5598 5261 4790 4424 4225 4130 4190 4244 4452 5348 7288 9916 12699 15994
3235.2 15994 19444 21448 21181 19468 17182 14205 10655 7764 6043 4980 4273 3923 3928 3978 4012 4090 4075 3908 3648
$$ packed form
2331.4A9434J292J383TJ402TJ260J165J023N97J00l27q23j290j786k440l667m322l422
2409.6A2364j754q55p09p74o28o04o43o21n35m00l15l19l79l82l02j69q9q6j11j09
2496.5B580j05j00r5r0q6q0o7m5l3l2l6Tl7l8l9m3m9n2Tn4n3m7l8l1k5j6j0Tj2Tj1
2631.2A146j0qrqrTpqj8l4m4m5m4m3l6k9k0oJ9L5K9K0J4Lj5k8k7k4Tk3j9j8j7j8Uj9
2792F11j9j5ojT%UkTMJ3J9K1K3K5K1J5J1Omj1j0qUrj0nOJ0J1RQRJ1TNoj1j3j2j3rl
2987.5F63%MQJ1TJ0J1QMJT%jJj%QK3L0L1K7K8TK4TL8N9P2P3M9TJ06J72K29L18M32N21
3148.3C072N66O84P30N19J95j7j51l37m71l66j99r5O0N4K08Q96J940K628K783L295
3235.2A5994L450K004k67j713k286k977l550k891j721j063p07l50NN0L4P8j5j67k60
$$ plain form
3317.8 3648 3334 2944 2500 2107 1804 1553 1343 1175 1049 952 892 861 829 787 745 706 670 637 605 577 551 524 496 467 443 424
3430.8 424 410 401 398 400 401 401 401 401 402 402 399 391 381 370 361 351 342 331 320 315 320 330 340 349 357 366 376 385 391 392 388 382 373 361 350 338 327 318 315 314 314 314 314 314 314 314 314 314 314 314 314 314 314 314 314 314 314 314 317 323 333 342 351 359 368
3713.2 368 377 386 393 397 400 401 402 401 401 402 402 401 397 392 385 378 369 360 351 343 334 327 319 314 313 314 314 314 314 314 314 314 314 314 314 314 314 314 314 314 314 314 314 314 314 314 314 314 314 314 314 313 312 314 322 332 342 352 361 371 382 393 399 395 385 379
$$ packed form
3317.8C648l14l90m44l93l03k51k10j68j26r7o0l1l2m2Tl9l6l3l2k8k6k7k8k9k4j9
3430.8D24j4rlKJ%UJ%lqj0j1rj0rj1TnNJ0TRQRJ0ROJmorj2j1j2j1rlj%S8LOJ0RTQR
3713.2C68RTPMLJTj%J%jmnpTrUqrpqnjJ%T5jTKQJ0URJ0J1TOmj0o
4000C79
##END=$$ End of RAMAN
##END=