##TITLE= N2F2
##JCAMP-DX=5.01
##DATA TYPE= LINK
##BLOCKS= 4
##TITLE= cis-N2F2(Z)
##JCAMP-DX= 5.01
##DATA TYPE= INFRARED SPECTRUM
##DATA CLASS= XYDATA
##BLOCK ID=1
##ORIGIN= Department of Chemistry, UWI, JAMAICA
##OWNER= public domain
##LONGDATE= 2012/02/18 12:31:56.0440 -0500 $$ export date from JSpecView
##SPECTROMETER/DATA SYSTEM= from WebMO Gaussian simulation
##$MODELS=
<Models>
<ModelData id="cN2F2" type="MOL">
Cis-N2F2
__Jmol-14_02041519213D 1   1.00000     0.00000     0
Jmol version 14.3.12_2015.02.04  2015-02-04 07:47 EXTRACT: ({0:31})
  4  3  0  0  0  0              1 V2000
   0.00000   0.62246   0.66361 N   0  0  0  0  0  0
   0.00000   1.32221  -0.51614 F   0  0  0  0  0  0
   0.00000  -0.62246   0.66361 N   0  0  0  0  0  0
   0.00000  -1.32221  -0.51614 F   0  0  0  0  0  0
  1  3  2  0  0  0
  1  2  1  0  0  0
  3  4  1  0  0  0
M  END
</ModelData>
<ModelData id="C1" type="XYZVIB" baseModel="cN2F2" vibrationScale=".5">
4
Model[1]: PATH=Calculation 1;Input;Convg=0.2973D-08;-V/T=2.0037;Energy=NaN;Range=M.O.s;E(RHF)=-307.564599541 A.U.;PATH=Calculation 1;Input
N       0.00000      0.00000      0.00000
F       0.00000      0.00000      1.37166
N       1.07075      0.00000     -0.63509
F       2.27444      0.00000      0.02263
4
Model[2]: PATH=Calculation 1;Standard;Convg=0.2973D-08;-V/T=2.0037;Energy=-307.5646;Range=M.O.s;E(RHF)=-307.564599541 A.U.;PATH=Calculation 1;Standard
N       0.00000      0.62246      0.66361
F       0.00000      1.32221     -0.51614
N       0.00000     -0.62246      0.66361
F       0.00000     -1.32221     -0.51614
4
Model[3]: IRIntensity=1.6378 KM/Mole;PATH=Calculation 1;FrequenciesFrequencies;ReducedMass=18.6503 AMU;ForceConstant=1.0128 mDyne/A;FreqValue=303.5906;Frequency=303.5906 cm^-1;FrequencyLabel=A1;PATH=Calculation 1;FrequenciesFrequencies
N       0.00000      0.62246      0.66361      0.00000      0.02000     -0.19000
F       0.00000      1.32221     -0.51614      0.00000      0.67000      0.14000
N       0.00000     -0.62246      0.66361      0.00000     -0.02000     -0.19000
F       0.00000     -1.32221     -0.51614      0.00000     -0.67000      0.14000
4
Model[4]: IRIntensity=0.0000 KM/Mole;PATH=Calculation 1;FrequenciesFrequencies;ReducedMass=14.5399 AMU;ForceConstant=4.2412 mDyne/A;FreqValue=703.6226;Frequency=703.6226 cm^-1;FrequencyLabel=A2;PATH=Calculation 1;FrequenciesFrequencies
N       0.00000      0.62246      0.66361      0.67000      0.00000      0.00000
F       0.00000      1.32221     -0.51614     -0.23001      0.00000      0.00000
N       0.00000     -0.62246      0.66361     -0.67000      0.00000      0.00000
F       0.00000     -1.32221     -0.51614      0.23001      0.00000      0.00000
4
Model[5]: IRIntensity=85.7201 KM/Mole;PATH=Calculation 1;FrequenciesFrequencies;ReducedMass=16.2718 AMU;ForceConstant=6.1981 mDyne/A;FreqValue=804.0590;Frequency=804.0590 cm^-1;FrequencyLabel=B2;PATH=Calculation 1;FrequenciesFrequencies
N       0.00000      0.62246      0.66361      0.00000      0.51000      0.12000
F       0.00000      1.32221     -0.51614      0.00000     -0.38000      0.29000
N       0.00000     -0.62246      0.66361      0.00000      0.51000     -0.12000
F       0.00000     -1.32221     -0.51614      0.00000     -0.38000     -0.29000
4
Model[6]: IRIntensity=76.4095 KM/Mole;PATH=Calculation 1;FrequenciesFrequencies;ReducedMass=15.9799 AMU;ForceConstant=9.3236 mDyne/A;FreqValue=995.1294;Frequency=995.1294 cm^-1;FrequencyLabel=A1;PATH=Calculation 1;FrequenciesFrequencies
N       0.00000      0.62246      0.66361      0.00000      0.08000      0.54000
F       0.00000      1.32221     -0.51614      0.00000      0.19000     -0.40000
N       0.00000     -0.62246      0.66361      0.00000     -0.08000      0.54000
F       0.00000     -1.32221     -0.51614      0.00000     -0.19000     -0.40000
4
Model[7]: IRIntensity=144.1223 KM/Mole;PATH=Calculation 1;FrequenciesFrequencies;ReducedMass=14.5082 AMU;ForceConstant=10.9878 mDyne/A;FreqValue=1133.7681;Frequency=1133.7681 cm^-1;FrequencyLabel=B2;PATH=Calculation 1;FrequenciesFrequencies
N       0.00000      0.62246      0.66361      0.00000      0.01000      0.67000
F       0.00000      1.32221     -0.51614      0.00000     -0.01000     -0.22000
N       0.00000     -0.62246      0.66361      0.00000      0.01000     -0.67000
F       0.00000     -1.32221     -0.51614      0.00000     -0.01000      0.22000
4
Model[8]: IRIntensity=21.9232 KM/Mole;PATH=Calculation 1;FrequenciesFrequencies;ReducedMass=14.0257 AMU;ForceConstant=22.0129 mDyne/A;FreqValue=1632.1156;Frequency=1632.1156 cm^-1;FrequencyLabel=A1;PATH=Calculation 1;FrequenciesFrequencies
N       0.00000      0.62246      0.66361      0.00000      0.70000     -0.05000
F       0.00000      1.32221     -0.51614      0.00000     -0.03000      0.04000
N       0.00000     -0.62246      0.66361      0.00000     -0.70000     -0.05000
F       0.00000     -1.32221     -0.51614      0.00000      0.03000      0.04000
</ModelData>
</Models>
##$PEAKS=
<Peaks type="IR" xUnitsExpected="1/cm"  >
<PeakData id="1" title="1- (~1632 cm-1)" peakShape="broad" model="C1.8" xMax="1650" xMin="1610"    />
<PeakData id="2" title="2- (~1134 cm-1)" peakShape="broad" model="C1.7" xMax="1150" xMin="1110"    />
<PeakData id="3" title="3- (~995 cm-1)" peakShape="broad" model="C1.6" xMax="1020" xMin="975"    />
<PeakData id="4" title="4- (~804 cm-1)" peakShape="broad" model="C1.5" xMax="825" xMin="780"    />
<PeakData id="5" title="5- Inactive (~704 cm-1)" peakShape="broad" model="C1.4" xMax="725" xMin="680"    />
<PeakData id="6" title="6- (~304 cm-1)" peakShape="broad" model="C1.3" xMax="325" xMin="285"    />
</Peaks>
##XUNITS= 1/CM
##YUNITS= TRANSMITTANCE
##XFACTOR= 1
##YFACTOR= 9.999000E-07
##FIRSTX= 1.832116E+03
##FIRSTY= 9.873769E-01
##LASTX= 1.035906E+02
##NPOINTS= 2001
##MINY= 10.000000E-05
##MAXY= 1
##XYDATA= (X++(Y..Y))
1832.1156 987476 987359 987241 987121 986999 986876 986752 986626 986498 986368 986237 986104 985969 985833 985694 985554 985412
1817.4231 985267 985121 984973 984823 984670 984516 984359 984201 984040 983876 983710 983542 983372 983199 983023 982845 982664
1802.7307 982481 982295 982106 981914 981720 981522 981322 981118 980911 980701 980488 980271 980051 979828 979601 979370 979136
1788.0382 978898 978656 978410 978161 977907 977648 977386 977119 976848 976572 976292 976006 975716 975421 975120 974815 974504
1773.3457 974187 973865 973538 973204 972864 972519 972166 971808 971443 971071 970692 970306 969912 969511 969103 968687 968262
1758.6533 967830 967388 966939 966480 966012 965535 965048 964551 964044 963526 962998 962459 961908 961346 960772 960185 959586
1743.9608 958974 958349 957709 957056 956388 955705 955007 954292 953562 952814 952049 951266 950465 949645 948805 947944 947063
1729.2683 946161 945236 944288 943317 942321 941300 940253 939178 938076 936945 935785 934593 933370 932114
1717.1687 930823 929498 928135 926735 925296 923815 922293 920727 919116 917458 915751 913993 912183
1705.9332 910318 908397 906417 904376 902271 900100 897861 895550 893165 890703 888160 885534 882820
1694.6979 880016 877117 874119 871019 867812 864494 861059 857503 853820 850006 846054 841958 837713
1683.4624 833312 828748 824013 819102 814005 808716 803225 797525 791606 785460 779077 772447 765561
1672.227 758408 750978 743261 735247 726925 718285 709316 700010 690356 680347 669975 659232 648114
1660.9916 636617 624739 612481 599845 586839 573471 559756 545712 531363 516737 501869
1651.4847 486800 471578 456258 440902 425577 410359 395329 380573 366182 352247 338865
1641.9779 326130 314133 302965 292710 283445 275239 268155 262245 257551 254109 251941 251062 251480
1630.7424 253191 256184 260436 265918 272591 280404 289301 299213 310066 321778 334261 347425 361173
1619.5071 375413 390051 404993 420154 435449 450803 466143 481406 496535 511480 526196
1610.0001 540648 554803 568637 582130 595266 608035 620427 632441 644073 655325 666201
1600.4933 676704 686841 696620 706049 715136 723892 732326 740448 748270 755800 763050 770030 776750
1589.2578 783220 789449 795448 801224 806788 812148 817312 822289 827085 831709 836168 840468 844615
1578.0225 848618 852480 856209 859809 863287 866646 869892 873030 876063 878997 881834 884580 887237
1566.787 889809 892299 894711 897048 899313 901507 903635 905699 907700 909642 911527 913356 915132
1555.5516 916857 918532 920160 921742 923279 924774 926228 927642 929018 930356 931659 932927 934162
1544.3162 935365 936536 937678 938790 939874 940931 941961 942966 943946 944902 945835 946745 947634 927176 927912
1531.3523 928629 929326 930004 930663 931305 931929 932536 933127 933702 934261 934805 935335 935849 936350 936838 937312 937773
1516.6598 938222 938658 939082 939495 939896 940286 940666 941034 941393 941741 942079 942408 942727 943038 943339 943631 943915
1501.9673 944190 944457 944716 944967 945210 945446 945674 945895 946108 946315 946515 946708 946895 947075 947248 947416 947577
1487.2749 947732 947881 948025 948163 948295 948421 948542 948658 948768 948873 948973 949068 949158 949243 949323 949399 949469 949535 949597
1470.8539 949654 949706 949754 949798 949837 949872 949903 949930 949952 949971 949985 949996 950002 950005 950004 949998 949989 949977 949960 949940 949916 949888 949857 949822 949784 949741 949696
1447.5188 949647 949594 949538 949478 949415 949349 949279 949205 949128 949048 948965 948878 948787 948694 948597 948496 948393 948286 948175 948062 947945 947824
1428.505 947701 947574 947444 947310 947173 947033 946890 946743 946592 946439 946282 946122 945958 945791 945621 945447 945270
1413.8125 945090 944906 944718 944527 944333 944135 943934 943729 943521 943309 943094 942875 942652 942426 942196 941962 941725
1399.1201 941484 941240 940991 940739 940483 928955 928646 928333 928016 927694 927368 927038 926704 926365 926022 925674
1385.2919 925322 924965 924604 924239 923868 923494 923114 922730 922340 921946 921548 921144 920735 920321 919902 919478 919049
1370.5994 918614 918175 917729 917279 916823 916361 915894 915421 914943 914458 913968 913472 912970 912461 911947 911426 910899
1355.907 910366 909827 909280 908727 908168 907602 907029 906448 905861 905267 904666 904057 903441 902817 902186 901547 900900
1341.2145 900245 899582 898912 898232 897545 896849 896144 895431 894709 893978 893238 892488 891729 890961 890183 889395 888598
1326.5221 887790 886972 886144 885305 884455 883595 882723 881841 880947 880041 879124 878195 877253 876300 875334 874355 873364
1311.8296 872359 871341 870309 869264 868205 867132 866044 864941 863824 862691 861544 860380 859200
1300.5941 858005 856792 855563 854317 853054 851772 850473 849156 847820 846465 845091 843697 842283
1289.3588 840849 839394 837918 836420 834901 833360 831796 830208 828598 826963 825304 823620 821911
1278.1233 820176 818414 816626 814811 812967 811096 809195 807265 805305 803314 801292 799239 797152
1266.888 795033 792880 790692 788470 786211 783916 781583 779213 776804 774355 771865 769335 766762
1255.6525 764146 761487 758783 756033 753236 750392 747499 744557 741564 738520 735422 732271 729065
1244.4171 725802 722483 719104 715666 712167 708606 704981 701291 697534 693710 689817 685854 681818
1233.1816 677709 673524 671566 667202 662758 658233 653625 648931 644152 639283 634325 629275 624132
1221.9463 618893 613557 608122 602587 596948 591206 585357 579400 573333 567154 560862 554454 547930
1210.7108 541287 534524 527640 520632 513499 506241 498856 491342 477202 469507 461683 453732 445652
1199.4755 437444 429107 420643 412053 403337 394497 385535 376454 367256 357945 348525 338999 329374
1188.24 319655 309849 299961 290002 279978 269901 259780 249627 239455 229276 219106 208960
1177.8689 198854 188806 178834 168957 159197 149573 140108 130824 121743 112888 104282 95948 87906
1166.6334 80179 72786 65745 59073 52784 46888 41395 36310 31635 27367 23500 20026 16931 14198
1154.5338 11807 9737 7961 6455 5190 4140 3278 2578 2015 1568 1215 941 729 566 442 348
1140.7056 277 224 184 155 134 119 109 102 100 101 105 114 127 145 170 205 251 313 395 503 645 830 1070 1377 1767 2259
1118.2347 2871 3625 4544 5652 6971 8527 10341 12435 14828 17536 20572 23947 27667 31734
1106.1351 36148 40904 45995 51409 57134 63152 69446 75995 82779 89775 96959 104308 111799 119408
1094.0354 127111 134886 142710 150561 158419 166264 174077 181840 189536 197150 204665 212068 219347
1082.8 226488 233481 240315 246981 253470 259773 265883 271794 277498 282990 288265 293317 298142
1071.5646 302737 307096 311216 315095 318729 322114 325249 328131 330756 333124 335231 337075 338654
1060.3292 339965 341008 341779 342277 342500 342445 342111 341496 340598 339414 337944 336186 334137 331798 329165
1047.3652 326239 323018 319501 315689 311581 307179 302482 297493 292213 286646 280795 274665 268262
1036.1299 261591 254661 247482 240063 232417 224559 216502 208266 199869 191333 182682 173940 165137
1024.8944 156300 147463 138657 129918 121283 112786 104466 96359 88502 80928 73671 66759 60220
1013.659 54075 48340 43029 38147 33694 29665 26051 22835 19997 17515 15362 13513 11938 10612
1001.5593 9507 8600 7869 7295 6863 6561 6380 6314 6362 6525 6809 7223 7779 8493 9386 10480 11802 13381
986.0026 15246 17431 19967 22886 26218 29989 34224 38940 44152 49867 56086 62807 70017 77703
973.90295 85844 94414 103386 112727 122405 132384 142627 153099 163762 174583 185525 196556
963.5318 207645 218762 229878 240969 252011 262981 273860 284631 295276 305784 316139
954.0249 326333 336355 346197 355853 365317 374584 383651 392515 401174 409626 417871 425909 433741
942.7895 441366 448786 456004 463019 469835 476454 482878 489110 495151 501006 506676 512165 517475
931.5541 522609 527570 532360 536984 541442 545738 549875 553855 557681 561355 564879 568256 571488
920.31866 574577 577525 580334 583005 585542 587944 590215 592355 594365 596248 598004 599634 601139
909.08325 602521 603780 604917 605932 606827 607601 608255 608789 609204 609499 609675 609731 609667 609483 609179 608754 608207
894.3908 607538 606747 605832 604792 603627 602335 600915 599366 597686 595874 593929 591848 589630 587273
882.29114 584774 582133 579346 576412 573328 570092 566702 563153 559445 555574 551538 547333 542957
871.0557 538407 533679 528771 523679 518401 512933 507273 501416 495361 489104 482643 475975 469097
859.8203 462008 454704 447185 439448 431493 423318 414925 406312 397481 388433 379172 369699 360019
848.5849 350138 340061 329796 319352 308740 297970 287057 276016 264864 253620 242305
839.078 230942 219557 208175 196827 185544 174358 163304 152417 141735 131294 121132
829.5711 111287 101793 92685 83995 75751 67979 60698 53923 47665 41925 36703 31987 27765
818.3357 24014 20712 17827 15330 13185 11360 9819 8529 7460 6583 5873 5307 4867 4539 4309
805.37177 4170 4116 4145 4259 4462 4762 5169 5699 6368 7200 8218 9452 10933 12694 14772 17202 20021
790.67926 23263 26961 31144 35836 41057 46820 53133 59997 67406 75349 83810 92766 102192 112059
778.5796 122332 132977 143958 155238 166778 178542 190493 202596 214816 227120 239479
769.07275 251862 264244 276600 288906 301143 313291 325334 337256 349044 360687 372174
759.56586 383496 394647 405619 416409 427010 437422 447640 457665 467493 477127 486565 495808
749.1947 504858 513717 522385 530866 539162 547275 555208 562965 570547 577960 585205 592286 599206
737.9593 605969 612579 619038 625351 631519 637548 658134 663959 669651 675211 680645 685954 691142
726.7239 696212 701168 706011 710745 715373 719897 724321 728646 732876 737013 741059 745016 748888
715.48846 752676 756382 760009 763558 767032 770432 773761 777021 780212 783337 786398 789396 792333
704.25305 795210 797823 800584 803290 805942 808541 811089 813587 816037 818439 820795 823105 825372
693.01764 827595 829777 831918 834018 836080 838104 840090 842040 843955 845835 847681 849494 851275
681.7822 853025 854743 856432 858091 859721 861324 862898 864446 865968 867464 868935 870381 871803
670.5468 873202 874578 875931 877262 878571 879860 881128 882375 883603 884812 886001 887172 888324
659.3114 889459 890576 891677 892760 893827 894878 895913 896932 897936 898926 899901 900861 901808 902741
647.21173 903660 904566 905459 906340 907207 908063 908906 909738 910558 911367 912165 912951 913727 914493 915247 915992 916727
632.5192 917452 918167 918873 919569 920256 920935 921604 922265 922917 923561 924197 924824 925443 926055 926659 927255 927844
617.8268 928426 929000 929567 930128 930681 931228 931768 932302 932829 933349 933864 934372 934875 935371 935862 936347 936826
603.13434 937300 937768 938230 938688 939140 939587 940029 940466 940898 941325 953089 953462 953832 954197 954557 954914
589.30615 955266 955614 955958 956298 956634 956967 957295 957620 957941 958258 958572 958882 959189 959492 959792 960089 960382
574.61365 960672 960959 961242 961523 961800 962075 962346 962615 962880 963143 963403 963660 963914 964166 964415 964661 964905
559.9212 965146 965384 965620 965854 966085 966314 966540 966764 966985 967205 967422 967637 967849 968060 968268 968474 968678
545.22876 968880 969080 969278 969474 969668 969859 970049 970237 970424 970608 970790 970971 971150 971327 971502 971676 971848
530.53625 972018 972186 972353 972518 972682 972844 973004 973163 973320 973476 973630 973782 973933 974083 974231 974378 974523
515.8438 974667 974809 974951 975090 975228 975365 975501 975635 975768 975900 976030 976159 976287 976414 976539 976663 976786 976907
500.28708 977028 977147 977265 977382 977498 977612 977725 977838 977949 978059 978168 978275 978382 978488 978592 978696 978798 978899 978999
483.8661 979099 979197 979294 979390 979485 979579 979672 979764 979855 979945 980034 980122 980209 980295 980380 980464 980547 980629 980710 980790 980869 980948 981025 981101 981177
462.25955 981251 981324 981397 981468 981539 981609 981677 981745 981812 981877 981942 982006 982069 982131 982192 982252 982311 982369 982426 982482 982538 982592 982645 982697 982748 982798 982847
438.92444 982895 982942 982988 983033 983077 983120 983161 983202 983242 983280 983317 983353 983388 983422 983455 983486 983516 983545 983573 983599 983625 983648 983671 983692 983712 983731
416.4536 983748 983763 983777 983790 983801 983811 983819 983825 983830 983833 983834 983833 983831 983827 983821 997114 997047 996977 996906 996833 996759 996682 996603 996523 996440 996355 996267
393.11853 996178 996085 995991 995893 995793 995690 995584 995475 995362 995247 995128 995005 994879 994749 994615 994476 994334 994186
377.5618 994034 993877 993715 993548 993375 993196 993012 992820 992623 992418 992206 991987 991759 991523 991279 991026 990763
362.86935 990490 990206 989912 989606 989288 988957 988612 988254 987881 987492 987087 986665 986224 985765 985285 984783 984259
348.17688 983712 983139 982540 981913 981256 980568 979847 979092 978299 977467 976595 975678 974716 973706 972644 971528
334.3487 970356 969123 967828 966468 965038 963536 961960 960305 958570 956752 954849 952860 950785
323.11328 948622 946373 944041 941629 939144 936593 933986 931335 928657 925969 923294 920655 918081
311.87787 915602 913250 911058 909060 907291 905782 904561 903652 903074 902838 902950 903408 904201 905314 906724
298.9139 908404 910324 912451 914750 917188 919732 922351 925016 927702 930386 933048 935672 938245
287.6785 940754 943193 945554 947832 950026 952133 954153 956086 957934 959698 961381 962985 964513
276.4431 965968 967353 968671 969925 971118 972254 973334 974363 975342 976274 977162 978008 978814 979583 980316
263.47916 981015 981683 982321 982929 983511 984068 984600 985109 985596 986063 986510 986939 987350 987745 988123 988487 988836
248.7867 989171 989494 989804 990103 990390 990667 990933 991190 991438 991676 991907 992129 992344 992551 992751 992944 993131
234.09424 993312 993487 993657 993820 993979 994133 994282 994426 994566 994702 994833 994961 995085 995205 995322 995435 995545
219.40178 995653 995757 995858 995956 996052 996145 996236 996324 996410 996494 996575 996654 996732 996807 996881 996952 997022 997090 997157 997222 997285 997347 997407
199.52374 997466 997524 997580 997635 997689 997741 997792 997842 997891 997939 997986 998032 998077 998121 998164 998206 998247 998288 998327 998366 998404 998441 998477 998513 998548 998582
177.05292 998616 998649 998681 998712 998744 998774 998804 998833 998862 998890 998918 998945 998972 998998 999024 999049 999074 999098 999122 999146 999169 999192 999214 999236 999258 999279 999300 999320 999340 999360 999380 999399 999418 999436 999454
146.80373 999472 999490 999508 999525 999542 999558 999574 999591 999606 999622 999637 999652 999667 999682 999696 999711 999725 999738 999752 999765 999779 999792 999804 999817 999830 999842 999854 999866 999878 999889 999901
120.01159 999912 999923 999934 999945 999956 999966 999977 999987 999997 1000007 1000017 1000027 1000036 1000046 1000055 1000064 1000073 1000082 1000091
103.5906A000100  $$checkpoint
##END= $$ end of cis-N2F2 IR
##TITLE=Raman of cis-N2F2 (Z) $$ Begin of the data block
##JCAMP-DX=5.00 $$ ACD/DocManager Library v 5.00
##DATA TYPE=RAMAN SPECTRUM
##DATA CLASS=XYDATA
##BLOCK ID=2
##DATE=19 Feb 2012 10:29:22
##ORIGIN= Department of Chemistry, UWI, Jamaica
##OWNER= public domain
##SPECTROMETER/DATA SYSTEM=from WebMO Gaussian simulation
##$MODELS=
<Models>
<ModelData id="cN2F2" type="MOL">
Cis-N2F2
__Jmol-14_02041519213D 1   1.00000     0.00000     0
Jmol version 14.3.12_2015.02.04  2015-02-04 07:47 EXTRACT: ({0:31})
  4  3  0  0  0  0              1 V2000
   0.00000   0.62246   0.66361 N   0  0  0  0  0  0
   0.00000   1.32221  -0.51614 F   0  0  0  0  0  0
   0.00000  -0.62246   0.66361 N   0  0  0  0  0  0
   0.00000  -1.32221  -0.51614 F   0  0  0  0  0  0
  1  3  2  0  0  0
  1  2  1  0  0  0
  3  4  1  0  0  0
M  END
</ModelData>
<ModelData id="C2" type="XYZVIB" baseModel="cN2F2" vibrationScale=".5">
4
Model[1]: PATH=Calculation 1;Input;Convg=0.2973D-08;-V/T=2.0037;Energy=NaN;Range=M.O.s;E(RHF)=-307.564599541 A.U.;PATH=Calculation 1;Input
N       0.00000      0.00000      0.00000
F       0.00000      0.00000      1.37166
N       1.07075      0.00000     -0.63509
F       2.27444      0.00000      0.02263
4
Model[2]: PATH=Calculation 1;Standard;Convg=0.2973D-08;-V/T=2.0037;Energy=-307.5646;Range=M.O.s;E(RHF)=-307.564599541 A.U.;PATH=Calculation 1;Standard
N       0.00000      0.62246      0.66361
F       0.00000      1.32221     -0.51614
N       0.00000     -0.62246      0.66361
F       0.00000     -1.32221     -0.51614
4
Model[3]: IRIntensity=1.6378 KM/Mole;PATH=Calculation 1;FrequenciesFrequencies;ReducedMass=18.6503 AMU;ForceConstant=1.0128 mDyne/A;FreqValue=303.5906;Frequency=303.5906 cm^-1;FrequencyLabel=A1;PATH=Calculation 1;FrequenciesFrequencies
N       0.00000      0.62246      0.66361      0.00000      0.02000     -0.19000
F       0.00000      1.32221     -0.51614      0.00000      0.67000      0.14000
N       0.00000     -0.62246      0.66361      0.00000     -0.02000     -0.19000
F       0.00000     -1.32221     -0.51614      0.00000     -0.67000      0.14000
4
Model[4]: IRIntensity=0.0000 KM/Mole;PATH=Calculation 1;FrequenciesFrequencies;ReducedMass=14.5399 AMU;ForceConstant=4.2412 mDyne/A;FreqValue=703.6226;Frequency=703.6226 cm^-1;FrequencyLabel=A2;PATH=Calculation 1;FrequenciesFrequencies
N       0.00000      0.62246      0.66361      0.67000      0.00000      0.00000
F       0.00000      1.32221     -0.51614     -0.23001      0.00000      0.00000
N       0.00000     -0.62246      0.66361     -0.67000      0.00000      0.00000
F       0.00000     -1.32221     -0.51614      0.23001      0.00000      0.00000
4
Model[5]: IRIntensity=85.7201 KM/Mole;PATH=Calculation 1;FrequenciesFrequencies;ReducedMass=16.2718 AMU;ForceConstant=6.1981 mDyne/A;FreqValue=804.0590;Frequency=804.0590 cm^-1;FrequencyLabel=B2;PATH=Calculation 1;FrequenciesFrequencies
N       0.00000      0.62246      0.66361      0.00000      0.51000      0.12000
F       0.00000      1.32221     -0.51614      0.00000     -0.38000      0.29000
N       0.00000     -0.62246      0.66361      0.00000      0.51000     -0.12000
F       0.00000     -1.32221     -0.51614      0.00000     -0.38000     -0.29000
4
Model[6]: IRIntensity=76.4095 KM/Mole;PATH=Calculation 1;FrequenciesFrequencies;ReducedMass=15.9799 AMU;ForceConstant=9.3236 mDyne/A;FreqValue=995.1294;Frequency=995.1294 cm^-1;FrequencyLabel=A1;PATH=Calculation 1;FrequenciesFrequencies
N       0.00000      0.62246      0.66361      0.00000      0.08000      0.54000
F       0.00000      1.32221     -0.51614      0.00000      0.19000     -0.40000
N       0.00000     -0.62246      0.66361      0.00000     -0.08000      0.54000
F       0.00000     -1.32221     -0.51614      0.00000     -0.19000     -0.40000
4
Model[7]: IRIntensity=144.1223 KM/Mole;PATH=Calculation 1;FrequenciesFrequencies;ReducedMass=14.5082 AMU;ForceConstant=10.9878 mDyne/A;FreqValue=1133.7681;Frequency=1133.7681 cm^-1;FrequencyLabel=B2;PATH=Calculation 1;FrequenciesFrequencies
N       0.00000      0.62246      0.66361      0.00000      0.01000      0.67000
F       0.00000      1.32221     -0.51614      0.00000     -0.01000     -0.22000
N       0.00000     -0.62246      0.66361      0.00000      0.01000     -0.67000
F       0.00000     -1.32221     -0.51614      0.00000     -0.01000      0.22000
4
Model[8]: IRIntensity=21.9232 KM/Mole;PATH=Calculation 1;FrequenciesFrequencies;ReducedMass=14.0257 AMU;ForceConstant=22.0129 mDyne/A;FreqValue=1632.1156;Frequency=1632.1156 cm^-1;FrequencyLabel=A1;PATH=Calculation 1;FrequenciesFrequencies
N       0.00000      0.62246      0.66361      0.00000      0.70000     -0.05000
F       0.00000      1.32221     -0.51614      0.00000     -0.03000      0.04000
N       0.00000     -0.62246      0.66361      0.00000     -0.70000     -0.05000
F       0.00000     -1.32221     -0.51614      0.00000      0.03000      0.04000
</ModelData>
</Models>
##$PEAKS=
<Peaks type="RAMAN" xUnitsExpected="1/cm"  >
<PeakData id="1" title="1- (~1632 cm-1)" peakShape="broad" model="C2.8" xMax="1650" xMin="1610"    />
<PeakData id="2" title="2- (~1134 cm-1)" peakShape="broad" model="C2.7" xMax="1150" xMin="1110"    />
<PeakData id="3" title="3- (~995 cm-1)" peakShape="broad" model="C2.6" xMax="1020" xMin="975"    />
<PeakData id="4" title="4- (~804 cm-1)" peakShape="broad" model="C2.5" xMax="825" xMin="780"    />
<PeakData id="5" title="5- (~704 cm-1)" peakShape="broad" model="C2.4" xMax="725" xMin="680"    />
<PeakData id="6" title="6- (~304 cm-1)" peakShape="broad" model="C2.3" xMax="325" xMin="285"    />
</Peaks>
##XUNITS= 1/CM
##YUNITS= ABSORBANCE
##XFACTOR= 1
##YFACTOR= 2.019120E-07
##FIRSTX= 1.832116E+03
##FIRSTY= 5.395800E-02
##LASTX= 1.035906E+02
##NPOINTS= 2001
##MINY= 2.621200E-02
##MAXY= 2.021741E-01
##XYDATA= (X++(Y..Y))
1832.1156 2672 2695 2719 2742 2766 2791 2815 2840 2865 2891 2917 2943 2970 2997 3024 3052 3080 3108 3137 3167 3196 3226 3257 3288 3319 3351 3384 3416 3450 3483 3518 3552
1804.4592 3588 3624 3660 3697 3734 3772 3811 3850 3890 3930 3971 4013 4055 4098 4142 4186 4231 4277 4324 4371 4419 4468 4518 4569 4620 4672 4725 4780 4835
1779.3956 4891 4947 5005 5064 5124 5185 5247 5311 5375 5441 5507 5575 5645 5715 5787 5860 5935 6011 6088 6167 6248 6330 6413 6499 6586 6675 6765
1756.0605 6858 6952 7048 7146 7247 7349 7454 7560 7669 7781 7895 8011 8130 8252 8376 8503 8633 8766 8902
1739.6395 9041 9183 9329 9478 9631 9787 9947 10111 10280 10452 10628 10810 10995 11186 11381 11581 11787 11998
1724.0828 12215 12438 12666 12901 13143 13391 13646 13908 14178 14455 14741 15035 15338 15649 15971 16302 16643
1709.3904 16994 17357 17731 18117 18516 18927 19352 19791 20245 20714 21199 21701 22220 22758 23314 23891 24489
1694.6979 25108 25751 26418 27109 27828 28574 29349 30155 30993 31865 32772 33717 34702 35728 36797 37913 39077
1680.0054 40293 41562 42889 44276 45726 47244 48833 50497 52241 54069 55986 57998 60109 62326
1667.9058 64654 67101 69673 72377 75221 78213 81361 84673 88158 91826 95685 99744 104013 108501
1655.806 113214 118163 123352 128787 134472 140409 146596 153027 159694 166583 173674 180940 188348
1644.5707 195855 203410 210952 218412 225710 232760 239466 245730 251450 256528 260868 264385 267005
1633.3352 268674 269354 269030 267710 265422 262216 258159 253333 247830 241747 235187 228248 221028 213616
1621.2356 206095 198537 191006 183558 176237 169081 162117 155369 148853 142579 136553 130778 125254
1610.0001 119978 114945 110149 105582 101237 97104 93175 89440 85891 82518 79313 76267 73371
1598.7648 70618 68000 65510 63140 60884 58736 56690 54740 52881 51108 49416 47800 46258 44783
1586.665 43374 42027 40737 39503 38321 37188 36103 35061 34063 33104 32183 31299 30449 29632 28846
1573.7012 28090 27362 26660 25985 25334 24706 24101 23517 22953 22409 21883 21375 20884 20410 19951 19506 19076
1559.0087 18660 18257 17867 17489 17122 16766 16422 16087 15763 15447 15142 14845 14556 14276 14003 13738 13481
1544.3162 13230 12986 12749 12518 12294 12075 11862 11654 11452 11255 11062 10875 10692 10666 10493 10324 10159 9998
1528.7595 9841 9688 9538 9392 9249 9109 8973 8840 8709 8582 8458 8336 8217 8100 7986 7875 7766 7659
1513.2028 7554 7452 7351 7253 7157 7063 6971 6880 6792 6705 6620 6536 6454 6374 6296 6218 6143 6068 5996 5924 5854 5785 5718 5651 5586 5523
1490.7319 5460 5398 5338 5278 5220 5163 5106 5051 4997 4943 4891 4839 4788 4738 4689 4641 4594 4547 4501 4456 4412 4369 4326 4283 4242 4201 4161 4121 4083 4044
1464.8041 4007 3970 3933 3897 3862 3827 3793 3759 3726 3693 3661 3629 3598 3567 3537 3507 3478 3449 3420 3392 3364 3337 3310 3284 3258 3232 3206 3181 3157 3133 3109 3085 3062 3039 3017 2994 2972
1432.8263 2951 2930 2909 2888 2867 2847 2828 2808 2789 2770 2751 2733 2714 2696 2679 2661 2644 2627 2611 2594 2578 2562 2546 2531 2515 2500 2485 2470 2456 2442 2428 2414 2400 2387 2373 2360
1401.7129 2347 2335 2322 2310 2298 2286 2274 2262 4738 4737 4737 4737 4737 4738 4738 4739 4740 4742 4743 4745 4747 4750 4752 4755 4758 4761 4764 4768 4772 4776 4780 4785 4790 4795 4800 4805 4811 4817 4823 4829 4836 4843 4850 4857 4864 4872 4880 4888 4897 4905 4914 4923 4932 4942 4952 4962 4972 4982 4993 5004 5015 5026 5038 5050
1346.4 5062 5074 5087 5099 5112 5126 5139 5153 5167 5181 5196 5210 5225 5241 5256 5272 5288 5304 5321 5338 5355 5372 5390 5408 5426 5445 5463 5482 5502 5521 5541 5562
1318.7437 5582 5603 5624 5645 5667 5689 5712 5734 5757 5780 5804 5828 5852 5877 5902 5927 5953 5979 6005 6032 6059 6087 6115 6143 6172 6201 6230 6260 6290 6321 6352 6383 6415 6448 6480 6513 6547 6581
1285.9017 6616 6651 6686 6722 6759 6796 6834 6872 6910 6949 6989 7029 7070 7111 7153 7195 7238 7282 7326 7371 7417 7463 7510 7557 7605 7654 7704 7754 7805 7857 7910
1259.1096 7963 8017 8072 8128 8184 8242 8300 8359 8419 8480 8542 8605 8669 8734 8800 8867 8935 9004 9075 9146 9219 9293 9368 9444 9522 9601 9681
1235.7744 9763 9846 9930 10016 10104 9524 9618 9713 9810 9909 10010 10112 10216 10322 10431 10541 10653 10768 10884 11003
1218.4893 11125 11249 11375 11504 11636 11770 11908 12048 12191 12338 12488 12641 12798 12958 13123 13291 13463
1203.7968 14823 15009 15199 15395 15595 15800 16011 16227 16449 16677 16912 17153 17400 17655 17918 18188 18466
1189.1042 18752 19048 19353 19668 19992 20328 20675 21033 21404 21788 22186 22598 23025 23468 23928 24406 24902
1174.4119 25418 25954 26512 27094 27699 28331 28989 29676 30393 31142 31925 32743 33598 34493 35428 36407 37432
1159.7194 38504 39626 40799 42026 43308 44648 46045 47502 49018 50593 52226 53916 55658 57449
1147.6198 59283 61152 63046 64954 66864 68758 70619 72427 74162 75801 77322 78701 79918 80954
1135.52 81792 82419 82828 83015 82982 82736 82287 81652 80848 79897 78821 77642 76384 75068 73715 72344
1121.6918 70971 69610 68275 66975 65720 64515 63366 62277 61251 60289 59391 58559 57792 57088 56447
1108.7279 55868 55348 54886 54481 54130 53832 53585 53604 53456 53354 53297 53284 53314 53384 53495 53646 53835 54061 54325
1092.3069 54625 54961 55333 55740 56182 56659 57170 57717 58298 58915 59566 60254 60977 61736 62532 63366 64238
1077.6144 65149 66099 67090 68123 69198 70317 71481 72691 73949 75256 76615 78025 79491 81012
1065.5148 82592 84233 85937 87706 89543 91451 93433 95493 97632 99855 102167 104569 107068 109667
1053.415 112370 115184 118113 121164 124341 127652 131103 134702 138455 142372 146461 150731 155192
1042.1797 159854 164728 169827 175162 180747 186597 192725 199149 205885 212952 220367 228152 236329
1030.9442 244919 253947 263438 273419 283917 294962 306584 318815 331686 345230 359483 374476
1020.5731 390244 406819 424231 442510 461679 481759 502762 524694 547550 571310 595943
1011.0662 621395 647593 674441 701811 729549 757464 785335 812901 839871 865923 890709
1001.5593 913863 935012 953788 969841 982856 992563 998755 1001298 1000136 995295 986882 975081
991.1882 960140 942359 922078 899660 875478 849901 823286 795963 768236 740376 712619
981.6813 685166 658184 631810 606150 581288 557281 534169 511976 490711 470373 450951
972.17444 432428 414780 397981 382000 366805 352364 338643 325607 313224 301461 290287
962.66754 279670 269581 259992 250875 242206 233959 226111 218641 211528 204752 198295 192139 186268
951.4321 180668 175322 170218 165343 160685 156233 151975 147902 144005 140274 136702 133280 130001
940.1967 126858 123845 120956 118184 115524 112971 110520 108167 105908 103737 101652 99648 97723
928.9613 95873 94095 92385 90742 89163 87645 86186 84783 83435 82140 80896 79701 78553 77451
916.86163 76393 75379 74406 73473 72579 71724 70906 70123 69376 68663 67983 67336 66721 66137 65584 65061 64567
902.1691 64102 63666 63258 62878 62525 62199 61901 61629 61383 61164 60971 60804 60663 60548 60460 60397 60361 60352
886.6124 60369 60413 60484 60582 60709 60863 61046 61258 61500 61772 62074 62408 62775 63174 63607 64075 64579 65120
871.0557 65698 66316 66974 67675 68418 69206 70041 70925 71858 72845 73885 74982 76139 77357 78640 79991
857.2275 81412 82907 84480 86135 87875 89705 91629 93652 95780 98018 100372 102848 105453 108194
845.1278 111079 114115 117311 120676 124220 127954 131887 136030 140398 145000 149852 154966 160358
833.8924 166041 172032 178346 184999 192007 199386 207151 215317 223898 232904 242347 252231 262559
822.657 273328 284531 296150 308162 320531 333211 346142 359250 372445 385620 398652
813.1501 411403 423720 435435 446377 456366 465229 472798 478923 483476 486359 487508 486895 484534
801.9147 480477 474809 467648 459139 449443 438732 427184 414975 402273 389238 376013 362728
791.5436 349493 336407 323547 310979 298754 286911 275478 264475 253911 243793 234119
782.0367 224884 216081 207697 199722 192139 184935 178093 171598 165434 159585 154036 148772 143779
770.8013 139042 134548 130286 126242 122405 118765 115312 112035 108927 105978 103181 100529 98014
759.56586 95629 93370 91230 89205 87288 85477 83767 82153 80633 79204 77862 76605 75430 74335
747.4662 73319 72380 71516 70727 70010 69366 68795 68295 67866 67509 67224 67012 66873 66808 66817 66904 67068 67160 67485
731.04517 67893 68386 68966 69634 70393 71245 72191 73232 74371 75607 76939 78368 79890 81503 83201
718.08124 84977 86823 88727 90675 92650 94632 96599 98525 100381 102137 103761 105220 106482 107516
705.98157 108295 108794 108996 109218 108797 108064 107028 105704 104114 102284 100243 98022 95653 93169 90600
693.01764 87975 85320 82658 80011 77394 74822 72308 69860 67486 65190 62976 60845 58799 56836
680.91797 54957 53160 51441 49800 48233 46737 45310 43948 42649 41409 40226 39096 38017 36987
668.8183 36003 35062 34162 33301 32477 31688 30932 30207 29512 28845 28205 27590 26999 26431 25884 25358 24851
654.1258 24363 23893 23439 23001 22578 22170 21775 21394 21025 20668 20322 19988 19664 19349 19045 18749 18463
639.43335 18184 17914 17651 17396 17148 16907 16672 16444 16222 16005 15794 15589 15389 15193 15003 14817 14636
624.7409 14459 14287 14118 13954 13793 13636 13482 13332 13185 13041 12901 12763 12629 12497 12368 12242 12118
610.0484 11997 11878 11762 11648 11536 11427 11319 11214 11110 11009 10909 10812 10716 10622 10529 10439 10349 10262 7706 7633
592.7632 7560 7489 7419 7351 7284 7218 7153 7090 7028 6967 6907 6848 6790 6733 6677 6622 6569 6516 6464 6413 6363 6313 6265 6218 6171 6125 6080
569.4281 6036 5992 5949 5907 5866 5825 5785 5746 5708 5670 5632 5596 5560 5525 5490 5456 5422 5389 5357 5325 5294 5263 5233 5203 5174 5145 5117 5090 5063 5036 5010 4984
541.77167 4959 4934 4910 4886 4863 4840 4817 4795 4774 4753 4732 4711 4691 4672 4653 4634 4616 4598 4580 4563 4546 4529 4513 4498 4482 4467 4453 4439 4425 4411 4398 4385 4373 4361 4349 4338 4327 4316 4305 4295 4286
506.3369 4276 4268 4259 4251 4243 4235 4228 4221 4214 4208 4202 4196 4191 4186 4182 4177 4174 4170 4167 4164 4162 4159 4158 4156 4155 4154 4154 4154 4154 4155 4156 4158 4159 4162 4164 4167 4171 4174 4178 4183 4188 4193 4199 4205 4212 4219 4226 4234 4242 4251 4260 4270 4280
460.531 4291 4302 4313 4325 4338 4351 4364 4378 4393 4408 4424 4440 4457 4474 4492 4511 4530 4550 4570 4591 4613 4635 4658 4682 4707 4732 4758 4784 4812 4840 4869 4899
432.8746 4930 4961 4994 5027 5061 5097 5133 5170 5208 5248 5288 5329 5372 5415 5460 5506 5554 5602 5652 5703 5756 5810 5866 5923 5981 6041 6103 6167
408.67526 6232 6299 6368 6439 6512 6586 5488 5572 5659 5747 5838 5931 6027 6126 6227 6330 6437 6547 6660 6775 6895
390.52576 7017 7144 7273 7407 7545 7686 7832 7983 8138 8298 8463 8633 8808 8989 9176 9369 9568 9774
374.96902 9987 10207 10434 10669 10913 11165 11426 11696 11976 12267 12568 12880 13204 13541 13890 14253 14630 15022
359.4123 15430 15855 16297 16757 17236 17736 18257 18800 19368 19960 20579 21225 21902 22609 23349 24124 24935
344.71985 25786 26678 27613 28594 29624 30705 31842 33035 34291 35610 36998 38458 39995 41612
332.62015 43313 45103 46987 48969 51053 53244 55545 57961 60494 63148 65924 68823 71844 74984
320.52048 78240 81604 85066 88615 92232 95898 99587 103270 106913 110477 113919 117194 120253 123046
308.4208 125525 127644 129361 130640 131455 131786 131627 130766 129649 128083 126101 123744 121055 118084
296.32114 114880 111491 107964 104344 100670 96978 93300 89661 86085 82590 79188 75892 72709
285.08572 69644 66701 63880 61182 58605 56146 53804 51573 49450 47432 45512 43688 41955 40307
272.98605 38741 37253 35839 34494 33216 31999 30841 29740 28690 27691 26738 25830 24964 24138 23349
260.02213 22595 21875 21187 20529 19899 19296 18718 18165 17635 17126 16638 16170 15720 15288 14873 14474 14090
245.32965 13721 13365 13023 12693 12375 12068 11772 11487 11212 10946 10689 10441 10201 9969 9745 9528 9318
230.63719 9115 8918 8727 8543 8363 8190 8021 7858 7699 7546 7396 7251 7110 6973 6840 6711 6585 6462
215.08046 6343 6227 6115 6005 5898 5794 5693 5594 5497 5404 5312 5223 5136 5051 4968 4887 4808 4731 4656 4582 4511 4441
196.06668 4372 4305 4240 4176 4113 4052 3992 3934 3876 3820 3765 3712 3659 3608 3557 3508 3460 3412 3366 3320 3276 3232 3189 3147 3106 3066 3026 2987 2949
171.00308 2912 2875 2839 2804 2769 2735 2702 2669 2637 2605 2574 2544 2514 2484 2455 2427 2399 2371 2344 2318 2291 2266 2240 2216 2191 2167 2144 2120 2097 2075
145.0752 2053 2031 2009 1988 1967 1947 1927 1907 1887 1868 1849 1831 1812 1794 1776 1759 1741 1724 1707 1691 1674 1658 1642 1627 1611 1596 1581 1566 1552 1538 1523 1509 1496
116.554535 1482 1469 1455 1442 1429 1417 1404 1392 1379 1367 1355 1344 1332 1321 1309
103.5906A298  $$checkpoint
##END=$$ End of the RAMAN for cis-N2F2
##TITLE= trans-N2F2 (E)
##JCAMP-DX= 5.01
##DATA TYPE= INFRARED SPECTRUM
##DATA CLASS= XYDATA
##BLOCK ID=3
##ORIGIN= Department of Chemistry, UWI, JAMAICA
##OWNER= public domain
##LONGDATE= 2012/02/18 12:32:26.0301 -0500 $$ export date from JSpecView
##SPECTROMETER/DATA SYSTEM= from WebMO Gaussian simulation
##$MODELS=
<Models>
<ModelData id="tN2F2" type="MOL">
trans-N2F2
__Jmol-14_02041519463D 1   1.00000     0.00000     0
Jmol version 14.3.12_2015.02.04  2015-02-04 07:47 EXTRACT: ({0:31})
  4  3  0  0  0  0              1 V2000
  -0.32590   0.52950   0.00000 N   0  0  0  0  0  0
   0.32590   1.73473   0.00000 F   0  0  0  0  0  0
   0.32590  -0.52950   0.00000 N   0  0  0  0  0  0
  -0.32590  -1.73473   0.00000 F   0  0  0  0  0  0
  1  3  2  0  0  0
  1  2  1  0  0  0
  4  3  1  0  0  0
M  END
</ModelData>
<ModelData id="T1" type="XYZVIB" baseModel="tN2F2" vibrationScale=".5">
4
Model[1]: PATH=Calculation 1;Input;Convg=0.6094D-08;-V/T=2.0039;Energy=NaN;Range=M.O.s;E(RHF)=-307.543247413 A.U.;PATH=Calculation 1;Input
N       0.00000      0.00000      0.00000
F       0.00000      0.00000      1.37019
N       1.07708      0.00000     -0.62145
F       1.07708      0.00000     -1.99164
4
Model[2]: PATH=Calculation 1;Standard;Convg=0.6094D-08;-V/T=2.0039;Energy=-307.54324;Range=M.O.s;E(RHF)=-307.543247413 A.U.;PATH=Calculation 1;Standard
N      -0.32590      0.52950      0.00000
F       0.32590      1.73473      0.00000
N       0.32590     -0.52950      0.00000
F      -0.32590     -1.73473      0.00000
4
Model[3]: IRIntensity=9.9939 KM/Mole;PATH=Calculation 1;FrequenciesFrequencies;ReducedMass=15.7615 AMU;ForceConstant=1.6707 mDyne/A;FreqValue=424.1532;Frequency=424.1532 cm^-1;FrequencyLabel=BU;PATH=Calculation 1;FrequenciesFrequencies
N      -0.32590      0.52950      0.00000     -0.49001      0.28000      0.00000
F       0.32590      1.73473      0.00000      0.36001     -0.21000      0.00000
N       0.32590     -0.52950      0.00000     -0.49001      0.28000      0.00000
F      -0.32590     -1.73473      0.00000      0.36001     -0.21000      0.00000
4
Model[4]: IRIntensity=3.2135 KM/Mole;PATH=Calculation 1;FrequenciesFrequencies;ReducedMass=15.7615 AMU;ForceConstant=1.8399 mDyne/A;FreqValue=445.1102;Frequency=445.1102 cm^-1;FrequencyLabel=AU;PATH=Calculation 1;FrequenciesFrequencies
N      -0.32590      0.52950      0.00000      0.00000      0.00000      0.57000
F       0.32590      1.73473      0.00000      0.00000      0.00000     -0.42000
N       0.32590     -0.52950      0.00000      0.00000      0.00000      0.57000
F      -0.32590     -1.73473      0.00000      0.00000      0.00000     -0.42000
4
Model[5]: IRIntensity=0.0000 KM/Mole;PATH=Calculation 1;FrequenciesFrequencies;ReducedMass=18.4711 AMU;ForceConstant=3.1524 mDyne/A;FreqValue=538.2069;Frequency=538.2069 cm^-1;FrequencyLabel=AG;PATH=Calculation 1;FrequenciesFrequencies
N      -0.32590      0.52950      0.00000      0.16000      0.17000      0.00000
F       0.32590      1.73473      0.00000      0.07000      0.67000      0.00000
N       0.32590     -0.52950      0.00000     -0.16000     -0.17000      0.00000
F      -0.32590     -1.73473      0.00000     -0.07000     -0.67000      0.00000
4
Model[6]: IRIntensity=283.9405 KM/Mole;PATH=Calculation 1;FrequenciesFrequencies;ReducedMass=15.7615 AMU;ForceConstant=9.4587 mDyne/A;FreqValue=1009.2323;Frequency=1009.2323 cm^-1;FrequencyLabel=BU;PATH=Calculation 1;FrequenciesFrequencies
N      -0.32590      0.52950      0.00000      0.28000      0.49001      0.00000
F       0.32590      1.73473      0.00000     -0.21000     -0.36001      0.00000
N       0.32590     -0.52950      0.00000      0.28000      0.49001      0.00000
F      -0.32590     -1.73473      0.00000     -0.21000     -0.36001      0.00000
4
Model[7]: IRIntensity=0.0000 KM/Mole;PATH=Calculation 1;FrequenciesFrequencies;ReducedMass=14.6176 AMU;ForceConstant=14.0859 mDyne/A;FreqValue=1278.8749;Frequency=1278.8749 cm^-1;FrequencyLabel=AG;PATH=Calculation 1;FrequenciesFrequencies
N      -0.32590      0.52950      0.00000      0.55000      0.36001      0.00000
F       0.32590      1.73473      0.00000     -0.20001     -0.14000      0.00000
N       0.32590     -0.52950      0.00000     -0.55000     -0.36001      0.00000
F      -0.32590     -1.73473      0.00000      0.20001      0.14000      0.00000
4
Model[8]: IRIntensity=0.0000 KM/Mole;PATH=Calculation 1;FrequenciesFrequencies;ReducedMass=14.0175 AMU;ForceConstant=20.8242 mDyne/A;FreqValue=1587.9014;Frequency=1587.9014 cm^-1;FrequencyLabel=AG;PATH=Calculation 1;FrequenciesFrequencies
N      -0.32590      0.52950      0.00000     -0.40000      0.58000      0.00000
F       0.32590      1.73473      0.00000      0.00000     -0.04000      0.00000
N       0.32590     -0.52950      0.00000      0.40000     -0.58000      0.00000
F      -0.32590     -1.73473      0.00000      0.00000      0.04000      0.00000
</ModelData>
</Models>
##$PEAKS=
<Peaks type="IR" xUnitsExpected="1/cm"  >
<PeakData id="1" title="1- Inactive (~1587 cm-1)" peakShape="broad" model="T1.8" xMax="1610" xMin="1560"    />
<PeakData id="2" title="2- Inactive (~1278 cm-1)" peakShape="broad" model="T1.7" xMax="1310" xMin="1250"    />
<PeakData id="3" title="3- (~1009 cm-1)" peakShape="broad" model="T1.6" xMax="1030" xMin="975"    />
<PeakData id="4" title="4- Inactive (~538 cm-1)" peakShape="broad" model="T1.5" xMax="560" xMin="510"    />
<PeakData id="5" title="5- (~445 cm-1)" peakShape="broad" model="T1.4" xMax="470" xMin="420"    />
<PeakData id="6" title="6- (~424 cm-1)" peakShape="broad" model="T1.3" xMax="450" xMin="400"    />
</Peaks>
##XUNITS= 1/CM
##YUNITS= TRANSMITTANCE
##XFACTOR= 1
##YFACTOR= 9.999000E-07
##FIRSTX= 1.787119E+03
##FIRSTY= 1
##LASTX= 2.241532E+02
##NPOINTS= 2000
##MINY= 10.000000E-05
##MAXY= 1
##XYDATA= (X++(Y..Y))
1787.1195A000100%V82k2731q8Tq9Tr0r1Ur2r3Tr4Tr5r6Ur7r8Tr9Tj01I75111
1389.9275 975010 974908 974805 974702 974598 974494 974389 974283 974177 974070 973962 973854 973745 973635 973525 973414 973302 973190 973077 972963 972848
1373.5082 972733 972617 972500 972383 972265 972146 972026 971905 971784 971662 971539 971416 971291 971166 971040 970913 970785 970657 970527 970397
1357.8706 970266 970134 970001 969868 969733 969598 969461 969324 969186 969047 968907 968766 968624 968481 968337 968192 968046 967899 967751
1343.015 967602 967453 967302 967150 966997 966843 966687 966531 966374 966215 966056 965895 965733 965571 965406 965241 965075 964907 964738 964568
1327.3776 964397 964225 964051 963876 963700 963522 963343 963163 962982 962799 962615 962430 962243 962055 961865 961674 961482
1314.0857 961288 961092 960896 960697 960498 960296 960094 959889 959683 959476 959267 959056 958844 958630 958415 958197 957979 957758 957536 957311
1298.4482 957086 956858 956629 956397 956164 955930 955693 955454 955214 954971 954727 954480 954232 953981 953729 953474 953218
1285.1564 952959 952698 952435 952170 951903 951633 951361 951087 950811 950532 950251 949968 949682 949394 949103 948810 948514
1271.8645 948216 947915 947612 947306 946997 946686 946372 946055 945736 945413 945088 944760 944429 944095 943758 943419 943076
1258.5726 942730 942381 942028 941673 941314 940952 940587 940218 939846 939471 939092 938709 938323 937933 937540 937143 936743
1245.2808 936338 935930 935518 935102 934681 934257 933829 933397 932960 932520 932075 931625 931171 930713 930251 929783 929311
1231.9889 928835 928353 927867 927376 926880 926379 925873 925362 924845 924324 923797 923264 922726 922183 921634 921079 920518
1218.697 919951 919379 918800 918215 917625 917027 916424 915814 915197 914574 913944 913307 912663 912012 911354 910689 910016
1205.4052 909336 908648 907953 907250 906539 905820 905093 904357 903613 902861 902100 901331 900552 899764 898968 898162 897346
1192.1133 896521 895686 894841 893987 893122 892246 891361 890464 889557 888639 887709 886768 885816 884852 883876 882888 881888
1178.8215 880875 879849 878811 877759 876694 875616 874524 873418 872297 871163 870013 868849 867669
1168.6571 866474 865263 864036 862793 861534 860258 858964 857654 856325 854979 853614 852231 850828
1158.4928 849407 847966 846505 845023 843521 841998 840454 838887 837299 835688 834054 832396 830715
1148.3284 829010 827279 825524 823743 821936 820103 818242 816354 814437 812492 810518 808515 806481
1138.1641 804416 802320 800192 798031 795837 793609 791347 789050 786717 784347 781940 779495 777012
1127.9996 774489 771926 769322 766676 763988 761256 758480 755659 752792 749878 746916 743906 740846
1117.8353 737735 734572 731357 728088 724765 721385 717949 714455 710901 707287 703612 699874 696072
1107.6709 692206 688272 684271 680202 676062 671850 667566 663207 658773 654261 649672 645002 640251
1097.5066 635418 630500 625497 620406 615227 609958 604597 599144 593596 587952 582211 576371 570431
1087.3422 564389 558245 551996 545642 539181 532612 525935 519147 512249 505239 498117 490881 483532
1077.1779 476069 468491 460800 452994 445074 437041 428895 420637 412269 403793 395209 386521 377730
1067.0134 368840 359854 350776 341611 332362 323035 313636 304172 294649 285075 275459 265808 256134
1056.8491 246446 236756 227074 217415 207791 198216 188705 179273 169937 160713 151618 142670 133886
1046.6847 125286 116885 108704 100760 93069 85650 78517 71686 65170 58980 53128 47621 42465
1036.5204 37663 33218 29126 25383 21983 18915 16167 13724 11570 9686 8051 6646 5449 4438
1025.5741 3592 2890 2313 1843 1464 1160 918 727 577 460 369 299 245 204 172 148 130 117 108 103 100 100
1008.3729 103 110 119 133 152 177 210 254 311 384 479 602 758 958 1210 1527 1922 2410 3008 3735 4609 5653
991.1717 6887 8332 10010 11943 14148 16645 19451 22579 26041 29847 34003 38514 43380 48601
980.22546 54171 60086 66336 72910 79798 86984 94454 102192 110181 118404 126842 135478 144292 153269
969.27924 162389 171634 180989 190436 199960 209545 219177 228841 238525 248216 257902 267573 277218
959.11487 286827 296392 305905 315358 324744 334057 343291 352441 361502 370471 379343 388115 396785
948.9505 405349 413806 422154 430391 438516 446529 454428 462213 469884 477440 484883 492211 499426
938.78613 506528 513517 520395 527163 533820 540369 546810 553145 559375 565500 571523 577445 583267
928.62177 588990 594616 600147 605583 610927 616180 621342 626417 631404 636307 641125 645861 650516
918.4574 655091 659588 664009 668354 672625 676823 680950 685007 688996 692917 696772 700562 704288
908.293 707952 711555 715097 718581 722007 725376 728689 731948 735154 738307 741408 744459 747461
898.12866 750414 753319 756178 758990 761758 764482 767162 769800 772397 774953 777468 779945 782382
887.9643 784782 787145 789472 791763 794019 796240 798428 800583 802705 804795 806854 808883 810881
877.7999 812850 814789 816701 818584 820439 822268 824070 825847 827597 829323 831024 832701 834354
867.63556 835984 837591 839175 840737 842278 843797 845295 846773 848230 849668 851086 852485 853865
857.4712 855226 856569 857894 859202 860492 861765 863022 864262 865485 866693 867886 869062 870224
847.3069 871371 872503 873621 874497 875585 876660 877721 878769 879804 880826 881835 882832 883817 884789
836.3606 885750 886699 887637 888563 889478 890382 891275 892158 893030 893892 894743 895585 896417 897239 898051 898854 898920
823.0688 899701 900474 901237 901991 902737 903475 904204 904924 905637 906342 907038 907727 908408 909082 909748 910407 911059
809.7769 911703 912340 912971 913594 914211 914821 915425 916022 916613 917197 917775 918347 918913 919473 920027 920575 921118
796.48505 921655 922186 922712 923232 923747 924257 924761 925260 925755 926244 926728 927207 927682 928151 928616 929077 929533
783.1932 929984 930430 930873 931311 931744 932174 932599 933020 933436 933849 934258 934663 935064 935461 935854 936244 936629
769.9013 937011 937390 937765 938136 938504 938868 939229 939587 939941 940292 940639 940983 941325 941663 941997 942329 942658
756.60944 942984 943306 943626 943943 944257 944568 944876 945182 945484 945784 946082 946376 946668 946957 947244 947528 947810
743.3176 948089 948366 948640 948912 949181 949448 949713 949975 950235 950493 950748 951001 951252 951501 951748 951992 952235
730.02576 952475 952713 952949 953184 953416 953646 953874 954100 954324 954546 954767 954985 955202 955416 955629 955840 956050
716.7339 956257 956463 956667 956869 957069 957268 957465 957660 957854 958046 958237 958425 958613 958798 958982 959165 959346 959525
702.66016 959703 959879 960054 960227 960399 960569 960738 960906 961072 961237 961400 961562 961722 961881 962039 962195 962350
689.3683 962504 962656 962807 962957 963105 963252 963398 963543 963686 963828 963969 964108 964247 964384 964520 964654 964788 964920 965051
674.5127 965181 965310 965437 965564 965689 965813 965936 966058 966179 966298 966417 966534 966650 966766 966880 966993 967105 967216 967325
659.6571 967434 967542 967648 967754 967858 967962 968064 968165 968266 968365 968463 968560 968657 968752 968846 968939 969031 969122 969212 969301 969390 969477 969563 969648
640.8921 969732 969815 969897 969978 970059 970138 970216 970293 970369 970444 970519 970592 970664 970735 970805 970875 970943 971010 971076 971142 971206 971269 971331 971393 971453 971512 971570
619.7815 971628 971684 971739 971793 971846 971898 971949 972000 972048 972096 972143 972189 972234 972278 994828 994782 994736 994689 994641 994593 994544 994494 994444 994393 994341
600.2346 994289 994236 994182 994128 994072 994016 993959 993902 993843 993784 993724 993663 993601 993538 993474 993410 993344 993278 993210 993142 993072 993002 992930 992857 992783 992708 992632 992555
578.34216 992476 992397 992316 992233 992150 992065 991979 991891 991802 991711 991619 991526 991431 991334 991236 991136 991034 990931 990825 990719 990610 990499 990386
560.3591 990272 990155 990036 989915 989792 989667 989539 989409 989277 989142 989005 988865 988722 988577 988429 988278 988124
547.0672 987967 987807 987644 987478 987308 987135 986959 986778 986594 986407 986215 986019 985819 985615 985407 985194 984976
533.7753 984754 984526 984294 984056 983813 983565 983311 983051 982785 982513 982234 981949 981657 981358 981051 980738 980416
520.48346 980086 979749 979402 979047 978683 978309 977925 977532 977128 976713 976287 975849 975400 974938 974463 973975 973473
507.19162 972956 972425 971878 971315 970735 970138 969523 968889 968236 967562 966868 966151 965412 964649 963861 963047 962206
493.89975 961337 960439 959511 958550 957557 956528 955463 954361 953218 952035 950808 949536 948216 946847
482.95352 945427 943952 942420 940830 939177 937459 935674 933818 931887 929879 927790 925617 923355
472.78915 921002 918553 916004 913352 910592 907721 904735 901631 898405 895053 891575 887966 884226
462.6248 880353 876348 872212 867946 863553 859039 854410 849673 844837 839915 834918 829862 824760
452.46045 819632 814492 809359 804250 799181 794166 789217 784344 779553 774848 770228 765689 761225
442.29608 756827 752486 748190 743931 739699 735491 731303 727141 723013 718934 714927 711018 707243
432.1317 703641 700259 697144 694349 691926 689927 688402 687396 686948 687091 687847 689230 691243 693879
421.1855 697122 700943 705309 710178 715501 721226 727299 733664 740266 747051 753967 760965 768002
411.02112 775036 782032 788958 795787 802496 809065 815479 821726 827796 833682 839381 844889 850206
400.85675 855333 860272 865025 869596 873989 878210 882263 886154 889888 893471 896909 900207 903372
390.69238 906408 909320 912116 914798 917373 919845 922218 924498 926687 928792 930814 932758 934628
380.528 936427 938157 939823 941427 942971 944459 945893 947276 948609 949895 951135 952333 953489
370.36365 954605 955684 956726 957734 958708 959650 960562 961444 962299 963126 963927 964703 965456 966185 966892 967578
357.85367 968244 968890 969517 970126 970717 971291 971849 972392 972919 973432 973930 974415 974887 975347 975794 976229 976654
344.5618 977067 977469 977861 978243 978616 978979 979334 979680 980017 980346 980667 980981 981287 981586 981878 982163 982441
331.26996 982714 982980 983240 983494 983743 983986 984224 984457 984684 984907 985125 985339 985548 985752 985953 986149 986341
317.9781 986530 986714 986895 987072 987246 987416 987583 987747 987907 988065 988219 988371 988519 988665 988808 988949 989087
304.68622 989222 989355 989486 989614 989740 989863 989985 990104 990222 990337 990450 990561 990671 990778 990884 990988 991090
291.39438 991190 991289 991386 991482 991576 991669 991760 991849 991937 992024 992110 992194 992276 992358 992438 992517 992595 992671 992747 992821 992894 992966 993037 993107 993176
271.84753 993244 993311 993377 993442 993506 993569 993631 993692 993753 993813 993871 993929 993987 994043 994099 994153 994208 994261 994314 994366 994417 994467 994517 994567 994615 994663 994711 994757 994803 994849 994894 994938
246.82755 994982 995025 995068 995110 995152 995193 995234 995274 995314 995353 995391 995430 995467 995505 995541 995578 995614 995649 995684 995719 995753 995787 995821 995854 995887 995919 995951 995983 996014
224.1532I96045  $$checkpoint
##END= $$ end of trans-N2F2 IR
##TITLE=Raman of trans-N2F2 (E) $$ Begin of the data block
##JCAMP-DX=5.00 $$ ACD/DocManager Library v 5.00
##DATA TYPE=RAMAN SPECTRUM
##DATA CLASS=XYDATA
##BLOCK ID=4
##DATE=19 Feb 2012 10:30:00
##ORIGIN= Department of Chemistry, UWI, Jamaica
##OWNER= public domain
##SPECTROMETER/DATA SYSTEM=from WebMO Gaussian simulation
##$MODELS=
<Models>
<ModelData id="tN2F2" type="MOL">
trans-N2F2
__Jmol-14_02041519463D 1   1.00000     0.00000     0
Jmol version 14.3.12_2015.02.04  2015-02-04 07:47 EXTRACT: ({0:31})
  4  3  0  0  0  0              1 V2000
  -0.32590   0.52950   0.00000 N   0  0  0  0  0  0
   0.32590   1.73473   0.00000 F   0  0  0  0  0  0
   0.32590  -0.52950   0.00000 N   0  0  0  0  0  0
  -0.32590  -1.73473   0.00000 F   0  0  0  0  0  0
  1  3  2  0  0  0
  1  2  1  0  0  0
  4  3  1  0  0  0
M  END
</ModelData>
<ModelData id="T2" type="XYZVIB" baseModel="tN2F2" vibrationScale=".5">
4
Model[1]: PATH=Calculation 1;Input;Convg=0.6094D-08;-V/T=2.0039;Energy=NaN;Range=M.O.s;E(RHF)=-307.543247413 A.U.;PATH=Calculation 1;Input
N       0.00000      0.00000      0.00000
F       0.00000      0.00000      1.37019
N       1.07708      0.00000     -0.62145
F       1.07708      0.00000     -1.99164
4
Model[2]: PATH=Calculation 1;Standard;Convg=0.6094D-08;-V/T=2.0039;Energy=-307.54324;Range=M.O.s;E(RHF)=-307.543247413 A.U.;PATH=Calculation 1;Standard
N      -0.32590      0.52950      0.00000
F       0.32590      1.73473      0.00000
N       0.32590     -0.52950      0.00000
F      -0.32590     -1.73473      0.00000
4
Model[3]: IRIntensity=9.9939 KM/Mole;PATH=Calculation 1;FrequenciesFrequencies;ReducedMass=15.7615 AMU;ForceConstant=1.6707 mDyne/A;FreqValue=424.1532;Frequency=424.1532 cm^-1;FrequencyLabel=BU;PATH=Calculation 1;FrequenciesFrequencies
N      -0.32590      0.52950      0.00000     -0.49001      0.28000      0.00000
F       0.32590      1.73473      0.00000      0.36001     -0.21000      0.00000
N       0.32590     -0.52950      0.00000     -0.49001      0.28000      0.00000
F      -0.32590     -1.73473      0.00000      0.36001     -0.21000      0.00000
4
Model[4]: IRIntensity=3.2135 KM/Mole;PATH=Calculation 1;FrequenciesFrequencies;ReducedMass=15.7615 AMU;ForceConstant=1.8399 mDyne/A;FreqValue=445.1102;Frequency=445.1102 cm^-1;FrequencyLabel=AU;PATH=Calculation 1;FrequenciesFrequencies
N      -0.32590      0.52950      0.00000      0.00000      0.00000      0.57000
F       0.32590      1.73473      0.00000      0.00000      0.00000     -0.42000
N       0.32590     -0.52950      0.00000      0.00000      0.00000      0.57000
F      -0.32590     -1.73473      0.00000      0.00000      0.00000     -0.42000
4
Model[5]: IRIntensity=0.0000 KM/Mole;PATH=Calculation 1;FrequenciesFrequencies;ReducedMass=18.4711 AMU;ForceConstant=3.1524 mDyne/A;FreqValue=538.2069;Frequency=538.2069 cm^-1;FrequencyLabel=AG;PATH=Calculation 1;FrequenciesFrequencies
N      -0.32590      0.52950      0.00000      0.16000      0.17000      0.00000
F       0.32590      1.73473      0.00000      0.07000      0.67000      0.00000
N       0.32590     -0.52950      0.00000     -0.16000     -0.17000      0.00000
F      -0.32590     -1.73473      0.00000     -0.07000     -0.67000      0.00000
4
Model[6]: IRIntensity=283.9405 KM/Mole;PATH=Calculation 1;FrequenciesFrequencies;ReducedMass=15.7615 AMU;ForceConstant=9.4587 mDyne/A;FreqValue=1009.2323;Frequency=1009.2323 cm^-1;FrequencyLabel=BU;PATH=Calculation 1;FrequenciesFrequencies
N      -0.32590      0.52950      0.00000      0.28000      0.49001      0.00000
F       0.32590      1.73473      0.00000     -0.21000     -0.36001      0.00000
N       0.32590     -0.52950      0.00000      0.28000      0.49001      0.00000
F      -0.32590     -1.73473      0.00000     -0.21000     -0.36001      0.00000
4
Model[7]: IRIntensity=0.0000 KM/Mole;PATH=Calculation 1;FrequenciesFrequencies;ReducedMass=14.6176 AMU;ForceConstant=14.0859 mDyne/A;FreqValue=1278.8749;Frequency=1278.8749 cm^-1;FrequencyLabel=AG;PATH=Calculation 1;FrequenciesFrequencies
N      -0.32590      0.52950      0.00000      0.55000      0.36001      0.00000
F       0.32590      1.73473      0.00000     -0.20001     -0.14000      0.00000
N       0.32590     -0.52950      0.00000     -0.55000     -0.36001      0.00000
F      -0.32590     -1.73473      0.00000      0.20001      0.14000      0.00000
4
Model[8]: IRIntensity=0.0000 KM/Mole;PATH=Calculation 1;FrequenciesFrequencies;ReducedMass=14.0175 AMU;ForceConstant=20.8242 mDyne/A;FreqValue=1587.9014;Frequency=1587.9014 cm^-1;FrequencyLabel=AG;PATH=Calculation 1;FrequenciesFrequencies
N      -0.32590      0.52950      0.00000     -0.40000      0.58000      0.00000
F       0.32590      1.73473      0.00000      0.00000     -0.04000      0.00000
N       0.32590     -0.52950      0.00000      0.40000     -0.58000      0.00000
F      -0.32590     -1.73473      0.00000      0.00000      0.04000      0.00000
</ModelData>
</Models>
##$PEAKS=
<Peaks type="RAMAN" xUnitsExpected="1/cm"  >
<PeakData id="1" title="1- (~1587 cm-1)" peakShape="broad" model="T2.8" xMax="1610" xMin="1560"    />
<PeakData id="2" title="2- (~1278 cm-1)" peakShape="broad" model="T2.7" xMax="1310" xMin="1250"    />
<PeakData id="3" title="3- Inactive (~1009 cm-1)" peakShape="broad" model="T2.6" xMax="1030" xMin="975"    />
<PeakData id="4" title="4- (~538 cm-1)" peakShape="broad" model="T2.5" xMax="560" xMin="510"    />
<PeakData id="5" title="5- Inactive (~445 cm-1)" peakShape="broad" model="T2.4" xMax="470" xMin="420"    />
<PeakData id="6" title="6- Inactive (~424 cm-1)" peakShape="broad" model="T2.3" xMax="450" xMin="400"    />
</Peaks>
##XUNITS= 1/CM
##YUNITS= ABSORBANCE
##XFACTOR= 1
##YFACTOR= 2.570232E-07
##FIRSTX= 1.787119E+03
##FIRSTY= 1.373650E-03
##LASTX= 2.241532E+02
##NPOINTS= 2000
##MINY= 7.316400E-02
##MAXY= 2.577548E-101
##XYDATA= (X++(Y..Y))
1787.1195 5344 5386 5429 5471 5515 5559 5603 5648 5693 5739 5786 5833 5881 5929 5978 6027 6077 6128 6180 6231 6284 6337 6391 6446 6502 6558 6615 6672 6730 6790
1763.6633 6849 6910 6971 7034 7097 7161 7226 7291 7358 7426 7494 7563 7634 7705 7777 7851 7925 8001 8077 8155 8234 8313 8395 8477 8560 8645 8731 8818 8907 8996
1740.207 9088 9180 9274 9370 9467 9565 9665 9767 9870 9974 10081 10189 10299 10410 10524 10639 10756 10876 10997
1725.3514 11120 11245 11372 11502 11633 11767 11903 12042 12183 12327 12473 12621 12772 12926 13083 13243 13405
1712.0596 13571 13739 13911 14086 14264 14445 14630 14819 15011 15207 15406 15610 15818 16029 16245 16466 16691
1698.7677 16920 17154 17393 17637 17886 18140 18400 18665 18936 19213 19496 19785 20080 20382 20691 21006 21329
1685.476 21660 21998 22343 22697 23059 23430 23810 24199 24597 27503 27931 28369 28818 29279 29751 30234 30730
1672.1841 31239 31761 32296 32846 33410 33990 34584 35196 35823 36469 37132 37814 38515 39237 39979 40743 41530
1658.8922 42340 43174 44034 44920 45833 46775 47746 48748 49782 50850 51953 53091 54268 55485 56743
1647.1641 58044 59390 60783 62225 63719 65266 66870 68533 70257 72046 73903 75831 77834 79915
1636.2178 82077 84326 86665 89099 91632 94271 97019 99884 102870 105984 109234 112625 116166 119864
1625.2716 123727 127765 131986 136401 141018 145849 150904 156196 161736 167536 173609 179969 186627
1615.1072 193598 200895 208532 216521 224874 233604 242721 252233 262148 272469 283198 294332 305864
1604.9429 317780 330062 342681 355604 368784 382166 395683 409257 422796 436195 449338
1596.3423 462099 474341 485920 496689 506498 515205 522673 528781 533426 536525 538024 537896 536144
1586.1779 532799 527922 521599 513937 505061 495107 484222 472552 460247 447448 434291 420900
1576.7954 407390 393862 380406 367099 354004 341176 328659 316485 304680 293263 282245
1568.1948 271633 261429 251631 242235 233233 224616 216373 208493 200963 193770 186901 180342 174080
1558.0304 168102 162395 156945 151742 146773 142027 137493 133159 129018 125058 121271 117648 114181
1547.8661 110862 107685 104640 101724 98928 96247 93675 91207 88839 86565 84380 82281 80264
1537.7017 78324 76458 74663 72935 71272 69670 68127 66640 65206 63824 62491 61205 59964 58766
1526.7555 57610 56493 55413 54371 53363 52389 51447 50536 49654 48802 47976 47177 46404 45655 44930 44228
1514.2455 43547 42888 42249 41629 41029 40447 39883 39336 38805 38290 37791 37307 36837 36381 35939 35510 35094
1500.9536 34690 34298 33917 33548 33190 32843 32505 32178 31861 31553 31254 30964 30683 30411 30147 29891 29642
1487.6617 29402 29168 28943 28724 28512 28307 28109 27917 27732 27552 27379 27212 27050 26895 26745 26600 26461
1474.3699 26327 26198 26074 25955 25842 25733 25628 25529 25434 25344 25258 25176 25099 25026 24957 24893 24832 24776 24724 24676 24631 24591
1457.1687 24555 24522 24493 24468 24447 24429 24415 24405 24399 24396 24397 24401 24409 24421 24436 24454 24477 24503 24532 24565 24602 24642 24686 24733 24784 24839 24897
1436.0581 24959 25024 25093 25166 25242 25323 25407 25494 25586 25681 25780 25884 25991 26102 26217 26336 26459 26586 26718 26853 26993
1419.6387 27138 27287 27440 27597 27760 27927 28098 28275 28456 28642 28834 29030 29232 29438 29651 29868 30092
1406.3468 30320 30555 30796 31042 31295 31554 31819 32091 32369 32654 32946 33245 33552 33865 34187 34516 34852
1393.0549 35197 35550 35912 36282 36661 37049 37447 37854 38271 38698 39135 39583 40041 40511 40992 41485 41990
1379.7631 42507 43037 43580 44136 44707 45291 45891 46505 47135 47781 48443 49123 49820 50534 51268 52021 52793
1366.4713 53586 54400 55236 56095 56976 57882 58813 59769 60752 61762 62801 63869 64967 66098 67261 68458
1353.9613 69690 70958 72265 73610 74997 76426 77898 79417 80983 82598 84264 85984 87760 89594
1343.015 91487 93444 95466 97556 99717 101953 104266 106660 109139 111705 114365 117120 119977 122939
1332.0688 126011 129199 132509 135945 139515 143224 147080 151089 155260 159600 164117 168822 173723
1321.9044 178831 184156 189709 195502 201548 207860 214452 221339 228536 236060 243927 252156 260766
1311.7401 269776 279206 289080 299418 310244 321582 333456 345891 358912 372543 386811 401739
1302.3575 417350 433667 450708 468490 487027 506326 526389 547211 568778 591066 614038
1293.757 637643 661816 686472 711507 736795 762188 787514 812580 837167 861036 883932
1285.1564 905586 925720 944056 960326 974274 985673 994328 1000087 1002847 1002556 999221 992902
1275.7739 983710 971808 957396 940707 921999 901545 879621 856505 832463 807750 782598
1267.1732 757223 731815 706540 681543 656946 632848 609331 586458 564277 542822 522115
1258.5726 502168 482986 464565 446896 429965 413756 398248 383419 369247 355705 342770
1249.972 330416 318618 307352 296593 286318 276503 267126 258167 249605 241419 233592 226105
1240.5895 218941 212085 205521 199233 193210 187436 181901 176592 171497 166608 161913 157402 153068
1230.4252 148902 144896 141041 137332 133761 130322 127009 123816 120737 117768 114903 112138 109469
1220.2607 106892 104401 101995 99668 97418 95242 93136 91098 89124 87213 85361 83567 81827
1210.0964 80141 78505 76918 75378 73883 72431 71022 69652 68322 67029 65772 64549 63360 62203
1199.1501 61078 59982 58916 57878 56866 55881 54921 53986 53074 52185 51318 50472 49647 48843 48057 45964
1186.6403 45221 44495 43787 43095 42419 41758 41113 40482 39865 39263 38673 38097 37533 36982 36442 35914 35398
1173.3484 34892 34397 33912 33437 32972 32517 32071 31633 31205 30785 30374 29970 29575 29187 28807 28434 28068
1160.0565 27709 27357 27012 26673 26340 26013 25693 25378 25069 24765 24467 24174 23887 23604 23327 23054 22786
1146.7646 22522 22263 22009 21759 21513 21271 21033 20799 20569 20343 20120 19901 19686 19474 19265 19060 18858
1133.4728 18659 18463 18270 18080 17894 17710 17528 17350 17174 17001 16831 16663 16497 16334 16174 16015 15859
1120.1809 15706 15554 15405 15258 15112 14969 14828 14689 14552 14417 14283 14152 14022 13894 13768 13643 13521
1106.889 13399 13280 13162 13045 12930 12817 12705 12595 12485 12378 12272 12167 12063 11961 11860 11760 11662 11564
1092.8153 11468 11374 11280 11187 11096 11006 10916 10828 10741 10655 10570 10486 10403 10321 10240 10160 10081 10003 9925 9849 9773 9699 9625 9552 9480 9408 9338 9268
1070.9229 9199 9131 9063 8996 8930 8865 8800 8736 8673 8611 8549 8488 8427 8367 8308 8249 8191 8134 8077 8021 7965 7910 7856 7802 7749 7696 7643 7592 7540 7490 7440
1046.6847 7390 7341 7292 7244 7196 7149 7102 7055 7009 6964 6919 6874 6830 6786 6743 6700 6658 6615 6574 6532 6491 6451 6411 6371 6332 6292 6254 6215 6177 6140 6102 6065
1021.6648 6029 5992 5957 5921 5886 5850 5816 5781 5747 5713 5680 5647 5614 5581 5549 5517 5485 5453 5422 5391 5360 5330 5300 5270 5240 5211 5182 5153 5124 5095 5067 5039 5011 4984 4957 4929 4903 4876 4849 4823 4797
989.608 4771 4746 4720 4695 4670 4645 4621 4597 4572 4548 4524 4501 4477 4454 4431 4408 4385 4363 4340 4318 4296 4274 4253 4231 4210 4188 4167 4146 4126 4105 4085 4064
964.58795 4044 4024 4004 3985 3965 3946 3927 3907 3888 3870 3851 3832 3814 3796 3777 3759 3741 3724 3706 3688 3671 3654 3637 3620 3603 3586 3569 3553 3536 3520 3503 3487 3471 3455 5496 5488
936.4405 5480 5473 5466 5459 5452 5445 5439 5432 5426 5420 5414 5408 5402 5397 5391 5386 5381 5376 5371 5367 5362 5358 5354 5350 5346 5342 5338 5335 5331 5328 5325 5322 5319 5317 5314 5312 5310 5307 5306 5304 5302 5301 5299 5298 5297 5296 5295 5294 5294 5293 5293 5293 5293 5293 5294 5294 5295 5295 5296 5297 5298 5300 5301 5303 5304 5306 5308 5310 5313 5315
881.7093 5318 5320 5323 5326 5330 2847 2860 2873 2886 2900 2913 2927 2940 2954 2968 2982 2996 3010 3024 3039 3053 3068 3082 3097 3112 3127 3142 3157 3173 3188 3203 3219 3235 3251 3267 3283 3299 3315 3332 3348 3365 3382
848.8706 3399 3416 3433 3451 3468 3486 3504 3521 3540 3558 3576 3594 3613 3632 3651 3670 3689 3708 3728 3747 3767 3787 3807 3827 3848 3868 3889 3910 3931 3953 3974 3996 4017 4039 4062 4084
820.72314 4106 4129 4152 4175 4198 4222 4245 4269 4293 4318 4342 4367 4392 4417 4442 4468 4493 4519 4546 4572 4599 4626 4653 4680 4708 4736 4764 4792 4821 4850 4879 4908 4938 4968 4998 5029 5059 5090 5122 5153
789.4482 5185 5217 5250 5283 5316 5349 5383 5417 5452 5486 5521 5557 5592 5629 5665 5702 5739 5776 5814 5852 5891 5930 5970 6009 6049 6090 6131 6172 6214 6257 6299 6342
764.4282 6386 6430 6474 6519 6565 6611 6657 6704 6751 6799 6847 6896 6946 6995 7046 7097 7148 7201 7253 7307 7360 7415 7470 7526 7582 7639 7696 7755 7813 7873 7933
740.1901 7994 8056 8118 8181 8245 8310 8375 8441 8508 8575 8644 8713 8783 8854 8926 8999 9072 9147 9222 9299 9376 9454 9533 9614 9695 9777 9860 9945 10030
717.51575 10117 10204 10293 10383 10474 10567 10660 10755 10851 10949 11047 11147 11249 11351 11456 11561 11668 11777 11887 11998 12112 12226 12343 12461
698.7508 12581 12702 12825 12950 13077 13206 13337 13469 13604 13740 13879 14020 14163 14308 14455 14604 14756
685.4589 14910 15067 15226 15388 15552 15719 15888 16060 16235 16413 16594 16778 16965 17155 17348 17544 17744
672.16705 17947 18154 18364 18578 18795 19016 19242 19471 19704 19942 20184 20430 20680 20936 21196 21461 21730
658.8752 22005 22285 22570 22861 23158 23460 23768 24082 24402 24729 25062 25402 25749 26103 26464 26833 27209
645.5833 27593 27985 28386 28795 29213 29640 30076 30522 30978 31444 31920 32407 32905 33415 33936 34470 35016
632.2915 35575 36147 36732 37332 37947 38576 39221 39882 40560 41255 41967 42698 43448 44217 45006 45816 46648
618.99963 47503 48380 49282 50208 51160 52139 53146 54181 55246 56342 57471 58632 59828 61061 62330
607.2715 63639 64988 66379 67813 69294 70821 72399 74027 75710 77448 79245 81103 83025 85012
596.32526 87070 89199 91405 93690 96057 98512 101057 103698 106438 109282 112236 115304 118493 121809
585.379 125257 128844 132577 136465 140513 144732 149129 153714 158497 163487 168697 174137 179819
575.21466 185756 191962 198451 205238 212337 219766 227542 235682 244204 253127 262472 272258 282505
565.0503 293235 304467 316223 328522 341383 354825 368864 383512 398781 414677 431202
556.4497 448352 466115 484471 503391 522832 542739 563044 583661 604486 625397 646254
547.84906 666896 687144 706801 725657 743490 760072 775175 788576 800066 809458 816592
539.2485 821341 823622 823392 820656 815464 807907 798119 786265 772537 757147 740320 722283 703264
529.0841 683484 663150 642456 621578 600672 579877 559310 539071 519244 499895 481076
520.48346 462826 445174 428137 411727 395946 380791 366255 352326 338992 326234 314036
511.88287 302377 291238 280598 270437 260733 251467 242618 234167 226095 218384 211016 203975 197244
501.7185 190808 184652 178762 173125 167729 162560 157608 152862 148312 143948 139762 135743 131884
491.55414 128178 124617 121194 117902 114735 111688 108754 105929 103208 100585 98057 95619 93266
481.38977 90996 88805 86689 84644 82669 80759 78913 77127 75399 73726 72107 70539 69020 67548
470.44354 66121 64738 63397 62095 60833 59607 58417 57262 56140 55049 53990 52960 51958 50984
459.4973 50037 49115 48218 47345 46495 45667 44861 44075 43309 42563 41836 41127 40435 39760 39102 38460 37833
446.20544 37222 36624 36041 35471 34915 34371 33840 33321 32814 32317 31832 31358 30894 30440 29996 29561 29136
432.91357 28720 28312 27913 27522 27140 26765 26398 26038 25685 25340 25001 24669 24343 24024 23711 23404 23103
419.62173 22808 22518 22234 21955 21681 21412 21148 20889 20634 20385 20139 19898 19661 19429 19200 18976 18755
406.32986 18538 18325 18116 17910 17707 17508 17312 17120 16930 16744 16561 16381 16203 16029 15857 15688 15522
393.038 15358 15197 15038 14882 14728 14577 14428 14281 14136 13994 13854 13715 13579 13445 13313 13182 13054
379.74615 12928 12803 12680 12559 12439 12321 12205 12091 11978 11867 11757 11649 11542 11436 11333 11230 11129 11029
365.67242 10931 10834 10738 10643 10550 10458 10367 10277 10188 10101 10014 9929 9845 9762 9680 9599 9519 9440 9362 9285 9208 9133 9059 8985 8913 8841
345.3437 8770 8700 8631 8563 8496 8429 8363 8298 8233 8170 8107 8045 7983 7922 7862 7803 7744 7686 7628 7572 7515 7460 7405 7351 7297 7244 7191 7139 7088 7037
321.88745 6986 6936 6887 6838 6790 6742 6695 6648 6602 6556 6511 6466 6422 6378 6334 6291 6249 6207 6165 6124 6083 6042 6002 5962 5923 5884 5845 5807 5769 5732 5695 5658 5622 5586 5550 5515 5480 5445 5411 5377
290.6125 5343 5310 5277 5244 5212 5179 5148 5116 5085 5054 5023 4993 4962 4932 4903 4874 4844 4816 4787 4759 4731 4703 4675 4648 4621 4594 4567 4541 4515 4489 4463 4438 4412 4387 4362 4338 4313
261.68317 4289 4265 4241 4217 4194 4171 4148 4125 4102 4080 4057 4035 4013 3992 3970 3949 3927 3906 3885 3865 3844 3824 3804 3783 3764 3744 3724 3705 3685 3666 3647 3628 3610 3591
235.09944 3573 3554 3536 3518 3500 3483 3465 3448 3430 3413 3396 3379 3362 3345
224.1532C329  $$checkpoint
##END= $$ end of trans-N2F2 Raman data
##END= $$ end of file