##TITLE= Compound file, contains several data records
##JCAMP-DX= 5.0
##DATA TYPE= LINK
##BLOCKS= 6
##ORIGIN= Department of Chemistry, The UWI, JAMAICA
##OWNER= public domain
##TITLE= sample 1
##JCAMP-DX= 5.01
##DATA TYPE= INFRARED SPECTRUM
##DATA CLASS= XYDATA
##BLOCK ID=1
##ORIGIN= Department of Chemistry, The UWI, JAMAICA
##OWNER= public domain
##LONGDATE= Thu Oct 01 2020 06:23:54 GMT-0500 $$ export date from JSpecView
##SPECTROMETER/DATA SYSTEM= HP-GC/MS/IRD
##XUNITS= 1/CM
##YUNITS= TRANSMITTANCE
##XFACTOR= 1
##YFACTOR= 9.999000E-07
##FIRSTX= 3838
##FIRSTY= 9.514807E-01
##LASTX= 550
##NPOINTS= 823
##MINY= 1.000000E-04
##MAXY= 1
##XYDATA= (X++(Y..Y))
3838 951576 965703 955088 971949 995505 964814 945461 954209 952453 949825 947204 941984
3790 955968 965703 945461 947204 952453 957731 970160 971054 952453 939385 950700 963038
3742 967483 960381 953330 947204 953330 959497 941117 926496 922239 901246 883982 886428
3694 873461 850440 821190 774896 715885 646314 589988 540062 501237 480445 456713
3650 428591 374665 319186 284999 274690 276467 284999 319480 379528 459244 543055 619503
3602 697017 762155 797340 842643 876685 881543 877493 890519 925643 935069 927349 926496
3554 938520 949825 941984 938520 935069 938520 948950 947204 940250 943721 948077 958613 949825
3502 939385 929915 935930 963038 960381 955968 961266 956849 963925 975536 981846 972845 971054
3450 986378 989107 980039 983656 973741 974638 971054 966593 975536 963925 968375 978236 980942
3398 976435 967483 958613 957731 955968 956849 958613 950700 951576 959497 954209 951576 980942 986378
3342 960381 961266 969267 977335 990931 1000100 987287 974638 974638 969267 981846 984563 973741
3290 969267 962151 966593 960381 957731 960381 944590 937656 958613 970160 960381 958613 967483
3238 958613 948950 963925 966593 980942 987287 973741 967483 958613 960381 966593 979137 989107
3186 985470 976435 963038 960381 966593 973741 983656 976435 968375 970160 988197 997340 977335
3134 960381 971949 983656 976435 958613 957731 964814 957731 964814 976435 962151 959497
3086 957731 943721 947204 955088 953330 948950 950700 950700 949825 962151 961266 948950 948077 944590
3030 931630 928204 932488 937656 924791 905406 893806 871051 861476 849657 814411 763560
2982 698302 584041 412709 217793 75031 17589 3884 1108 348 122 100
2938 190 638 2777 9046 22184 46009 80769 116639 138562 142182 129313 104146 74549
2886 49985 35322 27444 24392 27418 39268 59709 96127 159677 245269 333921 414613
2838 481774 542555 593258 632766 666873 700880 719190 727853 740702 758653 769207
2794 772046 781346 792216 806944 821190 831847 834917 843419 850440 850440 856729 861476 855940
2742 848874 855152 871051 871853 868647 872657 880731 879110 888062 892161 873461 865453 875071
2690 875071 870249 869448 871051 863860 858309 864656 873461 879110 879110 887245 888062 887245 894630 899588
2630 903740 906240 909585 912102 912943 915469 928204 929059 919694 927349 938520 941984 937656
2578 929915 940250 946332 940250 940250 948950 949825 947204 955088 961266 962151 967483 972845 967483
2522 961266 964814 963925 958613 970160 977335 965703 961266 966593 965703 967483 975536 978236
2470 975536 979137 980039 978236 977335 980942 983656 981846 982751 986378 987287 978236 976435 974638
2414 960381 963038 972845 973741 974638 970160 966593 968375 961266 950700 951576 960381 961266 954209
2358 952453 960381 960381 954209 950700 955088 962151 967483 972845 971949 980039 981846 979137 981846
2302 983656 985470 990931 990931 982751 988197 999179 998259 994588 980942 972845 978236 978236 977335 977335
2242 975536 973741 975536 978236 988197 990931 980942 982751 981846 972845 977335 985470 982751 973741
2186 970160 971949 973741 970160 967483 965703 958613 955088 957731 960381 962151 970160 974638
2134 968375 967483 960381 956849 949825 953330 959497 963038 974638 978236 971949 969267 970160
2082 978236 988197 986378 981846 982751 984563 987287 992758 989107 987287 991844 988197 984563 981846
2026 990931 990931 986378 992758 980942 980942 980942 975536 979137 987287 976435 969267 973741 969267 974638
1966 983656 984563 979137 974638 975536 983656 983656 979137 982751 979137 984563 989107 980942 979137 984563
1906 986378 988197 989107 985470 980942 977335 979137 980942 980942 989107 991844 990931 987287 980942 982751
1846 990019 990019 979137 980039 985470 996422 1000100 985470 980942 986378 979137 986378 993673 983656
1790 981846 989107 995505 998259 993673 990019 986378 990931 991844 991844 990019 985470 988197 986378
1734 990931 990931 981846 986378 999179 991844 986378 997340 1000100 991844 987287 990019 999179 1000100
1678 996422 995505 992758 988197 976435 979137 988197 981846 980942 975536 977335 985470 975536 969267
1622 972845 974638 974638 967483 962151 966593 972845 965703 955968 960381 956849 962151 977335 973741
1566 962151 970160 981846 978236 971054 973741 984563 969267 955088 955088 962151 969267 964814
1514 956849 957731 940250 910423 904573 883168 852008 806944 733911 652895 583503 511969
1466 450862 405176 368166 359454 391962 441411 490279 552641 611003 653497 676774
1422 684295 677397 656513 623510 588903 557755 524377 497558 471676 452526 445496
1378 448790 452109 454196 464776 470808 460091 442633 430173 420769 416911 410434 397414
1330 394860 398514 402572 405549 413469 418835 420769 423490 425837 426229 418450 398147 376741
1278 359785 343592 329643 322139 323924 325719 329339 337321 338878 335462 339503 340756 346133
1226 361779 382334 406671 428197 453360 474726 495728 515280 527283 530693 535110
1182 536097 527768 517659 500776 488476 480002 473417 472110 478237 475164 481331 478678 459244
1130 443857 425053 396683 378829 366812 345496 321546 281089 229110 171729 111903
1086 63862 33515 17670 10215 6849 5476 5115 5481 6224 7299 9604 13946 20723 31278
1030 48044 76145 123835 186915 253772 310487 360117 411570 457977 500776 541556
986 574438 602620 625235 642752 660151 681779 693176 689356 686821 678021 655909 626965
938 609317 608756 604287 590532 611003 649297 678021 709976 737978 745493 759353 778473
890 782787 792216 791486 771336 736620 678021 595996 525344 475164 441818 432956 451277
842 492996 560846 652294 744121 818924 868647 894630 914626 914626 916312 934208 935930
794 936793 938520 925643 926496 929059 925643 940250 933348 919694 933348 960381 966593
746 948077 943721 945461 942852 937656 941117 961266 952453 929059 952453 969267 955088
698 945461 929059 912943 926496 946332 933348 943721 960381 944590 951576 963925
654 931630 927349 968375 959497 965703 1000100 968375 930772 918847 903740 925643 954209
606 941117 908748 909585 907911 880731 866250 837227 841092 845753 837227 824980 809177
558 842643 879920
550H35687  $$checkpoint
##END=  $$ End of sample 1
##TITLE= sample 2
##JCAMP-DX= 5.01
##DATA TYPE= INFRARED SPECTRUM
##DATA CLASS= XYDATA
##BLOCK ID=2
##ORIGIN= Department of Chemistry, The UWI, JAMAICA
##OWNER= public domain
##LONGDATE= Thu Oct 01 2020 06:30:55 GMT-0500 $$ export date from JSpecView
##XUNITS= 1/CM
##YUNITS= TRANSMITTANCE
##XFACTOR= 1
##YFACTOR= 9.999000E-07
##FIRSTX= 3958
##FIRSTY= 9.763376E-01
##LASTX= 450
##NPOINTS= 878
##MINY= 1.000000E-04
##MAXY= 1
##XYDATA= (X++(Y..Y))
3958 976435 981846 974638 1000100 970160 975536 966593 984563 963925 994588 987287 967483
3910 963925 970160 957731 994588 989107 998259 974638 972845 955968 955968 980942 974638 971949
3858 980039 975536 996422 998259 992758 994588 983656 978236 987287 996422 977335 990019 995505
3806 984563 976435 977335 983656 992758 975536 989107 971949 983656 980039 966593 980942
3758 985470 992758 983656 980942 980942 980942 981846 984563 968375 968375 982751 989107 993673 986378 998259
3698 984563 971949 977335 989107 994588 987287 968375 979137 986378 980942 968375 974638
3650 979137 968375 985470 987287 961266 968375 955968 959497 959497 956849 939385 946332 918002
3598 856729 719852 485784 260641 142051 94546 78351 93593 139458 240128
3558 431364 649895 796606 872657 905406 907911 909585 921390 901246 902077 918002 933348
3510 931630 950700 955088 955088 958613 963038 966593 974638 971949 960381 976435 972845 984563
3458 976435 970160 967483 961266 967483 969267 963925 962151 975536 963925 966593 971054 962151
3406 956849 957731 971949 960381 953330 960381 947204 955968 953330 967483 951576 956849
3358 954209 948950 953330 953330 955968 957731 959497 949825 954209 943721 944590 948077 949825 940250
3302 945461 948950 949825 949825 938520 940250 944590 930772 938520 941117 932488 928204 929059 932488
3246 927349 927349 926496 912943 916312 917156 920542 912102 913784 912943 911262 912102 910423 906240 906240
3186 889700 890519 880731 880731 868647 873461 871853 869448 873461 874266 874266 873461 875071 872657 876685
3126 870249 879920 879920 875071 869448 870249 867049 867848 866250 855940 859099 850440 843419 841867
3070 840318 841867 837227 828788 831081 827263 824221 819678 813661 809922 805459 790758 782066
3018 764968 736620 692538 631020 526312 372600 195724 78712 29733 15376
2978 7878 7587 16445 30286 48938 59985 53956 50355 53808 65470 87992 128957 181486
2926 234879 272925 306792 327524 329643 309630 262811 226383 195364 177192 194287
2882 222251 290298 386584 480887 566557 648102 711940 753778 784230 807688 827263
2838 843419 859891 867848 882355 883982 888881 888881 888062 891340 892983 899588 899588 907911 912943 919694
2778 918002 918002 911262 912943 912102 911262 912102 919694 927349 930772 943721 948077 953330 953330 955088
2718 960381 958613 955088 956849 963038 963038 965703 969267 971054 966593 965703 965703 956849 956849 960381 965703
2654 967483 971054 974638 976435 971054 966593 966593 971054 970160 970160 972845 973741 978236 980039 980942
2594 985470 981846 986378 984563 980942 981846 980942 981846 982751 983656 986378 990019 989107 992758 985470
2534 990019 990019 987287 987287 987287 990019 986378 986378 985470 985470 985470 982751 985470 981846 985470 984563 990019 987287
2462 991844 987287 990931 995505 993673 990931 989107 986378 985470 983656 980039 978236 982751 980942
2406 979137 981846 982751 982751 986378 984563 989107 995505 997340 992758 995505 991844 980942 981846
2350 985470 996422 984563 990019 990931 990019 989107 983656 987287 985470 985470 986378 986378 986378 989107 986378 986378
2282 989107 985470 989107 985470 987287 983656 985470 983656 981846 980942 979137 977335 975536 973741
2226 974638 972845 969267 971949 971949 971054 970160 969267 972845 972845 977335 978236 982751 983656 989107 991844
2162 990019 990931 994588 991844 990019 991844 991844 992758 994588 993673 994588 995505 995505 995505 994588 993673 992758
2094 990019 990931 989107 989107 990931 993673 996422 998259 997340 990931 990931 984563 987287 993673 990931
2034 995505 990931 989107 985470 990931 986378 983656 983656 982751 985470 990019 990931 986378 986378 987287
1974 989107 990931 989107 987287 985470 985470 983656 989107 990019 984563 983656 982751 981846 986378 978236 975536
1910 975536 973741 971949 971054 970160 968375 960381 958613 954209 954209 960381 953330 943721 940250 932488
1850 929059 929059 907075 882355 849657 815161 756560 689991 614389 544056 473853 407421
1802 346133 262569 155756 54657 12057 2837 781 100 150 796 2697 11718 42623
1750 119246 210496 286578 338254 376395 383392 408925 471241 570747 673664 746180
1706 826501 866250 900416 892983 912943 935069 937656 923939 944590 940250 938520 947204
1658 946332 960381 973741 952453 956849 963925 972845 955968 980039 966593 980039 967483
1610 971949 972845 965703 974638 965703 971949 961266 971054 966593 967483 963925 958613 969267 987287
1554 967483 962151 980039 986378 969267 960381 963925 966593 980039 969267 955088 971949
1506 950700 923939 906240 864656 826501 735264 639799 558783 470808 399249 392684
1462 394134 433355 500315 580822 678021 742068 799546 818924 819678 810669 777756 746867
1414 666260 598747 519091 459667 422322 395953 389443 430570 466491 518136 568124
1370 599299 620645 633933 651094 653497 664421 668719 684926 699590 698946 710630 714568
1322 721180 718528 703467 673664 639799 605401 559814 536097 519569 517659 522930 553660
1274 584041 626965 657724 685557 705413 721844 737978 753778 777040 789302 800283
1230 789302 784953 769207 762858 752391 735942 708669 654702 578687 466491 359123
1186 256592 166741 111903 93766 87668 91716 107856 131475 165670 183841 184011 160858
1138 129433 95773 71654 56499 42545 33177 24527 20627 17460 18486 24392 38658
1090 62928 100935 151371 188644 219403 232940 232940 260401 322139 376395 441005 515755
1042 584579 634517 663198 712596 740702 769916 802497 835687 868647 893806 924791
998 935930 952453 957731 969267 975536 971949 972845 962151 968375 955088 969267 955088
950 955088 941117 934208 910423 887245 873461 844974 832613 826501 839544 832613 852793
902 870249 880731 897932 917156 939385 939385 966593 949825 947204 927349 924791 908748
854 898759 909585 902908 917156 928204 947204 942852 966593 963925 955968 953330 929915
806 917156 859099 837999 799546 774896 711285 693815 678646 662588 674906 648699
762 633349 570747 517182 452526 441818 427803 459244 524860 565514 624660 735264
718 791486 796606 852008 852008 886428 896279 911262 923089 913784 967483 896279 938520 947204
666 898759 886428 874266 864656 818924 792216 737299 647505 568648 487128 425837
622 400353 353870 324821 293524 277743 249140 222456 197717 161750 170625 166435
578 187950 225550 267944 335153 396318 446728 465204 537580 570221 630440 664421
534 684295 735942 720516 777040 773470 818924 811416 803236 746867 772046 762858 780627
486 801020 803977 869448 865453 907911 911262 976435 975536 952453
450H60683  $$checkpoint
##END=  $$ End of sample 2
##TITLE= sample 3
##JCAMP-DX= 5.01
##DATA TYPE= INFRARED SPECTRUM
##DATA CLASS= XYDATA
##BLOCK ID=3
##ORIGIN= Department of Chemistry, The UWI, JAMAICA
##OWNER= public domain
##LONGDATE= Thu Oct 01 2020 06:35:47 GMT-0500 $$ export date from JSpecView
##XUNITS= 1/CM
##YUNITS= TRANSMITTANCE
##XFACTOR= 1
##YFACTOR= 9.999000E-07
##FIRSTX= 3958
##FIRSTY= 9.926588E-01
##LASTX= 450
##NPOINTS= 878
##MINY= 1.000000E-04
##MAXY= 1
##XYDATA= (X++(Y..Y))
3958 992758 970160 972845 960381 965703 980039 963925 971949 965703 964814 949825 981846
3910 959497 934208 953330 982751 963038 962151 967483 973741 966593 974638 957731 974638
3862 956849 962151 962151 1000100 960381 995505 971949 986378 989107 990019 963925 998259 991844
3810 991844 978236 990019 993673 997340 997340 999179 980942 1000100 980942 990931 970160 963038
3758 962151 923939 958613 944590 963038 956849 967483 980039 973741 992758 984563 964814
3710 990931 983656 976435 999179 945461 977335 966593 970160 910423 953330 932488 928204
3662 892161 821190 762155 684926 691263 669335 678021 703467 718528 787850 761454 745493
3614 709322 658330 622936 549090 504479 424662 384453 292175 212248 127774 72451
3570 48713 41884 50588 69318 128246 248681 397048 489828 531182 514332 506808
3526 501237 520527 561363 612694 691263 759353 824221 857518 888062 891340 906240
3482 891340 894630 876685 854365 828025 815161 791486 764264 754473 745493 748934 742751
3434 758653 772046 795872 815161 828788 848093 850440 879110 871051 879920 878301 888062
3386 901246 915469 932488 948950 956849 948950 967483 956849 962151 956849 965703 957731
3338 951576 964814 958613 968375 963925 978236 973741 973741 972845 971949 971054 973741 978236 971054 982751
3278 985470 982751 976435 980039 980942 967483 970160 961266 947204 931630 933348 920542 915469
3226 909585 916312 913784 912102 918002 911262 907911 904573 913784 905406 917156 918847 918847
3174 918847 919694 924791 918002 922239 921390 919694 912102 911262 909585 897105 896279 880731 882355
3118 858309 851223 836457 818924 800283 783508 768499 750315 743436 729195 726513 715885
3070 718528 711940 706714 702172 695094 683665 664421 649895 613823 579220 521967 461789
3022 405176 358132 317427 258966 179161 78712 21560 5542 2003 936 710
2978 1487 4542 11451 25659 43136 54757 55827 49391 43656 39705 37709 39522 44141
2926 51433 62466 75239 87911 98275 107360 118807 132814 154328 183672 221638 270672
2878 319186 370547 422322 481774 531182 578687 617225 648699 678021 702172 730539
2834 747555 776325 791486 814411 824221 839544 852793 861476 876685 880731 887245 886428
2786 897932 895454 898759 897105 900416 905406 904573 912102 910423 916312 916312 928204 924791 929059
2730 932488 931630 944590 944590 960381 959497 967483 968375 976435 974638 974638 981846 980942 981846 978236 982751
2666 978236 985470 977335 979137 979137 977335 985470 977335 980942 978236 985470 979137 984563 982751
2610 983656 986378 984563 989107 978236 987287 975536 979137 975536 981846 973741 967483 975536
2558 970160 972845 968375 976435 966593 971949 964814 967483 966593 970160 975536 971054 980039 972845
2502 980942 974638 980039 980942 980039 984563 983656 986378 976435 990019 981846 982751 980039 981846
2446 979137 979137 983656 980039 982751 980942 990931 983656 989107 988197 988197 985470 982751 984563 971054
2386 973741 963038 959497 941984 963038 966593 973741 998259 998259 991844 969267 990019 980039
2334 992758 992758 992758 995505 990931 996422 990019 994588 982751 988197 977335 980039 977335 977335
2278 978236 978236 983656 973741 980942 974638 980039 975536 979137 979137 975536 979137 976435 980039 969267
2218 978236 969267 973741 966593 969267 968375 958613 965703 955968 962151 953330 962151 953330 955968
2162 957731 951576 952453 948077 959497 947204 957731 951576 960381 953330 961266 967483 959497
2110 967483 961266 971054 959497 971054 968375 972845 971054 976435 983656 970160 983656 974638
2058 989107 976435 987287 976435 981846 986378 981846 987287 982751 997340 977335 993673
2010 985470 993673 985470 984563 984563 975536 983656 972845 980942 962151 971949 970160 972845 971949
1954 966593 983656 957731 984563 967483 979137 962151 983656 963925 962151 973741
1910 956849 965703 946332 964814 938520 948077 946332 950700 943721 935930 937656 924791 938520
1858 925643 941117 905406 918002 918847 911262 909585 892161 910423 869448 899588 852008
1810 860683 810669 818170 765673 741384 735264 679272 648699 570221 540559 411191 366137
1762 263295 205894 122587 75101 33515 11170 2933 702 182 100 108 132 458 1886
1706 8832 19717 60429 97554 182660 237052 341699 379528 475164 517659 552133
1662 573381 543555 476918 356815 359785 286051 280830 251214 285525 306227 358132
1618 423100 481774 560846 604844 682407 700880 721180 745493 748934 748934 732560 760753
1570 731212 748244 723841 722509 732560 711285 722509 681779 715885 686821 711940
1526 671805 689356 664421 674285 639210 631020 641569 583503 553151 471676 422322 352893
1478 306792 265243 227218 210496 202322 194824 191445 190039 186227 189340 181486 184520 178502
1426 174600 160858 148335 123493 91463 49254 20646 8280 3303 1308 783 451
1378 362 266 272 457 987 2616 6762 16736 29569 39016 38694 36580 31510 30454 32482 38093
1314 50774 69830 99459 136033 184690 233154 279797 318892 341070 342014 330859 310773
1266 284475 261363 250982 250060 242797 229532 201578 159090 115570 78495 55827 41119
1218 30008 26354 27570 27698 27494 24527 17205 10348 5824 4254 3588 4322 6252 10598 16536
1158 20703 22451 22431 23793 25029 28526 33732 44141 58512 80398 112316 158797 219808
1106 292984 377784 454615 524377 578154 624660 659543 683665 695734 708669 710630
1062 718528 718528 715885 713253 691900 666260 629279 593804 555192 523894 504479 498016
1014 502624 506341 511497 507742 503087 485784 459244 420381 370206 321250 263053 221638
966 192861 175406 165670 166741 184520 210884 245722 273680 295150 300361 297881 291638
918 286315 291101 311346 350625 394497 453360 505875 553151 595447 629279 668103
874 701525 727853 755864 779908 800283 812912 817417 818924 814411 814411 789302 760753 730539
822 695094 696375 704115 733235 750315 806944 846532 886428 904573 836457 820434 888062
774 837999 850440 834917 852793 848093 871051 907911 914626 955088 952453 984563 966593
726 994588 977335 998259 974638 982751 981846 963925 965703 966593 981846 960381 976435
678 959497 973741 953330 957731 951576 918002 945461 922239 905406 861476 841867 739339
630 636859 516230 428591 386228 340442 365127 398881 501237 586737 677397 709976
586 764968 752391 725176 729867 705413 715226 649297 642752 575497 529229 445906 379178
538 283168 205326 153336 112110 103191 84731 89052 86148 95950 107856 128246 151930
490 164909 215201 192683 252839 231017 322436 266467 308208 312783 295422
450A69529  $$checkpoint
##END= $$ End of sample 3
##TITLE= sample 4
##JCAMP-DX= 5.01
##DATA TYPE= INFRARED SPECTRUM
##DATA CLASS= XYDATA
##BLOCK ID=4
##ORIGIN= Department of Chemistry, The UWI, JAMAICA
##OWNER= public domain
##LONGDATE= Thu Oct 01 2020 06:51:53 GMT-0500 $$ export date from JSpecView
##XUNITS= 1/CM
##YUNITS= TRANSMITTANCE
##XFACTOR= 1
##YFACTOR= 9.999000E-07
##FIRSTX= 3958
##FIRSTY= 9.272567E-01
##LASTX= 450
##NPOINTS= 878
##MINY= 1.000000E-04
##MAXY= 1
##XYDATA= (X++(Y..Y))
3958 927349 960381 946332 956849 974638 959497 970160 970160 980039 965703 994588 966593
3910 987287 1000100 990931 978236 986378 990019 979137 980039 990019 999179 964814 969267 951576
3858 984563 965703 979137 991844 976435 987287 983656 990931 975536 996422 972845 983656
3810 982751 966593 956849 1000100 997340 987287 985470 967483 983656 988197 981846 949825
3762 971054 962151 978236 959497 973741 972845 990019 1000100 980942 987287 1000100 960381
3714 960381 980942 969267 981846 990931 972845 962151 991844 980942 977335 967483 969267
3666 963038 979137 976435 984563 980942 979137 972845 972845 975536 968375 965703 969267 964814 974638
3610 980039 981846 977335 992758 980039 987287 990019 995505 999179 980039 972845 987287 974638
3558 975536 979137 987287 986378 989107 988197 976435 988197 993673 980039 985470 993673 992758
3506 990019 991844 978236 980942 981846 980039 986378 978236 990931 995505 991844 988197 985470
3454 988197 981846 979137 982751 979137 977335 977335 978236 988197 985470 979137 978236 985470 980942 985470
3394 978236 979137 983656 979137 977335 966593 980039 971949 980039 964814 967483 970160 971054
3342 976435 985470 976435 986378 975536 973741 973741 966593 959497 972845 971054 970160 970160 971949 972845
3282 965703 966593 970160 970160 980039 977335 970160 973741 971949 971054 962151 967483 963038 955968 952453
3222 942852 943721 946332 935069 925643 926496 923089 920542 918847 922239 923939 921390 921390 918847
3166 926496 920542 919694 915469 922239 925643 927349 918847 912102 916312 918847 918847 914626 906240
3110 901246 889700 889700 878301 869448 858309 849657 844196 837999 837999 833381 836457 829552 821190
3054 815161 799546 779190 758653 726513 695734 645124 584041 502162 396318 247767
3010 120460 47298 15249 6235 1878 1150 1538 1571 2868 5755 8552 9377 8481 7272
2954 6195 5692 6730 10706 16782 28870 45086 62524 75239 80398 74824 59545 42978
2902 28500 17801 11525 9333 9525 13087 23445 45713 90125 173637 280571 373631
2854 440193 488926 527283 559298 592166 621790 658330 686188 717866 749624 774183
2810 799546 821190 839544 852793 864656 878301 885612 897105 904573 910423 911262 916312
2762 917156 918847 917156 923089 918002 916312 922239 928204 931630 935930 939385 937656 939385
2710 932488 925643 909585 902077 891340 878301 867848 867848 873461 883168 896279 912102 927349
2658 933348 944590 950700 951576 956849 955088 962151 964814 967483 963925 968375 967483 975536 972845
2602 978236 978236 983656 986378 984563 986378 988197 985470 985470 990019 989107 982751 981846 981846 984563 987287
2538 988197 990019 991844 993673 998259 997340 997340 996422 998259 995505 993673 998259 998259 998259 996422 997340
2474 998259 992758 998259 996422 1000100 993673 991844 990019 990019 985470 985470 978236 977335 971054 977335
2414 978236 978236 977335 976435 980039 977335 979137 974638 967483 959497 961266 965703 971949 980942 992758
2354 998259 984563 973741 986378 980039 978236 988197 987287 984563 991844 990019 986378 976435
2302 969267 967483 965703 966593 968375 966593 971054 972845 977335 978236 979137 980039 975536 978236 978236
2242 979137 976435 977335 977335 971949 971054 969267 970160 971054 970160 972845 969267 971949 975536 970160
2182 972845 972845 971054 970160 963925 963038 959497 956849 959497 957731 957731 961266 963925 961266 961266
2122 959497 955088 953330 951576 946332 944590 945461 942852 945461 939385 940250 935930 939385 940250
2066 945461 948077 952453 961266 964814 967483 968375 971949 966593 968375 963925 964814 963038 963038
2010 962151 960381 956849 955088 952453 951576 943721 939385 940250 935069 937656 936793 935069 933348
1954 932488 929059 923939 926496 923939 922239 917156 919694 921390 921390 929915 938520 941984 950700
1898 955088 963038 965703 971949 972845 971054 967483 968375 965703 964814 956849 955088 953330 941984
1842 946332 942852 940250 942852 945461 950700 953330 960381 966593 963038 968375 965703 957731
1790 959497 963038 948950 942852 920542 912102 892983 855940 830316 779190 752391 727853
1742 740020 731212 731886 727853 746867 767792 790758 834917 861476 888881 881543 900416
1694 921390 935930 911262 940250 929059 933348 933348 928204 940250 930772 885612 929915 912102
1642 929915 910423 935069 929059 944590 932488 942852 935069 955088 949825 959497 948077
1594 956849 953330 948950 946332 933348 926496 926496 924791 896279 890519 909585 898759 906240
1542 878301 901246 899588 916312 901246 900416 902077 904573 886428 850440 841092 798074
1494 747555 685557 593258 510556 460939 402572 383039 370206 363114 390161 436559
1450 493450 556216 613258 666873 720516 758653 786400 787850 796606 790030 767792 721844
1402 620074 460939 306509 197717 138562 102717 101776 128838 172840 221842 291638
1358 347091 374665 346452 356487 383746 402943 453360 517182 579220 640388 666260
1314 626388 544056 460939 397780 353544 337010 337010 343276 354196 340129 294065 238805
1266 190390 152350 127774 117502 115463 119686 119466 111287 95070 79441 64631 53956
1218 48311 38908 30679 26136 24983 24369 30314 42116 63510 90291 120017 137418 138945
1166 123493 114510 111287 105207 105790 106278 106867 111800 124866 149845 190916 244367 303419
1114 349336 364119 332999 250982 134290 39341 6830 1202 266 100 106 239 891
1062 4894 19572 46735 78063 104820 135532 169373 207799 273177 317134 367488 437767
1014 482662 512440 527283 560329 596545 643344 681779 732560 763560 790758 798810
970 803236 772046 705413 580288 481331 450032 370889 381631 409679 450862 561363
926 629279 650494 613823 568648 508210 455873 410434 357144 287636 216393 163698
882 119796 89134 82346 99459 131596 201022 291906 408548 531182 639799 725844
838 787125 832613 853578 872657 869448 906240 914626 889700 897932 863065 870249 834149
790 793676 746867 707365 689991 693176 695734 746867 696375 796606 844974 881543
746 915469 927349 934208 936793 945461 940250 942852 942852 962151 940250 937656 941117 934208
694 934208 924791 916312 903740 907075 899588 886428 894630 883982 857518 855152 838771
646 836457 843419 863065 868647 897932 893806 979137 973741 935930 949825 940250 937656
598 940250 935069 938520 897932 879920 845753 891340 863860 760753 870249 864656
554 918847 893806 963925 893806 912102 912943 855152 971054 994588 769916 746180
510 813661 705413 721844 707365 744806 793676 832613 844196 907911 948077 841092
466 935930 819678 828788 652895
450D88476  $$checkpoint
##END=  $$ End of sample 4
##TITLE= sample 5
##JCAMP-DX= 5.01
##DATA TYPE= INFRARED SPECTRUM
##DATA CLASS= XYDATA
##BLOCK ID=5
##ORIGIN= Department of Chemistry, The UWI, JAMAICA
##OWNER= public domain
##LONGDATE= Thu Oct 01 2020 06:32:35 GMT-0500 $$ export date from JSpecView
##XUNITS= 1/CM
##YUNITS= TRANSMITTANCE
##XFACTOR= 1
##YFACTOR= 9.999000E-07
##FIRSTX= 3958
##FIRSTY= 9.341143E-01
##LASTX= 450
##NPOINTS= 878
##MINY= 1.000000E-04
##MAXY= 1
##XYDATA= (X++(Y..Y))
3958 934208 965703 953330 942852 941984 956849 955088 951576 957731 938520 952453 971949
3910 933348 897932 902908 935930 944590 955968 963925 961266 977335 971949 946332 918847
3862 946332 922239 893806 924791 942852 938520 922239 939385 929915 938520 927349 933348
3814 966593 952453 947204 929059 943721 955968 955088 941117 937656 941117 945461 923089
3766 939385 934208 927349 921390 897932 923939 935069 911262 924791 948950 922239 941117
3718 951576 921390 935930 949825 955968 943721 948077 937656 971949 936793 920542 924791
3670 942852 981846 944590 952453 933348 911262 938520 950700 947204 924791 907911 918847
3622 927349 906240 898759 852008 841867 783508 665646 522448 261363 73662 34837
3578 32964 33454 83492 263538 494360 645124 737978 787125 815161 841867 856729
3534 879920 895454 880731 924791 935930 941117 937656 940250 949825 963925 976435 971949
3486 978236 980942 978236 987287 995505 985470 986378 985470 988197 984563 971949 988197 979137
3434 980942 982751 975536 982751 991844 985470 987287 980039 979137 977335 985470 980942 979137 982751
3378 974638 980039 973741 982751 980039 975536 979137 971949 977335 970160 979137 980942 976435
3326 967483 968375 976435 966593 971949 974638 977335 962151 957731 958613 958613 949825 950700 962151 956849
3266 957731 964814 976435 967483 966593 967483 962151 946332 943721 956849 949825 938520 935069
3214 934208 926496 923089 918847 921390 923089 919694 923089 918847 923939 908748 912102 911262
3162 914626 907075 904573 906240 897105 902077 892161 896279 894630 891340 893806 892983 880731 888062
3106 888062 883168 878301 875878 872657 867848 865453 867049 858309 854365 847312 844196 837999
3054 837227 821190 810669 795140 784230 768499 755864 742068 720516 693815 660760
3010 621217 566557 497100 413089 320954 220823 122361 50774 21520 12625 8897
2966 9325 11859 12695 11632 9882 9012 9239 11472 16674 25754 40146 63803 95158 132082
2910 169217 196808 206464 189166 156474 130390 114616 103477 110980 130871 155612 196990
2862 255884 337321 421545 508679 578687 632184 678646 713253 748244 770626 790030
2818 803977 824221 832613 842643 852793 859099 868647 879110 887245 892983 899588 896279
2770 902077 905406 900416 900416 892161 895454 892161 898759 902908 902077 913784 917156 918002 920542
2714 921390 921390 925643 922239 927349 919694 919694 912102 915469 918847 923939 929915 933348 931630 927349
2654 924791 923089 926496 926496 927349 931630 931630 930772 931630 934208 933348 935069 933348 941117 946332 938520
2590 938520 938520 941984 936793 944590 942852 943721 943721 946332 948950 948950 949825 946332 948077 947204 951576
2526 948950 951576 955968 954209 955968 954209 957731 959497 963925 963925 961266 964814 963925 962151
2470 963925 964814 969267 966593 962151 966593 963038 962151 962151 959497 962151 958613 961266 961266 961266
2410 963038 959497 958613 961266 961266 961266 954209 943721 928204 921390 933348 941117 976435 1000100
2354 1000100 988197 965703 969267 971949 989107 986378 994588 1000100 994588 994588 988197 985470
2302 978236 980039 973741 972845 969267 964814 964814 962151 965703 962151 963038 959497 957731 956849 958613
2242 954209 950700 950700 949825 954209 950700 955088 956849 959497 958613 958613 958613 957731 958613 961266 965703 965703
2174 969267 967483 969267 971054 970160 970160 972845 974638 974638 977335 973741 974638 974638 977335 978236 974638
2110 980942 979137 980039 987287 992758 992758 992758 993673 987287 983656 976435 975536 974638 971949 970160 972845
2046 971054 966593 963925 962151 964814 959497 965703 963038 966593 968375 969267 969267 966593 967483
1990 964814 971054 966593 969267 964814 967483 966593 966593 967483 966593 968375 965703 969267 963038 963925
1930 961266 963925 962151 961266 962151 961266 963038 956849 959497 952453 953330 949825 947204 941984
1874 936793 932488 921390 921390 907075 893806 873461 858309 826501 788576 740020 674906
1826 587819 484890 372257 256120 156619 80324 33239 10521 2876 608 218
1782 100 109 159 562 1948 6650 19021 43216 84653 135908 206084 266467 333613 394860
1726 471676 551117 632766 702172 752391 796606 825740 863065 880731 900416 910423
1682 926496 929059 946332 953330 956849 965703 965703 968375 978236 981846 981846 982751 988197 988197 987287 990019
1618 990931 989107 996422 993673 991844 993673 997340 998259 996422 997340 998259 997340 1000100 999179
1562 994588 999179 996422 995505 986378 985470 983656 981846 979137 971054 969267 957731 952453 940250
1506 927349 906240 882355 841092 792216 727183 655305 577622 508679 459244 432159
1462 429382 447140 478678 509147 536591 549090 552641 562916 571273 582966 586737 598747
1414 586737 559298 499394 420381 344543 282126 243245 228267 232297 250521 283168
1370 315677 344226 367488 387296 402572 421545 449204 473853 511969 545059 577622
1326 593804 605401 601511 592166 580288 564993 555704 543055 540559 536591 535604 530205 530205
1274 528255 525828 528742 524860 523412 512913 503551 492996 485337 479561 466921 449204 423490
1222 396683 363114 341699 323924 316843 314227 314227 308776 290833 264267 225550 185372 146435
1170 117285 90374 65894 43535 26671 17157 12475 11037 11958 16536 24437 38375 55417
1118 67740 63569 46649 30595 20158 17524 18418 24146 37055 60932 93766 135034
1070 186743 241015 307357 368845 437364 493905 557755 608756 651694 691263 720516
1026 748934 764968 783508 788576 795140 793676 788576 784230 775610 764264 762155 764968 765673
974 783508 791486 815161 826501 843419 852793 863065 874266 878301 902077 908748 919694
926 911262 912943 912102 906240 907075 899588 906240 903740 922239 920542 935069 934208 936793 929915
870 922239 929915 909585 918002 902908 922239 922239 920542 935930 947204 958613 974638 981846
818 977335 990019 982751 983656 982751 957731 975536 991844 948950 910423 891340 861476
770 878301 853578 860683 835687 822704 773470 733911 674906 645719 631020 612694
726 652294 649297 685557 691900 719190 715885 702819 702819 686821 684295 669952 670569 653497
674 661368 639799 599851 592166 557241 511497 441818 392684 303419 262327 215995
630 193751 202509 188992 201022 187605 192506 187432 198629 183672 196085 207035 218798
582 237489 234230 248911 226383 234446 220416 235095 240350 287371 317134 337010 377089
534 386584 408548 392684 421933 381279 414613 384807 414232 453778 472545 493905
490 513385 545561 537580 586737 553151 572326 592166 588360 617225 556216
450D52109  $$checkpoint
##END= $$ End of sample 5
##TITLE= sample 6
##JCAMP-DX= 5.01
##DATA TYPE= INFRARED SPECTRUM
##DATA CLASS= XYDATA
##BLOCK ID=6
##ORIGIN= Department of Chemistry, The UWI, JAMAICA
##OWNER= public domain
##LONGDATE= Thu Oct 01 2020 06:27:21 GMT-0500 $$ export date from JSpecView
##XUNITS= 1/CM
##YUNITS= TRANSMITTANCE
##XFACTOR= 1
##YFACTOR= 9.999000E-07
##FIRSTX= 3958
##FIRSTY= 9.990794E-01
##LASTX= 450
##NPOINTS= 878
##MINY= 1.000000E-04
##MAXY= 1
##XYDATA= (X++(Y..Y))
3958 999179 1000100 986378 987287 987287 995505 995505 995505 995505 994588 988197 989107 987287 977335 973741 972845 969267 965703
3886 959497 966593 973741 958613 944590 951576 952453 955968 923089 962151 960381 951576 943721
3834 951576 964814 972845 945461 952453 966593 972845 965703 953330 959497 982751 984563
3786 988197 990019 986378 983656 973741 980942 974638 974638 942852 928204 906240 955088 940250
3734 948950 973741 971054 988197 987287 962151 973741 989107 990019 987287 971054 931630
3686 964814 958613 913784 927349 925643 959497 966593 946332 953330 918847 970160 983656
3638 990019 978236 946332 985470 970160 969267 974638 954209 982751 989107 981846 982751
3590 959497 977335 990931 990931 990931 979137 980942 990019 985470 976435 983656 982751 990931 990931
3534 990931 990931 990931 993673 997340 993673 990931 990931 983656 970160 955088 948077 919694 911262 912943
3474 935069 943721 958613 969267 980039 983656 989107 990931 990931 990931 990931 990931 991844 993673 990019 990931
3410 996422 995505 999179 990931 990931 992758 991844 990931 991844 990931 990931 991844 986378 991844 991844 992758 992758
3342 993673 990019 992758 992758 991844 991844 991844 991844 991844 991844 988197 992758 992758 991844 991844 999179 991844 991844 992758 992758 992758 992758 992758 992758 992758 992758 993673 993673
3230 985470 977335 985470 978236 977335 979137 963925 971054 971949 962151 968375 955968 961266
3178 957731 955968 963925 964814 963925 963925 963925 972845 965703 967483 966593 951576 948077 929915 929059
3118 929059 935930 942852 944590 950700 950700 956849 963038 957731 953330 945461 950700 950700 941984 943721
3058 942852 935930 936793 927349 929915 928204 913784 906240 887245 868647 841867 797340 748244
3006 688087 607636 504015 377089 260401 145226 63044 28343 18520 15362 18588
2962 33670 57233 78207 87830 85279 71721 56970 49391 46994 49893 60262 80620
2914 106082 136033 166895 191445 205894 212835 217793 234230 264024 311920 383392 473417
2866 559298 628121 678021 717866 746867 775610 800283 826501 851223 863860 865453
2822 885612 896279 904573 915469 917156 929059 924791 931630 931630 937656 931630 937656 938520
2770 947204 938520 938520 935069 931630 930772 927349 923089 911262 911262 911262 918847 925643 933348 948077 955088
2706 957731 971949 976435 975536 981846 980942 974638 974638 974638 974638 974638 983656 973741 983656 978236 974638 980942
2638 979137 976435 975536 974638 982751 976435 982751 990931 988197 991844 986378 985470 990019 990019
2582 990019 999179 996422 997340 989107 997340 997340 989107 991844 997340 990931 990931 992758 994588 988197
2522 995505 987287 987287 994588 987287 994588 988197 990931 985470 985470 990019 994588 994588 994588 993673 993673 993673
2454 985470 987287 985470 984563 984563 984563 984563 985470 985470 985470 983656 977335 983656 977335 983656 977335 974638 967483
2382 951576 951576 941984 931630 918002 908748 904573 897932 904573 897932 904573 902077 907075 903740
2326 900416 899588 908748 902077 914626 923089 930772 936793 944590 951576 958613 964814 972845
2274 972845 972845 976435 979137 979137 978236 978236 978236 986378 985470 985470 978236 978236 978236 978236 978236 976435 976435 976435 976435 970160 977335 970160 969267
2178 976435 970160 967483 976435 976435 966593 976435 967483 967483 967483 968375 967483 953330 959497 953330 952453
2114 949825 945461 945461 937656 943721 937656 936793 937656 943721 937656 936793 944590 943721 950700 950700
2054 949825 957731 957731 957731 957731 957731 955968 963925 955968 955968 963038 958613 955968 947204 957731 940250 941117
1986 940250 934208 941117 940250 934208 941117 947204 947204 948950 945461 947204 950700 953330 954209
1930 960381 953330 946332 938520 952453 952453 954209 954209 950700 952453 955088 958613 958613 958613 952453 930772
1866 950700 950700 950700 950700 942852 911262 928204 936793 925643 911262 908748 916312 902908 875878 836457
1806 798074 732560 655305 527768 484444 450862 405176 325719 233799 156186 76992
1762 16613 955 157 153 157 501 7387 46349 121239 205326 285788 349980 453778 533634
1706 585657 607077 685557 769916 815161 774896 851223 861476 875878 863860 908748
1662 902908 913784 791486 898759 887245 929059 883982 911262 926496 917156 929059
1618 880731 933348 935069 935930 933348 935930 935069 941117 934208 935069 886428 925643 902077
1566 928204 855152 837999 908748 919694 897105 831081 889700 885612 910423 890519
1522 838771 871853 894630 844974 809177 853578 788576 767792 684295 624085 555704
1478 490731 434954 452526 473417 522448 533143 638621 694454 740020 779908 770626
1434 828788 836457 855940 853578 846532 860683 841092 795140 735942 658330 615522 581358
1386 569172 574438 603731 632766 673044 709976 737978 770626 782066 794408 795140
1342 795872 804717 819678 815161 815161 803236 796606 790758 777756 765673 755168 753084 724508
1290 709322 684295 668103 648102 651094 631602 630440 630440 614955 597645 588903 589445 582430
1238 580288 582430 581358 566035 547071 502162 451693 384099 300915 195544 92479
1194 27723 7159 1772 575 167 113 100 147 453 1538 5481 20608 53808 117827 194645
1134 274185 348693 410434 455453 511969 567601 617794 611003 711940 717866 729195
1090 739339 751006 761454 763560 759353 760052 756560 755864 738658 736620 733235 743436 760052
1038 761454 770626 779190 786400 806944 806944 824980 829552 815912 835687 824980 848093 854365
986 834917 829552 826501 818924 832613 826501 806201 792216 764968 737978 695094 686821
938 671805 631602 621790 605959 621217 635687 687454 717205 765673 816664 844196
894 848093 864656 911262 897105 910423 923089 923939 939385 942852 915469 932488 891340
846 919694 922239 899588 875071 889700 863065 860683 841867 839544 821190 833381 856729
798 870249 875878 842643 853578 853578 867848 867848 879110 879920 865453 888881 879920 875071 888062
742 904573 875071 863860 910423 899588 898759 925643 924791 929059 925643 914626 922239
694 871853 893806 910423 922239 918847 906240 883982 891340 905406 929059 888881 902077
646 887245 842643 841092 892983 892983 900416 944590 898759 902077 888062 898759 919694 905406
594 931630 930772 913784 928204 927349 949825 892983 914626 955968 920542 963038 906240
546 940250 978236 937656 923939 907075 912943 919694 929059 960381 963925 954209 963038
498 996422 973741 963038 933348 920542 920542 900416 892983 913784 912943 925643 946332
450I52453  $$checkpoint
##END= $$ End of sample 6
##END=$$ END of FILE