##TITLE= 1,1,1-F3C-CH3 and  1,1,2-F2HC-CH2F
##JCAMP-DX=5.01
##DATA TYPE= LINK
##BLOCKS= 4
##TITLE= 1,1,1-F3C-CH3
##JCAMP-DX= 5.01
##DATA TYPE= INFRARED SPECTRUM
##DATA CLASS= XYDATA
##BLOCK ID=1
##ORIGIN= Department of Chemistry, UWI, JAMAICA
##OWNER= public domain
##LONGDATE= 2012/02/18 12:31:56.0440 -0500 $$ export date from JSpecView
##SPECTROMETER/DATA SYSTEM= from WebMO Gaussian simulation
##$MODELS=
<Models>
<ModelData id="I111" type="MOL">
1,1,1-H3C2F3
__Jmol-14_02241910263D 1   1.00000     0.00000     0
Jmol version 14.29.31  2019-01-29 15:30 EXTRACT: ({0:7})
  8  7  0  0  0  0            999 V2000
    0.0000    0.0000    1.4666 C   0  0  0  0  0  0
    0.0000    0.0000   -0.0328 C   0  0  2  0  0  0
    0.0000    1.2316   -0.5215 F   0  0  0  0  0  0
   -1.0666   -0.6158   -0.5215 F   0  0  0  0  0  0
    1.0666   -0.6158   -0.5215 F   0  0  0  0  0  0
    0.8835    0.5101    1.8258 H   0  0  0  0  0  0
   -0.8835    0.5101    1.8258 H   0  0  0  0  0  0
   -0.0000   -1.0202    1.8258 H   0  0  0  0  0  0
  1  8  1  0  0  0
  1  2  1  0  0  0
  1  6  1  0  0  0
  2  5  1  0  0  0
  2  3  1  0  0  0
  4  2  1  0  0  0
  7  1  1  0  0  0
M  END
</ModelData>
<ModelData id="1" type="XYZVIB" baseModel="I111" vibrationScale=".5">
8
Model[1]: PATH=Calculation 2;Standard;Energy=-375.82037;Range=M.O.s;NFock==Conv=0.36D-09;E(RHF)=-375.820368975 A.U.;PATH=Calculation 2;Standard
C       0.00000      0.00000      1.46659
C       0.00000      0.00000     -0.03281
F       0.00000      1.23155     -0.52148
F      -1.06655     -0.61577     -0.52148
F       1.06655     -0.61577     -0.52148
H       0.88354      0.51011      1.82577
H      -0.88354      0.51011      1.82577
H      -0.00000     -1.02022      1.82577
8
Model[2]: FrequencyLabel=A2;ForceConstant=0.0392 mDyne/A;ReducedMass=1.0425 AMU;FreqValue=252.5564;Frequency=252.5564 cm^-1;Mode=1;PATH=Calculation 2;FrequenciesFrequencies;IRIntensity=0.0000 KM/Mole;PATH=Calculation 2;FrequenciesFrequencies
C       0.00000      0.00000      1.46659     -0.00000      0.00000      0.00000
C       0.00000      0.00000     -0.03281      0.00000     -0.00000     -0.00000
F       0.00000      1.23155     -0.52148      0.03000      0.00000      0.00000
F      -1.06655     -0.61577     -0.52148     -0.01000      0.02000      0.00000
F       1.06655     -0.61577     -0.52148     -0.01000     -0.02000     -0.00000
H       0.88354      0.51011      1.82577     -0.29000      0.50000      0.00000
H      -0.88354      0.51011      1.82577     -0.29000     -0.50000     -0.00000
H      -0.00000     -1.02022      1.82577      0.58000      0.00000      0.00000
8
Model[3]: FrequencyLabel=E;ForceConstant=0.3526 mDyne/A;ReducedMass=3.9015 AMU;FreqValue=391.6372;Frequency=391.6372 cm^-1;Mode=2;PATH=Calculation 2;FrequenciesFrequencies;IRIntensity=0.4499 KM/Mole;PATH=Calculation 2;FrequenciesFrequencies
C       0.00000      0.00000      1.46659     -0.05000      0.23001     -0.00000
$$ [...]
C       0.00000      0.00000      1.46659     -0.09000     -0.02000     -0.00000
C       0.00000      0.00000     -0.03281     -0.00000     -0.00000     -0.00000
F       0.00000      1.23155     -0.52148      0.00000      0.00000     -0.00000
F      -1.06655     -0.61577     -0.52148      0.00000      0.00000      0.00000
F       1.06655     -0.61577     -0.52148      0.00000     -0.00000     -0.00000
H       0.88354      0.51011      1.82577      0.63000      0.37000      0.26000
H      -0.88354      0.51011      1.82577      0.49001     -0.29000     -0.20001
H      -0.00000     -1.02022      1.82577     -0.01000      0.16000     -0.06000
8
Model[19]: FrequencyLabel=E;ForceConstant=7.2211 mDyne/A;ReducedMass=1.1057 AMU;FreqValue=3329.3434;Frequency=3329.3434 cm^-1;Mode=18;PATH=Calculation 2;FrequenciesFrequencies;IRIntensity=11.1127 KM/Mole;PATH=Calculation 2;FrequenciesFrequencies
C       0.00000      0.00000      1.46659      0.02000     -0.09000     -0.00000
C       0.00000      0.00000     -0.03281      0.00000     -0.00000      0.00000
F       0.00000      1.23155     -0.52148     -0.00000      0.00000     -0.00000
F      -1.06655     -0.61577     -0.52148      0.00000      0.00000      0.00000
F       1.06655     -0.61577     -0.52148     -0.00000      0.00000      0.00000
H       0.88354      0.51011      1.82577      0.21000      0.11000      0.09000
H      -0.88354      0.51011      1.82577     -0.45000      0.25000      0.18001
H      -0.00000     -1.02022      1.82577      0.00000      0.75000     -0.27001
</ModelData>
</Models>
##$PEAKS=
<Peaks type="IR" xUnitsExpected="1/cm"  >
<PeakData id="1" title="1- (~3330 cm-1)" peakShape="broad" model="1.18" xMax="3350" xMin="3310"    />
<PeakData id="2" title="2- (~3245 cm-1)" peakShape="broad" model="1.17" xMax="3260" xMin="3230"    />
<PeakData id="3" title="3- (~1600 cm-1)" peakShape="broad" model="1.14" xMax="1620" xMin="1580"    />
<PeakData id="4" title="4- (~1430 cm-1)" peakShape="broad" model="1.13" xMax="1450" xMin="1420"    />
<PeakData id="5" title="5- (~1415 cm-1)" peakShape="broad" model="1.11" xMax="1420" xMin="1400"    />
<PeakData id="6" title="6- (~1095 cm-1)" peakShape="broad" model="1.9" xMax="1110" xMin="1080"    />
<PeakData id="7" title="7- (~910 cm-1)" peakShape="broad" model="1.8" xMax="930" xMin="890"    />
<PeakData id="8" title="8- (~645 cm-1)" peakShape="broad" model="1.7" xMax="660" xMin="630"    />
<PeakData id="9" title="9- (~585 cm-1)" peakShape="broad" model="1.5" xMax="600" xMin="570"    />
<PeakData id="10" title="10-(~390 cm-1)" peakShape="broad" model="1.3" xMax="410" xMin="370"    />
</Peaks>
##XUNITS= 1/CM
##YUNITS= TRANSMITTANCE
##XFACTOR= 1
##YFACTOR= 9.999000E-07
##FIRSTX= 3.529344E+03
##FIRSTY= 1
##LASTX= 5.255640E+01
##NPOINTS= 2001
##MINY= 1.000000E-04
##MAXY= 1
##XYDATA= (X++(Y..Y))
3529.3435A000100%V5k301o8p0p4p7q1q5q9r3r7j03j08j14j19j27j33I96221
3419.8247I96072j57j67j76j88j99k13k26k41k58k77k96l18l41l69l97I91819
3390.272I91354n06n50o00o57p19p91q71r64j070j190j330j492j679I76809
3364.196I74645k471k835l271l795m431n203o151p315q751j0523j2698H91868
3341.597H73421k1943k5494k8369k9291k6571j8899o650P425J9459K6827G99199
3320.736H27401K5254K1689J8207J5119J2509J0357Q604P182O029N088I61759
3299.8755I65446L162K724K356K043J777J546J346J169J011Q69P38O14I85297
3275.5378I85676K62J39Pj40l06n00p30j008j344j744k209k708l162l408I65629
$$ plain form
3529.3435 1000100 1000100 1000100 1000100 1000100 1000100 1000100 1000100 1000100 1000100 1000100 1000100 1000100 1000100 1000100 1000100 1000100 1000100 1000100 1000100 1000100 1000100 1000100 1000100 1000100 1000100 1000100 1000100 1000100 1000100 1000100 1000100 1000100 1000100 1000100 1000100 1000100 1000100 1000100 1000100 1000100 1000100 1000100 1000100 1000100 1000100 997799 997731 997661 997587 997510 997429 997344 997255 997162 997065 996962 996854 996740 996621 996494 996361 996221
3419.8247 996072 995915 995748 995572 995384 995185 994972 994746 994505 994247 993970 993674 993356 993015 992646 992249 991819
3390.272 991354 990848 990298 989698 989041 988322 987531 986660 985696 984626 983436 982106 980614 978935 976809
3364.196 974645 972174 969339 966068 962273 957842 952639 946488 939173 930422 919899 907201 891868
3341.597 873421 851478 825984 797615 768324 741753 722854 716204 723629 743088 769915 799199
3320.736 827401 852655 874344 892551 907670 920179 930536 939140 946322 952351 957439 961759
3299.8755 965446 968608 971332 973688 975731 977508 979054 980400 981569 982580 983449 984187 984801 985297
3275.5378 985676 985938 986077 986084 985944 985638 985138 984408 983400 982056 980312 978103 975395 972233 968825 965629
3247.7236I63337o99J180K743L611L797L544L094K609K164J784J473J222I90880
3223.3862I91739P30O25N39M68M11L62L21K86K485J70J52J34J21J08R7I98836
3193.8335I98916P3O6O0N6N1M6M4M0L7L4L2L0K8K5TK3K1K0J9J7TJ6J5I99725
$$ plain form
3247.7236 963337 962638 963818 966561 970172 973969 977513 980607 983216 985380 987164 988637 989859 990880
3223.3862 991739 992469 993094 993633 994101 994512 994874 995195 995481 997966 998136 998288 998422 998543 998651 998748 998836
3193.8335 998916 998989 999055 999115 999171 999222 999268 999312 999352 999389 999423 999455 999485 999513 999538 999563 999586 999607 999627 999646 999663 999680 999696 999711 999725
3150.3735I99738J3J2J1URJ0RQUPUK31%Y91l9jUkjTkTjkWr713k87l00I89426
1714.4606I89099l43l58l76l95m13m35m57m81n06n34n62n95o28o64p04I80902
1684.9078I80110q42q96r54j018j087j164j246j338j437j549j669j805I63151
1660.5704I61031k306k513k747l008l304l640m021m458m958n533o198I11379
1637.9713I03523q884j0064j1399j2896j4565j6472j8747k1556k5024G34703
1618.849G00579l9697m5754n1900n7384o0996o1128n6175m5317k9186B43366
1599.7266B54278L0300M6189N6735O1396O1062N7352N1866M5782L9826G39152
1580.6042G68700K5388K1843J8839J6303J4161J2350J0815M690%S9o54H91266
1528.4525H89903j556j750j944k142k344k551k763k984l212l451l700H57543
$$ plain form
1714.4606 989099 988756 988398 988022 987627 987214 986779 986322 985841 985335 984801 984239 983644 983016 982352 981648 980902
1684.9078 980110 979268 978372 977418 976400 975313 974149 972903 971565 970128 968579 966910 965105 963151
1660.5704 961031 958725 956212 953465 950457 947153 943513 939492 935034 930076 924543 918345 911379
1637.9713 903523 894639 884575 873176 860280 845715 829243 810496 788940 763916 734703
1618.849 700579 660882 615128 563228 505844 444848 383720 327545 282228 253042 243366
1599.7266 254278 284578 330767 387502 448898 509960 567312 619178 664960 704786 739152
1580.6042 768700 794088 815931 834770 851073 865234 877584 888399 893089 893089 893089 893089 893089 893089 893089 893089 893089 893089 893089 893089 893089 893089 893089 893089 893089 893089 893089 893089 892435 891266
1528.4525 889903 888347 886597 884653 882511 880167 877616 874853 871869 868657 865206 861506 857543
1505.8534H53336m533m842n172n521n896o295o724p183p679q212q788G73082
1483.2543G63001j0811m557j2773j3699j4709j5809j7006j8308j9725F14342
1464.132E91418k4717k6639k8682l0830l3054l5301l7493l9513m1193B51686
1445.0096B09107m1671l9271l5186k9511k2774j5929j0033n750l113j725C024
1424.1489B114p91o01l65j78o9j0M5J66N11J428L449P046J2236J8474F8340
1396.3346I8987L5222L8401M0223M0870M0583L9601L8136L6363L4414D75189
1377.2123E05548K8372K6461K4646K2937K1337J9848J8466J7189J6007G15730
1358.09G29644J2987J2135J1348J0622R953R334Q764Q235P746P294H34936
$$ plain form
1505.8534 853336 848803 843961 838789 833268 827372 821077 814353 807170 799491 791279 782491 773082
1483.2543 763001 752190 747633 734860 721161 706452 690643 673637 655329 635604 614342
1464.132 591418 566701 540062 511380 480550 447496 412195 374702 335189 293996 251686
1445.0096 209107 167436 128165 92979 63468 40694 24765 14732 8982 5869 4144 3024
1424.1489 2114 1323 722 357 179 110 100 145 311 822 2250 5699 12745 24981 43455 68340
1396.3346 98987 134209 172610 212833 253703 294286 333887 372023 408386 442800 475189
1377.2123 505548 533920 560381 585027 607964 629301 649149 667615 684804 700811 715730
1358.09 729644 742631 754766 766114 776736 786689 796023 804787 813022 820768 828062 834936
1337.2292H41420O122N786N472N181M908M655M417M196L988L793L611H96989
1314.6301I00268L129K986L000TL001L000UL001L000TL001L000TL001I48387
1285.0774I51387L000L001L000TL001L000TL001L000TJ708J000K001M000I90099
1257.2631I90099%T4j7k98l11l26l40l56l74l92m11m31m54m77n02n30I84322
1187.7273I83732o23o58o98p40p84q34q87r44j008j075j150j232j321I70359
1161.6515I68832j646j777j924k084k265k465k691k942l227l547l911I36029
1139.0524I31233n336n956o672p501q467r592j0913j2465j4296j6463H14543
1118.1917G92478k5650k9853l4715m0214m6194n2268n7685o1232o1302C27077
$$ plain form
1337.2292 841420 847542 853328 858800 863981 868889 873544 877961 882157 886145 889938 893549 896989
1314.6301 900268 903397 906383 909383 912383 915384 918384 921384 924384 927385 930385 933385 936386 939386 942386 945387 948387
1285.0774 951387 954387 957388 960388 963388 966389 969389 972389 975390 978390 981390 983098 984098 986099 990099 990099
1257.2631 990099 990099 990099 990099 990099 990099 990099 990099 990099 990099 990099 990099 990099 990099 990099 990099 990099 990099 990099 990099 990099 990099 990099 990099 990099 990082 989784 989473 989147 988807 988451 988077 987685 987274 986843 986389 985912 985410 984880 984322
1187.7273 983732 983109 982451 981753 981013 980229 979395 978508 977564 976556 975481 974331 973099 971778 970359
1161.6515 968832 967186 965409 963485 961401 959136 956671 953980 951038 947811 944264 940353 936029
1139.0524 931233 925897 919941 913269 905768 897301 887709 876796 864331 850035 833572 814543
1118.1917 792478 766828 736975 702260 662046 615852 563584 505899 444667 383365 327077
1099.0693B81694k9219r697J0890L0280M6178N6743O1424O1104N7405F18723
1079.9469F64560L9877L4412K9589K5424K1873J8866J6326J4181J2367H88304
1060.8246H97826Q405P450O627N918N302M766M298L889L527L209K927I56821
1038.2255I59274K253K075J914J770J638J092J400J302J212J131J055I77103
1015.6264I78027Q66Q11P63P16O73O34N96N62N30M99M71M44M18L94L72I87126
986.0737I87455L09K90K71K54K35J285%Q490q3r0r7j07j16j27j39j53I97508
954.78265I97321k08k31k59k90l28l71m22m84n55o43p48q77j034j229I88172
926.9683I86401k148k618l203l912m742n636o439o846o395m661j661I40001
$$ plain form
1099.0693 281694 252475 242778 253668 283948 330126 386869 448293 509397 566802 618723
1079.9469 664560 704437 738849 768438 793862 815735 834601 850927 865108 877475 888304
1060.8246 897826 906231 913681 920308 926226 931528 936294 940592 944481 948008 951217 954144 956821
1038.2255 959274 961527 963602 965516 967286 968924 970016 971416 972718 973930 975061 976116 977103
1015.6264 978027 978893 979704 980467 981183 981856 982490 983086 983648 984178 984677 985148 985592 986010 986404 986776 987126
986.0737 987455 987764 988054 988325 988579 988814 990099 990099 998589 998506 998416 998319 998212 998096 997969 997830 997677 997508
954.78265 997321 997113 996882 996623 996333 996005 995634 995212 994728 994173 993530 992782 991905 990871 989642 988172
926.9683 986401 984253 981635 978432 974520 969778 964142 957703 950857 944462 939801 938140 940001
904.3692I44802O454O840O400N584M691L867L165K588K123J752J454I90936
881.7701I91960Q69P41O38N51M79M19L68L25K89K57K30K06J86J68J52I97977
852.2174I98103J16J06R7Q9Q3P6P1O6O1N6N4M9M6M4M1L8L6L4L2L0K8I99383
812.2344I99409K4K3K2K0TJ9J8J7J6TJ4UJ3M41%S1l114r1r6j00j04j09I96371
753.12897I96251j26j32j39j46j54j61j71j80j90k01k12k26k38k54k70I93165
723.5763I92859l26l49l73m00m29m62m97n37n80o29j228p58q26r02r88I82491
694.0236I81297j319j461j624j812k030k282k577k924l333l819m398I48624
671.4245I42689o955q200r723j1593j3883j6672k0015k3913k8204l2441G35410
$$ plain form
904.3692 944802 951256 958096 964496 970080 974771 978638 981803 984391 986514 988266 989720 990936
881.7701 991960 992829 993570 994208 994759 995238 995657 996025 996350 996639 996896 997126 997332 997518 997686 997838 997977
852.2174 998103 998219 998325 998422 998511 998594 998670 998741 998807 998868 998924 998978 999027 999073 999117 999158 999196 999232 999266 999298 999328 999356 999383
812.2344 999409 999433 999456 999478 999498 999518 999537 999555 999572 999588 999604 999618 999632 999646 999659 1000100 1000100 1000100 1000100 1000100 1000100 1000100 1000100 1000100 1000100 1000100 1000100 996986 996895 996799 996699 996595 996486 996371
753.12897 996251 996125 995993 995854 995708 995554 995393 995222 995042 994852 994651 994439 994213 993975 993721 993451 993165
723.5763 992859 992533 992184 991811 991411 990982 990520 990023 989486 988906 988277 987049 986291 985465 984563 983575 982491
694.0236 981297 979978 978517 976893 975081 973051 970769 968192 965268 961935 958116 953718 948624
671.4245 942689 935734 927534 917811 906218 892335 875663 855648 831735 803531 771090 735410
650.5638F99041l2575k2936q057Q874K3498L2767L6224L5310L1953K7671H55141
629.70306H74621J6143J3356J1055R166P610O320N239M322L528K826K190I57969
607.10394I58981M24j96q73j638k516l528m668n870o946p523p043m993I12215
582.7664I15062O397Q394Q854Q301P285O171N138M253L522K931K454I80832
560.1673I82591J508J302J133R91Q74P75O91O19N58N04M59M18L82L51I93480
532.353I93778K77K57K39K24L223J12J03R6Q9Q2P6k2O4N9N5N2M7M5I98897
497.58514I98936L6L4L1K9K7K5K4K1K0J8J7J5J4J2J1RQPNN40j3j4j5j6I99763
452.3869I99744k0k3k4k7l0l2l6l9m4m9n5o1p0p8r0j02j18j36j59j86I98145
$$ plain form
650.5638 699041 666466 643530 635473 644347 667845 700612 736836 772146 804099 831770 855141
629.70306 874621 890764 904120 915175 924341 931951 938271 943510 947832 951360 954186 956376 957969
607.10394 958981 959405 959209 958336 956698 954182 950654 945986 940116 933170 925647 918604 913611 912215
582.7664 915062 921459 929853 938707 947008 954293 960464 965602 969855 973377 976308 978762 980832
560.1673 982591 984099 985401 986534 987525 988399 989174 989865 990484 991042 991546 992005 992423 992805 993156 993480
532.353 993778 994055 994312 994551 994775 997998 998110 998213 998309 998398 998480 998556 998534 998598 998657 998712 998764 998811 998856 998897
497.58514 998936 998972 999006 999037 999066 999093 999118 999142 999163 999183 999201 999218 999233 999247 999259 999270 999279 999287 999294 999299 999839 999826 999812 999797 999781 999763
452.3869 999744 999724 999701 999677 999650 999620 999588 999552 999513 999469 999420 999365 999304 999234 999156 999066 998964 998846 998710 998551 998365 998145
414.14224I97884l13l78m59n60o87q41j024j221j403j499j408j032l68I87104
388.06635I88166J420J498J394J210J012Q31O79N54M53L74L09K59K17I98561
361.99045I98718J35J17J02Q9P8O8O2N4M9M3M0L5L2L0K6K5K2K1J8TJ6I99813
$$ plain form
414.14224 997884 997571 997193 996734 996174 995487 994646 993622 992401 990998 989499 988091 987059 986691 987104
388.06635 988166 989586 991084 992478 993688 994700 995531 996210 996764 997217 997591 997900 998159 998376 998561
361.99045 998718 998853 998970 999072 999161 999239 999307 999369 999423 999472 999515 999555 999590 999622 999652 999678 999703 999725 999746 999764 999782 999798 999813
322.0074I99827J3J2J1J0TRTQTPTOUNVMVLMLWR3%S23A000100
52.5564A000100  $$checkpoint
##END= $$ end of 1,1,1-F3C-CH3
##TITLE=Raman of 1,1,1-F3C-CH3 $$ Begin of the data block
##JCAMP-DX=5.00 $$ ACD/DocManager Library v 5.00
##DATA TYPE=RAMAN SPECTRUM
##DATA CLASS=XYDATA
##BLOCK ID=2
##DATE=19 Feb 2012 10:29:22
##ORIGIN= Department of Chemistry, UWI, Jamaica
##OWNER= public domain
##SPECTROMETER/DATA SYSTEM=from WebMO Gaussian simulation
##$MODELS=
<Models>
<ModelData id="R111" type="MOL">
1,1,1-H3C2F3
__Jmol-14_02241910263D 1   1.00000     0.00000     0
Jmol version 14.29.31  2019-01-29 15:30 EXTRACT: ({0:7})
  8  7  0  0  0  0            999 V2000
    0.0000    0.0000    1.4666 C   0  0  0  0  0  0
    0.0000    0.0000   -0.0328 C   0  0  2  0  0  0
    0.0000    1.2316   -0.5215 F   0  0  0  0  0  0
   -1.0666   -0.6158   -0.5215 F   0  0  0  0  0  0
    1.0666   -0.6158   -0.5215 F   0  0  0  0  0  0
    0.8835    0.5101    1.8258 H   0  0  0  0  0  0
   -0.8835    0.5101    1.8258 H   0  0  0  0  0  0
   -0.0000   -1.0202    1.8258 H   0  0  0  0  0  0
  1  8  1  0  0  0
  1  2  1  0  0  0
  1  6  1  0  0  0
  2  5  1  0  0  0
  2  3  1  0  0  0
  4  2  1  0  0  0
  7  1  1  0  0  0
M  END
</ModelData>
<ModelData id="2" type="XYZVIB" baseModel="R111" vibrationScale=".5">
8
Model[1]: PATH=Calculation 2;Standard;Energy=-375.82037;Range=M.O.s;NFock==Conv=0.36D-09;E(RHF)=-375.820368975 A.U.;PATH=Calculation 2;Standard
C       0.00000      0.00000      1.46659
C       0.00000      0.00000     -0.03281
F       0.00000      1.23155     -0.52148
F      -1.06655     -0.61577     -0.52148
F       1.06655     -0.61577     -0.52148
H       0.88354      0.51011      1.82577
H      -0.88354      0.51011      1.82577
H      -0.00000     -1.02022      1.82577
8
Model[2]: FrequencyLabel=A2;ForceConstant=0.0392 mDyne/A;ReducedMass=1.0425 AMU;FreqValue=252.5564;Frequency=252.5564 cm^-1;Mode=1;PATH=Calculation 2;FrequenciesFrequencies;IRIntensity=0.0000 KM/Mole;PATH=Calculation 2;FrequenciesFrequencies
C       0.00000      0.00000      1.46659     -0.00000      0.00000      0.00000
C       0.00000      0.00000     -0.03281      0.00000     -0.00000     -0.00000
F       0.00000      1.23155     -0.52148      0.03000      0.00000      0.00000
F      -1.06655     -0.61577     -0.52148     -0.01000      0.02000      0.00000
F       1.06655     -0.61577     -0.52148     -0.01000     -0.02000     -0.00000
H       0.88354      0.51011      1.82577     -0.29000      0.50000      0.00000
H      -0.88354      0.51011      1.82577     -0.29000     -0.50000     -0.00000
H      -0.00000     -1.02022      1.82577      0.58000      0.00000      0.00000
8
Model[3]: FrequencyLabel=E;ForceConstant=0.3526 mDyne/A;ReducedMass=3.9015 AMU;FreqValue=391.6372;Frequency=391.6372 cm^-1;Mode=2;PATH=Calculation 2;FrequenciesFrequencies;IRIntensity=0.4499 KM/Mole;PATH=Calculation 2;FrequenciesFrequencies
C       0.00000      0.00000      1.46659     -0.05000      0.23001     -0.00000
C       0.00000      0.00000     -0.03281      0.02000     -0.08000      0.00000
F       0.00000      1.23155     -0.52148      0.03000      0.02000      0.25000
F      -1.06655     -0.61577     -0.52148      0.07000     -0.10000     -0.07000
F       1.06655     -0.61577     -0.52148     -0.06000     -0.08000     -0.17000
H       0.88354      0.51011      1.82577     -0.10000      0.42000     -0.13000
H      -0.88354      0.51011      1.82577     -0.08000      0.41000     -0.30001
H      -0.00000     -1.02022      1.82577     -0.10000      0.39000      0.43000
8
Model[4]: FrequencyLabel=E;ForceConstant=0.3526 mDyne/A;ReducedMass=3.9015 AMU;FreqValue=391.6372;Frequency=391.6372 cm^-1;Mode=3;PATH=Calculation 2;FrequenciesFrequencies;IRIntensity=0.4499 KM/Mole;PATH=Calculation 2;FrequenciesFrequencies
C       0.00000      0.00000      1.46659     -0.23001     -0.05000      0.00000
C       0.00000      0.00000     -0.03281      0.08000      0.02000      0.00000
F       0.00000      1.23155     -0.52148      0.13000     -0.00000     -0.06000
F      -1.06655     -0.61577     -0.52148      0.00000     -0.04000      0.24000
F       1.06655     -0.61577     -0.52148      0.03000      0.08000     -0.19000
H       0.88354      0.51011      1.82577     -0.39000     -0.08000      0.42000
H      -0.88354      0.51011      1.82577     -0.40000     -0.11000     -0.33001
H      -0.00000     -1.02022      1.82577     -0.42000     -0.09000     -0.10000
8
Model[5]: FrequencyLabel=E;ForceConstant=1.6012 mDyne/A;ReducedMass=7.9436 AMU;FreqValue=584.9119;Frequency=584.9119 cm^-1;Mode=4;PATH=Calculation 2;FrequenciesFrequencies;IRIntensity=2.6706 KM/Mole;PATH=Calculation 2;FrequenciesFrequencies
C       0.00000      0.00000      1.46659     -0.02000      0.05000      0.00000
C       0.00000      0.00000     -0.03281      0.10000     -0.22000      0.00000
F       0.00000      1.23155     -0.52148     -0.15001     -0.28000      0.06000
F      -1.06655     -0.61577     -0.52148     -0.20001      0.30001     -0.01000
F       1.06655     -0.61577     -0.52148      0.32000      0.05000     -0.06000
H       0.88354      0.51011      1.82577     -0.11000      0.24000     -0.05000
H      -0.88354      0.51011      1.82577     -0.09000      0.23001     -0.42000
H      -0.00000     -1.02022      1.82577     -0.11000      0.21000      0.47000
8
Model[6]: FrequencyLabel=E;ForceConstant=1.6012 mDyne/A;ReducedMass=7.9436 AMU;FreqValue=584.9119;Frequency=584.9119 cm^-1;Mode=5;PATH=Calculation 2;FrequenciesFrequencies;IRIntensity=2.6706 KM/Mole;PATH=Calculation 2;FrequenciesFrequencies
C       0.00000      0.00000      1.46659      0.05000      0.02000      0.00000
C       0.00000      0.00000     -0.03281     -0.22000     -0.10000      0.00000
F       0.00000      1.23155     -0.52148      0.33001     -0.13000      0.03000
F      -1.06655     -0.61577     -0.52148     -0.25000     -0.18001     -0.07000
F       1.06655     -0.61577     -0.52148     -0.01000      0.35000      0.04000
H       0.88354      0.51011      1.82577      0.21000      0.10000     -0.52000
H      -0.88354      0.51011      1.82577      0.22000      0.12000      0.30001
H      -0.00000     -1.02022      1.82577      0.24000      0.10000      0.22000
8
Model[7]: FrequencyLabel=A1;ForceConstant=1.5192 mDyne/A;ReducedMass=6.1751 AMU;FreqValue=646.1906;Frequency=646.1906 cm^-1;Mode=6;PATH=Calculation 2;FrequenciesFrequencies;IRIntensity=30.0885 KM/Mole;PATH=Calculation 2;FrequenciesFrequencies
C       0.00000      0.00000      1.46659      0.00000      0.00000      0.42000
C       0.00000      0.00000     -0.03281      0.00000      0.00000      0.18001
F       0.00000      1.23155     -0.52148     -0.00000     -0.17000     -0.15001
F      -1.06655     -0.61577     -0.52148      0.15001      0.09000     -0.15001
F       1.06655     -0.61577     -0.52148     -0.15001      0.09000     -0.15001
H       0.88354      0.51011      1.82577     -0.01000     -0.00000      0.46001
H      -0.88354      0.51011      1.82577      0.01000     -0.00000      0.46001
H      -0.00000     -1.02022      1.82577      0.00000      0.01000      0.46001
8
Model[8]: FrequencyLabel=A1;ForceConstant=3.7944 mDyne/A;ReducedMass=7.8068 AMU;FreqValue=908.2566;Frequency=908.2566 cm^-1;Mode=7;PATH=Calculation 2;FrequenciesFrequencies;IRIntensity=4.2633 KM/Mole;PATH=Calculation 2;FrequenciesFrequencies
C       0.00000      0.00000      1.46659     -0.00000      0.00000      0.36001
C       0.00000      0.00000     -0.03281     -0.00000      0.00000     -0.09000
F       0.00000      1.23155     -0.52148     -0.00000      0.30001     -0.08000
F      -1.06655     -0.61577     -0.52148     -0.26000     -0.15001     -0.08000
F       1.06655     -0.61577     -0.52148      0.26000     -0.15001     -0.08000
H       0.88354      0.51011      1.82577     -0.01000     -0.01000      0.43000
H      -0.88354      0.51011      1.82577      0.01000     -0.01000      0.43000
H      -0.00000     -1.02022      1.82577     -0.00000      0.02000      0.43000
8
Model[9]: FrequencyLabel=E;ForceConstant=1.2140 mDyne/A;ReducedMass=1.7187 AMU;FreqValue=1094.9468;Frequency=1094.9468 cm^-1;Mode=8;PATH=Calculation 2;FrequenciesFrequencies;IRIntensity=47.1853 KM/Mole;PATH=Calculation 2;FrequenciesFrequencies
C       0.00000      0.00000      1.46659     -0.12000      0.11000     -0.00000
C       0.00000      0.00000     -0.03281     -0.07000      0.07000     -0.00000
F       0.00000      1.23155     -0.52148      0.00000     -0.06000      0.04000
F      -1.06655     -0.61577     -0.52148      0.02000      0.01000      0.02000
F       1.06655     -0.61577     -0.52148      0.08000     -0.04000     -0.06000
H       0.88354      0.51011      1.82577      0.15001     -0.20001     -0.21000
H      -0.88354      0.51011      1.82577      0.06000     -0.10000      0.73000
H      -0.00000     -1.02022      1.82577      0.18001     -0.07000     -0.51000
8
Model[10]: FrequencyLabel=E;ForceConstant=1.2140 mDyne/A;ReducedMass=1.7187 AMU;FreqValue=1094.9468;Frequency=1094.9468 cm^-1;Mode=9;PATH=Calculation 2;FrequenciesFrequencies;IRIntensity=47.1853 KM/Mole;PATH=Calculation 2;FrequenciesFrequencies
C       0.00000      0.00000      1.46659      0.11000      0.12000     -0.00000
C       0.00000      0.00000     -0.03281      0.07000      0.07000     -0.00000
F       0.00000      1.23155     -0.52148     -0.00000     -0.07000      0.04000
F      -1.06655     -0.61577     -0.52148     -0.08000     -0.04000     -0.06000
F       1.06655     -0.61577     -0.52148     -0.02000      0.01000      0.01000
H       0.88354      0.51011      1.82577     -0.05000     -0.11000      0.71000
H      -0.88354      0.51011      1.82577     -0.14000     -0.20001     -0.17000
H      -0.00000     -1.02022      1.82577     -0.17000     -0.08000     -0.54000
8
Model[11]: FrequencyLabel=E;ForceConstant=5.6127 mDyne/A;ReducedMass=4.7614 AMU;FreqValue=1414.4715;Frequency=1414.4715 cm^-1;Mode=10;PATH=Calculation 2;FrequenciesFrequencies;IRIntensity=281.1914 KM/Mole;PATH=Calculation 2;FrequenciesFrequencies
C       0.00000      0.00000      1.46659     -0.11000     -0.13000     -0.00000
C       0.00000      0.00000     -0.03281      0.33001      0.39000      0.00000
F       0.00000      1.23155     -0.52148     -0.02000     -0.11000      0.03000
F      -1.06655     -0.61577     -0.52148     -0.11000     -0.07000     -0.04000
F       1.06655     -0.61577     -0.52148     -0.04000     -0.02000      0.01000
H       0.88354      0.51011      1.82577     -0.06000      0.16000     -0.44000
H      -0.88354      0.51011      1.82577      0.24000      0.41000      0.08000
H      -0.00000     -1.02022      1.82577      0.31000      0.02000      0.36001
8
Model[12]: FrequencyLabel=E;ForceConstant=5.6127 mDyne/A;ReducedMass=4.7614 AMU;FreqValue=1414.4715;Frequency=1414.4715 cm^-1;Mode=11;PATH=Calculation 2;FrequenciesFrequencies;IRIntensity=281.1914 KM/Mole;PATH=Calculation 2;FrequenciesFrequencies
C       0.00000      0.00000      1.46659     -0.13000      0.11000      0.00000
C       0.00000      0.00000     -0.03281      0.39000     -0.33001     -0.00000
F       0.00000      1.23155     -0.52148     -0.02000      0.09000     -0.03000
F      -1.06655     -0.61577     -0.52148     -0.06000      0.00000     -0.01000
F       1.06655     -0.61577     -0.52148     -0.12000      0.07000      0.04000
H       0.88354      0.51011      1.82577      0.24000     -0.39000     -0.16000
H      -0.88354      0.51011      1.82577     -0.02000     -0.08000      0.46001
H      -0.00000     -1.02022      1.82577      0.37000     -0.02000     -0.30001
8
Model[13]: FrequencyLabel=A1;ForceConstant=4.0551 mDyne/A;ReducedMass=3.3667 AMU;FreqValue=1429.7878;Frequency=1429.7878 cm^-1;Mode=12;PATH=Calculation 2;FrequenciesFrequencies;IRIntensity=178.6395 KM/Mole;PATH=Calculation 2;FrequenciesFrequencies
C       0.00000      0.00000      1.46659     -0.00000      0.00000     -0.03000
C       0.00000      0.00000     -0.03281     -0.00000     -0.00000      0.43000
F       0.00000      1.23155     -0.52148      0.00000      0.06000     -0.06000
F      -1.06655     -0.61577     -0.52148     -0.05000     -0.03000     -0.06000
F       1.06655     -0.61577     -0.52148      0.05000     -0.03000     -0.06000
H       0.88354      0.51011      1.82577      0.13000      0.07000     -0.49001
H      -0.88354      0.51011      1.82577     -0.13000      0.07000     -0.49001
H      -0.00000     -1.02022      1.82577      0.00000     -0.15001     -0.49001
8
Model[14]: FrequencyLabel=A1;ForceConstant=2.4801 mDyne/A;ReducedMass=1.6419 AMU;FreqValue=1601.1614;Frequency=1601.1614 cm^-1;Mode=13;PATH=Calculation 2;FrequenciesFrequencies;IRIntensity=94.1615 KM/Mole;PATH=Calculation 2;FrequenciesFrequencies
C       0.00000      0.00000      1.46659      0.00000     -0.00000      0.19000
C       0.00000      0.00000     -0.03281      0.00000     -0.00000     -0.14000
F       0.00000      1.23155     -0.52148     -0.00000     -0.01000      0.01000
F      -1.06655     -0.61577     -0.52148      0.01000      0.01000      0.01000
F       1.06655     -0.61577     -0.52148     -0.01000      0.01000      0.01000
H       0.88354      0.51011      1.82577      0.22000      0.12000     -0.50000
H      -0.88354      0.51011      1.82577     -0.22000      0.12000     -0.50000
H      -0.00000     -1.02022      1.82577     -0.00000     -0.25000     -0.50000
8
Model[15]: FrequencyLabel=E;ForceConstant=1.6565 mDyne/A;ReducedMass=1.0616 AMU;FreqValue=1627.3615;Frequency=1627.3615 cm^-1;Mode=14;PATH=Calculation 2;FrequenciesFrequencies;IRIntensity=0.1870 KM/Mole;PATH=Calculation 2;FrequenciesFrequencies
C       0.00000      0.00000      1.46659     -0.04000     -0.02000     -0.00000
C       0.00000      0.00000     -0.03281     -0.05000     -0.02000      0.00000
F       0.00000      1.23155     -0.52148      0.00000      0.00000     -0.00000
F      -1.06655     -0.61577     -0.52148      0.01000      0.00000      0.00000
F       1.06655     -0.61577     -0.52148      0.01000     -0.00000     -0.00000
H       0.88354      0.51011      1.82577     -0.10000     -0.16000      0.37000
H      -0.88354      0.51011      1.82577      0.19000      0.54000     -0.22000
H      -0.00000     -1.02022      1.82577      0.65000     -0.07000     -0.15001
8
Model[16]: FrequencyLabel=E;ForceConstant=1.6565 mDyne/A;ReducedMass=1.0616 AMU;FreqValue=1627.3615;Frequency=1627.3615 cm^-1;Mode=15;PATH=Calculation 2;FrequenciesFrequencies;IRIntensity=0.1870 KM/Mole;PATH=Calculation 2;FrequenciesFrequencies
C       0.00000      0.00000      1.46659      0.02000     -0.04000     -0.00000
C       0.00000      0.00000     -0.03281      0.02000     -0.05000      0.00000
F       0.00000      1.23155     -0.52148     -0.00000      0.01000     -0.00000
F      -1.06655     -0.61577     -0.52148     -0.00000      0.00000      0.00000
F       1.06655     -0.61577     -0.52148     -0.00000      0.01000      0.00000
H       0.88354      0.51011      1.82577     -0.37000      0.60001      0.05000
H      -0.88354      0.51011      1.82577      0.33001      0.30001      0.30001
H      -0.00000     -1.02022      1.82577     -0.28000     -0.15001     -0.34000
8
Model[17]: FrequencyLabel=A1;ForceConstant=6.4295 mDyne/A;ReducedMass=1.0362 AMU;FreqValue=3245.2625;Frequency=3245.2625 cm^-1;Mode=16;PATH=Calculation 2;FrequenciesFrequencies;IRIntensity=2.2306 KM/Mole;PATH=Calculation 2;FrequenciesFrequencies
C       0.00000      0.00000      1.46659     -0.00000     -0.00000      0.05000
C       0.00000      0.00000     -0.03281     -0.00000      0.00000     -0.00000
F       0.00000      1.23155     -0.52148      0.00000     -0.00000      0.00000
F      -1.06655     -0.61577     -0.52148      0.00000      0.00000      0.00000
F       1.06655     -0.61577     -0.52148     -0.00000      0.00000      0.00000
H       0.88354      0.51011      1.82577     -0.47000     -0.27001     -0.19000
H      -0.88354      0.51011      1.82577      0.47000     -0.27001     -0.19000
H      -0.00000     -1.02022      1.82577     -0.00000      0.55000     -0.19000
8
Model[18]: FrequencyLabel=E;ForceConstant=7.2211 mDyne/A;ReducedMass=1.1057 AMU;FreqValue=3329.3434;Frequency=3329.3434 cm^-1;Mode=17;PATH=Calculation 2;FrequenciesFrequencies;IRIntensity=11.1127 KM/Mole;PATH=Calculation 2;FrequenciesFrequencies
C       0.00000      0.00000      1.46659     -0.09000     -0.02000     -0.00000
C       0.00000      0.00000     -0.03281     -0.00000     -0.00000     -0.00000
F       0.00000      1.23155     -0.52148      0.00000      0.00000     -0.00000
F      -1.06655     -0.61577     -0.52148      0.00000      0.00000      0.00000
F       1.06655     -0.61577     -0.52148      0.00000     -0.00000     -0.00000
H       0.88354      0.51011      1.82577      0.63000      0.37000      0.26000
H      -0.88354      0.51011      1.82577      0.49001     -0.29000     -0.20001
H      -0.00000     -1.02022      1.82577     -0.01000      0.16000     -0.06000
8
Model[19]: FrequencyLabel=E;ForceConstant=7.2211 mDyne/A;ReducedMass=1.1057 AMU;FreqValue=3329.3434;Frequency=3329.3434 cm^-1;Mode=18;PATH=Calculation 2;FrequenciesFrequencies;IRIntensity=11.1127 KM/Mole;PATH=Calculation 2;FrequenciesFrequencies
C       0.00000      0.00000      1.46659      0.02000     -0.09000     -0.00000
C       0.00000      0.00000     -0.03281      0.00000     -0.00000      0.00000
F       0.00000      1.23155     -0.52148     -0.00000      0.00000     -0.00000
F      -1.06655     -0.61577     -0.52148      0.00000      0.00000      0.00000
F       1.06655     -0.61577     -0.52148     -0.00000      0.00000      0.00000
H       0.88354      0.51011      1.82577      0.21000      0.11000      0.09000
H      -0.88354      0.51011      1.82577     -0.45000      0.25000      0.18001
H      -0.00000     -1.02022      1.82577      0.00000      0.75000     -0.27001
</ModelData>
</Models>
##$PEAKS=
<Peaks type="RAMAN" xUnitsExpected="1/cm"  >
<PeakData id="1" title="1- (~3330 cm-1)" peakShape="broad" model="2.18" xMax="3350" xMin="3310"    />
<PeakData id="2" title="2- (~3245 cm-1)" peakShape="broad" model="2.17" xMax="3260" xMin="3230"    />
<PeakData id="3" title="3- (~1630 cm-1)" peakShape="broad" model="2.15" xMax="1650" xMin="1610"    />
<PeakData id="4" title="4- (~1430 cm-1)" peakShape="broad" model="2.13" xMax="1450" xMin="1420"    />
<PeakData id="5" title="5- (~1095 cm-1)" peakShape="broad" model="2.9" xMax="1110" xMin="1080"    />
<PeakData id="6" title="6- (~910 cm-1)" peakShape="broad" model="2.8" xMax="930" xMin="890"    />
<PeakData id="7" title="7- (~645 cm-1)" peakShape="broad" model="2.7" xMax="660" xMin="630"    />
<PeakData id="8" title="8- (~585 cm-1)" peakShape="broad" model="2.5" xMax="600" xMin="570"    />
<PeakData id="9" title="9-(~390 cm-1)" peakShape="broad" model="2.3" xMax="410" xMin="370"    />
</Peaks>
##XUNITS= 1/CM
##YUNITS= ABSORBANCE
##XFACTOR= 1
##YFACTOR= 8.710077E-07
##FIRSTX= 3.529344E+03
##FIRSTY= 0
##LASTX= 5.255640E+01
##NPOINTS= 2001
##MINY= 0
##MAXY= 8.710077E-01
##XYDATA= (X++(Y..Y))
3529.3435@%V5O816K01K09K19K29K40K51K64K76K90L05L20L38L55L74A1083
3421.563A1500M42M67M95N25N58N93O31O73P18P68Q22Q82R47J018J098B3322
3392.0103B4604J389J510J643J794J963K153K368K613K893L212L580M004E8224
3367.6729F3297J2267O737P690Q830J0198J1853J3870J6345J9404K3207B21663
3346.812B55595M1419N0747O2167P5629R0310J03800J11112J04572P6821A000000
3327.6897I69986p7982j04370j09850j01962q8266p3575o0177m8832l9562B33305
3308.5674B07166k1355j7499j4362j1785r641p833o283m930l728k633A05504
3287.7068A04867L24J296K306L385M566N890P403R166J1252J3758J6804B01567
$$ plain form
3529.3435 0 0 0 0 0 0 0 0 0 0 0 0 0 0 0 0 0 0 0 0 0 0 0 0 0 0 0 0 0 0 0 0 0 0 0 0 0 0 0 0 0 0 0 0 0 0 6816 7017 7226 7445 7674 7914 8165 8429 8705 8995 9300 9620 9958 10313 10687 11083
3421.563 11500 11942 12409 12904 13429 13987 14580 15211 15884 16602 17370 18192 19074 20021 21039 22137 23322
3392.0103 24604 25993 27503 29146 30940 32903 35056 37424 40037 42930 46142 49722 53726 58224
3367.6729 63297 75564 82301 89991 98821 109019 120872 134742 151087 170491 193698 221663
3346.812 255595 297014 347761 409928 485557 575867 679667 790779 895351 972172 1000000
3327.6897 969986 892004 787634 677784 575822 487556 413981 353804 304972 265410 233305
3308.5674 207166 185811 168312 153950 142165 132524 124691 118408 113478 109750 107117 105504
3287.7068 104867 105191 106487 108793 112178 116744 122634 130037 139203 150455 164213 181017 201567
3265.1077B26759L0984L8215M7199N8177P1099Q5180R8114J05135R8898I32130
3245.9854I57646k9807p5689j00938j06193r8669q5593p1574n8798m7994B43211
3226.863B11098k6478k1986j8394j5503j3164j1257r690q395p316o411F0242
3206.0022E5424m272l805l402l053k750k485k252k048j868j707j564j437B3459
3181.6648B2238j128j045r70r02q40p83p32o84o41o02n65n32n00m72m45A0976
3152.112A0578l77l57l39l22l05k91k76k64k51k40k29k18k09k00j92@
$$ plain form
3265.1077 226759 257743 295958 343157 401334 472433 557613 655727 760862 859760 932130
3245.9854 957646 927839 852150 751212 645019 546350 460757 389183 330385 282391 243211
3226.863 211098 184620 162634 144240 128737 115573 104316 94626 86231 78915 72504 60242
3206.0022 55424 51152 47347 43945 40892 38142 35657 33405 31357 29489 27782 26218 24781 23459
3181.6648 22238 21110 20065 19095 18193 17353 16570 15838 15154 14513 13911 13346 12814 12314 11842 11397 10976
3152.112 10578 10201 9844 9505 9183 8878 8587 8311 8047 7796 7556 7327 7109 6900 6700 6508 0
3122.5593@%Y90J646M8N1N3N5N8O1O3O7P0P4P7Q1Q6R1J34J02J08J14J21C288
1710.9838C424J45J54J64J76J87K00K15K31K48K68K88L13L38L68M00M36H033
1679.6927H557N76O35P03P81Q70R73J092J232J395J588J818K091K420B7549
1653.6168C0852L900M637N553O701Q140R947J2198J4954J8204K1748K5006A88612
1631.0177B13806J8496O669p291j8866k5225k6532k4604k1267j7678j4394G1522
1610.157F2234p430n970m877m134l690l436l235k994k702k386k082j807A5922
1585.8195A4557j195j051r28q26p36o61n95n37m88m45m05l72l41l14k89E106
1556.2667D858k30k15j99p2j70j60j49j40j31j23j15j09j5r3q7q3p7p2B551
1521.4989B487n9n5n1m8m5m0l8l4j628J6J8J9K1K3K4K7K8L2L4L7M0M4I00
$$ plain form
1710.9838 3424 3569 3723 3887 4063 4250 4450 4665 4896 5144 5412 5700 6013 6351 6719 7119 7555 8033
1679.6927 8557 9133 9768 10471 11252 12122 13095 14187 15419 16814 18402 20220 22311 24731 27549
1653.6168 30852 34752 39389 44942 51643 59783 69730 81928 96882 115086 136834 161840 188612
1631.0177 213806 232302 238971 231680 212814 187589 161057 136453 115186 97508 83114 71522
1610.157 62234 54804 48834 43957 39823 36133 32697 29462 26468 23766 21380 19298 17491 15922
1585.8195 14557 13362 12311 11383 10557 9821 9160 8565 8028 7540 7095 6690 6318 5977 5663 5374 5106
1556.2667 4858 4628 4413 4214 4142 3972 3812 3663 3523 3392 3269 3154 3045 3030 2937 2850 2767 2690 2618 2551
1521.4989 2487 2428 2373 2322 2274 2229 2189 2151 2117 489 505 523 542 563 586 610 637 665 697 731 768 808 852 900
1479.7775I15N9O5P2Q0Q9R9J11J24J41J60J83K09K43K81L30L88M61N52E226
1445.0096F031R79J194J446J726J993K163K114J719R85J24n42q18p25A7968
1418.9337A7871O6o1m95j076j563j800j791j629j403j176r73q01o62n49C500
1391.1194C115l27k78k39k07j80j58j38j23j09r7q7p8p1o4n8n3m8m5m1F77
1354.6132F42l2l0k7k6k4k2k1k0j8j7j6j5Tj3Tj2j1Urj0qrqpqj18mlXk@
1290.2926@%V2N70J7J8TJ9K0K1K2K3K5TK7K8L0L1L3L5L7L9M2M4M6N0N3A329
1172.0818A389O5O8P4P9Q6R1J00J07J16J26J38J50J64J81J98K18K42K69D161
1137.314D496L76M25M81N47O27P22Q35R72J141J346J602J919K316K813B4057
$$ plain form
1479.7775 915 974 1039 1111 1191 1280 1379 1490 1614 1755 1915 2098 2307 2550 2831 3161 3549 4010 4562 5226
1445.0096 6031 7010 8204 9650 11376 13369 15532 17646 19365 20350 20474 19932 19114 18389 17968
1418.9337 17871 17937 17876 17381 16305 14742 12942 11151 9522 8119 6943 5970 5169 4507 3958 3500
1391.1194 3115 2788 2510 2271 2064 1884 1726 1588 1465 1356 1259 1172 1094 1023 959 901 848 800 755 714 677
1354.6132 642 610 580 553 527 503 481 460 440 422 405 389 374 359 346 333 321 310 299 288 279 269 261 252 244 237 229 111 107 104 101 98 95 92 89 87 0
1290.2926 0 0 0 0 0 0 0 0 0 0 0 0 0 0 0 0 0 0 0 0 0 0 0 0 0 0 0 0 0 0 0 0 0 0 0 0 0 0 0 0 0 0 0 570 587 605 623 642 662 683 705 728 753 778 805 833 863 894 927 962 999 1038 1080 1124 1170 1220 1273 1329
1172.0818 1389 1454 1522 1596 1675 1761 1852 1952 2059 2175 2301 2439 2589 2753 2934 3132 3350 3592 3861 4161
1137.314 4496 4872 5297 5778 6325 6952 7674 8509 9481 10622 11968 13570 15489 17805 20618 24057
1109.4996B8276N172O297P524Q650R261Q711O387K284k560o576q787r250D6795
1085.1621C9343o227n112m168l398k782k289j899j585j333j130r64q28F913
1060.8246F291n43m78m21l74l33k97k67k41k17j98j79j63j49j37j26j16A946
1029.5336A847K57p4o9o2n7n1m7m3l8l5l1k7k4k1j8j4j2rnl%LORJ3J6A530
980.8585A553K7L1L5n13O1O5P1P7Q5R1J01J10J21J34J48J64J84K04K31C239
944.3523C533L35L84M41N10N95O98Q23R80J173J417J720K103K580L163B4306
916.53796B8907N291N663N328L905J397j565m022n374n657n255m558l808A7126
892.20044A4577k078j701j400j161r70q15o91n90n06m37l81l32k92k58B737
$$ plain form
1109.4996 28276 33448 39745 47269 55919 65180 73891 80278 82562 80002 73426 64639 55389 46795
1085.1621 39343 33116 28004 23836 20438 17656 15367 13468 11883 10550 9420 8456 7628 6913
1060.8246 6291 5748 5270 4849 4475 4142 3845 3578 3337 3120 2922 2743 2580 2431 2294 2168 2052 1946
1029.5336 1847 2104 2030 1961 1899 1842 1791 1744 1701 1663 1628 1597 1570 1546 1525 1507 1493 1481 1472 1467 1464 1464 1467 1473 1482 1495 1511 1530
980.8585 1553 1580 1611 1646 1133 1194 1259 1330 1407 1492 1583 1684 1794 1915 2049 2197 2361 2545 2749 2980 3239
944.3523 3533 3868 4252 4693 5203 5798 6496 7319 8299 9472 10889 12609 14712 17292 20455 24306
916.53796 28907 34198 39861 45189 49094 50491 48926 44904 39530 33873 28618 24060 20252 17126
892.20044 14577 12499 10798 9398 8237 7267 6452 5761 5171 4665 4228 3847 3515 3223 2965 2737
864.38617B533j82j63j47j33j21j09j00r2q3p7p1o5o1n5n2m9m5m1m0l6G76
826.1415G44l0k8k7k5k4k3k1k0j9j8Tj6Tj4Uj3j2Tj1Tj0l48%S1J24MA32
760.0826A36MNMNUOVPTQTRUJ0J1J2TJ3J4J5J6J8TK0K2K3K6J06L2L5L9G29
695.762G75N0N6O2O9P6Q6R7J09J23J42J62J87K18K55L00L56M25N13D683
660.99414E441R30J138J384J653J900K034J914J409N14n41j416j897j996A0616
634.9182I017j329j082q73p00n61m48l56k80k15j61j11o6k2K1O7J16C189
603.62714C426L14M09N21O60Q18R92J151J239J165Q49K87l78r27j231H003
575.81287F802j042q73p18n88m80l95l26k72k29j93j64j41j22j06r3q1I07
$$ plain form
864.38617 2533 2351 2188 2041 1908 1787 1678 1578 1486 1403 1326 1255 1190 1129 1074 1022 973 928 887 847 811 776
826.1415 744 714 686 659 634 610 587 566 546 527 509 491 475 459 445 431 417 404 392 380 369 358 348 0 0 0 0 0 0 0 0 0 0 0 0 124 128 132
760.0826 136 140 145 149 154 159 164 170 176 182 188 195 202 210 218 227 236 245 255 266 278 290 303 317 332 348 366 384 404 426 449 475 581 613 648 687 729
695.762 775 825 881 943 1012 1088 1174 1271 1380 1503 1645 1807 1994 2212 2467 2767 3123 3548 4061 4683
660.99414 5441 6371 7509 8893 10546 12446 14480 16394 17803 18317 17776 16360 14463 12467 10616
634.9182 9017 7688 6606 5733 5033 4472 4024 3668 3388 3173 3012 2901 2835 2813 2834 2901 3017 3189
603.62714 3426 3740 4149 4670 5330 6148 7140 8291 9530 10695 11544 11831 11453 10526 9295 8003
575.81287 6802 5760 4887 4169 3581 3101 2706 2380 2108 1879 1686 1522 1381 1259 1153 1060 979 907
544.5218H42n7n1m6m2l8l5l1k9k6k5k2j42j6j4Tj3j1TQrqTpTononmVlA44
483.67798A41klkjkjV%Tp6KLVMUNTOTPQRTJ1J2J3J5J8K0K2K7L1L6M3N1D91
410.66547E65Q9J09J34J64K00K39K74K94K76K03P2q1k08k79k94k72k37A051
377.636H88j32j08q8p2o1n0m2l6l1k6k3j9j8j5j3j2j1rqTpoTnTmUlE9
$$ plain form
544.5218 842 785 734 688 646 608 573 542 513 487 462 440 298 282 268 254 241 230 219 227 218 210 202 195 188 182 177 171 166 162 158 154 150 147 144
483.67798 141 139 136 134 133 131 130 129 128 127 127 127 51 53 56 59 62 65 69 73 77 82 87 93 99 106 114 123 132 143 155 168 183 201 221 243 270 301 337 380 431 491
410.66547 565 654 763 897 1061 1261 1500 1774 2068 2344 2547 2619 2538 2330 2051 1757 1485 1248 1051
377.636 888 756 648 560 488 427 377 335 299 268 242 219 200 182 167 154 142 131 122 114 106 99 93 87 82 77 73 69 65 62 59
323.7458E6lTkWjkjkjTkjW%jU%jT%j%jj8%S23@
52.5564@  $$checkpoint
##END=$$ End of the RAMAN for 1,1,1-F3C-CH3
##TITLE= 1,1,2-F2HC-CH2F
##JCAMP-DX= 5.01
##DATA TYPE= INFRARED SPECTRUM
##DATA CLASS= XYDATA
##BLOCK ID=3
##ORIGIN= Department of Chemistry, UWI, JAMAICA
##OWNER= public domain
##LONGDATE= 2012/02/18 12:32:26.0301 -0500 $$ export date from JSpecView
##SPECTROMETER/DATA SYSTEM= from WebMO Gaussian simulation
##$MODELS=
<Models>
<ModelData id="I112" type="MOL">
112C2H3F3
$$ plain form
112 32 83 63
__Jmol-14_02241912233D 1   1.00000     0.00000     0
Jmol version 14.29.31  2019-01-29 15:30 EXTRACT: ({0:7})
  8  7  0  0  0  0            999 V2000
   -0.7379   -0.8265    0.0000 C   0  0  1  0  0  0
   -0.3524    0.6280    0.0000 C   0  0  2  0  0  0
    0.3851    0.9076    1.0824 F   0  0  0  0  0  0
   -1.2193    1.2727    0.0000 H   0  0  0  0  0  0
    0.3851    0.9076   -1.0824 F   0  0  0  0  0  0
    0.3851   -1.5906    0.0000 F   0  0  0  0  0  0
   -1.3179   -1.0505    0.8852 H   0  0  0  0  0  0
   -1.3179   -1.0505   -0.8852 H   0  0  0  0  0  0
  1  6  1  0  0  0
  1  2  1  0  0  0
  2  5  1  0  0  0
  2  3  1  0  0  0
  4  2  1  0  0  0
  7  1  1  0  0  0
  8  1  1  0  0  0
M  END
</ModelData>
<ModelData id="3" type="XYZVIB" baseModel="I112" vibrationScale=".5">
8
Model[1]: PATH=Calculation 2;Standard;Energy=-375.78287;Range=M.O.s;NFock==Conv=0.78D-09;E(RHF)=-375.782869155 A.U.;PATH=Calculation 2;Standard
C      -0.73785     -0.82652      0.00000
C      -0.35242      0.62800      0.00000
F       0.38506      0.90750      1.08242
H      -1.21929      1.27271      0.00000
F       0.38506      0.90750     -1.08242
F       0.38506     -1.59062      0.00000
H      -1.31786     -1.05051      0.88519
H      -1.31786     -1.05051     -0.88519
8
Model[2]: FrequencyLabel=A";ForceConstant=0.0493 mDyne/A;ReducedMass=5.6221 AMU;FreqValue=121.9877;Frequency=121.9877 cm^-1;Mode=1;PATH=Calculation 2;FrequenciesFrequencies;IRIntensity=2.7017 KM/Mole;PATH=Calculation 2;FrequenciesFrequencies
C      -0.73785     -0.82652      0.00000     -0.00000     -0.00000     -0.20001
C      -0.35242      0.62800      0.00000     -0.00000      0.00000     -0.03000
F       0.38506      0.90750      1.08242      0.12000     -0.21000     -0.06000
H      -1.21929      1.27271      0.00000     -0.00000      0.00000      0.17000
F       0.38506      0.90750     -1.08242     -0.12000      0.21000     -0.06000
F       0.38506     -1.59062      0.00000     -0.00000      0.00000      0.32000
H      -1.31786     -1.05051      0.88519     -0.38000      0.01000     -0.45000
H      -1.31786     -1.05051     -0.88519      0.38000     -0.01000     -0.45000
8
Model[3]: FrequencyLabel=A';ForceConstant=0.5497 mDyne/A;ReducedMass=14.6290 AMU;FreqValue=252.5422;Frequency=252.5422 cm^-1;Mode=2;PATH=Calculation 2;FrequenciesFrequencies;IRIntensity=2.4772 KM/Mole;PATH=Calculation 2;FrequenciesFrequencies
C      -0.73785     -0.82652      0.00000     -0.20001      0.12000     -0.00000
C      -0.35242      0.62800      0.00000     -0.11000      0.04000      0.00000
F       0.38506      0.90750      1.08242      0.02000     -0.38000      0.02000
H      -1.21929      1.27271      0.00000      0.16000      0.40000      0.00000
F       0.38506      0.90750     -1.08242      0.02000     -0.38000     -0.02000
F       0.38506     -1.59062      0.00000      0.15001      0.64000     -0.00000
H      -1.31786     -1.05051      0.88519     -0.10000     -0.06000      0.01000
H      -1.31786     -1.05051     -0.88519     -0.10000     -0.06000     -0.01000
8
Model[4]: FrequencyLabel=A";ForceConstant=0.2540 mDyne/A;ReducedMass=2.6786 AMU;FreqValue=401.1650;Frequency=401.1650 cm^-1;Mode=3;PATH=Calculation 2;FrequenciesFrequencies;IRIntensity=0.1123 KM/Mole;PATH=Calculation 2;FrequenciesFrequencies
C      -0.73785     -0.82652      0.00000     -0.00000     -0.00000     -0.17000
C      -0.35242      0.62800      0.00000     -0.00000      0.00000      0.13000
F       0.38506      0.90750      1.08242      0.08000      0.15001      0.04000
H      -1.21929      1.27271      0.00000     -0.00000     -0.00000      0.14000
F       0.38506      0.90750     -1.08242     -0.08000     -0.15001      0.04000
F       0.38506     -1.59062      0.00000     -0.00000     -0.00000     -0.01000
H      -1.31786     -1.05051      0.88519     -0.34000     -0.30001     -0.48000
H      -1.31786     -1.05051     -0.88519      0.34000      0.30001     -0.48000
8
Model[5]: FrequencyLabel=A';ForceConstant=1.9582 mDyne/A;ReducedMass=10.7383 AMU;FreqValue=556.3355;Frequency=556.3355 cm^-1;Mode=4;PATH=Calculation 2;FrequenciesFrequencies;IRIntensity=16.3219 KM/Mole;PATH=Calculation 2;FrequenciesFrequencies
C      -0.73785     -0.82652      0.00000      0.19000      0.22000     -0.00000
C      -0.35242      0.62800      0.00000      0.24000      0.14000      0.00000
F       0.38506      0.90750      1.08242     -0.16000     -0.09000      0.43000
H      -1.21929      1.27271      0.00000      0.29000      0.20001      0.00000
F       0.38506      0.90750     -1.08242     -0.16000     -0.09000     -0.43000
F       0.38506     -1.59062      0.00000      0.01000     -0.09000      0.00000
H      -1.31786     -1.05051      0.88519      0.16000      0.33001      0.00000
H      -1.31786     -1.05051     -0.88519      0.16000      0.33001     -0.00000
8
Model[6]: FrequencyLabel=A';ForceConstant=2.8155 mDyne/A;ReducedMass=7.0041 AMU;FreqValue=825.9912;Frequency=825.9912 cm^-1;Mode=5;PATH=Calculation 2;FrequenciesFrequencies;IRIntensity=64.2515 KM/Mole;PATH=Calculation 2;FrequenciesFrequencies
C      -0.73785     -0.82652      0.00000      0.27001      0.34000     -0.00000
C      -0.35242      0.62800      0.00000     -0.19000      0.29000      0.00000
F       0.38506      0.90750      1.08242     -0.06000     -0.14000     -0.18001
H      -1.21929      1.27271      0.00000     -0.19000      0.32000     -0.00000
F       0.38506      0.90750     -1.08242     -0.06000     -0.14000      0.18001
F       0.38506     -1.59062      0.00000      0.06000     -0.18001      0.00000
H      -1.31786     -1.05051      0.88519      0.26000      0.37000     -0.01000
H      -1.31786     -1.05051     -0.88519      0.26000      0.37000      0.01000
8
Model[7]: FrequencyLabel=A';ForceConstant=1.6816 mDyne/A;ReducedMass=3.0767 AMU;FreqValue=963.1299;Frequency=963.1299 cm^-1;Mode=6;PATH=Calculation 2;FrequenciesFrequencies;IRIntensity=47.7740 KM/Mole;PATH=Calculation 2;FrequenciesFrequencies
C      -0.73785     -0.82652      0.00000     -0.16000     -0.14000      0.00000
C      -0.35242      0.62800      0.00000     -0.14000      0.28000      0.00000
F       0.38506      0.90750      1.08242      0.05000      0.00000      0.05000
H      -1.21929      1.27271      0.00000      0.16000      0.69000     -0.00000
F       0.38506      0.90750     -1.08242      0.05000      0.00000     -0.05000
F       0.38506     -1.59062      0.00000      0.09000     -0.09000     -0.00000
H      -1.31786     -1.05051      0.88519     -0.06000     -0.40000     -0.00000
H      -1.31786     -1.05051     -0.88519     -0.06000     -0.40000      0.00000
8
Model[8]: FrequencyLabel=A";ForceConstant=1.3080 mDyne/A;ReducedMass=1.9204 AMU;FreqValue=1075.1609;Frequency=1075.1609 cm^-1;Mode=7;PATH=Calculation 2;FrequenciesFrequencies;IRIntensity=67.1129 KM/Mole;PATH=Calculation 2;FrequenciesFrequencies
C      -0.73785     -0.82652      0.00000      0.00000      0.00000      0.21000
C      -0.35242      0.62800      0.00000      0.00000     -0.00000      0.10000
F       0.38506      0.90750      1.08242     -0.05000     -0.04000     -0.07000
H      -1.21929      1.27271      0.00000     -0.00000     -0.00000     -0.05000
F       0.38506      0.90750     -1.08242      0.05000      0.04000     -0.07000
F       0.38506     -1.59062      0.00000      0.00000     -0.00000     -0.03000
H      -1.31786     -1.05051      0.88519     -0.41000     -0.51000     -0.19000
H      -1.31786     -1.05051     -0.88519      0.41000      0.51000     -0.19000
8
Model[9]: FrequencyLabel=A';ForceConstant=4.4282 mDyne/A;ReducedMass=5.0464 AMU;FreqValue=1220.3799;Frequency=1220.3799 cm^-1;Mode=8;PATH=Calculation 2;FrequenciesFrequencies;IRIntensity=22.0328 KM/Mole;PATH=Calculation 2;FrequenciesFrequencies
C      -0.73785     -0.82652      0.00000      0.35000     -0.16000     -0.00000
C      -0.35242      0.62800      0.00000     -0.26000      0.06000      0.00000
F       0.38506      0.90750      1.08242      0.08000     -0.00000      0.07000
H      -1.21929      1.27271      0.00000     -0.40000     -0.13000      0.00000
F       0.38506      0.90750     -1.08242      0.08000     -0.00000     -0.07000
F       0.38506     -1.59062      0.00000     -0.23001      0.11000      0.00000
H      -1.31786     -1.05051      0.88519      0.37000     -0.35000     -0.03000
H      -1.31786     -1.05051     -0.88519      0.37000     -0.35000      0.03000
8
Model[10]: FrequencyLabel=A";ForceConstant=2.5782 mDyne/A;ReducedMass=2.6475 AMU;FreqValue=1285.6233;Frequency=1285.6233 cm^-1;Mode=9;PATH=Calculation 2;FrequenciesFrequencies;IRIntensity=107.0702 KM/Mole;PATH=Calculation 2;FrequenciesFrequencies
C      -0.73785     -0.82652      0.00000      0.00000     -0.00000     -0.14000
C      -0.35242      0.62800      0.00000      0.00000      0.00000      0.29000
F       0.38506      0.90750      1.08242     -0.07000     -0.01000     -0.09000
H      -1.21929      1.27271      0.00000      0.00000      0.00000      0.57000
F       0.38506      0.90750     -1.08242      0.07000      0.01000     -0.09000
F       0.38506     -1.59062      0.00000     -0.00000      0.00000      0.04000
H      -1.31786     -1.05051      0.88519      0.48000     -0.12000      0.15001
H      -1.31786     -1.05051     -0.88519     -0.48000      0.12000      0.15001
8
Model[11]: FrequencyLabel=A';ForceConstant=2.9347 mDyne/A;ReducedMass=2.9003 AMU;FreqValue=1310.4983;Frequency=1310.4983 cm^-1;Mode=10;PATH=Calculation 2;FrequenciesFrequencies;IRIntensity=144.7601 KM/Mole;PATH=Calculation 2;FrequenciesFrequencies
C      -0.73785     -0.82652      0.00000      0.09000     -0.12000      0.00000
C      -0.35242      0.62800      0.00000      0.26000      0.10000     -0.00000
F       0.38506      0.90750      1.08242     -0.09000     -0.01000     -0.08000
H      -1.21929      1.27271      0.00000      0.58000      0.50000     -0.00000
F       0.38506      0.90750     -1.08242     -0.09000     -0.01000      0.08000
F       0.38506     -1.59062      0.00000     -0.09000      0.05000     -0.00000
H      -1.31786     -1.05051      0.88519      0.17000     -0.33001     -0.00000
H      -1.31786     -1.05051     -0.88519      0.17000     -0.33001      0.00000
8
Model[12]: FrequencyLabel=A";ForceConstant=1.3153 mDyne/A;ReducedMass=1.1294 AMU;FreqValue=1405.9771;Frequency=1405.9771 cm^-1;Mode=11;PATH=Calculation 2;FrequenciesFrequencies;IRIntensity=24.2613 KM/Mole;PATH=Calculation 2;FrequenciesFrequencies
C      -0.73785     -0.82652      0.00000      0.00000     -0.00000      0.03000
C      -0.35242      0.62800      0.00000      0.00000      0.00000      0.07000
F       0.38506      0.90750      1.08242     -0.02000      0.00000     -0.02000
H      -1.21929      1.27271      0.00000      0.00000      0.00000      0.34000
F       0.38506      0.90750     -1.08242      0.02000     -0.00000     -0.02000
F       0.38506     -1.59062      0.00000     -0.00000      0.00000     -0.04000
H      -1.31786     -1.05051      0.88519     -0.36001      0.55000     -0.05000
H      -1.31786     -1.05051     -0.88519      0.36001     -0.55000     -0.05000
8
Model[13]: FrequencyLabel=A";ForceConstant=1.8792 mDyne/A;ReducedMass=1.2977 AMU;FreqValue=1567.7709;Frequency=1567.7709 cm^-1;Mode=12;PATH=Calculation 2;FrequenciesFrequencies;IRIntensity=50.8605 KM/Mole;PATH=Calculation 2;FrequenciesFrequencies
C      -0.73785     -0.82652      0.00000      0.00000      0.00000      0.03000
C      -0.35242      0.62800      0.00000     -0.00000     -0.00000     -0.15001
F       0.38506      0.90750      1.08242     -0.01000      0.01000      0.01000
H      -1.21929      1.27271      0.00000      0.00000      0.00000      0.95000
F       0.38506      0.90750     -1.08242      0.01000     -0.01000      0.01000
F       0.38506     -1.59062      0.00000      0.00000     -0.00000      0.00000
H      -1.31786     -1.05051      0.88519      0.01000     -0.18001     -0.02000
H      -1.31786     -1.05051     -0.88519     -0.01000      0.18001     -0.02000
8
Model[14]: FrequencyLabel=A';ForceConstant=1.9574 mDyne/A;ReducedMass=1.3369 AMU;FreqValue=1576.4119;Frequency=1576.4119 cm^-1;Mode=13;PATH=Calculation 2;FrequenciesFrequencies;IRIntensity=37.6167 KM/Mole;PATH=Calculation 2;FrequenciesFrequencies
C      -0.73785     -0.82652      0.00000      0.05000     -0.07000     -0.00000
C      -0.35242      0.62800      0.00000     -0.10000     -0.11000      0.00000
F       0.38506      0.90750      1.08242      0.00000      0.02000      0.00000
H      -1.21929      1.27271      0.00000      0.47000      0.63000     -0.00000
F       0.38506      0.90750     -1.08242      0.00000      0.02000     -0.00000
F       0.38506     -1.59062      0.00000      0.00000      0.00000     -0.00000
H      -1.31786     -1.05051      0.88519     -0.01000      0.41000      0.08000
H      -1.31786     -1.05051     -0.88519     -0.01000      0.41000     -0.08000
8
Model[15]: FrequencyLabel=A';ForceConstant=2.6815 mDyne/A;ReducedMass=1.7664 AMU;FreqValue=1605.1854;Frequency=1605.1854 cm^-1;Mode=14;PATH=Calculation 2;FrequenciesFrequencies;IRIntensity=36.0317 KM/Mole;PATH=Calculation 2;FrequenciesFrequencies
C      -0.73785     -0.82652      0.00000     -0.04000      0.20001     -0.00000
C      -0.35242      0.62800      0.00000     -0.06000     -0.15001      0.00000
F       0.38506      0.90750      1.08242      0.01000      0.02000      0.01000
H      -1.21929      1.27271      0.00000      0.29000      0.28000     -0.00000
F       0.38506      0.90750     -1.08242      0.01000      0.02000     -0.01000
F       0.38506     -1.59062      0.00000     -0.01000     -0.02000      0.00000
H      -1.31786     -1.05051      0.88519      0.35000     -0.51000      0.05000
H      -1.31786     -1.05051     -0.88519      0.35000     -0.51000     -0.05000
8
Model[16]: FrequencyLabel=A';ForceConstant=1.8402 mDyne/A;ReducedMass=1.1317 AMU;FreqValue=1661.3110;Frequency=1661.3110 cm^-1;Mode=15;PATH=Calculation 2;FrequenciesFrequencies;IRIntensity=5.9305 KM/Mole;PATH=Calculation 2;FrequenciesFrequencies
C      -0.73785     -0.82652      0.00000     -0.09000     -0.05000      0.00000
C      -0.35242      0.62800      0.00000      0.02000      0.03000     -0.00000
F       0.38506      0.90750      1.08242     -0.00000     -0.00000     -0.00000
H      -1.21929      1.27271      0.00000     -0.11000     -0.12000      0.00000
F       0.38506      0.90750     -1.08242     -0.00000     -0.00000      0.00000
F       0.38506     -1.59062      0.00000     -0.00000      0.00000      0.00000
H      -1.31786     -1.05051      0.88519      0.51000      0.18001      0.43000
H      -1.31786     -1.05051     -0.88519      0.51000      0.18001     -0.43000
8
Model[17]: FrequencyLabel=A';ForceConstant=6.6387 mDyne/A;ReducedMass=1.0587 AMU;FreqValue=3262.4129;Frequency=3262.4129 cm^-1;Mode=16;PATH=Calculation 2;FrequenciesFrequencies;IRIntensity=17.4008 KM/Mole;PATH=Calculation 2;FrequenciesFrequencies
C      -0.73785     -0.82652      0.00000      0.06000      0.03000      0.00000
C      -0.35242      0.62800      0.00000     -0.01000      0.01000     -0.00000
F       0.38506      0.90750      1.08242     -0.00000     -0.00000     -0.00000
H      -1.21929      1.27271      0.00000      0.16000     -0.11000      0.00000
F       0.38506      0.90750     -1.08242     -0.00000     -0.00000      0.00000
F       0.38506     -1.59062      0.00000      0.00000     -0.00000      0.00000
H      -1.31786     -1.05051      0.88519     -0.36001     -0.15001      0.57000
H      -1.31786     -1.05051     -0.88519     -0.36001     -0.15001     -0.57000
8
Model[18]: FrequencyLabel=A';ForceConstant=7.0166 mDyne/A;ReducedMass=1.0879 AMU;FreqValue=3308.5887;Frequency=3308.5887 cm^-1;Mode=17;PATH=Calculation 2;FrequenciesFrequencies;IRIntensity=68.8952 KM/Mole;PATH=Calculation 2;FrequenciesFrequencies
C      -0.73785     -0.82652      0.00000     -0.01000     -0.01000      0.00000
C      -0.35242      0.62800      0.00000     -0.06000      0.05000      0.00000
F       0.38506      0.90750      1.08242      0.00000     -0.00000     -0.00000
H      -1.21929      1.27271      0.00000      0.77000     -0.60001     -0.00000
F       0.38506      0.90750     -1.08242      0.00000     -0.00000      0.00000
F       0.38506     -1.59062      0.00000      0.00000     -0.00000     -0.00000
H      -1.31786     -1.05051      0.88519      0.07000      0.03000     -0.11000
H      -1.31786     -1.05051     -0.88519      0.07000      0.03000      0.11000
8
Model[19]: FrequencyLabel=A";ForceConstant=7.2099 mDyne/A;ReducedMass=1.1116 AMU;FreqValue=3317.9447;Frequency=3317.9447 cm^-1;Mode=18;PATH=Calculation 2;FrequenciesFrequencies;IRIntensity=36.8136 KM/Mole;PATH=Calculation 2;FrequenciesFrequencies
C      -0.73785     -0.82652      0.00000     -0.00000     -0.00000     -0.10000
C      -0.35242      0.62800      0.00000     -0.00000      0.00000     -0.00000
F       0.38506      0.90750      1.08242      0.00000      0.00000      0.00000
H      -1.21929      1.27271      0.00000      0.00000     -0.00000      0.00000
F       0.38506      0.90750     -1.08242     -0.00000     -0.00000      0.00000
F       0.38506     -1.59062      0.00000      0.00000     -0.00000      0.00000
H      -1.31786     -1.05051      0.88519     -0.37000     -0.16000      0.58000
H      -1.31786     -1.05051     -0.88519      0.37000      0.16000      0.58000
</ModelData>
</Models>
##$PEAKS=
<Peaks type="IR" xUnitsExpected="1/cm"  >
<PeakData id="1" title="1- (~3320 cm-1)" peakShape="broad" model="3.19" xMax="3350" xMin="3315"    />
<PeakData id="2" title="2- (~3310 cm-1)" peakShape="broad" model="3.18" xMax="3315" xMin="3285"    />
<PeakData id="3" title="3- (~3260 cm-1)" peakShape="broad" model="3.17" xMax="3280" xMin="3230"    />
<PeakData id="4" title="4- (~1660 cm-1)" peakShape="broad" model="3.16" xMax="1680" xMin="1640"    />
<PeakData id="5" title="5- (~1605 cm-1)" peakShape="broad" model="3.15" xMax="1620" xMin="1590"    />
<PeakData id="6" title="6- (~1575 cm-1)" peakShape="broad" model="3.14" xMax="1590" xMin="1570"    />
<PeakData id="7" title="7- (~1565 cm-1)" peakShape="broad" model="3.13" xMax="1570" xMin="1550"    />
<PeakData id="8" title="8- (~1405 cm-1)" peakShape="broad" model="3.12" xMax="1420" xMin="1390"    />
<PeakData id="9" title="9- (~1310 cm-1)" peakShape="broad" model="3.11" xMax="1330" xMin="1290"    />
<PeakData id="10" title="10-(~1285 cm-1)" peakShape="broad" model="3.10" xMax="1290" xMin="1270"    />
<PeakData id="11" title="11- (~1220 cm-1)" peakShape="broad" model="3.9" xMax="1240" xMin="1200"    />
<PeakData id="12" title="12- (~1075 cm-1)" peakShape="broad" model="3.8" xMax="1090" xMin="1060"    />
<PeakData id="13" title="13- (~965 cm-1)" peakShape="broad" model="3.7" xMax="980" xMin="950"    />
<PeakData id="14" title="14- (~825 cm-1)" peakShape="broad" model="3.6" xMax="840" xMin="810"    />
<PeakData id="15" title="115- (~555 cm-1)" peakShape="broad" model="3.5" xMax="570" xMin="550"    />
<PeakData id="16" title="16- (~400 cm-1)" peakShape="broad" model="3.4" xMax="420" xMin="380"    />
<PeakData id="17" title="17- (~250 cm-1)" peakShape="broad" model="3.3" xMax="270" xMin="230"    />
<PeakData id="18" title="18- (~120 cm-1)" peakShape="broad" model="3.2" xMax="140" xMin="100"    />
</Peaks>
##XUNITS= 1/CM
##YUNITS= TRANSMITTANCE
##XFACTOR= 1
##YFACTOR= 9.999000E-07
##FIRSTX= 3.516147E+03
##FIRSTY= 1
##LASTX= -7.801230E+01
##NPOINTS= 2000
##MINY= 1.000000E-04
##MAXY= 1
##XYDATA= (X++(Y..Y))
3516.1467A000100%V3j4801m50m71m94n16k7587j369j433j501j573j650I46523
3415.46I44705j912k011k118k232k353k485k625k777k940l115l306I13321
3392.0862I09588l974m236m520m829n168j1726o087o533p021p558q149H30987
3368.7124H21467j0315j1196j2174j3261j4469j5816j7317j8989k0852F64152
3348.9348F38925k7771l0564l3602l6853m0259m3701m6984m9809n1748B25393
3329.157A74722m6532l9744l0987k1738j3706p935m430k529j467o68E213
3307.5813F762L857P912J4225K2389L1008L8396M3392M5624M5324M3006C41101
3286.0054C75469K8795K2662J6039Q935J342o684j4911k2761k9128l2332C16957
$$ plain form
3516.1467 1000100 1000100 1000100 1000100 1000100 1000100 1000100 1000100 1000100 1000100 1000100 1000100 1000100 1000100 1000100 1000100 1000100 1000100 1000100 1000100 1000100 1000100 1000100 1000100 1000100 1000100 1000100 1000100 1000100 1000100 1000100 1000100 1000100 1000100 1000100 1000100 1000100 1000100 1000100 1000100 1000100 1000100 1000100 1000100 985299 984849 984378 983884 983368 955781 954412 952979 951478 949905 948255 946523
3415.46 944705 942793 940782 938664 936432 934079 931594 928969 926192 923252 920137 916831 913321
3392.0862 909588 905614 901378 896858 892029 886861 875135 869048 862515 855494 847936 839787 830987
3368.7124 821467 811152 799956 787782 774521 760052 744236 726919 707930 687078 664152
3348.9348 638925 611154 580590 546988 510135 469876 426175 379191 329382 277634 225393
3329.157 174722 128190 88446 57459 35721 22015 14080 9650 7121 5654 4986 5213
3307.5813 6762 10619 18531 32756 55145 86153 124549 167941 213565 258889 301895 341101
3286.0054 375469 404264 426926 442965 451900 453242 446558 431647 408886 379758 347426 316957
3264.4297B94655q267R314K6980M1328N0219N3441N2268M8441M3435L8212F83320
3242.854G12223K5094K1842J9083J6751J4777J3100J1672J0448R397H62875
3223.0762H70572P007O402N868N396M975M601M265L964L691L444L221I26423
3199.7024I29255K661J5934K008J888J779J677K7479P85P34O87O44O04I86702
3174.5308I87236N02M74M47M23M00L78L59L40L23L07K92K78K65K52K41I92747
$$ plain form
3264.4297 294655 286388 295702 322682 364010 414229 467670 519938 568379 611814 650026 683320
3242.854 712223 737317 759159 778242 794993 809770 822870 834542 844990 854387 862875
3223.0762 870572 877579 883981 889849 895245 900220 904821 909086 913050 916741 920185 923406 926423
3199.7024 929255 931916 947850 949858 951746 953525 955202 982681 983466 984200 984887 985531 986135 986702
3174.5308 987236 987738 988212 988659 989082 989482 989860 990219 990559 990882 991189 991481 991759 992024 992276 992517 992747
3143.965I92967K10O923%Y55k399p4p7q0q5q8r3r7j03j08j14j19j27I96403
1755.9258I96262j49j58j68j77j89k01k15k28k45k61k80l00l24l47l76I92238
1725.3601I91799j4839r48j014j086j167j256j355j467j591j732j892I61379
1701.9865I59098k521k797l120j7818m316m853n492k4849p595q709j0067H55236
1678.6127H41487j6204j9132k2495k6086k9353l1223l0099k4396j3851F28004
1658.835F39319J8859K1277J9831J6286J1999P724L775K21k985n932G21657
1637.2592G10223j4168j6999j9999k3234k6760l0614l4812l9306m3969D11837
1617.4814C59348n5117n5427n2429m5599l5443k3559j1783j192P839J4698A19544
1595.9056A36983J2531M687m423j3124j9973k3857k4193k1233j6185j0780A4054
$$ plain form
1755.9258 996262 996113 995955 995787 995610 995421 995220 995005 994777 994532 994271 993991 993691 993367 993020 992644 992238
1725.3601 991799 976960 976012 974998 973912 972745 971489 970134 968667 967076 965344 963452 961379
1701.9865 959098 956577 953780 950660 932842 928526 923673 918181 893332 885737 877028 866961 855236
1678.6127 841487 825283 806151 783656 757570 728217 696994 666895 642499 628648 628004
1658.835 639319 658178 679455 699286 715572 727571 735295 739070 739291 736306 730374 721657
1637.2592 710223 696055 679056 659057 635823 609063 578449 543637 504331 460362 411837
1617.4814 359348 304231 248804 196375 150776 115333 91774 79991 78799 86638 101336 119544
1595.9056 136983 149514 154201 149778 136654 116681 92824 68631 47398 31213 20433 14054
1574.33A0642j558k16J244L494P316J3415K1803L1379M0368M7266N1406B79459
1550.9562C31745N0212M7253M3850M0309L6822L4852L0456K7624K5053F90911
1531.1785G11564J8785J7114Q156J3906J2698J1612J0633R749Q951Q227H38963
1509.6027H45932O420N919N457N031M639M273L933L615L317L035K768H96852
1486.229H99122K035J4506J239J031Q25O18M10J96k2k50m89p40j009I16174
1459.2593I14563j953k330J0581l646m160m744J2562o824p704q732r938H76313
1435.8856H63268j5045j7424o6416k3622k7362l1735l6765m2378m8319E00178
1416.1078D41698o0180n7368m8756l4412j5985n623K2079L7359M7546C78288
$$ plain form
1574.33 10642 9084 8868 10112 13606 20922 34337 56140 87519 127887 175153 226559 279459
1550.9562 331745 381957 429210 473060 513369 550191 585043 615499 643123 668176 690911
1531.1785 711564 730349 747463 755619 769525 782223 793835 804468 814217 823168 831395 838963
1509.6027 845932 852352 858271 863728 868759 873398 877671 881604 885219 888536 891571 894339 896852
1486.229 899122 901157 915663 916902 917933 918758 919376 919786 919982 919960 919710 919221 918481 917472 916174
1459.2593 914563 912610 910280 920861 917215 913055 908311 920873 914049 906345 897613 887675 876313
1435.8856 863268 848223 830799 764383 740761 713399 681664 644899 602521 554202 500178
1416.1078 441698 381518 324150 275394 240982 224997 219374 241453 278812 326358 378288
1396.3301D29596M7320M1600L5347K9268K3713J8796J4512J0801P579F63295
1376.5522F65570N0j974l842n597p276q905j0512j2118j3743j5402j7108E50267
1353.1786E29560k2611k4580k6607k8671l0736l2752l4638l8888l7294B14807
1333.4009A76928l6768l4429l0739k5769j9886j3784q347m296j853o76A62
1311.8251A00KO1J77M01P22R62Q61L39l46q03q48o12l22q4J65N78J522F401
1277.6635A3512J2334J8590K4885L0304L4303L6734L7712L7492L6350C16760
1257.8857C49035K9696K6909K3975K0924J7755J4446J0958P226L180j271D96623
1236.3099D84917j7768k4271l0846l6735m0678m1024l6254k5844j0779B27532
$$ plain form
1396.3301 429596 476916 518516 553863 583131 606844 625640 640152 650953 658532 663295
1376.5522 665570 665620 663646 659804 654207 646931 638026 627514 615396 601653 586251 569143 550267
1353.1786 529560 506949 482369 455762 427091 396355 363603 328965 290077 252783 214807
1333.4009 176928 140160 105731 74992 49223 29337 15553 7206 2910 1057 381 162
1311.8251 100 102 163 340 741 1463 2425 3286 3625 3279 2476 1628 1016 694 610 775 1353 2875 6401
1277.6635 13512 25846 44436 69321 99625 133928 170662 208374 245866 282216 316760
1257.8857 349035 378731 405640 429615 450539 468294 482740 493698 500924 504104 502833 496623
1236.3099 484917 467149 442878 412032 375297 334619 293595 257341 231497 220718 227532
1216.5322B51901L9275M9464N4229N4345N1335M6699M1525L6460L1827F84805
1196.7545G09024J628J7546J5377N7221J1323R903Q680P621O699N889H56085
1175.1787H60622L965L448K976K542K141L8943L76O7k31n22q07j092j378I09380
1148.209I07412k278k602k944l306l694m111m562n054n591o182o834H52699
1124.8353H44340r256j0260j1388j2660j4095j5719j7559j9648k2014F87046
1105.0575F59327l1115l4887l9019l9058m8524n2953n6800n9409n9943A80107
1085.2798A28580m2206l1979j9481j0587m037J229O906J4482K4396L5532A48613
1063.7041B01902N7294N8036N6295N2946M8729M4182L9652L5343L1358F53474
$$ plain form
1216.5322 251901 291176 340640 394869 449214 500549 547248 588773 625233 657060 684805
1196.7545 709024 710652 728198 743575 800796 812119 822022 830702 838323 845022 850911 856085
1175.1787 860622 864587 868035 871011 873553 875694 914637 915013 915080 914849 914327 913520 912428 911050 909380
1148.209 907412 905134 902532 899588 896282 892588 888477 883915 878861 873270 867088 860254 852699
1124.8353 844340 835084 824824 813436 800776 786681 770962 753403 733755 711741 687046
1105.0575 659327 628212 593325 554306 515248 466724 413771 356971 297562 237619 180107
1085.2798 128580 86374 54395 34914 24327 20290 21519 28425 42907 67303 102835 148613
1063.7041 201902 259196 317232 373527 426473 475202 519384 559036 594379 625737 653474
1043.9263F77959K1579J8992J6690J4637J2803J1155R667Q315P075N929H09659
1022.3505H13507K881J944J023J06q21j773k764l810m928o139p464q929G72271
997.17883G59872j4476j6836j9530k2606k6114l0097l4575l9525m4845D60975
977.40106D05548n9525o1570o0390n5061m5575l3272k0343q371K718J4169A05152
955.8253A45073N6546O0583O4126O3776O0671M2960M8865M3454L8309F57965
936.04755F87356K5678K2431J9602J7143J5003J3137J1507J0077Q815H38448
916.26984H45152N813N009M279L610K992K417J876J363Q68L90p9n46j014H70642
889.3001H68668k479l007l565m159m799n489o244p072p985q998j0128G93349
$$ plain form
1043.9263 677959 699538 718530 735220 749857 762660 773815 783482 791797 798872 804801 809659
1022.3505 813507 816388 818332 819355 819461 818640 816867 814103 810293 805365 799226 791762 782833 772271
997.17883 759872 745396 728560 709030 686424 660310 630213 595638 556113 511268 460975
977.40106 405548 346023 284453 224063 169002 123427 90155 69812 61441 64159 78328 105152
955.8253 145073 201619 262202 326328 390104 450775 493735 542600 586054 624363 657965
936.04755 687356 713034 735465 755067 772210 787213 800350 811857 821934 830749 838448
916.26984 845152 850965 855974 860253 863863 866855 869272 871148 872511 873379 873769 873690 873144 872130 870642
889.3001 868668 866189 863182 859617 855458 850659 845170 838926 831854 823869 814871 804743 793349
865.9264G80532j4421j6235j8291k0620k3261k6246k9606l3356l7487E19065
846.1486D72469n1193n5323n2608o0710n8870n3434m4449l3146k1677B9070
826.3709B4449J433P927J6373K7094L8774M9186N6531O0176O0505N8384D55566
804.79517E05867M5616M1011L6680L2711K9139K5957K3144K0666J8488G95852
785.0174H10745J3413J2111J0961R945R044Q244P531O896O327N817N360I11340
761.6437I15914M238L932L654L402L172K962K770K593K431K282K145I51514
738.26996I53415J794J693J600J514J434J358J289J224J163J107J053I69647
714.89624I70603R12Q71Q32P95P61K5326%S5o590k01k11k20k31k43k54I91883
$$ plain form
865.9264 780532 766111 749876 731585 710965 687704 661458 631852 598496 561009 519065
846.1486 472469 421276 365953 313345 252635 193765 140331 95882 62736 41059 29070
826.3709 24449 25882 33809 50182 77276 116050 165236 221767 281943 342448 400832 455566
804.79517 505867 551483 592494 629174 661885 691024 716981 740125 760791 779279 795852
785.0174 810745 824158 836269 847230 857175 866219 874463 881994 888890 895217 901034 906394 911340
761.6437 915914 920152 924084 927738 931140 934312 937274 940044 942637 945068 947350 949495 951514
738.26996 953415 955209 956902 958502 960016 961450 962808 964097 965321 966484 967591 968644 969647
714.89624 970603 971515 972386 973218 974013 974774 1000100 1000100 1000100 1000100 1000100 1000100 1000100 1000100 1000100 1000100 1000100 1000100 1000100 1000100 1000100 1000100 993510 993309 993098 992878 992647 992404 992150 991883
660.95685I91602k95l11l28l45l65l85m08m32m57m86n16n49n84o24o65I84140
630.39124I83377q18q79r46j020j102j192j293j406j530j671j829k008I65475
605.21954I63038k698k996l338l732m191m722n345o076o940p964r187H95198
581.8458H82785j4541j7116k0229k3983k8462l3711l9649m5954n1868E51266
562.06805D94953n0531l7324j7514N678K7757M4641N4209N6790N4345F82134
542.2903G25030L6706L1080K6203K2082J8651J5810J3463J1520R910I19024
522.5125I26471O462N706N030M453L959L534L164K845K565K321K106I70532
499.1388I72280J599J465J347J240J144J058R80R09Q44P87P33O84O39I86308
$$ plain form
660.95685 991602 991307 990996 990668 990323 989958 989573 989165 988733 988276 987790 987274 986725 986141 985517 984852 984140
630.39124 983377 982559 981680 980734 979714 978612 977420 976127 974721 973191 971520 969691 967683 965475
605.21954 963038 960340 957344 954006 950274 946083 941361 936016 929940 923000 915036 905849 895198
581.8458 882785 868244 851128 830899 806916 778454 744743 705094 659140 607272 551266
562.06805 494953 444422 407098 389584 395262 423019 467660 521869 578659 633004 682134
542.2903 725030 761736 792816 819019 841101 859752 875562 889025 900545 910455 919024
522.5125 926471 932933 938639 943669 948122 952081 955615 958779 961624 964189 966510 968616 970532
499.1388 972280 973879 975344 976691 977931 979075 980133 981113 982022 982866 983653 984386 985070 985709 986308
472.16913I86869N26M93M64M37M11L87L64L44L23L05K88K71K55K39K25I92411
441.6035I92606J82J67J52O441n9p0q1r6j14j37j66k01k47l04l75m63I96673
409.23987I96010p38To00l00R9M64O86P51P08O16N13M18L39K75K23J83I99060
376.87625I99185J05Q9r27L3K4J4Pjoj2j8k2k7l2l6m1m6n0n5n9o5p1p6I97831
331.9268I97742r6j04j11j21j31j41j54j66j81j96k15k34k57k82l10I94700
301.36118I94321m21m69n25n89o63p51q55r76j122j298j508j723k082I78869
274.39148I75915l556m313n261o448p908r651j1606j3516j4820j4571H72570
252.81575H66766J905Q994J3466J4958J4317J2625R613Q734P124N800I69035
$$ plain form
472.16913 986869 987395 987888 988352 988789 989200 989587 989951 990295 990618 990923 991211 991482 991737 991976 992201 992411
441.6035 992606 992788 992955 993107 999548 999489 999419 999338 999242 999128 998991 998825 998624 998377 998073 997698 997235 996673
409.23987 996010 995272 994534 993934 993634 993733 994197 994883 995634 996342 996958 997471 997889 998228 998503 998726 998909 999060
376.87625 999185 999290 999379 998452 998485 998509 998523 998530 998529 998523 998511 998493 998471 998444 998412 998376 998335 998289 998239 998184 998125 998060 997989 997913 997831
331.9268 997742 997646 997542 997431 997310 997179 997038 996884 996718 996537 996341 996126 995892 995635 995353 995043 994700
301.36118 994321 993900 993431 992906 992317 991654 990903 990048 989072 987950 986652 985144 983421 981339 978869
274.39148 975915 972359 968046 962785 956337 948429 938778 927172 913656 898836 884265 872570
252.81575 866766 868671 877665 891131 906089 920406 933031 942644 951378 958502 964302 969035
231.24I72917L202K660K223J871J582J347J151R89Q51P35O36N51M76I91603
204.27032I91958L04K59K17J79J45J11Q0N0K0ql7o7r6j28j62j97k34k77I91794
168.31076I91420m31m97n71o56p55q72j007j169j362j594j876k221k645I72592
141.34108I68764m650n681o966q548j0432j1655j4631j6019j5728j2605H55599
119.765335H57650R689J4524J6155J5487J3675J1543R524P784O349N194I71844
98.18959I75379K946K474K093J782J528J318J145R98Q76P73O84O09N43I93636
71.21992I94074L96L59L26K97K71K48K28K10J93J79J66J53J43J32J24I97615
40.65428I97723J01R5Q9Q4P9P4P0O6O3N9N6N4N0M8M6M3M2L9L8L6L4L3A000100
$$ plain form
231.24 972917 976119 978779 981002 982873 984455 985802 986953 987942 988793 989528 990164 990715 991191 991603
204.27032 991958 992262 992521 992738 992917 993062 993173 993253 993303 993323 993315 993278 993211 993115 992987 992825 992628 992394 992117 991794
168.31076 991420 990989 990492 989921 989265 988510 987638 986631 985462 984100 982506 980630 978409 975764 972592
141.34108 968764 964114 958433 951467 942919 932487 920832 906201 890182 874454 861849 855599
119.765335 857650 867339 881863 898018 913505 927180 938723 948247 956031 962380 967574 971844
98.18959 975379 978325 980799 982892 984674 986202 987520 988665 989663 990539 991312 991996 992605 993148 993636
71.21992 994074 994470 994829 995155 995452 995723 995971 996199 996409 996602 996781 996947 997100 997243 997375 997499 997615
40.65428 997723 997824 997919 998008 998092 998171 998245 998315 998381 998444 998503 998559 998613 998663 998711 998757 998800 998842 998881 998919 998955 998989 999022 1000100
-2.497203A000100%V0A000100
$$ plain form
-2.497203 1000100 1000100 1000100 1000100 1000100 1000100 1000100 1000100 1000100 1000100 1000100 1000100 1000100 1000100 1000100 1000100 1000100 1000100 1000100 1000100 1000100 1000100 1000100 1000100 1000100 1000100 1000100 1000100 1000100 1000100 1000100 1000100 1000100 1000100 1000100 1000100 1000100 1000100 1000100 1000100 1000100 1000100
-78.0123A000100  $$checkpoint
##END= $$ end of 1,1,2-F2HC-CH2F IR
##TITLE=Raman of 1,1,2-F2HC-CH2F $$ Begin of the data block
##JCAMP-DX=5.00 $$ ACD/DocManager Library v 5.00
##DATA TYPE=RAMAN SPECTRUM
##DATA CLASS=XYDATA
##BLOCK ID=4
##DATE=19 Feb 2012 10:30:00
##ORIGIN= Department of Chemistry, UWI, Jamaica
##OWNER= public domain
##SPECTROMETER/DATA SYSTEM=from WebMO Gaussian simulation
##$MODELS=
<Models>
<ModelData id="R112" type="MOL">
112C2H3F3
$$ plain form
112 32 83 63
__Jmol-14_02241912233D 1   1.00000     0.00000     0
Jmol version 14.29.31  2019-01-29 15:30 EXTRACT: ({0:7})
  8  7  0  0  0  0            999 V2000
   -0.7379   -0.8265    0.0000 C   0  0  1  0  0  0
   -0.3524    0.6280    0.0000 C   0  0  2  0  0  0
    0.3851    0.9076    1.0824 F   0  0  0  0  0  0
   -1.2193    1.2727    0.0000 H   0  0  0  0  0  0
    0.3851    0.9076   -1.0824 F   0  0  0  0  0  0
    0.3851   -1.5906    0.0000 F   0  0  0  0  0  0
   -1.3179   -1.0505    0.8852 H   0  0  0  0  0  0
   -1.3179   -1.0505   -0.8852 H   0  0  0  0  0  0
  1  6  1  0  0  0
  1  2  1  0  0  0
  2  5  1  0  0  0
  2  3  1  0  0  0
  4  2  1  0  0  0
  7  1  1  0  0  0
  8  1  1  0  0  0
M  END
</ModelData>
<ModelData id="4" type="XYZVIB" baseModel="tN2F2" vibrationScale=".5">
8
Model[1]: PATH=Calculation 2;Standard;Energy=-375.78287;Range=M.O.s;NFock==Conv=0.78D-09;E(RHF)=-375.782869155 A.U.;PATH=Calculation 2;Standard
C      -0.73785     -0.82652      0.00000
C      -0.35242      0.62800      0.00000
F       0.38506      0.90750      1.08242
H      -1.21929      1.27271      0.00000
F       0.38506      0.90750     -1.08242
F       0.38506     -1.59062      0.00000
H      -1.31786     -1.05051      0.88519
H      -1.31786     -1.05051     -0.88519
8
Model[2]: FrequencyLabel=A";ForceConstant=0.0493 mDyne/A;ReducedMass=5.6221 AMU;FreqValue=121.9877;Frequency=121.9877 cm^-1;Mode=1;PATH=Calculation 2;FrequenciesFrequencies;IRIntensity=2.7017 KM/Mole;PATH=Calculation 2;FrequenciesFrequencies
C      -0.73785     -0.82652      0.00000     -0.00000     -0.00000     -0.20001
C      -0.35242      0.62800      0.00000     -0.00000      0.00000     -0.03000
F       0.38506      0.90750      1.08242      0.12000     -0.21000     -0.06000
H      -1.21929      1.27271      0.00000     -0.00000      0.00000      0.17000
F       0.38506      0.90750     -1.08242     -0.12000      0.21000     -0.06000
F       0.38506     -1.59062      0.00000     -0.00000      0.00000      0.32000
H      -1.31786     -1.05051      0.88519     -0.38000      0.01000     -0.45000
H      -1.31786     -1.05051     -0.88519      0.38000     -0.01000     -0.45000
8
Model[3]: FrequencyLabel=A';ForceConstant=0.5497 mDyne/A;ReducedMass=14.6290 AMU;FreqValue=252.5422;Frequency=252.5422 cm^-1;Mode=2;PATH=Calculation 2;FrequenciesFrequencies;IRIntensity=2.4772 KM/Mole;PATH=Calculation 2;FrequenciesFrequencies
C      -0.73785     -0.82652      0.00000     -0.20001      0.12000     -0.00000
C      -0.35242      0.62800      0.00000     -0.11000      0.04000      0.00000
F       0.38506      0.90750      1.08242      0.02000     -0.38000      0.02000
H      -1.21929      1.27271      0.00000      0.16000      0.40000      0.00000
F       0.38506      0.90750     -1.08242      0.02000     -0.38000     -0.02000
F       0.38506     -1.59062      0.00000      0.15001      0.64000     -0.00000
H      -1.31786     -1.05051      0.88519     -0.10000     -0.06000      0.01000
H      -1.31786     -1.05051     -0.88519     -0.10000     -0.06000     -0.01000
8
Model[4]: FrequencyLabel=A";ForceConstant=0.2540 mDyne/A;ReducedMass=2.6786 AMU;FreqValue=401.1650;Frequency=401.1650 cm^-1;Mode=3;PATH=Calculation 2;FrequenciesFrequencies;IRIntensity=0.1123 KM/Mole;PATH=Calculation 2;FrequenciesFrequencies
C      -0.73785     -0.82652      0.00000     -0.00000     -0.00000     -0.17000
C      -0.35242      0.62800      0.00000     -0.00000      0.00000      0.13000
F       0.38506      0.90750      1.08242      0.08000      0.15001      0.04000
H      -1.21929      1.27271      0.00000     -0.00000     -0.00000      0.14000
F       0.38506      0.90750     -1.08242     -0.08000     -0.15001      0.04000
F       0.38506     -1.59062      0.00000     -0.00000     -0.00000     -0.01000
H      -1.31786     -1.05051      0.88519     -0.34000     -0.30001     -0.48000
H      -1.31786     -1.05051     -0.88519      0.34000      0.30001     -0.48000
8
Model[5]: FrequencyLabel=A';ForceConstant=1.9582 mDyne/A;ReducedMass=10.7383 AMU;FreqValue=556.3355;Frequency=556.3355 cm^-1;Mode=4;PATH=Calculation 2;FrequenciesFrequencies;IRIntensity=16.3219 KM/Mole;PATH=Calculation 2;FrequenciesFrequencies
C      -0.73785     -0.82652      0.00000      0.19000      0.22000     -0.00000
C      -0.35242      0.62800      0.00000      0.24000      0.14000      0.00000
F       0.38506      0.90750      1.08242     -0.16000     -0.09000      0.43000
H      -1.21929      1.27271      0.00000      0.29000      0.20001      0.00000
F       0.38506      0.90750     -1.08242     -0.16000     -0.09000     -0.43000
F       0.38506     -1.59062      0.00000      0.01000     -0.09000      0.00000
H      -1.31786     -1.05051      0.88519      0.16000      0.33001      0.00000
H      -1.31786     -1.05051     -0.88519      0.16000      0.33001     -0.00000
8
Model[6]: FrequencyLabel=A';ForceConstant=2.8155 mDyne/A;ReducedMass=7.0041 AMU;FreqValue=825.9912;Frequency=825.9912 cm^-1;Mode=5;PATH=Calculation 2;FrequenciesFrequencies;IRIntensity=64.2515 KM/Mole;PATH=Calculation 2;FrequenciesFrequencies
C      -0.73785     -0.82652      0.00000      0.27001      0.34000     -0.00000
C      -0.35242      0.62800      0.00000     -0.19000      0.29000      0.00000
F       0.38506      0.90750      1.08242     -0.06000     -0.14000     -0.18001
H      -1.21929      1.27271      0.00000     -0.19000      0.32000     -0.00000
F       0.38506      0.90750     -1.08242     -0.06000     -0.14000      0.18001
F       0.38506     -1.59062      0.00000      0.06000     -0.18001      0.00000
H      -1.31786     -1.05051      0.88519      0.26000      0.37000     -0.01000
H      -1.31786     -1.05051     -0.88519      0.26000      0.37000      0.01000
8
Model[7]: FrequencyLabel=A';ForceConstant=1.6816 mDyne/A;ReducedMass=3.0767 AMU;FreqValue=963.1299;Frequency=963.1299 cm^-1;Mode=6;PATH=Calculation 2;FrequenciesFrequencies;IRIntensity=47.7740 KM/Mole;PATH=Calculation 2;FrequenciesFrequencies
C      -0.73785     -0.82652      0.00000     -0.16000     -0.14000      0.00000
C      -0.35242      0.62800      0.00000     -0.14000      0.28000      0.00000
F       0.38506      0.90750      1.08242      0.05000      0.00000      0.05000
H      -1.21929      1.27271      0.00000      0.16000      0.69000     -0.00000
F       0.38506      0.90750     -1.08242      0.05000      0.00000     -0.05000
F       0.38506     -1.59062      0.00000      0.09000     -0.09000     -0.00000
H      -1.31786     -1.05051      0.88519     -0.06000     -0.40000     -0.00000
H      -1.31786     -1.05051     -0.88519     -0.06000     -0.40000      0.00000
8
Model[8]: FrequencyLabel=A";ForceConstant=1.3080 mDyne/A;ReducedMass=1.9204 AMU;FreqValue=1075.1609;Frequency=1075.1609 cm^-1;Mode=7;PATH=Calculation 2;FrequenciesFrequencies;IRIntensity=67.1129 KM/Mole;PATH=Calculation 2;FrequenciesFrequencies
C      -0.73785     -0.82652      0.00000      0.00000      0.00000      0.21000
C      -0.35242      0.62800      0.00000      0.00000     -0.00000      0.10000
F       0.38506      0.90750      1.08242     -0.05000     -0.04000     -0.07000
H      -1.21929      1.27271      0.00000     -0.00000     -0.00000     -0.05000
F       0.38506      0.90750     -1.08242      0.05000      0.04000     -0.07000
F       0.38506     -1.59062      0.00000      0.00000     -0.00000     -0.03000
H      -1.31786     -1.05051      0.88519     -0.41000     -0.51000     -0.19000
H      -1.31786     -1.05051     -0.88519      0.41000      0.51000     -0.19000
8
Model[9]: FrequencyLabel=A';ForceConstant=4.4282 mDyne/A;ReducedMass=5.0464 AMU;FreqValue=1220.3799;Frequency=1220.3799 cm^-1;Mode=8;PATH=Calculation 2;FrequenciesFrequencies;IRIntensity=22.0328 KM/Mole;PATH=Calculation 2;FrequenciesFrequencies
C      -0.73785     -0.82652      0.00000      0.35000     -0.16000     -0.00000
C      -0.35242      0.62800      0.00000     -0.26000      0.06000      0.00000
F       0.38506      0.90750      1.08242      0.08000     -0.00000      0.07000
H      -1.21929      1.27271      0.00000     -0.40000     -0.13000      0.00000
F       0.38506      0.90750     -1.08242      0.08000     -0.00000     -0.07000
F       0.38506     -1.59062      0.00000     -0.23001      0.11000      0.00000
H      -1.31786     -1.05051      0.88519      0.37000     -0.35000     -0.03000
H      -1.31786     -1.05051     -0.88519      0.37000     -0.35000      0.03000
8
Model[10]: FrequencyLabel=A";ForceConstant=2.5782 mDyne/A;ReducedMass=2.6475 AMU;FreqValue=1285.6233;Frequency=1285.6233 cm^-1;Mode=9;PATH=Calculation 2;FrequenciesFrequencies;IRIntensity=107.0702 KM/Mole;PATH=Calculation 2;FrequenciesFrequencies
C      -0.73785     -0.82652      0.00000      0.00000     -0.00000     -0.14000
C      -0.35242      0.62800      0.00000      0.00000      0.00000      0.29000
F       0.38506      0.90750      1.08242     -0.07000     -0.01000     -0.09000
H      -1.21929      1.27271      0.00000      0.00000      0.00000      0.57000
F       0.38506      0.90750     -1.08242      0.07000      0.01000     -0.09000
F       0.38506     -1.59062      0.00000     -0.00000      0.00000      0.04000
H      -1.31786     -1.05051      0.88519      0.48000     -0.12000      0.15001
H      -1.31786     -1.05051     -0.88519     -0.48000      0.12000      0.15001
8
Model[11]: FrequencyLabel=A';ForceConstant=2.9347 mDyne/A;ReducedMass=2.9003 AMU;FreqValue=1310.4983;Frequency=1310.4983 cm^-1;Mode=10;PATH=Calculation 2;FrequenciesFrequencies;IRIntensity=144.7601 KM/Mole;PATH=Calculation 2;FrequenciesFrequencies
C      -0.73785     -0.82652      0.00000      0.09000     -0.12000      0.00000
C      -0.35242      0.62800      0.00000      0.26000      0.10000     -0.00000
F       0.38506      0.90750      1.08242     -0.09000     -0.01000     -0.08000
H      -1.21929      1.27271      0.00000      0.58000      0.50000     -0.00000
F       0.38506      0.90750     -1.08242     -0.09000     -0.01000      0.08000
F       0.38506     -1.59062      0.00000     -0.09000      0.05000     -0.00000
H      -1.31786     -1.05051      0.88519      0.17000     -0.33001     -0.00000
H      -1.31786     -1.05051     -0.88519      0.17000     -0.33001      0.00000
8
Model[12]: FrequencyLabel=A";ForceConstant=1.3153 mDyne/A;ReducedMass=1.1294 AMU;FreqValue=1405.9771;Frequency=1405.9771 cm^-1;Mode=11;PATH=Calculation 2;FrequenciesFrequencies;IRIntensity=24.2613 KM/Mole;PATH=Calculation 2;FrequenciesFrequencies
C      -0.73785     -0.82652      0.00000      0.00000     -0.00000      0.03000
C      -0.35242      0.62800      0.00000      0.00000      0.00000      0.07000
F       0.38506      0.90750      1.08242     -0.02000      0.00000     -0.02000
H      -1.21929      1.27271      0.00000      0.00000      0.00000      0.34000
F       0.38506      0.90750     -1.08242      0.02000     -0.00000     -0.02000
F       0.38506     -1.59062      0.00000     -0.00000      0.00000     -0.04000
H      -1.31786     -1.05051      0.88519     -0.36001      0.55000     -0.05000
H      -1.31786     -1.05051     -0.88519      0.36001     -0.55000     -0.05000
8
Model[13]: FrequencyLabel=A";ForceConstant=1.8792 mDyne/A;ReducedMass=1.2977 AMU;FreqValue=1567.7709;Frequency=1567.7709 cm^-1;Mode=12;PATH=Calculation 2;FrequenciesFrequencies;IRIntensity=50.8605 KM/Mole;PATH=Calculation 2;FrequenciesFrequencies
C      -0.73785     -0.82652      0.00000      0.00000      0.00000      0.03000
C      -0.35242      0.62800      0.00000     -0.00000     -0.00000     -0.15001
F       0.38506      0.90750      1.08242     -0.01000      0.01000      0.01000
H      -1.21929      1.27271      0.00000      0.00000      0.00000      0.95000
F       0.38506      0.90750     -1.08242      0.01000     -0.01000      0.01000
F       0.38506     -1.59062      0.00000      0.00000     -0.00000      0.00000
H      -1.31786     -1.05051      0.88519      0.01000     -0.18001     -0.02000
H      -1.31786     -1.05051     -0.88519     -0.01000      0.18001     -0.02000
8
Model[14]: FrequencyLabel=A';ForceConstant=1.9574 mDyne/A;ReducedMass=1.3369 AMU;FreqValue=1576.4119;Frequency=1576.4119 cm^-1;Mode=13;PATH=Calculation 2;FrequenciesFrequencies;IRIntensity=37.6167 KM/Mole;PATH=Calculation 2;FrequenciesFrequencies
C      -0.73785     -0.82652      0.00000      0.05000     -0.07000     -0.00000
C      -0.35242      0.62800      0.00000     -0.10000     -0.11000      0.00000
F       0.38506      0.90750      1.08242      0.00000      0.02000      0.00000
H      -1.21929      1.27271      0.00000      0.47000      0.63000     -0.00000
F       0.38506      0.90750     -1.08242      0.00000      0.02000     -0.00000
F       0.38506     -1.59062      0.00000      0.00000      0.00000     -0.00000
H      -1.31786     -1.05051      0.88519     -0.01000      0.41000      0.08000
H      -1.31786     -1.05051     -0.88519     -0.01000      0.41000     -0.08000
8
Model[15]: FrequencyLabel=A';ForceConstant=2.6815 mDyne/A;ReducedMass=1.7664 AMU;FreqValue=1605.1854;Frequency=1605.1854 cm^-1;Mode=14;PATH=Calculation 2;FrequenciesFrequencies;IRIntensity=36.0317 KM/Mole;PATH=Calculation 2;FrequenciesFrequencies
C      -0.73785     -0.82652      0.00000     -0.04000      0.20001     -0.00000
C      -0.35242      0.62800      0.00000     -0.06000     -0.15001      0.00000
F       0.38506      0.90750      1.08242      0.01000      0.02000      0.01000
H      -1.21929      1.27271      0.00000      0.29000      0.28000     -0.00000
F       0.38506      0.90750     -1.08242      0.01000      0.02000     -0.01000
F       0.38506     -1.59062      0.00000     -0.01000     -0.02000      0.00000
H      -1.31786     -1.05051      0.88519      0.35000     -0.51000      0.05000
H      -1.31786     -1.05051     -0.88519      0.35000     -0.51000     -0.05000
8
Model[16]: FrequencyLabel=A';ForceConstant=1.8402 mDyne/A;ReducedMass=1.1317 AMU;FreqValue=1661.3110;Frequency=1661.3110 cm^-1;Mode=15;PATH=Calculation 2;FrequenciesFrequencies;IRIntensity=5.9305 KM/Mole;PATH=Calculation 2;FrequenciesFrequencies
C      -0.73785     -0.82652      0.00000     -0.09000     -0.05000      0.00000
C      -0.35242      0.62800      0.00000      0.02000      0.03000     -0.00000
F       0.38506      0.90750      1.08242     -0.00000     -0.00000     -0.00000
H      -1.21929      1.27271      0.00000     -0.11000     -0.12000      0.00000
F       0.38506      0.90750     -1.08242     -0.00000     -0.00000      0.00000
F       0.38506     -1.59062      0.00000     -0.00000      0.00000      0.00000
H      -1.31786     -1.05051      0.88519      0.51000      0.18001      0.43000
H      -1.31786     -1.05051     -0.88519      0.51000      0.18001     -0.43000
8
Model[17]: FrequencyLabel=A';ForceConstant=6.6387 mDyne/A;ReducedMass=1.0587 AMU;FreqValue=3262.4129;Frequency=3262.4129 cm^-1;Mode=16;PATH=Calculation 2;FrequenciesFrequencies;IRIntensity=17.4008 KM/Mole;PATH=Calculation 2;FrequenciesFrequencies
C      -0.73785     -0.82652      0.00000      0.06000      0.03000      0.00000
C      -0.35242      0.62800      0.00000     -0.01000      0.01000     -0.00000
F       0.38506      0.90750      1.08242     -0.00000     -0.00000     -0.00000
H      -1.21929      1.27271      0.00000      0.16000     -0.11000      0.00000
F       0.38506      0.90750     -1.08242     -0.00000     -0.00000      0.00000
F       0.38506     -1.59062      0.00000      0.00000     -0.00000      0.00000
H      -1.31786     -1.05051      0.88519     -0.36001     -0.15001      0.57000
H      -1.31786     -1.05051     -0.88519     -0.36001     -0.15001     -0.57000
8
Model[18]: FrequencyLabel=A';ForceConstant=7.0166 mDyne/A;ReducedMass=1.0879 AMU;FreqValue=3308.5887;Frequency=3308.5887 cm^-1;Mode=17;PATH=Calculation 2;FrequenciesFrequencies;IRIntensity=68.8952 KM/Mole;PATH=Calculation 2;FrequenciesFrequencies
C      -0.73785     -0.82652      0.00000     -0.01000     -0.01000      0.00000
C      -0.35242      0.62800      0.00000     -0.06000      0.05000      0.00000
F       0.38506      0.90750      1.08242      0.00000     -0.00000     -0.00000
H      -1.21929      1.27271      0.00000      0.77000     -0.60001     -0.00000
F       0.38506      0.90750     -1.08242      0.00000     -0.00000      0.00000
F       0.38506     -1.59062      0.00000      0.00000     -0.00000     -0.00000
H      -1.31786     -1.05051      0.88519      0.07000      0.03000     -0.11000
H      -1.31786     -1.05051     -0.88519      0.07000      0.03000      0.11000
8
Model[19]: FrequencyLabel=A";ForceConstant=7.2099 mDyne/A;ReducedMass=1.1116 AMU;FreqValue=3317.9447;Frequency=3317.9447 cm^-1;Mode=18;PATH=Calculation 2;FrequenciesFrequencies;IRIntensity=36.8136 KM/Mole;PATH=Calculation 2;FrequenciesFrequencies
C      -0.73785     -0.82652      0.00000     -0.00000     -0.00000     -0.10000
C      -0.35242      0.62800      0.00000     -0.00000      0.00000     -0.00000
F       0.38506      0.90750      1.08242      0.00000      0.00000      0.00000
H      -1.21929      1.27271      0.00000      0.00000     -0.00000      0.00000
F       0.38506      0.90750     -1.08242     -0.00000     -0.00000      0.00000
F       0.38506     -1.59062      0.00000      0.00000     -0.00000      0.00000
H      -1.31786     -1.05051      0.88519     -0.37000     -0.16000      0.58000
H      -1.31786     -1.05051     -0.88519      0.37000      0.16000      0.58000
</ModelData>
</Models>
##$PEAKS=
<Peaks type="RAMAN" xUnitsExpected="1/cm"  >
<PeakData id="1" title="1- (~3320 cm-1)" peakShape="broad" model="4.19" xMax="3350" xMin="3315"    />
<PeakData id="2" title="2- (~3310 cm-1)" peakShape="broad" model="4.18" xMax="3315" xMin="3285"    />
<PeakData id="3" title="3- (~3260 cm-1)" peakShape="broad" model="4.17" xMax="3280" xMin="3230"    />
<PeakData id="4" title="4- (~1660 cm-1)" peakShape="broad" model="4.16" xMax="1680" xMin="1640"    />
<PeakData id="5" title="5- (~1605 cm-1)" peakShape="broad" model="4.15" xMax="1620" xMin="1590"    />
<PeakData id="6" title="6- (~1575 cm-1)" peakShape="broad" model="4.14" xMax="1590" xMin="1570"    />
<PeakData id="7" title="7- (~1565 cm-1)" peakShape="broad" model="4.13" xMax="1570" xMin="1550"    />
<PeakData id="8" title="8- (~1405 cm-1)" peakShape="broad" model="4.12" xMax="1420" xMin="1390"    />
<PeakData id="9" title="9- (~1310 cm-1)" peakShape="broad" model="4.11" xMax="1330" xMin="1290"    />
<PeakData id="10" title="10-(~1285 cm-1)" peakShape="broad" model="4.10" xMax="1290" xMin="1270"    />
<PeakData id="11" title="11- (~1220 cm-1)" peakShape="broad" model="4.9" xMax="1240" xMin="1200"    />
<PeakData id="12" title="12- (~1075 cm-1)" peakShape="broad" model="4.8" xMax="1090" xMin="1060"    />
<PeakData id="13" title="13- (~965 cm-1)" peakShape="broad" model="4.7" xMax="980" xMin="950"    />
<PeakData id="14" title="14- (~825 cm-1)" peakShape="broad" model="4.6" xMax="840" xMin="810"    />
<PeakData id="15" title="15- (~555 cm-1)" peakShape="broad" model="4.5" xMax="570" xMin="550"    />
</Peaks>
##XUNITS= 1/CM
##YUNITS= ABSORBANCE
##XFACTOR= 1
##YFACTOR= 9.587894E-07
##FIRSTX= 3.516147E+03
##FIRSTY= 0
##LASTX= -7.801230E+01
##NPOINTS= 2000
##MINY= 0
##MAXY= 9.587894E-01
##XYDATA= (X++(Y..Y))
3516.1467@%V3L051R4R8J02J08N062K70K83K97L12L27L45L62L82M03M25A2370
3406.47A2845N03N32N66O00O38O80P25P74Q28Q87R51J021J100N887B9962
3377.7024C1500J662J802J956K130K324K545K793L076L399L768M194M687G1096
3352.5308G7027O722P658Q776J0117J1743J3723J6159J9171K2925K7621B55147
3330.9548B95989M9856O0557P2412Q3821R1689R2063Q2883O7105N0826I83147
3311.1772A000000j2758n0042q2828j00476j01764r2239p8164o3613n0457C28435
3291.3994B98627k1876j5041q932l209K453Q373J4876K2296L0940M0980D21679
3269.8237D85119P1873P2351N8602K7883j3342n1018p3845q0263p5529C56106
$$ plain form
3516.1467 0 0 0 0 0 0 0 0 0 0 0 0 0 0 0 0 0 0 0 0 0 0 0 0 0 0 0 0 0 0 0 0 0 0 0 0 0 0 0 0 0 0 0 0 3051 3145 3243 3345 3453 8515 8785 9068 9365 9677 10004 10349 10711 11093 11496 11921 12370
3406.47 12845 13348 13880 14446 15046 15684 16364 17089 17863 18691 19578 20529 21550 22650 28537 29962
3377.7024 31500 33162 34964 36920 39050 41374 43919 46712 49788 53187 56955 61149 65836 71096
3352.5308 77027 83749 91407 100183 110300 122043 135766 151925 171096 194021 221642 255147
3330.9548 295989 345845 406402 478814 562635 654324 746387 829270 896375 947201 983147
3311.1772 1000000 987242 937200 854372 753896 652132 559893 481729 418116 367659 328435
3291.3994 298627 276751 261710 252778 249569 252022 260395 275271 297567 328507 369487 421679
3269.8237 485119 556992 629343 687945 715828 702486 651468 577623 497360 421831 356106
3250.046C01216m4962l6586k9791k4372k0078j6670j3957j1781j0023H4402
3230.268G6983o450n642m963m391l904l487l129k819k550k314k107j925C1538
3205.0964B9917j492j379j276j183m020r41q75q17p63n450n33m98m65I789
3178.1267I380l83l61l39l20l02k85k70k55k42k29k17k07j97j87j78j69E077
$$ plain form
3250.046 301216 256254 219668 189877 165505 145427 128757 114800 103019 92996 84402
3230.268 76983 70533 64891 59928 55537 51633 48146 45017 42198 39648 37334 35227 33302 31538
3205.0964 29917 28425 27046 25770 24587 20567 19626 18751 17934 17171 11721 11188 10690 10225 9789
3178.1267 9380 8997 8636 8297 7977 7675 7390 7120 6865 6623 6394 6177 5970 5773 5586 5408 5239 5077
3145.7632D922j47j41m634%Y55L77J2TJ3TJ4TJ6TJ7J8J9K0K1K2K3K5K7G07
1746.9359G37L1L4L6L9M1M4M8N1N5N9O4P0K68Q8R6J04J15J25J38J52J68B750
1705.5824B959K33K62K97L36L83O23N14N96O96R16R74J165J403J703K084A7707
1675.0167B0868L887M722N569O201TN065K574p55l796n641o168n794n013B3776
1648.0471B0429k669k116j670j309j016p71n64l81k15n7J01K66M47O52A2020
1619.2794A3200J526J935K400K872L235L281K752J538r4j566k414k568B3860
1594.1077B2198r99l16L73J077J797K501L095L389L138K219Q23o03j751C4327
1567.1381C1065l644l682l422k995k525k089j717j410j163r66q09o82E382
1541.9663D885p90l61l16k77k44k16j93j72P04j13r9q5p4o4n4m5l7k9B398
$$ plain form
1746.9359 737 768 802 838 877 918 962 1010 1061 1116 1175 1239 1309 1577 1665 1761 1865 1980 2105 2243 2395 2563 2750
1705.5824 2959 3192 3454 3751 4087 4470 5093 5607 6203 6899 7815 8789 9954 11357 13060 15144 17707
1675.0167 20868 24755 29477 35046 41247 47448 52513 55087 54332 50536 44895 38727 32933 27920 23776
1648.0471 20429 17760 15644 13974 12665 11649 10878 10314 9933 9718 9661 9762 10028 10475 11127 12020
1619.2794 13200 14726 16661 19061 21933 25168 28449 31201 32739 32645 31079 28665 26097 23860
1594.1077 22198 21199 20883 21256 22333 24130 26631 29726 33115 36253 38472 39295 38692 36941 34327
1567.1381 31065 27421 23739 20317 17322 14797 12708 10991 9581 8418 7452 6643 5961 5382
1541.9663 4885 4095 3734 3418 3141 2897 2681 2488 2316 3020 2907 2808 2723 2649 2585 2531 2486 2449 2420 2398
1506.0067B382qlMJ0J6K1K8L4M1M7N4O1j15Q2R1J00J10J20J32J45J60C687
1464.6532C880K12K35K59K87L20J81M03M50N07M79O50P40Q46R73J126A2859
1434.0876A4395J814K479K596L135L816M676N763P120Q768J0661J2584I1820
1410.7139A05826J1412N730j790q794j3010j4222j3393j1633r680p891C6173
1389.1382C1014m186l415k805k320j931j617j363j152r79q33p10o05n14H151
1362.1685G788k98k40j85j33q1l0K2P7J36K02K74L58O63N79P20Q92J106A3221
1328.0068A4926K122K642L272L993M728N280N296M347K247n62l119m650C5477
1302.8352C0815l911l067k260j538r20m37j46j29m11j707j311j560j578A0396
$$ plain form
1506.0067 2382 2374 2371 2375 2385 2401 2422 2450 2484 2525 2572 2626 2687 2572 2654 2745 2845 2955 3075 3207 3352 3512 3687
1464.6532 3880 4092 4327 4586 4873 5193 5374 5777 6227 6734 7213 7863 8603 9449 10422 11548 12859
1434.0876 14395 16209 18688 21284 24419 28235 32911 38674 45794 54562 65223 77807 91820
1410.7139 105826 117238 122968 121178 112384 99374 85152 71759 60126 50446 42555 36173
1389.1382 31014 26828 23413 20608 18288 16357 14740 13377 12225 11246 10413 9703 9098 8584 8151
1362.1685 7788 7490 7250 7065 6932 6851 6821 6843 6920 7056 7258 7532 7890 8553 9132 9852 10744 11850 13221
1328.0068 14926 17048 19690 22962 26955 31683 36963 42259 46606 48853 48291 45172 40522 35477
1302.8352 30815 26904 23837 21577 20039 19119 18682 18536 18407 17996 16289 14978 13418 11840 10396
1275.8655I153j034q45o83n50m39l47k69k02j41q8l5J6O7J23J82K50L28E907
1241.704F439O69Q40J051J318J648K048K506K970L316L317K698J336B9673
1216.5322B7527l155l445l245k821k352j922j560j265j032q46p00l73D327
1191.3605C918o54k89k47k14j84j61j41j22j08r5q3p3o4n6j16m1l5k9A182
1155.401A162j5j1pkJORJ4J9K2K8L3L9M5N1O0O7P7Q8J01J14J30J50J72B551
1108.6536B781K67L13L68M37N20M28P63R29J139J403J735K137K599L068B2770
1079.8859B6199K796J410m42k135l163l459l256k825k348j911j541j243G079
1054.7141F264o65n45m49l72l07k56k11j74j43j15r1o9m9l2j5JJ7L3M8B933
$$ plain form
1275.8655 9153 8119 7274 6591 6041 5602 5255 4986 4784 4643 4555 4520 4536 4603 4726 4908 5158 5486 5907
1241.704 6439 7108 7948 8999 10317 11965 14013 16519 19489 22805 26122 28820 30156 29673
1216.5322 27527 24372 20927 17682 14861 12509 10587 9027 7762 6730 5884 5184 4811 4327
1191.3605 3918 3264 2975 2728 2514 2330 2169 2028 1906 1798 1703 1620 1547 1483 1427 1311 1270 1235 1206 1182
1155.401 1162 1147 1136 1129 1127 1128 1134 1143 1157 1176 1198 1226 1259 1298 1343 1394 1454 1521 1598 1686 1787 1901 2031 2181 2353 2551
1108.6536 2781 3048 3361 3729 4166 4686 5114 5877 6806 7945 9348 11083 13220 15819 18887 22770
1079.8859 26199 28995 30405 29963 27828 24665 21206 17950 15125 12777 10866 9325 8082 7079
1054.7141 6264 5599 5054 4605 4233 3926 3670 3459 3285 3142 3027 2936 2867 2818 2786 2771 2772 2789 2822 2870 2933
1016.9566C014R8J17J38J60J85K14K47K84L26L77M37N06N91O92Q15R67A0322
984.593A1710J679K049K516L105L840M734N760O802P576P573O166L088F5573
959.42126F0788p068p727p478o319n262m293l476k671k284j868j539j278H457
934.2496G556p65o53n62m85m22l69l23k85k52k23j99j77j58j41j26j13B202
901.886B111q0p1o3n5m8m1l4k8k1j5qkNJ2K0K7L7M7N7P0Q5J01J19J43B537
855.13855B739K40K88L47M20N11O27P72N11J198J475J795K118K359K358A9679
826.3709B0642l17j486k197k401k262j965j637j335j081q76p12n82m80B912
799.4012B578k82k40k05j77j53j33j17j04r1q1p2o5n9n2m8m3m0l6l3E17
$$ plain form
1016.9566 3014 3112 3229 3367 3527 3712 3926 4173 4457 4783 5160 5597 6103 6694 7386 8201 9168 10322
984.593 11710 13389 15438 17954 21059 24899 29633 35393 42195 49771 57344 63510 66598 65573
959.42126 60788 53720 45993 38515 32196 26934 22641 19165 16494 14210 12342 10803 9525 8457
934.2496 7556 6791 6138 5576 5091 4669 4300 3977 3692 3440 3217 3018 2841 2683 2542 2416 2303 2202
901.886 2111 2031 1960 1897 1842 1794 1753 1719 1691 1670 1655 1647 1645 1650 1662 1682 1709 1746 1793 1850 1920 2005 2106 2225 2368 2537
855.13855 2739 2979 3267 3614 4034 4545 5172 5944 6455 7653 9128 10923 13041 15400 17758 19679
826.3709 20642 20325 18839 16642 14241 11979 10014 8377 7042 5961 5085 4373 3791 3311 2912
799.4012 2578 2296 2056 1851 1674 1521 1388 1271 1167 1076 995 923 858 799 747 699 656 616 580 547 517
761.6437D89k6k3k2k1j9j7Tj5j4Tj2Tj1Trj0qrqpUoUnonmnmj43%S5O7G0
671.74475G2KTLKLVMLMUNMNONOPUQRTJ0TJ2TJ4TJ6J8J9K1K4K5K9L2L6E22
596.2296E67N1N8O6P7Q8J03J21J43J69K03K46K99L66M52N59O88Q36R88G180
560.2701H279Q95M49j48o92j024j120j054r16p63o23n04m08l32k72k24A357
529.7044A202j32j11r6q2o6o2n5m7m3l7l4l0k7k4k2k0j8j7j5j3Tj2j0B06
484.75497A97qTpoUnTmTlmklkTjV%JTKTLTo0QRJ0J2J5J7K2K5L2L9M8N9D37
409.23987E22R5R4P7L9j3n9q8r7r0p9o5n4m3l5k9k3j9j6j4j1mqponTmE0
357.0985D7lkVjkjT%jT%j%XJ%TJXKJKTLUMTNOPQLJ2J3J6J9K3K9L5M4C33
$$ plain form
761.6437 489 463 440 418 397 378 361 344 329 315 301 289 277 266 255 246 236 228 219 211 204 197 190 184 178 172 167 161 156 152 147 143 0 0 0 0 0 0 0 0 0 0 0 0 0 0 0 0 67 70
671.74475 72 74 76 79 81 84 87 90 93 97 100 104 108 112 117 121 126 132 137 143 150 157 164 172 181 190 200 210 222 234 248 262 278 296 315 336 360 385 414 446 482 522
596.2296 567 618 676 742 819 907 1010 1131 1274 1443 1646 1892 2191 2557 3009 3568 4256 5092 6080 7180
560.2701 8279 9174 9623 9475 8783 7759 6639 5585 4669 3906 3283 2779 2371 2039 1767 1543 1357
529.7044 1202 1070 959 863 781 715 653 598 551 508 471 437 407 380 356 334 314 296 279 264 251 238 226 216 206
484.75497 197 189 181 174 168 162 156 151 146 142 138 135 131 129 126 124 122 121 120 119 118 118 119 120 122 124 127 130 70 78 87 97 109 124 141 163 188 220 259 307 366 437
409.23987 522 617 711 788 827 814 755 667 570 480 401 336 282 239 204 175 152 133 117 103 92 88 80 73 67 62 57 53 50
357.0985 47 44 42 40 38 36 35 33 32 31 31 30 29 29 28 28 28 28 28 28 28 29 29 29 30 31 32 33 34 35 37 38 40 42 45 48 51 55 59 64 70 77 85 88 100 113 129 148 171 200 235 279 333
261.80563C98P8Q6TP0L5j2n4q0q8q2p2n9m9l9l2k6k1j8j4j2j1qToTnmD3
209.66426D0lTkVjkjX%jT%j%Tj%Uj%VJ%TJ%JUKULM%OTPNLjmopoTmTlkA2
99.98757A0jV%j%j%j%Vj%Yj%T4j%V9@
$$ plain form
261.80563 398 476 562 648 718 753 741 687 607 519 437 365 306 257 218 186 160 139 121 107 95 84 76 68 62 56 51 47 43
209.66426 40 37 34 32 30 28 26 25 23 22 21 20 19 18 17 17 16 15 15 14 14 14 13 13 13 13 12 12 12 12 12 13 13 13 14 14 15 16 17 19 21 23 26 30 30 36 42 49 54 57 56 52 46 39 33 27 23 19 16 14 12
99.98757 10 9 8 7 6 6 5 5 4 4 3 3 3 3 3 2 2 2 2 2 2 2 2 1 1 1 1 1 1 1 1 1 1 1 1 1 1 1 1 1 1 1 1 1 1 1 1 1 0 0 0 0 0 0 0 0 0 0 0 0 0 0 0 0 0 0 0 0 0 0 0 0 0 0 0 0 0 0 0 0 0 0 0 0 0 0 0 0 0 0 0 0 0 0 0 0 0 0 0
-78.0123@  $$checkpoint
##END= $$ end of 1,1,2-F2HC-CH2F Raman data
##END= $$ end of file