##TITLE= 1,2-dichloroethylene
##JCAMP-DX=5.01
##DATA TYPE= LINK
##BLOCKS= 6
##TITLE= cis-1,2-dichloroethylene (Z)
##JCAMP-DX= 5.01
##DATA TYPE= INFRARED SPECTRUM
##DATA CLASS= XYDATA
##BLOCK ID=1
##ORIGIN= Department of Chemistry, UWI, JAMAICA
##OWNER= public domain
##LONGDATE= 2012/02/18 12:31:56.0440 -0500 $$ export date from JSpecView
##SPECTROMETER/DATA SYSTEM= from scan
##$MODELS=
<Models>
<ModelData id="cDCE" type="MOL">
cis-1,2-dichloroethylene (Z)
__Jmol-14_02171521233D 1   1.00000     0.00000     0
Jmol version 14.3.12_2015.02.11  2015-02-11 19:15 EXTRACT: ({0:5})
  6  5  0  0  0  0              1 V2000
   0.00000   0.67022   0.96140 C   0  0  0  0  0  0
   0.00000  -0.67022   0.96140 C   0  0  0  0  0  0
   0.00000  -1.65604  -0.45086 Cl  0  0  0  0  0  0
   0.00000  -1.25420   1.89597 H   0  0  0  0  0  0
   0.00000   1.65604  -0.45086 Cl  0  0  0  0  0  0
   0.00000   1.25420   1.89597 H   0  0  0  0  0  0
  1  6  1  0  0  0
  1  5  1  0  0  0
  1  2  2  0  0  0
  2  3  1  0  0  0
  2  4  1  0  0  0
M  END
</ModelData>
<ModelData id="C1" type="XYZVIB" baseModel="cDCE" vibrationScale=".5">
6
Model[1]: PATH=Calculation 1;Input;Convg=0.9764D-08;-V/T=2.0006;Energy=NaN;Range=M.O.s;E(RHF)=-995.827490213 A.U.;PATH=Calculation 1;Input
C       0.00000      0.00000      0.00000
C       0.00000      0.00000      1.34044
Cl      1.41224      0.00000      2.32626
H      -0.93457      0.00000      1.92442
Cl      1.41224      0.00000     -0.98582
H      -0.93457      0.00000     -0.58398
6
Model[2]: PATH=Calculation 1;Standard;Convg=0.9764D-08;-V/T=2.0006;Energy=-995.8275;Range=M.O.s;E(RHF)=-995.827490213 A.U.;PATH=Calculation 1;Standard
C       0.00000      0.67022      0.96140
C       0.00000     -0.67022      0.96140
Cl      0.00000     -1.65604     -0.45085
H       0.00000     -1.25420      1.89597
Cl      0.00000      1.65604     -0.45085
H       0.00000      1.25420      1.89597
6
Model[3]: IRIntensity=0.4101 KM/Mole;PATH=Calculation 1;FrequenciesFrequencies;ReducedMass=27.0583 AMU;ForceConstant=0.5615 mDyne/A;FreqValue=187.6781;Frequency=187.6781 cm^-1;FrequencyLabel=A1;PATH=Calculation 1;FrequenciesFrequencies
C       0.00000      0.67022      0.96140      0.00000     -0.01000      0.28000
C       0.00000     -0.67022      0.96140      0.00000      0.01000      0.28000
Cl      0.00000     -1.65604     -0.45085      0.00000      0.59000     -0.10000
H       0.00000     -1.25420      1.89597      0.00000     -0.20001      0.15001
Cl      0.00000      1.65604     -0.45085      0.00000     -0.59000     -0.10000
H       0.00000      1.25420      1.89597      0.00000      0.20001      0.15001
6
Model[4]: IRIntensity=0.0000 KM/Mole;PATH=Calculation 1;FrequenciesFrequencies;ReducedMass=4.0875 AMU;ForceConstant=0.6230 mDyne/A;FreqValue=508.6316;Frequency=508.6316 cm^-1;FrequencyLabel=A2;PATH=Calculation 1;FrequenciesFrequencies
C       0.00000      0.67022      0.96140      0.36001      0.00000      0.00000
$$ [...]
C       0.00000      0.67022      0.96140      0.00000      0.03000      0.05000
C       0.00000     -0.67022      0.96140      0.00000      0.03000     -0.05000
Cl      0.00000     -1.65604     -0.45085      0.00000      0.00000      0.00000
H       0.00000     -1.25420      1.89597      0.00000     -0.37000      0.60001
Cl      0.00000      1.65604     -0.45085      0.00000      0.00000      0.00000
H       0.00000      1.25420      1.89597      0.00000     -0.37000     -0.60001
6
Model[14]: IRIntensity=4.5509 KM/Mole;PATH=Calculation 1;FrequenciesFrequencies;ReducedMass=1.1026 AMU;ForceConstant=6.4650 mDyne/A;FreqValue=3154.6217;Frequency=3154.6217 cm^-1;FrequencyLabel=A1;PATH=Calculation 1;FrequenciesFrequencies
C       0.00000      0.67022      0.96140      0.00000      0.04000      0.05000
C       0.00000     -0.67022      0.96140      0.00000     -0.04000      0.05000
Cl      0.00000     -1.65604     -0.45085      0.00000      0.00000      0.00000
H       0.00000     -1.25420      1.89597      0.00000      0.38000     -0.59000
Cl      0.00000      1.65604     -0.45085      0.00000      0.00000      0.00000
H       0.00000      1.25420      1.89597      0.00000     -0.38000     -0.59000
</ModelData>
</Models>
##$PEAKS=
<Peaks type="IR" xUnitsExpected="1/cm"  >
<PeakData id="1" title="B2-asymm stretch of C-H group (~3160 cm-1)" peakShape="broad" model="C1.13" xMax="3175" xMin="3145"    />
<PeakData id="2" title="A1-symm stretch of C-H group (~3160 cm-1)" peakShape="broad" model="C1.14" xMax="3145" xMin="3115"    />
<PeakData id="3" title="A1- C=C stretch (~1740 cm-1)" peakShape="broad" model="C1.12" xMax="1760" xMin="1720"    />
<PeakData id="4" title="B2-asymm C-H bend (~1510 cm-1)" peakShape="broad" model="C1.11" xMax="1540" xMin="1515"    />
<PeakData id="5" title="A1- C-H scissors (~1510 cm-1)" peakShape="broad" model="C1.10" xMax="1370" xMin="1340"    />
<PeakData id="6" title="A2-symm C-H rocking (~1360 cm-1)" peakShape="broad" model="C1.9" xMax="1160" xMin="1130"    />
<PeakData id="7" title="B1-asym C-H flap (~960 cm-1)" peakShape="broad" model="C1.9" xMax="975" xMin="960"    />
<PeakData id="8" title="A1-symm stretch of C-Cl group (~960 cm-1)" peakShape="broad" model="C1.6" xMax="795" xMin="755"    />
<PeakData id="9" title="B1-asymm stretch of C-Cl group (~765 cm-1)" peakShape="broad" model="C1.7" xMax="720" xMin="670"    />
<PeakData id="10" title="B2-asymm bend of C-Cl group (~615 cm-1)" peakShape="broad" model="C1.4" xMax="635" xMin="605"    />
<PeakData id="11" title="Inactive A2- Cl-C=C-Cl torsion (~510 cm-1)" peakShape="broad" model="C1.5" xMax="520" xMin="480"    />
<PeakData id="12" title="A1-symm bend of C-Cl group (~173 cm-1)" peakShape="broad" model="C1.3" xMax="205" xMin="165"    />
</Peaks>
##XUNITS= 1/CM
##YUNITS= TRANSMITTANCE
##XFACTOR= 1
##YFACTOR= 9.999000E-07
##FIRSTX= 3.489600E+03
##FIRSTY= 9.905498E-01
##LASTX= 1.330873E+02
##NPOINTS= 2001
##MINY= 10.000000E-05
##MAXY= 1
##XYDATA= (X++(Y..Y))
3489.5996I90649n31n80o33o94p64q44r35j042j166j312j484j689j938I74797
$$ 990649 990118 989538 988905 988211 987447 986603 985668 984626 983460 982148 980664 978975 977037 974797
3464.4255I72185l078l670m431n434o776q618j1203j4915k0341k8289H25957
$$ 972185 969107 965437 961006 955572 948796 940178 928975 914060 893719 865430 825957
3444.2866G73122o0703m5280o24L9050M6441L3560J6764J469j2562k7020G20471
$$ 773122 712419 667139 666515 705565 752006 785566 802330 803799 791237 764217 720471
3424.1475F56344q7546j07318j06062o5193P284P6971J11846J09302Q9429G53037
$$ 656344 568798 461480 355418 290225 297509 374480 486326 595628 685057 753037
3405.6868H03575L7625K8338K1674J6847J3303J0661Q658P120N920M972I62909
$$ 803575 841200 869538 891212 908059 921362 932023 940681 947801 953721 958693 962909
3385.5476I66512L103K692K349K063J821J615J439J289J158J044R45Q58I87670
$$ 966512 969615 972307 974656 976719 978540 980155 981594 982883 984041 985085 986030 986888 987670
3362.052I88384O54O00N52N10M71M36M05L77L51L27L06K86K68J117K09I95449
$$ 988384 989038 989638 990190 990700 991171 991607 992012 992389 992740 993067 993373 993659 993927 995044 995253 995449
3333.5217I95634J74J64J54J47J38J31J24J18J11J07L098%Z17q459k90I91046
1937.2126I90725l39l57l78l99m22m47m75n04n35n70o07o49o92p42p95I81961
$$ 990725 990386 990029 989651 989252 988830 988383 987908 987404 986869 986299 985692 985043 984351 983609 982814 981961
1908.6823I81043r89j068j154j252j359j480j614j766j938k131k351k603I58448
$$ 981043 980054 978986 977832 976580 975221 973741 972127 970361 968423 966292 963941 961338 958448
1885.1866I55226l606m050m572n184n908o770p803r051j0570j2433j4741H52918
$$ 955226 951620 947570 942998 937814 931906 925136 917333 908282 897712 885279 870538 852918
1863.3694H31671k5852l1738l9294m8977o1233p6223r3126j08669j15194A29511
$$ 831671 805819 774081 734787 685810 624577 548354 455228 346559 231365 129511
1844.9086F3068k6991K297L3071P3490J05895J15194J06368R0191P3475F94994
$$ 63068 36077 38374 71445 144935 250830 366024 472392 562583 636058 694994
1826.4478G42141L7862L0623K4982K0563J7079J4309J2086J0287Q820I26364
$$ 742141 780003 810626 835608 856171 873250 887559 899645 909932 918752 926364
1807.9869I32975N775N072M476L970L535L162K839K557K311K096J907I72414
$$ 932975 938750 943822 948298 952268 955803 958965 961804 964361 966672 968768 970675 972414
1786.1696I74004J458J340J234J139J054R76R06Q43P86P33O85O41O00I86963
$$ 974004 975462 976802 978036 979175 980229 981205 982111 982954 983740 984473 985158 985799 986399 986963
1760.9957I87493M98M70M43M18L95L74L54L36L19L02K88Q410%S05j0326I89420
$$ 987493 987991 988461 988904 989322 989717 990091 990445 990781 991100 991402 991690 1000100 1000100 1000100 1000100 1000100 1000100 1000100 1000100 1000100 1000100 1000100 1000100 1000100 1000100 1000100 1000100 1000100 1000100 1000100 1000100 1000100 1000100 1000100 1000100 1000100 1000100 1000100 1000100 1000100 1000100 1000100 1000100 1000100 1000100 1000100 1000100 1000100 1000100 1000100 1000100 1000100 1000100 1000100 1000100 1000100 1000100 1000100 1000100 1000100 1000100 1000100 1000100 1000100 1000100 1000100 1000100 1000100 1000100 1000100 1000100 1000100 1000100 1000100 1000100 1000100 1000100 1000100 1000100 1000100 1000100 1000100 1000100 1000100 1000100 1000100 1000100 1000100 1000100 1000100 1000100 1000100 1000100 1000100 1000100 1000100 1000100 1000100 1000100 1000100 1000100 1000100 1000100 1000100 1000100 1000100 1000100 1000100 1000100 1000100 1000100 1000100 1000100 1000100 1000100 1000100 1000100 989774 989420
1559.605I89048l92m13m36m60m87n14n46n78o13o53o94p40p90q43r03I79018
$$ 989048 988656 988243 987807 987347 986860 986346 985800 985222 984609 983956 983262 982522 981732 980889 979986 979018
1531.0746I77979j117j203j298j404j522j652j797j961k144k351k585I56094
$$ 977979 976862 975659 974361 972957 971435 969783 967986 966025 963881 961530 958945 956094
1509.2573I52941l500l899m359m893n517o249p112q137r363j0838j2626H61637
$$ 952941 949441 945542 941183 936290 930773 924524 917412 909275 899912 889074 876448 861637
1487.44H44139k0831k4992l0217l6805m5102n5469o8115q2726r7620B73917
$$ 844139 823308 798316 768099 731294 686192 630723 562608 479882 382262 273917
1468.9791A67182q4907m8123j6894J352K1163N4629R0124J08306J07115D95141
$$ 167182 82275 34152 17258 18610 39773 94402 184526 292832 399947 495141
1450.5183E75271O5789N3533M3544L5534K9233K4208K0205J6994J4402H91006
$$ 575271 641060 694593 738137 773671 802904 827112 847317 864311 878713 891006
1432.0575I01568R135P946O951O112N400M793M273L823L434L095K799I61868
$$ 901568 910703 918649 925600 931712 937112 941905 946178 950001 953435 956530 959329 961868
1410.2402I64177K107J926J766J623J494J378J274J179J094J016R45Q80I81680
$$ 964177 966284 968210 969976 971599 973093 974471 975745 976924 978018 979034 979979 980859 981680
1386.7446I82445P15O67O24N82N43N07M71M37M02L69L33K95K54K07J0073I98685
$$ 982445 983160 983827 984451 985033 985576 986083 986554 986991 987393 987762 988095 988390 988644 988851 998924 998685
1358.2142I98369m29n96q52j247j845k644l268k530K80K816L214K500I95494
$$ 998369 997940 997344 996492 995245 993400 990756 987488 984958 985238 988054 991268 993768 995494
1334.7186I96661Q00N63M06L01K28J77J39J12R0P5O2N2M4L8L3K8K5K2I99875
$$ 996661 997461 998024 998430 998731 998959 999136 999275 999387 999477 999552 999614 999666 999710 999748 999781 999809 999834 999856 999875
1301.1536I99892J5J4J2J1J0RQTOPONTMNMLMLUKLKXJKJKJL9%S23k3275I76033
1030.9543I75201q77r23r74j028j085j148j215j287j366j451j542j642I58912
$$ 975201 974324 973401 972427 971399 970314 969166 967951 966664 965298 963847 962305 960663 958912
1007.45874I57044j997k139k292k462k647k853l079l330l608l917m263I19808
$$ 957044 955047 952908 950616 948154 945507 942654 939575 936245 932637 928720 924457 919808
985.6414I14726n570o120o743p452q259r183j0245j1469j2887j4533H05811
$$ 914726 909156 903036 896293 888841 880582 871399 861154 849685 836798 822265 805811
965.5023G87109k1343k4451k8117l2439l7518m3449n0276n7931o6110C51415
$$ 787109 765766 741315 713198 680759 643241 599792 549516 491585 425475 351415
947.0415B71153q2134p6193n9857l5690j3820k988l71J9N46M060J6891F1633
$$ 271153 189019 112826 52969 17279 3459 471 100 119 665 4725 21616 61633
925.2242A25018P7914Q2266P9420P2768N6692N5364M7886M1255L5508G04677
$$ 125018 202932 285198 364618 437386 494078 549442 597328 638583 674091 704677
906.76337G31074K2837J9808J7226J5016J3115J1474J0048Q800P705O732H69701
$$ 731074 753911 773719 790945 805961 819076 830550 840598 849398 857103 863835 869701
886.62427H74788M379L732L133K573K044J536J045N61P8o808j125j654H82070
$$ 874788 879167 882899 886032 888605 890649 892185 893230 893791 893869 887061 885936 884282 882070
863.1287H79260l456m164m948n825o816p946r247j0756j2521j4602j7070G61890
$$ 879260 875804 871640 866692 860867 854051 846105 836858 826102 813581 798979 781909 761890
841.3114G38327k7838l3009l9256m6754m3329o7548p8379q8165r3502A31455
$$ 738327 710489 677480 638224 591470 548141 480593 402214 314049 220547 131455
822.8506F1107m0756j5145l400K19M521J8342M5145P2619Q7559Q8705D00148
$$ 61107 20351 5206 1806 2025 6546 24888 70033 142652 230211 318916 400148
802.7115D70280N8380M7337L7430K8638K0741J3439O392p67q459j7166F28784
$$ 470280 528660 575997 613427 642065 662806 676245 682637 681870 673411 656245 628784
782.5724E88819n5199p3072r1611j04741j01346p3699l3262L294M1399A83738
$$ 588819 533620 460548 368937 264196 162850 89151 55889 59183 100582 183738
764.1116B93317J11878R9163Q2004O5859N2457M1878L3684K7358K2455H48678
$$ 293317 405195 504358 586362 652221 704678 746556 780240 807598 830053 848678
745.65076H64284J3202J1267R695Q407P340O451N703N069M529M065L664I46993
$$ 864284 877486 888753 898448 906855 914195 920646 926349 931418 935947 940012 943676 946993
723.83344I50007K747N75K233K046J6823J268J151J046R50Q65P86P13I81857
$$ 950007 952754 953329 955562 957608 974431 975699 976850 977896 978846 979711 980497 981210 981857
700.3379I82443N28M75M24L76L30K86K42K01J58J17P4L2j3o0j08j61I85128
$$ 982443 982971 983446 983870 984246 984576 984862 985104 985305 985463 985580 985654 985686 985673 985613 985505 985344 985128
670.1293I84851O484o40p13p97q94j007j141j298j487j712j986k319I74610
$$ 984851 991335 990695 989982 989185 988291 987284 986143 984845 983358 981646 979660 977341 974610
646.63367I71366l891m717n788p197r079j1642j5194k0204k7375l7697G76284
$$ 971366 967475 962758 956970 949773 940694 929052 913858 893654 866279 828582 776284
626.49457G04812r1280r6952o4568O721P3478R8047Q8296O7936M9455H71600
$$ 704812 613532 516580 452012 458733 532211 630258 718554 786490 835945 871600
608.03375H97554J9215J4497J1143Q716O925N584M561L769L147K654K257I81957
$$ 897554 916769 931266 942409 951125 958050 963634 968195 971964 975111 977765 980022 981957
586.21643I83628J452J269J117R86Q76P81P00O29N68N13M67M25L88L55I94481
$$ 983628 985080 986349 987466 988452 989328 990109 990809 991438 992006 992519 992986 993411 993799 994154 994481
559.3644I94781K77K56K36K20K04J91J77J66J55J45J36J28J20J13J07I97513
$$ 994781 995058 995314 995550 995770 995974 996165 996342 996508 996663 996808 996944 997072 997192 997305 997412 997513
530.834I97608R0Q6Q0P7P3O9K017%S40j28mnmonoUpTqTrTj0Tj2Tj3I99811
247.20871I99796j7Tj9k1k3k5k7l0l4l6m1m5n1n6o4p3q3r5j09j27j49I98479
$$ 999796 999779 999762 999743 999722 999699 999674 999647 999617 999583 999547 999506 999461 999410 999354 999290 999217 999134 999039 998930 998803 998654 998479
208.60883I98269k51l07l78m73o02p79j031j396j940k768m041n957q491I59427
$$ 998269 998018 997711 997333 996860 996258 995479 994448 993052 991112 988344 984303 978346 969855 959427
183.43498I51410Q83Q933J0270Q038N577L783K599J830J324R81P44N77I97404
$$ 951410 952293 961226 971496 979534 985111 988894 991493 993323 994647 995628 996372 996949 997404
159.93939I97768K96K44K03J70J45J24J07R2Q1P1O3N6M9M5I99553
$$ 997768 998064 998308 998511 998681 998826 998950 999057 999149 999230 999301 999364 999420 999469 999514 999553
133.0873I99589  $$checkpoint
##END= $$ end of cis-DCE IR
##TITLE=Raman of cis-1,2-dichloroethylene (Z) $$ Begin of the data block
##JCAMP-DX=5.00 $$ ACD/DocManager Library v 5.00
##DATA TYPE=RAMAN SPECTRUM
##DATA CLASS=XYDATA
##BLOCK ID=2
##DATE=19 Feb 2012 10:29:22
##ORIGIN= Department of Chemistry, UWI, Jamaica
##OWNER= public domain
##SPECTROMETER/DATA SYSTEM=from scan
##$MODELS=
<Models>
<ModelData id="cDCE" type="MOL">
cis-1,2-dichloroethylene (Z)
__Jmol-14_02171521233D 1   1.00000     0.00000     0
Jmol version 14.3.12_2015.02.11  2015-02-11 19:15 EXTRACT: ({0:5})
  6  5  0  0  0  0              1 V2000
   0.00000   0.67022   0.96140 C   0  0  0  0  0  0
   0.00000  -0.67022   0.96140 C   0  0  0  0  0  0
   0.00000  -1.65604  -0.45086 Cl  0  0  0  0  0  0
   0.00000  -1.25420   1.89597 H   0  0  0  0  0  0
   0.00000   1.65604  -0.45086 Cl  0  0  0  0  0  0
   0.00000   1.25420   1.89597 H   0  0  0  0  0  0
  1  6  1  0  0  0
  1  5  1  0  0  0
  1  2  2  0  0  0
  2  3  1  0  0  0
  2  4  1  0  0  0
M  END
</ModelData>
<ModelData id="C2" type="XYZVIB" baseModel="cDCE" vibrationScale=".5">
6
Model[1]: PATH=Calculation 1;Input;Convg=0.9764D-08;-V/T=2.0006;Energy=NaN;Range=M.O.s;E(RHF)=-995.827490213 A.U.;PATH=Calculation 1;Input
C       0.00000      0.00000      0.00000
C       0.00000      0.00000      1.34044
Cl      1.41224      0.00000      2.32626
H      -0.93457      0.00000      1.92442
Cl      1.41224      0.00000     -0.98582
H      -0.93457      0.00000     -0.58398
6
Model[2]: PATH=Calculation 1;Standard;Convg=0.9764D-08;-V/T=2.0006;Energy=-995.8275;Range=M.O.s;E(RHF)=-995.827490213 A.U.;PATH=Calculation 1;Standard
C       0.00000      0.67022      0.96140
C       0.00000     -0.67022      0.96140
Cl      0.00000     -1.65604     -0.45085
H       0.00000     -1.25420      1.89597
Cl      0.00000      1.65604     -0.45085
H       0.00000      1.25420      1.89597
6
Model[3]: IRIntensity=0.4101 KM/Mole;PATH=Calculation 1;FrequenciesFrequencies;ReducedMass=27.0583 AMU;ForceConstant=0.5615 mDyne/A;FreqValue=187.6781;Frequency=187.6781 cm^-1;FrequencyLabel=A1;PATH=Calculation 1;FrequenciesFrequencies
C       0.00000      0.67022      0.96140      0.00000     -0.01000      0.28000
C       0.00000     -0.67022      0.96140      0.00000      0.01000      0.28000
Cl      0.00000     -1.65604     -0.45085      0.00000      0.59000     -0.10000
H       0.00000     -1.25420      1.89597      0.00000     -0.20001      0.15001
Cl      0.00000      1.65604     -0.45085      0.00000     -0.59000     -0.10000
H       0.00000      1.25420      1.89597      0.00000      0.20001      0.15001
6
Model[4]: IRIntensity=0.0000 KM/Mole;PATH=Calculation 1;FrequenciesFrequencies;ReducedMass=4.0875 AMU;ForceConstant=0.6230 mDyne/A;FreqValue=508.6316;Frequency=508.6316 cm^-1;FrequencyLabel=A2;PATH=Calculation 1;FrequenciesFrequencies
C       0.00000      0.67022      0.96140      0.36001      0.00000      0.00000
C       0.00000     -0.67022      0.96140     -0.36001      0.00000      0.00000
Cl      0.00000     -1.65604     -0.45085      0.06000      0.00000      0.00000
H       0.00000     -1.25420      1.89597     -0.61000      0.00000      0.00000
Cl      0.00000      1.65604     -0.45085     -0.06000      0.00000      0.00000
H       0.00000      1.25420      1.89597      0.61000      0.00000      0.00000
6
Model[5]: IRIntensity=10.3585 KM/Mole;PATH=Calculation 1;FrequenciesFrequencies;ReducedMass=9.1362 AMU;ForceConstant=2.0412 mDyne/A;FreqValue=615.7893;Frequency=615.7893 cm^-1;FrequencyLabel=B2;PATH=Calculation 1;FrequenciesFrequencies
C       0.00000      0.67022      0.96140      0.00000      0.45000      0.20001
C       0.00000     -0.67022      0.96140      0.00000      0.45000     -0.20001
Cl      0.00000     -1.65604     -0.45085      0.00000     -0.17000     -0.12000
H       0.00000     -1.25420      1.89597      0.00000      0.40000     -0.24000
Cl      0.00000      1.65604     -0.45085      0.00000     -0.17000      0.12000
H       0.00000      1.25420      1.89597      0.00000      0.40000      0.24000
6
Model[6]: IRIntensity=28.3460 KM/Mole;PATH=Calculation 1;FrequenciesFrequencies;ReducedMass=9.1109 AMU;ForceConstant=3.1990 mDyne/A;FreqValue=771.9739;Frequency=771.9739 cm^-1;FrequencyLabel=A1;PATH=Calculation 1;FrequenciesFrequencies
C       0.00000      0.67022      0.96140      0.00000      0.07000      0.48000
C       0.00000     -0.67022      0.96140      0.00000     -0.07000      0.48000
Cl      0.00000     -1.65604     -0.45085      0.00000     -0.11000     -0.17000
H       0.00000     -1.25420      1.89597      0.00000     -0.33001      0.34000
Cl      0.00000      1.65604     -0.45085      0.00000      0.11000     -0.17000
H       0.00000      1.25420      1.89597      0.00000      0.33001      0.34000
6
Model[7]: IRIntensity=89.5375 KM/Mole;PATH=Calculation 1;FrequenciesFrequencies;ReducedMass=4.6319 AMU;ForceConstant=2.4956 mDyne/A;FreqValue=956.2813;Frequency=956.2813 cm^-1;FrequencyLabel=B2;PATH=Calculation 1;FrequenciesFrequencies
C       0.00000      0.67022      0.96140      0.00000     -0.06000      0.36001
C       0.00000     -0.67022      0.96140      0.00000     -0.06000     -0.36001
Cl      0.00000     -1.65604     -0.45085      0.00000      0.03000      0.09000
H       0.00000     -1.25420      1.89597      0.00000     -0.30001     -0.52000
Cl      0.00000      1.65604     -0.45085      0.00000      0.03000     -0.09000
H       0.00000      1.25420      1.89597      0.00000     -0.30001      0.52000
6
Model[8]: IRIntensity=61.4963 KM/Mole;PATH=Calculation 1;FrequenciesFrequencies;ReducedMass=1.2299 AMU;ForceConstant=0.6661 mDyne/A;FreqValue=958.7349;Frequency=958.7349 cm^-1;FrequencyLabel=B1;PATH=Calculation 1;FrequenciesFrequencies
C       0.00000      0.67022      0.96140      0.10000      0.00000      0.00000
C       0.00000     -0.67022      0.96140      0.10000      0.00000      0.00000
Cl      0.00000     -1.65604     -0.45085     -0.01000      0.00000      0.00000
H       0.00000     -1.25420      1.89597     -0.70000      0.00000      0.00000
Cl      0.00000      1.65604     -0.45085     -0.01000      0.00000      0.00000
H       0.00000      1.25420      1.89597     -0.70000      0.00000      0.00000
6
Model[9]: IRIntensity=0.0000 KM/Mole;PATH=Calculation 1;FrequenciesFrequencies;ReducedMass=1.2297 AMU;ForceConstant=0.9509 mDyne/A;FreqValue=1145.6135;Frequency=1145.6135 cm^-1;FrequencyLabel=A2;PATH=Calculation 1;FrequenciesFrequencies
C       0.00000      0.67022      0.96140     -0.10000      0.00000      0.00000
C       0.00000     -0.67022      0.96140      0.10000      0.00000      0.00000
Cl      0.00000     -1.65604     -0.45085      0.00000      0.00000      0.00000
H       0.00000     -1.25420      1.89597     -0.70000      0.00000      0.00000
Cl      0.00000      1.65604     -0.45085      0.00000      0.00000      0.00000
H       0.00000      1.25420      1.89597      0.70000      0.00000      0.00000
6
Model[10]: IRIntensity=0.2406 KM/Mole;PATH=Calculation 1;FrequenciesFrequencies;ReducedMass=1.1165 AMU;ForceConstant=1.2298 mDyne/A;FreqValue=1367.2548;Frequency=1367.2548 cm^-1;FrequencyLabel=A1;PATH=Calculation 1;FrequenciesFrequencies
C       0.00000      0.67022      0.96140      0.00000     -0.07000      0.01000
C       0.00000     -0.67022      0.96140      0.00000      0.07000      0.01000
Cl      0.00000     -1.65604     -0.45085      0.00000      0.00000     -0.01000
H       0.00000     -1.25420      1.89597      0.00000      0.61000      0.35000
Cl      0.00000      1.65604     -0.45085      0.00000      0.00000     -0.01000
H       0.00000      1.25420      1.89597      0.00000     -0.61000      0.35000
6
Model[11]: IRIntensity=29.7008 KM/Mole;PATH=Calculation 1;FrequenciesFrequencies;ReducedMass=1.2161 AMU;ForceConstant=1.6354 mDyne/A;FreqValue=1510.7919;Frequency=1510.7919 cm^-1;FrequencyLabel=B2;PATH=Calculation 1;FrequenciesFrequencies
C       0.00000      0.67022      0.96140      0.00000      0.06000     -0.08000
C       0.00000     -0.67022      0.96140      0.00000      0.06000      0.08000
Cl      0.00000     -1.65604     -0.45085      0.00000      0.00000      0.00000
H       0.00000     -1.25420      1.89597      0.00000     -0.61000     -0.35000
Cl      0.00000      1.65604     -0.45085      0.00000      0.00000      0.00000
H       0.00000      1.25420      1.89597      0.00000     -0.61000      0.35000
6
Model[12]: IRIntensity=32.4323 KM/Mole;PATH=Calculation 1;FrequenciesFrequencies;ReducedMass=5.0880 AMU;ForceConstant=9.0352 mDyne/A;FreqValue=1736.0748;Frequency=1736.0748 cm^-1;FrequencyLabel=A1;PATH=Calculation 1;FrequenciesFrequencies
C       0.00000      0.67022      0.96140      0.00000      0.43000     -0.06000
C       0.00000     -0.67022      0.96140      0.00000     -0.43000     -0.06000
Cl      0.00000     -1.65604     -0.45085      0.00000      0.01000      0.01000
H       0.00000     -1.25420      1.89597      0.00000      0.29000      0.48000
Cl      0.00000      1.65604     -0.45085      0.00000     -0.01000      0.01000
H       0.00000      1.25420      1.89597      0.00000     -0.29000      0.48000
6
Model[13]: IRIntensity=11.5546 KM/Mole;PATH=Calculation 1;FrequenciesFrequencies;ReducedMass=1.0869 AMU;ForceConstant=6.2829 mDyne/A;FreqValue=3132.2904;Frequency=3132.2904 cm^-1;FrequencyLabel=B2;PATH=Calculation 1;FrequenciesFrequencies
C       0.00000      0.67022      0.96140      0.00000      0.03000      0.05000
C       0.00000     -0.67022      0.96140      0.00000      0.03000     -0.05000
Cl      0.00000     -1.65604     -0.45085      0.00000      0.00000      0.00000
H       0.00000     -1.25420      1.89597      0.00000     -0.37000      0.60001
Cl      0.00000      1.65604     -0.45085      0.00000      0.00000      0.00000
H       0.00000      1.25420      1.89597      0.00000     -0.37000     -0.60001
6
Model[14]: IRIntensity=4.5509 KM/Mole;PATH=Calculation 1;FrequenciesFrequencies;ReducedMass=1.1026 AMU;ForceConstant=6.4650 mDyne/A;FreqValue=3154.6217;Frequency=3154.6217 cm^-1;FrequencyLabel=A1;PATH=Calculation 1;FrequenciesFrequencies
C       0.00000      0.67022      0.96140      0.00000      0.04000      0.05000
C       0.00000     -0.67022      0.96140      0.00000     -0.04000      0.05000
Cl      0.00000     -1.65604     -0.45085      0.00000      0.00000      0.00000
H       0.00000     -1.25420      1.89597      0.00000      0.38000     -0.59000
Cl      0.00000      1.65604     -0.45085      0.00000      0.00000      0.00000
H       0.00000      1.25420      1.89597      0.00000     -0.38000     -0.59000
</ModelData>
</Models>
##$PEAKS=
<Peaks type="RAMAN" xUnitsExpected="1/cm"  >
<PeakData id="1" title="B1-asymm stretch of C-H group (~3160 cm-1)" peakShape="broad" model="C2.13" xMax="3175" xMin="3145"    />
<PeakData id="2" title="A1-symm stretch of C-H group (~3160 cm-1)" peakShape="broad" model="C2.14" xMax="3145" xMin="3115"    />
<PeakData id="3" title="A1- C=C stretch (~1740 cm-1)" peakShape="broad" model="C2.12" xMax="1760" xMin="1720"    />
<PeakData id="4" title="B1-asymm C-H bend (~1510 cm-1)" peakShape="broad" model="C2.11" xMax="1540" xMin="1515"    />
<PeakData id="5" title="A1- C-H scissors (~1510 cm-1)" peakShape="broad" model="C2.10" xMax="1370" xMin="1340"    />
<PeakData id="6" title="A2-symm C-H rocking (~1360 cm-1)" peakShape="broad" model="C2.8" xMax="1160" xMin="1130"    />
<PeakData id="7" title="B2-asym C-H flap (~960 cm-1)" peakShape="broad" model="C2.9" xMax="975" xMin="960"    />
<PeakData id="8" title="A1-symm stretch of C-Cl group (~960 cm-1)" peakShape="broad" model="C2.6" xMax="795" xMin="755"    />
<PeakData id="9" title="B1-asymm stretch of C-Cl group (~765 cm-1)" peakShape="broad" model="C2.7" xMax="720" xMin="670"    />
<PeakData id="10" title="B2-asymm bend of C-Cl group (~615 cm-1)" peakShape="broad" model="C2.4" xMax="635" xMin="605"    />
<PeakData id="11" title="A2- Cl-C=C-Cl torsion (~510 cm-1)" peakShape="broad" model="C2.5" xMax="520" xMin="480"    />
<PeakData id="12" title="A1-symm bend of C-Cl group (~173 cm-1)" peakShape="broad" model="C2.3" xMax="205" xMin="165"    />
</Peaks>
##XUNITS=1/CM
##YUNITS=RAMAN INTENSITY
##XFACTOR= 1
##YFACTOR= 9.202128E-07
##FIRSTX= 3.352938E+03
##FIRSTY= 1.064559E-02
##LASTX= -1.232190E+01
##NPOINTS= 2000
##MINY= 0
##MAXY= 9.202128E-01
##XYDATA= (X++(Y..Y))
3352.9382A1569J91J97K02K06K12K18K23K29K35K42K48K55K61K70K76A5319
$$ 11569 11760 11957 12159 12365 12577 12795 13018 13247 13482 13724 13972 14227 14488 14758 15034 15319
3324.319A5611L02L09L19L29L38L49L59L71L82L94M07M20M33M48M63B1712
$$ 15611 15913 16222 16541 16870 17208 17557 17916 18287 18669 19063 19470 19890 20323 20771 21234 21712
3295.7002B2207N12N29N48N68N89O10O32O56O81P07P35P64P94Q26Q60C3114
$$ 22207 22719 23248 23796 24364 24953 25563 26195 26851 27532 28239 28974 29738 30532 31358 32218 33114
3267.081C4047R73J016J060J107J158J210J267J326J391J458J530J607E0840
$$ 34047 35020 36036 37096 38203 39361 40571 41838 43164 44555 46013 47543 49150 50840
3243.5125E2617J872J972K080K195K321K454K598K754K922L104L301L513H7449
$$ 52617 54489 56461 58541 60736 63057 65511 68109 70863 73785 76889 80190 83703 87449
3219.9438I1447M272M572M899N257N649O081O555P078P654Q291Q997R779A81179
$$ 91447 95719 100291 105190 110447 116096 122177 128732 135810 143464 151755 160752 170531 181179
3196.3752A92792J2689J3885J5220J6708J8366K0209K2258K4524K7019C93414
$$ 192792 205481 219366 234586 251294 269660 289869 312127 336651 363670 393414
3177.8572D26105L5828L9101M2411M5610M8487N0760N2075N2041N0265H89121
$$ 426105 461933 501034 543445 589055 637542 688302 740377 792418 842683 889121
3159.3389I29563L2433K2898J2609K497o543j3833j9029k2146k3495k3587H68348
$$ 929563 961996 984894 997503 1000000 993457 979624 960595 938449 914954 891367 868348
3139.1372H45972k2154k2685k4100k6310k9034l1878l4428l6349l7441E43941
$$ 845972 823818 801133 777033 750723 721689 689811 655383 619034 581593 543941
3120.6191E06887l5790l4041l1981k9756k7488k5258k3124k1121j9266B41498
$$ 506887 471097 437056 405075 375319 347831 322573 299449 278328 259062 241498
3102.1008B25484j4609j3338j2194j1161j0233r395q641p961p346o789A17531
$$ 225484 210875 197537 185343 174182 163949 154554 145913 137952 130606 123817 117531
3081.8992A11701n414n036m692m378m090l827l586l363l159k971k796F5752
$$ 111701 106287 101251 96559 92181 88091 84264 80678 77315 74156 71185 68389 65752
3060.0142F3265k350k222k103j992j890j793j703j620j541j468j399j334D0577
$$ 63265 60915 58693 56590 54598 52708 50915 49212 47592 46051 44583 43184 41850 40577
3036.4456C9360j162j112j064j019r76r36q98q62q28p96p65p35p08o82B6160
$$ 39360 38198 37086 36022 35003 34027 33091 32193 31331 30503 29707 28942 28207 27499 26817 26160
3009.51B5527o10n88n68n49n29n12m94m79m62m48m33m20m06l94l81A7884
$$ 25527 24917 24329 23761 23212 22683 22171 21677 21198 20736 20288 19855 19435 19029 18635 18254 17884
2980.8909A7525l49l38l28l18l10l00k92k85k76k68k62k54k48k41k35A2993
$$ 17525 17176 16838 16510 16192 15882 15582 15290 15005 14729 14461 14199 13945 13697 13456 13221 12993
2952.272A2770k17k12k06k01j96j92j87j82j78j74j69j66j62j58j54I865
$$ 12770 12553 12341 12135 11934 11738 11546 11359 11177 10999 10825 10656 10490 10328 10170 10016 9865
2923.6528I717j44j41j39j35j32j29j26j24j22j18j17j13j12j09j07j05G641
$$ 9717 9573 9432 9293 9158 9026 8897 8771 8647 8525 8407 8290 8177 8065 7956 7849 7744 7641
2893.3503G540r9r6r5r4r1r0q8q6q4Tq1q0p9p7p6p4p3p2p1o9o8o7o6o5E552
$$ 7540 7441 7345 7250 7156 7065 6975 6887 6801 6717 6633 6552 6472 6393 6316 6240 6166 6093 6021 5950 5881 5813 5746 5680 5615 5552
2849.58E489o1Tn9Tn7Tn5Tn4n3n2n1Tn0m9m8m7Tm6m5Tm4m3Tm2m1Tm0D053
$$ 5489 5428 5367 5308 5249 5192 5135 5080 5025 4971 4918 4866 4815 4764 4714 4665 4617 4570 4523 4477 4432 4387 4343 4300 4257 4215 4174 4133 4093 4053
2799.076D014l8Ul6l7l6l5Tl4Tl3Ul2Tl1Tl0Uk9Tk8Uk7k071rj0rj0rA042
$$ 4014 3976 3938 3900 3864 3827 3791 3756 3721 3687 3653 3620 3587 3554 3522 3490 3459 3428 3398 3368 3338 3309 3280 3252 3224 3196 3169 1098 1089 1079 1070 1060 1051 1042
2741.838A033rTqrqTr82%U52O24NONTOTNOYPOPOPZQPQXRQRTQRJ0RTJ0I49
2058.3484I59J0UJ1TJ0J2J1TJ2WJ3VJ4J3J4J5J4J5UJ6J5J7J6J7UJ8UJ9A489
$$ 959 969 979 989 1000 1011 1021 1033 1044 1055 1067 1079 1091 1103 1115 1128 1141 1154 1167 1181 1194 1208 1223 1237 1252 1267 1282 1298 1313 1330 1346 1363 1380 1397 1415 1433 1451 1470 1489
1992.693A509K0TK1UK2K3K2K4UK5TK6K7UK9UL0L1L2TL3L4L5L6TL7L8B409
$$ 1509 1529 1549 1570 1591 1612 1634 1657 1679 1703 1727 1751 1776 1801 1827 1854 1881 1908 1937 1966 1995 2025 2056 2088 2120 2153 2187 2222 2258 2294 2331 2369 2409
1937.1384B449M1M2M3M5TM7M8M9N0N2N4N5N6N8N9O6O3O5O7O9P1P3P5P8C900
$$ 2449 2490 2532 2575 2620 2665 2712 2760 2809 2859 2911 2965 3020 3076 3134 3193 3259 3322 3387 3454 3523 3594 3667 3742 3820 3900
1893.3682C982Q5Q8R1R4R7J00J04J07J11J15J19J23J27J33J37J43J48F057
$$ 3982 4067 4155 4246 4340 4437 4537 4641 4748 4859 4974 5093 5216 5343 5476 5613 5756 5904 6057
1861.3822F217J66J73J80J87J95K04K12K21K32K41K53K64K77K90L03L19A0269
$$ 6217 6383 6556 6736 6923 7118 7322 7534 7755 7987 8228 8481 8745 9022 9312 9615 9934 10269
1831.0797A0621L69L89M10M32M56M81N08N38N70O04O40O81P24P71Q22A9892
$$ 10621 10990 11379 11789 12221 12677 13158 13666 14204 14774 15378 16018 16699 17423 18194 19016 19892
1802.4607B0830J002J075J153J238J333J437J550J677J815J969K139K328D2084
$$ 20830 21832 22907 24060 25298 26631 28068 29618 31295 33110 35079 37218 39546 42084
1778.8921D4857L033L323L648M011M415M868N849N933O552P234P976Q777A20101
$$ 44857 47890 51213 54861 58872 63287 68155 74004 79937 86489 93723 101699 110476 120101
1755.3235A30604J1379J2208J2923J3437J3642J3417J2640J1217R110B46943
$$ 130604 141983 154191 167114 180551 194193 207610 220250 231467 240577 246943
1736.8053B50072l62l823o974r594j1559j2842j3495j3620j3341j2777A39654
$$ 250072 249710 245887 238913 229319 217760 204918 191423 177803 164462 151685 139654
1716.6036A28466j0308r434q594p806p075o407n801n254m761m320l925E1211
$$ 128466 118158 108724 100130 92324 85249 78842 73041 67787 63026 58706 54781 51211
1694.7185D7959k968k714k484k279k094j927j776j640j517j405j304j210B3514
$$ 47959 44991 42277 39793 37514 35420 33493 31717 30077 28560 27155 25851 24641 23514
1671.1499B2465r79r14q54q01p50p04o61o21n85n52n19m91m63m38m15A2326
$$ 22465 21486 20572 19718 18917 18167 17463 16802 16181 15596 15044 14525 14034 13571 13133 12718 12326
1642.5309A1954l52l34l17l01k87k72k58k47k34k23k13k02j93j84j75G995
$$ 11954 11602 11268 10951 10650 10363 10091 9833 9586 9352 9129 8916 8714 8521 8337 8162 7995
1613.9119G835j52j44j38j32j25j20j14j08j03r8r3q9q3q0p5p1o6o3n9E867
$$ 7835 7683 7539 7401 7269 7144 7024 6910 6802 6699 6601 6508 6419 6336 6256 6181 6110 6044 5981 5922 5867
1578.559E816m8m4m0l7l3k9k6k2j9j5j1plJORJ5K0K4R2L7M3N0N7O5P3F056
$$ 5816 5768 5724 5684 5647 5614 5585 5559 5537 5518 5503 5492 5485 5482 5483 5489 5498 5513 5533 5557 5649 5686 5729 5779 5836 5901 5974 6056
1531.4218F147J00J09J19J27J34J38J39J37J29J16R8P7N5L1J1nj6k1k2G584
$$ 6147 6247 6356 6475 6602 6736 6874 7013 7150 7279 7395 7493 7570 7625 7656 7667 7662 7646 7625 7603 7584
1496.0688G573lQK1L2M5N7P0Q3R4J07J18J31J43J56J67J81J94K08K22I844
$$ 7573 7570 7578 7599 7631 7676 7733 7803 7886 7980 8087 8205 8336 8479 8635 8802 8983 9177 9385 9607 9844
1460.716A0096K69K86L05L24L44L67L90M16M42M72N03N37N74O13O56A7297
$$ 10096 10365 10651 10956 11280 11624 11991 12381 12797 13239 13711 14214 14751 15325 15938 16594 17297
1432.0969A8050Q09Q70R36J009J089J176J274J380J499J629J775J936C5548
$$ 18050 18859 19729 20665 21674 22763 23939 25213 26593 28092 29721 31496 33432 35548
1408.5283C7864K540K789L067L378L724M111M540N015N538O107O722P372A00813
$$ 37864 40404 43193 46260 49638 53362 57473 62013 67028 72566 78673 85395 92767 100813
1384.9597A09532R354R903J0298J0455J0282R687Q595O979M874K391k86A89123
$$ 109532 118886 128789 139087 149542 159824 169511 178106 185085 189959 192350 192064 189123
1363.0746A83765p367q875r794j0359j0455j0241r807r236q589p914p243G7286
$$ 183765 176398 167523 157729 147370 136915 126674 116867 107631 99042 91128 83885 77286
1341.1895G1293n434m921m455m654l653l314l010k739k495k277k082j906B8605
$$ 71293 65859 60938 56483 51829 48176 44862 41852 39113 36618 34341 32259 30353 28605
1317.6208B7000j478j363j257j163j077r99r28q63q04p49p00o54o12n73A3242
$$ 27000 25522 24159 22902 21739 20662 19663 18735 17872 17068 16319 15619 14965 14353 13780 13242
1290.6853A2738m75m45m20l96l72l52l32l13k96k80k64k51k37k24k12G668
$$ 12738 12263 11818 11398 11002 10630 10278 9946 9633 9337 9057 8793 8542 8305 8081 7869 7668
1262.0663G478j80j70j61j52j43j36j27j20j13j06r9r2q6q0p3o7o1n4E409
$$ 7478 7298 7128 6967 6815 6672 6536 6409 6289 6176 6070 5971 5879 5793 5713 5640 5573 5512 5458 5409
1228.3969E366l6l0k4j7j1mMJ0J9K6L5M4N4O4P4Q7J00J13J29J45J63J83F699
$$ 5366 5330 5300 5276 5259 5248 5244 5248 5258 5277 5303 5338 5382 5436 5500 5574 5661 5761 5874 6003 6148 6311 6494 6699
1187.9935F928K56K85L18L55L95M40M91N46O07Q66P50Q29R13R99J085A7230
$$ 6928 7184 7469 7787 8142 8537 8977 9468 10014 10621 11487 12237 13066 13979 14978 16063 17230
1159.3745A8468J288J309J288J214J075Q70O03K88n2l88o96r50j142j266B0581
$$ 18468 19756 21065 22353 23567 24642 25512 26115 26403 26351 25963 25267 24317 23175 21909 20581
1132.439A9240j313j257j183j101j015r28q46p68o97o31n71n17m68m29G130
$$ 19240 17927 16670 15487 14386 13371 12443 11597 10829 10132 9501 8930 8413 7945 7516 7130
1105.5034F780l19k90k64k42k21k02j85j69j56j43j31j20j10j01r3q5C871
$$ 6780 6461 6171 5907 5665 5444 5242 5057 4888 4732 4589 4458 4338 4228 4127 4034 3949 3871
1075.2009C800o4n8n3m7m2l8l2k8k4j9j5j1pkJORJ4J8K3K7L2L7M1M8N2C727
$$ 3800 3736 3678 3625 3578 3536 3498 3466 3438 3414 3395 3380 3369 3362 3360 3361 3367 3376 3390 3408 3431 3458 3490 3527 3568 3616 3668 3727
1028.0637C792P2Q0Q7R5J04J14K11J37J49J64J78J96K13K34K57K82L09G014
$$ 3792 3864 3944 4031 4126 4230 4344 4555 4692 4841 5005 5183 5379 5592 5826 6083 6365 6674 7014
996.0777G388M13M56N03N56O14O80P51Q29R13J001J094J185J272J347B0403
$$ 7388 7801 8257 8760 9316 9930 10610 11361 12190 13103 14104 15198 16383 17655 19002 20403
969.14215B1825J400Q46J176R58O72L36k6l86p13r85j189j322j390j401A8429
$$ 21825 23225 24071 25247 26205 26877 27213 27187 26801 26088 25103 23914 22592 21202 19801 18429
942.2066A7116j235j146j053r62q74p91p14o44n80n22m70m22l81l43F671
$$ 17116 15881 14735 13682 12720 11846 11055 10341 9697 9117 8595 8125 7703 7322 6979 6671
915.27106F393k50k25k02o8j62j44j29j14j01q9p7o6n6m7l7k9k1j2nLD572
$$ 6393 6143 5918 5716 5648 5486 5342 5213 5099 4998 4909 4832 4766 4710 4663 4626 4597 4576 4564 4559 4562 4572
878.2347D589K5L1L9M6N3O1O8P6Q4R3J01J10J19J30J40J50J63J76J88F646
$$ 4589 4614 4645 4684 4730 4783 4844 4912 4988 5072 5165 5266 5376 5495 5625 5765 5915 6078 6254 6442 6646
842.8818F864K35K53K73K93L17L41L68L98M31M66N05N49N96O49P08P72A4863
$$ 6864 7099 7352 7625 7918 8235 8576 8944 9342 9773 10239 10744 11293 11889 12538 13246 14018 14863
812.5793A5788J015J115J227J351J490J645J816K007K216K444K689K951D0973
$$ 15788 16803 17918 19145 20496 21986 23631 25447 27454 29670 32114 34803 37754 40973
789.0107D4462L742L963M120M184M116L877L443K797J957R66j03j162G4234
$$ 44462 48204 52167 56287 60471 64587 68464 71907 74704 76661 77627 77524 76362 74234
765.4421G1305l532l923m123m160m075l900l672l412l142k873k616k372B7296
$$ 71305 67773 63850 59727 55567 51492 47592 43920 40508 37366 34493 31877 29505 27296
741.8735B5355j755j587j434j298j176j065r67q79p99p27o63o04n51A1347
$$ 25355 23600 22013 20579 19281 18105 17040 16073 15194 14395 13668 13005 12401 11850 11347
716.6214A0888m19l83l49l18k89k62k38k14j93j72j52j34j15r8q1o5G358
$$ 10888 10469 10086 9737 9419 9130 8868 8630 8416 8223 8051 7899 7765 7650 7552 7471 7406 7358
686.3189G326j6%J7L4N1P0Q8J08J29J51J75K01K28K58K91L27L67M10A0672
$$ 7326 7310 7310 7327 7361 7412 7482 7570 7678 7807 7958 8133 8334 8562 8820 9111 9438 9805 10215 10672
652.6495A1183N70O35P06P87Q75R70J076J189J307J431J554J671J772B7571
$$ 11183 11753 12388 13094 13881 14756 15726 16802 17991 19298 20729 22283 23954 25726 27571
627.3974B9446J847J743J550J263Q87M46l2n05r35j293j560j732j819B7473
$$ 29446 31293 33036 34586 35849 36736 37182 37150 36645 35710 34417 32857 31125 29306 27473
602.1453B5683j708j601j481j355j229j109r94q87p55o98o15n39m69A1838
$$ 25683 23975 22374 20893 19538 18309 17200 16206 15319 14564 13866 13251 12712 12243 11838
576.89325A1493k91k39j91j45j00n7j5K7O8J12J55J37K48L00L52M11M72A3278
$$ 11493 11202 10963 10772 10627 10527 10470 10455 10482 10550 10662 10817 10954 11202 11502 11854 12265 12737 13278
544.9073A3893O95P85Q84R91J109J240J379J531J690J854K018K172K307C4952
$$ 13893 14588 15373 16257 17248 18357 19597 20976 22507 24197 26051 28069 30241 32548 34952
519.6552C7396K404K265K007J622J122N31j07p39j314j793k152k385C6353
$$ 37396 39800 42065 44072 45694 46816 47347 47240 46501 45187 43394 41242 38857 36353
496.08658C3828k473k369k231k076j914j753j598j453j319j195j084r83A2488
$$ 33828 31355 28986 26755 24679 22765 21012 19414 17961 16642 15447 14363 13380 12488
472.51797A1677p37o73o13n61n14m72m33l99l69l40l15k92k71k52k35D982
$$ 11677 10940 10267 9654 9093 8579 8107 7674 7275 6906 6566 6251 5959 5688 5436 5201 4982
443.89896D778j92j79j68j58j49j40j32j24j17j11j06r9r4r0q5q1p7p3B533
$$ 4778 4586 4407 4239 4081 3932 3792 3660 3536 3419 3308 3202 3103 3009 2919 2834 2753 2676 2603 2533
410.22952B467o4o0n8n5n3n1m8m6m5m2m1l9l8l6l4l3l2l1k9Tk7k6k5k14A290
$$ 2467 2403 2343 2285 2230 2177 2126 2078 2032 1987 1945 1904 1865 1827 1791 1757 1724 1692 1661 1632 1603 1576 1550 1525 1311 1290
366.45926A269k0j9j8Tj7j6j5Tj4j3Tj2Tj1j0TrTqpUonUlmlkjU%JTKTMI66
$$ 1269 1249 1230 1212 1194 1177 1161 1146 1131 1117 1104 1091 1079 1067 1056 1046 1036 1027 1018 1010 1003 996 989 983 978 973 968 965 961 958 956 955 954 953 953 954 955 957 959 963 966
297.43692I71NOPQRTJ0J2TJ4J5J6J7J9K0K2K3K6K7K9L2L4L7L9M3M6M9A611
$$ 971 976 982 989 997 1006 1015 1025 1037 1049 1063 1078 1094 1111 1130 1150 1172 1195 1221 1248 1277 1309 1343 1380 1419 1462 1508 1557 1611
248.61623A669O2O8P4P9Q7R4J02J12J22J33J46J61J76J93K13K36K59K87D590
$$ 1669 1731 1799 1873 1952 2039 2133 2235 2347 2469 2602 2748 2909 3085 3278 3491 3727 3986 4273 4590
214.9468D856L88M28M72N17N65O12O57O96P23P35P22O81O04M90L41J67A3632
$$ 4856 5244 5672 6144 6661 7226 7838 8495 9191 9914 10649 11371 12052 12656 13146 13487 13654 13632
184.6443A3424l79n20o27o95p31p38p23o92o51o07n58n12m66m23l84D370
$$ 13424 13045 12525 11898 11203 10472 9734 9011 8319 7668 7061 6503 5991 5525 5102 4718 4370
156.02528D055k86k59k35k14j94j78j62j48j36j25j14j06r8r0q3p8p2A410
$$ 4055 3769 3510 3275 3061 2867 2689 2527 2379 2243 2118 2004 1898 1800 1710 1627 1549 1477 1410
124.039314A348n9n4n1m8m5m2l9l8l5j46l0k9k7k6k4k3k2k1k0j9j7Uj5D69
$$ 1348 1289 1235 1184 1136 1091 1049 1010 972 937 791 761 732 705 679 655 632 610 589 569 550 533 516 499 484 469
80.26905D55j4j3j2Tj1Uj0rVqUpVoVnonVmnmWlmTlVmklUklTkTA36
$$ 455 441 428 416 404 393 382 371 361 352 343 334 325 317 309 301 294 287 280 273 267 261 255 249 244 238 233 228 223 218 214 209 205 201 197 193 189 186 182 178 175 172 169 166 162 160 157 154 151 149 146 143 141 139 136
-12.3219A34  $$checkpoint
##END=$$ End of the RAMAN for cis-DCE
##TITLE= trans-1,2-dichloroethene (E)
##JCAMP-DX= 5.01
##DATA TYPE= INFRARED SPECTRUM
##DATA CLASS= XYDATA
##BLOCK ID=3
##ORIGIN= Department of Chemistry, UWI, JAMAICA
##OWNER= public domain
##LONGDATE= 2012/02/18 12:32:26.0301 -0500 $$ export date from JSpecView
##SPECTROMETER/DATA SYSTEM= from scan
##$MODELS=
<Models>
<ModelData id="tDCE" type="MOL">
trans-1,2-dichloroethylene (E)
__Jmol-14_02171520503D 1   1.00000     0.00000     0
Jmol version 14.3.12_2015.02.11  2015-02-11 19:15 EXTRACT: ({0:5})
  6  5  0  0  0  0              1 V2000
  -0.36431   0.56175   0.00000 C   0  0  0  0  0  0
   0.36431  -0.56175   0.00000 C   0  0  0  0  0  0
  -0.36431  -2.12076   0.00000 Cl  0  0  0  0  0  0
   1.46636  -0.58339   0.00000 H   0  0  0  0  0  0
  -1.46636   0.58339   0.00000 H   0  0  0  0  0  0
   0.36431   2.12076   0.00000 Cl  0  0  0  0  0  0
  1  6  1  0  0  0
  1  2  2  0  0  0
  2  4  1  0  0  0
  3  2  1  0  0  0
  5  1  1  0  0  0
M  END
</ModelData>
<ModelData id="T1" type="XYZVIB" baseModel="tDCE" vibrationScale=".5">
6
Model[1]: PATH=Calculation 1;Input;Convg=0.6909D-08;-V/T=2.0006;Energy=NaN;Range=M.O.s;E(RHF)=-995.827950206 A.U.;PATH=Calculation 1;Input
C       0.00000      0.00000      0.00000
C       0.00000      0.00000      1.33908
Cl      1.45962      0.00000      2.25063
H      -0.91285      0.00000      1.95689
H       0.91285      0.00000     -0.61781
Cl     -1.45962      0.00000     -0.91155
6
Model[2]: PATH=Calculation 1;Standard;Convg=0.6909D-08;-V/T=2.0006;Energy=-995.82794;Range=M.O.s;E(RHF)=-995.827950206 A.U.;PATH=Calculation 1;Standard
C      -0.36431      0.56175      0.00000
C       0.36431     -0.56175      0.00000
Cl     -0.36431     -2.12076      0.00000
H       1.46636     -0.58339      0.00000
H      -1.46636      0.58339      0.00000
Cl      0.36431      2.12076      0.00000
6
Model[3]: IRIntensity=0.9482 KM/Mole;PATH=Calculation 1;FrequenciesFrequencies;ReducedMass=8.2119 AMU;ForceConstant=0.2553 mDyne/A;FreqValue=229.7041;Frequency=229.7041 cm^-1;FrequencyLabel=AU;PATH=Calculation 1;FrequenciesFrequencies
C      -0.36431      0.56175      0.00000      0.00000      0.00000      0.48000
C       0.36431     -0.56175      0.00000      0.00000      0.00000      0.48000
Cl     -0.36431     -2.12076      0.00000      0.00000      0.00000     -0.18001
H       1.46636     -0.58339      0.00000      0.00000      0.00000      0.49001
H      -1.46636      0.58339      0.00000      0.00000      0.00000      0.49001
Cl      0.36431      2.12076      0.00000      0.00000      0.00000     -0.18001
6
Model[4]: IRIntensity=4.5756 KM/Mole;PATH=Calculation 1;FrequenciesFrequencies;ReducedMass=6.7769 AMU;ForceConstant=0.2730 mDyne/A;FreqValue=261.4711;Frequency=261.4711 cm^-1;FrequencyLabel=BU;PATH=Calculation 1;FrequenciesFrequencies
C      -0.36431      0.56175      0.00000      0.39000     -0.16000      0.00000
C       0.36431     -0.56175      0.00000      0.39000     -0.16000      0.00000
Cl     -0.36431     -2.12076      0.00000     -0.15001      0.07000      0.00000
H       1.46636     -0.58339      0.00000      0.39000     -0.37000      0.00000
H      -1.46636      0.58339      0.00000      0.39000     -0.37000      0.00000
Cl      0.36431      2.12076      0.00000     -0.15001      0.07000      0.00000
6
Model[5]: IRIntensity=0.0000 KM/Mole;PATH=Calculation 1;FrequenciesFrequencies;ReducedMass=21.5344 AMU;ForceConstant=1.8876 mDyne/A;FreqValue=385.7165;Frequency=385.7165 cm^-1;FrequencyLabel=AG;PATH=Calculation 1;FrequenciesFrequencies
C      -0.36431      0.56175      0.00000     -0.17000     -0.17000      0.00000
C       0.36431     -0.56175      0.00000      0.17000      0.17000      0.00000
Cl     -0.36431     -2.12076      0.00000      0.06000      0.53000      0.00000
H       1.46636     -0.58339      0.00000      0.18001      0.36001      0.00000
H      -1.46636      0.58339      0.00000     -0.18001     -0.36001      0.00000
Cl      0.36431      2.12076      0.00000     -0.06000     -0.53000      0.00000
6
Model[6]: IRIntensity=145.4250 KM/Mole;PATH=Calculation 1;FrequenciesFrequencies;ReducedMass=9.0780 AMU;ForceConstant=4.3937 mDyne/A;FreqValue=906.3509;Frequency=906.3509 cm^-1;FrequencyLabel=BU;PATH=Calculation 1;FrequenciesFrequencies
C      -0.36431      0.56175      0.00000      0.21000      0.46001      0.00000
C       0.36431     -0.56175      0.00000      0.21000      0.46001      0.00000
Cl     -0.36431     -2.12076      0.00000     -0.08000     -0.17000      0.00000
H       1.46636     -0.58339      0.00000      0.21000      0.40000      0.00000
H      -1.46636      0.58339      0.00000      0.21000      0.40000      0.00000
Cl      0.36431      2.12076      0.00000     -0.08000     -0.17000      0.00000
6
Model[7]: IRIntensity=0.0000 KM/Mole;PATH=Calculation 1;FrequenciesFrequencies;ReducedMass=4.7852 AMU;ForceConstant=2.6377 mDyne/A;FreqValue=967.2547;Frequency=967.2547 cm^-1;FrequencyLabel=AG;PATH=Calculation 1;FrequenciesFrequencies
C      -0.36431      0.56175      0.00000      0.33001      0.19000      0.00000
C       0.36431     -0.56175      0.00000     -0.33001     -0.19000      0.00000
Cl     -0.36431     -2.12076      0.00000      0.06000      0.06000      0.00000
H       1.46636     -0.58339      0.00000     -0.34000     -0.48000      0.00000
H      -1.46636      0.58339      0.00000      0.34000      0.48000      0.00000
Cl      0.36431      2.12076      0.00000     -0.06000     -0.06000      0.00000
6
Model[8]: IRIntensity=0.0000 KM/Mole;PATH=Calculation 1;FrequenciesFrequencies;ReducedMass=1.8463 AMU;ForceConstant=1.1155 mDyne/A;FreqValue=1012.6580;Frequency=1012.6580 cm^-1;FrequencyLabel=BG;PATH=Calculation 1;FrequenciesFrequencies
C      -0.36431      0.56175      0.00000      0.00000      0.00000     -0.19000
C       0.36431     -0.56175      0.00000      0.00000      0.00000      0.19000
Cl     -0.36431     -2.12076      0.00000      0.00000      0.00000     -0.01000
H       1.46636     -0.58339      0.00000      0.00000      0.00000     -0.68000
H      -1.46636      0.58339      0.00000      0.00000      0.00000      0.68000
Cl      0.36431      2.12076      0.00000      0.00000      0.00000      0.01000
6
Model[9]: IRIntensity=71.3035 KM/Mole;PATH=Calculation 1;FrequenciesFrequencies;ReducedMass=1.0871 AMU;ForceConstant=0.8649 mDyne/A;FreqValue=1162.0574;Frequency=1162.0574 cm^-1;FrequencyLabel=AU;PATH=Calculation 1;FrequenciesFrequencies
C      -0.36431      0.56175      0.00000      0.00000      0.00000      0.06000
C       0.36431     -0.56175      0.00000      0.00000      0.00000      0.06000
Cl     -0.36431     -2.12076      0.00000      0.00000      0.00000      0.00000
H       1.46636     -0.58339      0.00000      0.00000      0.00000     -0.70000
H      -1.46636      0.58339      0.00000      0.00000      0.00000     -0.70000
Cl      0.36431      2.12076      0.00000      0.00000      0.00000      0.00000
6
Model[10]: IRIntensity=25.0309 KM/Mole;PATH=Calculation 1;FrequenciesFrequencies;ReducedMass=1.1050 AMU;ForceConstant=1.3205 mDyne/A;FreqValue=1424.1223;Frequency=1424.1223 cm^-1;FrequencyLabel=BU;PATH=Calculation 1;FrequenciesFrequencies
C      -0.36431      0.56175      0.00000      0.02000     -0.06000      0.00000
C       0.36431     -0.56175      0.00000      0.02000     -0.06000      0.00000
Cl     -0.36431     -2.12076      0.00000     -0.01000      0.00000      0.00000
H       1.46636     -0.58339      0.00000      0.04000      0.70000      0.00000
H      -1.46636      0.58339      0.00000      0.04000      0.70000      0.00000
Cl      0.36431      2.12076      0.00000     -0.01000      0.00000      0.00000
6
Model[11]: IRIntensity=0.0000 KM/Mole;PATH=Calculation 1;FrequenciesFrequencies;ReducedMass=1.3166 AMU;ForceConstant=1.6333 mDyne/A;FreqValue=1451.0326;Frequency=1451.0326 cm^-1;FrequencyLabel=AG;PATH=Calculation 1;FrequenciesFrequencies
C      -0.36431      0.56175      0.00000     -0.11000      0.05000      0.00000
C       0.36431     -0.56175      0.00000      0.11000     -0.05000      0.00000
Cl     -0.36431     -2.12076      0.00000      0.01000      0.00000      0.00000
H       1.46636     -0.58339      0.00000      0.11000     -0.69000      0.00000
H      -1.46636      0.58339      0.00000     -0.11000      0.69000      0.00000
Cl      0.36431      2.12076      0.00000     -0.01000      0.00000      0.00000
6
Model[12]: IRIntensity=0.0000 KM/Mole;PATH=Calculation 1;FrequenciesFrequencies;ReducedMass=4.0894 AMU;ForceConstant=7.3480 mDyne/A;FreqValue=1746.3394;Frequency=1746.3394 cm^-1;FrequencyLabel=AG;PATH=Calculation 1;FrequenciesFrequencies
C      -0.36431      0.56175      0.00000     -0.12000      0.35000      0.00000
C       0.36431     -0.56175      0.00000      0.12000     -0.35000      0.00000
Cl     -0.36431     -2.12076      0.00000      0.00000      0.01000      0.00000
H       1.46636     -0.58339      0.00000      0.22000      0.56000      0.00000
H      -1.46636      0.58339      0.00000     -0.22000     -0.56000      0.00000
Cl      0.36431      2.12076      0.00000      0.00000     -0.01000      0.00000
6
Model[13]: IRIntensity=16.1874 KM/Mole;PATH=Calculation 1;FrequenciesFrequencies;ReducedMass=1.0862 AMU;ForceConstant=6.3251 mDyne/A;FreqValue=3143.7315;Frequency=3143.7315 cm^-1;FrequencyLabel=BU;PATH=Calculation 1;FrequenciesFrequencies
C      -0.36431      0.56175      0.00000      0.06000      0.00000      0.00000
C       0.36431     -0.56175      0.00000      0.06000      0.00000      0.00000
Cl     -0.36431     -2.12076      0.00000      0.00000      0.00000      0.00000
H       1.46636     -0.58339      0.00000     -0.70000      0.02000      0.00000
H      -1.46636      0.58339      0.00000     -0.70000      0.02000      0.00000
Cl      0.36431      2.12076      0.00000      0.00000      0.00000      0.00000
6
Model[14]: IRIntensity=0.0000 KM/Mole;PATH=Calculation 1;FrequenciesFrequencies;ReducedMass=1.1058 AMU;ForceConstant=6.4534 mDyne/A;FreqValue=3147.1884;Frequency=3147.1884 cm^-1;FrequencyLabel=AG;PATH=Calculation 1;FrequenciesFrequencies
C      -0.36431      0.56175      0.00000      0.07000     -0.01000      0.00000
C       0.36431     -0.56175      0.00000     -0.07000      0.01000      0.00000
Cl     -0.36431     -2.12076      0.00000      0.00000      0.00000      0.00000
H       1.46636     -0.58339      0.00000      0.70000     -0.02000      0.00000
H      -1.46636      0.58339      0.00000     -0.70000      0.02000      0.00000
Cl      0.36431      2.12076      0.00000      0.00000      0.00000      0.00000
</ModelData>
</Models>
##$PEAKS=
<Peaks type="IR" xUnitsExpected="1/cm"  >
<PeakData id="1" title="Bu- asymm stretch of CH group (~3150 cm-1)" peakShape="broad" model="T1.13" xMax="3180" xMin="3150"    />
<PeakData id="2" title="Inactive Ag-symm stretch of CH group (~3140 cm-1)" peakShape="broad" model="T1.14" xMax="3150" xMin="3120"    />
<PeakData id="3" title="Inactive Ag- C=C stretch (~1576 cm-1)" peakShape="broad" model="T1.12" xMax="1760" xMin="1730"    />
<PeakData id="4" title="Inactive Ag- H-C-H scissors (~1272 cm-1)" peakShape="broad" model="T1.11" xMax="1465" xMin="1435"    />
<PeakData id="5" title="Bu- C-H scissors (~1205 cm-1)" peakShape="broad" model="T1.10" xMax="1435" xMin="1405"    />
<PeakData id="6" title="Au- C-H wagging (~900 cm-1)" peakShape="broad" model="T1.9" xMax="1180" xMin="1150"    />
<PeakData id="7" title="Inactive Bg- wag of CH group (~750 cm-1)" peakShape="broad" model="T1.8" xMax="1030" xMin="1000"    />
<PeakData id="8" title="Inactive Ag-symm stretch of CCl group (~845 cm-1)" peakShape="broad" model="T1.7" xMax="980" xMin="950"    />
<PeakData id="9" title="Bu- asymm stretch of CCl group (~830 cm-1)" peakShape="broad" model="T1.6" xMax="925" xMin="895"    />
<PeakData id="10" title="Inactive Ag-symm bend of CCl group (~350 cm-1)" peakShape="broad" model="T1.5" xMax="400" xMin="370"    />
<PeakData id="11" title="Bu-asymm bend of CCl group (~265 cm-1)" peakShape="broad" model="T1.4" xMax="285" xMin="245"    />
<PeakData id="12" title="Au-Cl-C=C-Cl torsion  (~192 cm-1)" peakShape="broad" model="T1.3" xMax="245" xMin="215"    />
</Peaks>
##XUNITS= 1/CM
##YUNITS= TRANSMITTANCE
##XFACTOR= 1
##YFACTOR= 9.999000E-07
##FIRSTX= 3.347189E+03
##FIRSTY= 9.902938E-01
##LASTX= 2.970410E+01
##NPOINTS= 2001
##MINY= 10.000000E-05
##MAXY= 1
##XYDATA= (X++(Y..Y))
3347.1885I90393j58j61j66j69j74j78j83j88j92j97k03k08k13k19k25I87327
$$ 990393 990235 990074 989908 989739 989565 989387 989204 989016 988824 988627 988424 988216 988003 987784 987559 987327
3318.9897I87089k44k51k59k66k74k81k90k99l08l17l27l37l48l58l71I82177
$$ 987089 986845 986594 986335 986069 985795 985514 985224 984925 984617 984300 983973 983636 983288 982930 982559 982177
3290.7913I81783m08m22m35m51m66m82m99n18n36n55n76n98o20o44o69I73209
$$ 981783 981375 980953 980518 980067 979601 979119 978620 978102 977566 977011 976435 975837 975217 974573 973904 973209
3262.5925I72486p52p82q15q49q85r23r64j005j051j098j149j203j259I58431
$$ 972486 971734 970952 970137 969288 968403 967480 966516 965511 964460 963362 962213 961010 959751 958431
3237.7114I57047j453j526j603j686j775j869j971k080k195k321k455I33515
$$ 957047 955594 954068 952465 950779 949004 947135 945164 943084 940889 938568 936113 933515
3216.1477I30760k921l102l297l507l735l981m249m540m854n198n570H79830
$$ 930760 927839 924737 921440 917933 914198 910217 905968 901428 896574 891376 885806 879830
3194.5842H73412o901p427q000q625r308j0051j0858j1737j2687j3714G59287
$$ 873412 866511 859084 851084 842459 833151 823100 812242 800505 787818 774104 759287
3174.6792G43293j7242j8551j9904k1277k2635k3933k5108k6085k6770E14723
$$ 743293 726051 707500 687596 666319 643684 619751 594643 568558 541788 514723
3156.433D87862k6054k4564k2337j9369j5709j1454o754j783L257Q168C84018
$$ 487862 461808 437244 414907 395538 379829 368375 361621 359838 363095 371263 384018
3136.528D00866K0315K3067K5075K6359K6978K7026K6605K5824K4780F50458
$$ 400866 421181 444248 469323 495682 522660 549686 576291 602115 626895 650458
3118.282F72699K0874J9504J8162J6869J5642J4485J3405J2401J1472H26128
$$ 672699 693573 713077 731239 748108 763750 778235 791640 804041 815513 826128
3100.036H35954R101Q437P827P268O755O284N854N457N094M760M451I11411
$$ 835954 845055 853492 861319 868587 875342 881626 887480 892937 898031 902791 907242 911411
3078.4722I15318L666L444L238L047K872K707K556K414K283K161K047I47693
$$ 915318 918984 922428 925666 928713 931585 934292 936848 939262 941545 943706 945753 947693
3056.9084I49534J748J662J580J503J432J365J302J242J187J134J084I65810
$$ 949534 951282 952944 954524 956027 957459 958824 960126 961368 962555 963689 964773 965810
3035.345I66803R51R12Q74Q39Q05P74P43P15O87O62O36O14N91N70N50I78256
$$ 966803 967754 968666 969540 970379 971184 971958 972701 973416 974103 974765 975401 976015 976606 977176 977726 978256
3007.1462I78768M94M77M62M46M31M18M04L90L79L67L55L45L34L24L14I85013
$$ 978768 979262 979739 980201 980647 981078 981496 981900 982290 982669 983036 983391 983736 984070 984394 984708 985013
2978.9478I85309K88K79K72K64K56K49K43K36K29K24K17K12K06K01J96I89072
$$ 985309 985597 985876 986148 986412 986668 986917 987160 987396 987625 987849 988066 988278 988484 988685 988881 989072
2950.749I89258J81J77J73J68J64J61J56J53J49J46J43J39J36J33J30I91694
$$ 989258 989439 989616 989789 989957 990121 990282 990438 990591 990740 990886 991029 991168 991304 991437 991567 991694
2922.5503I91818J22J18J17J14J11J09J07J04J03J00R8R6R5R2R0Q9Q7I93655
$$ 991818 991940 992058 992175 992289 992400 992509 992616 992720 992823 992923 993021 993117 993212 993304 993394 993483 993570 993655
2891.0344I93739Q2Q1P8TP6P4TP1TO9O8O7O5TO3O2O1O0N9N8N7N6N5N4I95396
$$ 993739 993821 993902 993980 994058 994134 994208 994282 994353 994424 994493 994561 994628 994693 994758 994821 994883 994944 995004 995063 995121 995178 995234 995289 995343 995396
2847.907I95448N2N0TM9M8TM6TM5TM4M3M2TM1M0TL9TL8TL7L6TL5TL4I96620
$$ 995448 995500 995550 995600 995649 995697 995745 995791 995837 995882 995927 995971 996014 996056 996098 996139 996179 996219 996258 996297 996335 996373 996410 996446 996482 996517 996552 996586 996620
2799.8035I96654L2L3L2L1UL0TK9UK8TK7UK6UK5UK4UK3K4K2K3K2UK1TK547A000100
$$ 996654 996686 996719 996751 996782 996813 996844 996874 996904 996933 996962 996991 997019 997047 997074 997101 997128 997154 997180 997206 997231 997256 997281 997305 997329 997353 997376 997400 997422 997445 997467 997489 997511 997532 997553 1000100 1000100
2738.43A000100%W50l945l2l4l3l4l5Ul6Tl7Tl8Tl9Tm0Tm1Tm2m3Tm4I95239
1782.9945I95194m5m6m7m8Tm9Tn0n1n2Tn4Un6Tn8Tn9o0o1To3o4To6o7I93634
$$ 995194 995149 995103 995056 995008 994960 994911 994862 994812 994761 994709 994657 994603 994549 994495 994439 994383 994325 994267 994208 994148 994087 994026 993963 993899 993835 993769 993702 993634
1734.891I93565p0p1p2p3p5p6p7p8q0q1q3Tq6Tq9Tr2r3r4r7r8r9j02I91518
$$ 993565 993495 993424 993352 993279 993204 993128 993051 992973 992893 992812 992729 992646 992560 992474 992385 992296 992204 992111 992017 991920 991822 991723 991621 991518
1693.4225I91412j07j09j12j13j16j17j20j23j24j27j30j32j35j38j40I89426
$$ 991412 991305 991196 991084 990971 990855 990738 990618 990495 990371 990244 990114 989982 989847 989709 989569 989426
1665.2239I89280j49j52j56j58j62j66j69j72j77j80j84j88j93j97k01I86470
$$ 989280 989131 988979 988823 988665 988503 988337 988168 987996 987819 987639 987455 987267 987074 986877 986676 986470
1637.0253I86259k15k21k26k31k37k42k48k55k61k67k74k81k88k95l04I82103
$$ 986259 986044 985823 985597 985366 985129 984887 984639 984384 984123 983856 983582 983301 983013 982718 982414 982103
1608.8267I81784l28l37l45l56l65l75l86l97m08m20m32m45m58m72m86I75273
$$ 981784 981456 981119 980774 980418 980053 979678 979292 978895 978487 978067 977635 977190 976732 976260 975774 975273
1580.628I74756n33n49n67n85o05o24o44o67o89p13j1571q45q72r01I53460
$$ 974756 974223 973674 973107 972522 971917 971293 970649 969982 969293 968580 957009 956164 955292 954391 953460
1554.0881I52497r97j031j067j106j146j189j233j279j329j380j435j492I36260
$$ 952497 951500 950469 949402 948296 947150 945961 944728 943449 942120 940740 939305 937813 936260
1530.8657I34644j685j755j832j911j996k086k182k282k390k505k627I08637
$$ 934644 932959 931204 929372 927461 925465 923379 921197 918915 916525 914020 911393 908637
1509.3021I05742l042l201l369l549l743l949m172m411m667m942n239H55899
$$ 905742 902700 899499 896130 892581 888838 884889 880717 876306 871639 866697 861458 855899
1487.7384H49995o275o676p109p578q083q631r223r862j0553j1299j2105G39629
$$ 849995 843720 837044 829935 822357 814274 805643 796420 786558 776005 764706 752601 739629
1466.1748G25725j4903j5971j7105j8305j9561k0867k2204k3552k4880E22231
$$ 725725 710822 694851 677746 659441 639880 619013 596809 573257 548377 522231
1447.9286D94929k8286k9022k9435k9437k8952k7911k6276k4036k1226B32437
$$ 494929 466643 437621 408186 378749 349797 321886 295610 271574 250348 232437
1429.6825B18252j0159n934j605K746P044J1202J5127J8709K1848K4454C28158
$$ 218252 208093 202159 200554 203300 210344 221546 236673 255382 277230 301684 328158
1409.7776C56045K8715K9007K8837K8284K7433K6363K5142K3829K2471F17232
$$ 356045 384760 413767 442604 470888 498321 524684 549826 573655 596126 617232
1391.5314F36991J8451J7198J6004J4879J3820J2831J1908J1049J0252G72896
$$ 636991 655442 672640 688644 703523 717343 730174 742082 753131 763383 772896
1373.2853G81724Q192P604P058O553O084N648N244M867M517M189L885H49164
$$ 781724 789916 797520 804578 811131 817215 822863 828107 832974 837491 841680 845565 849164
1351.7216H52497L082K846K625K417K219K033J857J689J529J376J231H76493
$$ 852497 855579 858425 861050 863467 865686 867719 869576 871265 872794 874170 875401 876493
1330.158H77450Q29P04N83M67L53K43J34K8p6j79k81l81m81n81k0613H57273
$$ 877450 878279 878983 879566 880033 880386 880629 880763 880791 880715 880536 880255 879874 879393 878812 858199 857273
1301.9594H56247j126j227j329j432j538j644j753j865j979k095k216H35704
$$ 856247 855121 853894 852565 851133 849595 847951 846198 844333 842354 840259 838043 835704
1280.3956H33237k598k735k876l021l174l332l495l667l846m032m227G91802
$$ 833237 830639 827904 825028 822007 818833 815501 812006 808339 804493 800461 796234 791802
1258.832G87157m869n105n351n610n884o170o471o790p124p478p849G10214
$$ 787157 782288 777183 771832 766222 760338 754168 747697 740907 733783 726305 718456 710214
1237.2684G01559r091r552j0035j0547j1084j1650j2245j2869j3524j4208E71833
$$ 701559 692468 682916 672881 662334 651250 639600 627355 614486 600962 586754 571833
1217.3635E56168j6433j7228j8042j8871j9709k0547k1373k2174k2931C55232
$$ 556168 539735 522507 504465 485594 465885 445338 423965 401791 378860 355232
1199.1173C30996k4731k5082k5255k5217k4932k4372k3516k2350k0881I5524
$$ 330996 306265 281183 255928 230711 205779 181407 157891 135541 114660 95524
1180.8711G8364j5027j2821j0642q578o709n081l712k589j673r09k35A0803
$$ 78364 63337 50516 39874 31296 24587 19506 15794 13205 11532 10623 10388 10803
1159.3075A1907J902K864M042N467P140R038J1098J3243J5374J7402J9242A39552
$$ 11907 13809 16673 20715 26182 33322 42360 53458 66701 82075 99477 118719 139552
1137.7439A61689K3134K3825K4227K4366K4274K3982K3530K2944K2258C95726
$$ 161689 184823 208648 232875 257241 281515 305497 329027 351971 374229 395726
1119.4977D16409J9834J8967J8095J7226J6371J5534J4719J3931J3171E76697
$$ 416409 436243 455210 473305 490531 506902 522436 537155 551086 564257 576697
1101.2516E88436J1068J0427R816R232Q677Q146P641P160O701O263N846F84860
$$ 588436 599504 609931 619747 628979 637656 645802 653443 660603 667304 673567 679413 684860
1079.6879F89925M701M350M016L693L384L086K797K520K250J989J736G25935
$$ 689925 694626 698976 702992 706685 710069 713155 715952 718472 720722 722711 724447 725935
1058.1243G27183J012P82N56L32J14j04l18n31p43r54j165j376j588j801G19384
$$ 727183 728195 728977 729533 729865 729979 729875 729557 729026 728283 727329 726164 724788 723200 721399 719384
1031.5844G17152k451k673k897l126o07l634l876m125m380m641m909n185F69180
$$ 717152 714701 712028 709131 706005 705398 701764 697888 693763 689383 684742 679833 674648 669180
1008.36194F63420o061o371o691p021p362p714q078q454q842r243r656E67844
$$ 663420 657359 650988 644297 637276 629914 622200 614122 605668 596826 587583 577927 567844
986.79834E57322j0975j1440j1917j2406j2905j3414j3931j4453j4979D25397
$$ 557322 546347 534907 522990 510584 497679 484265 470334 455881 440902 425397
968.5522D09369j6543j7044j7526j7983j8403j8780j9103j9357j9534B25479
$$ 409369 392826 375782 358256 340273 321870 303090 283987 264630 245096 225479
950.30597B05888j9445j9160j8728j8135j7375j6446j5354j4109j2736D3135
$$ 205888 186443 167283 148555 130420 113045 96599 81245 67136 54400 43135
932.0598C3397q204o716n325m077l008k131j451r49n98l64k15j25p2A23
$$ 33397 25193 18477 13152 9075 6067 3936 2485 1536 938 574 359 234 162 123
907.1787A05nQK5M7Q4J48K53M25O91J088J645K389L335M474N788P236C6508
$$ 105 100 108 133 180 264 412 665 1090 1781 2869 4514 6903 10238 14712 20500 27736 36508
877.32135D6850J1891J3376J4755J5998J7087J8008J8761J9348J9776B15908
$$ 46850 58741 72117 86872 102870 119957 137965 156726 176074 195850 215908
859.0752B36113K0234K0156J9990J9745J9437J9074J8671J8234J7772D26716
$$ 236113 256347 276503 296493 316238 335675 354749 373420 391654 409426 426716
840.82904D43514J6299J5796J5294J4797J4306J3823J3350J2888J2439E84508
$$ 443514 459813 475609 490903 505700 520006 533829 547179 560067 572506 584508
822.5828E96087J1168J0772J0390J0020R664R321Q992Q675Q370Q078F99332
$$ 596087 607255 618027 628417 638437 648101 657422 666414 675089 683459 691537 699332
802.6779G06858P266P017O778O549O328O116N913N719N531N351N179G79617
$$ 706858 714124 721141 727919 734468 740796 746912 752825 758544 764075 769426 774605 779617
781.1143G84471M700M553M412M276M145M020L898L782L671L562L458H41629
$$ 784471 789171 793724 798136 802412 806557 810577 814475 818257 821928 825490 828948 841629
759.55066H44851L128L038K951K868K787K709K635K561K492K425K360H77101
$$ 844851 847979 851017 853968 856836 859623 862332 864967 867528 870020 872445 874805 877101
737.987H79337K177K121K065K013J961J912J864J817J773J729J686I02101
$$ 879337 881514 883635 885700 887713 889674 891586 893450 895267 897040 898769 900455 902101
716.42334I03708J568J531J495J460J426J394J361J331J300J272J243I20305
$$ 903708 905276 906807 908302 909762 911188 912582 913943 915274 916574 917846 919089 920305
694.8597I21494J163J138J113J090J067J044J022J001R80R60R40R22I34837
$$ 921494 922657 923795 924908 925998 927065 928109 929131 930132 931112 932072 933012 933934 934837
671.6373I35721Q67Q50Q34Q17Q01J06P64P50P35P21P07O94O81O68O56I47016
$$ 935721 936588 937438 938272 939089 939890 939996 940760 941510 942245 942966 943673 944367 945048 945716 946372 947016
643.4387I47647O21O09N97N87N77N66N56N46L95N25N17N08M99M90M82I56195
$$ 947647 948268 948877 949474 950061 950638 951204 951760 952306 952701 953226 953743 954251 954750 955240 955722 956195
615.24005I56661M57M50M42M35M27M20M14M06M00L93L86L81L74L68L62I63132
$$ 956661 957118 957568 958010 958445 958872 959292 959706 960112 960512 960905 961291 961672 962046 962414 962776 963132
587.04144I63482L45L39L34L28L23L18L13L08L03K98K94K88K85K79K76I68384
$$ 963482 963827 964166 964500 964828 965151 965469 965782 966090 966393 966691 966985 967273 967558 967837 968113 968384
558.84283I68651K62K59K54K50K47K42K39K35K31K27K24K20K17K14K09I72388
$$ 968651 968913 969172 969426 969676 969923 970165 970404 970639 970870 971097 971321 971541 971758 971972 972181 972388
530.6442I72591K00J96J94J90J87J84J80J78J75J71J69J66J63J60J57I97826
$$ 972591 972791 972987 973181 973371 973558 973742 973922 974100 974275 974446 974615 974781 974944 975104 975261 997826
502.44562I97795l1l2l3Tl4l5Tl7Ul9m0Tm1m3Tm4m5m6m8Tn0n1n2n3n5I96658
$$ 997795 997764 997732 997699 997666 997632 997597 997562 997525 997488 997451 997412 997372 997332 997291 997248 997205 997161 997116 997070 997022 996974 996924 996873 996821 996768 996713 996658
456.00082I96600n9o0o2o3o5o7o8p1p2p4p6p9q0q3q5q8r0r3r6r8j01j05I94758
$$ 996600 996541 996481 996419 996356 996291 996224 996156 996085 996013 995939 995863 995784 995704 995621 995536 995448 995358 995265 995169 995071 994970 994865 994758
416.191I94647j15j18j22j26j30j34j39j44j48j54j58j65j70j77j83I92274
$$ 994647 994532 994414 994292 994166 994036 993902 993763 993619 993471 993317 993159 992994 992824 992647 992464 992274
387.9924I92077k05k12k21k29k39k48k58k69k81k93l05l18l33l48l64I87573
$$ 992077 991872 991660 991439 991210 990971 990723 990465 990196 989915 989622 989317 988999 988666 988318 987954 987573
359.7938I87174m18m38m60m84n08n34n62n93o25o60o97p37p80q27q77I77043
$$ 987174 986756 986318 985858 985374 984866 984332 983770 983177 982552 981892 981195 980458 979678 978851 977974 977043
331.59518I76053j052j122j197j277j366j463j568j683j809j947k099I57205
$$ 976053 975001 973879 972682 971405 970039 968576 967008 965325 963516 961569 959470 957205
310.03152I54755k651k875l121l394l695m027m396m801n249n742o281I01653
$$ 954755 952104 949229 946108 942714 939019 934992 930596 925795 920546 914804 908523 901653
288.46786H94146q189q912r662j0420j1160j1840j2408j2795j2926j2710G71054
$$ 894146 885957 877045 867383 856963 845803 833963 821555 808760 795834 783124 771054
268.56296G60112r297p167m640j867R59L635N982P866R223J0044J0375G95518
$$ 760112 750815 743648 739008 737141 738100 741735 747717 755583 764806 774850 785225 795518
246.99933H05406R255Q483P650O828O076N445M971M681M577M643M839H77965
$$ 805406 814661 823144 830794 837622 843698 849143 854114 858795 863372 868015 872854 877965
225.43567H83364N647N815N881N842N709N498N232M931M613M290L974I44466
$$ 883364 889011 894826 900707 906549 912258 917756 922988 927919 932532 936822 940796 944466
203.87202I47851L118K871K645K438K248K077J919J777J648J529J422I72867
$$ 947851 950969 953840 956485 958923 961171 963248 965167 966944 968592 970121 971543 972867
182.30838I74102J152J078J010R46Q88Q35P86P40O98O60O23N90N59N30I85700
$$ 974102 975254 976332 977342 978288 979176 980011 980797 981537 982235 982895 983518 984108 984667 985197 985700
155.76851I86178M54M32M12L92L74L57L42L26L12K99K86K74K63K52K42I91428
$$ 986178 986632 987064 987476 987868 988242 988599 988941 989267 989579 989878 990164 990438 990701 990953 991195 991428
127.569885I91651K15K07J99J92J85J78J72J66J60J54J50J44J39J35J31I94304
$$ 991651 991866 992073 992272 992464 992649 992827 992999 993165 993325 993479 993629 993773 993912 994047 994178 994304
99.37127I94427J18J15J11J08J05J01R9R5R3R0Q8Q5Q3Q0P9P6P4P2P1I96238
$$ 994427 994545 994660 994771 994879 994984 995085 995184 995279 995372 995462 995550 995635 995718 995798 995877 995953 996027 996099 996170 996238
64.53768I96305O5O3O2O0N8N7N6N5N3N2N0TM8M7M6M5TM3M2I97343
$$ 996305 996370 996433 996495 996555 996613 996670 996726 996781 996834 996886 996936 996986 997034 997081 997127 997172 997217 997260 997302 997343
29.7041I97383  $$checkpoint
##END= $$ end of trans-DCE IR
##TITLE=Raman of trans-1,2-dichloroethylene (E) $$ Begin of the data block
##JCAMP-DX=5.00 $$ ACD/DocManager Library v 5.00
##DATA TYPE=RAMAN SPECTRUM
##DATA CLASS=XYDATA
##BLOCK ID=4
##DATE=19 Feb 2012 10:30:00
##ORIGIN= Department of Chemistry, UWI, Jamaica
##OWNER= public domain
##SPECTROMETER/DATA SYSTEM=from scan
##$MODELS=
<Models>
<ModelData id="tDCE" type="MOL">
trans-1,2-dichloroethylene (E)
__Jmol-14_02171520503D 1   1.00000     0.00000     0
Jmol version 14.3.12_2015.02.11  2015-02-11 19:15 EXTRACT: ({0:5})
  6  5  0  0  0  0              1 V2000
  -0.36431   0.56175   0.00000 C   0  0  0  0  0  0
   0.36431  -0.56175   0.00000 C   0  0  0  0  0  0
  -0.36431  -2.12076   0.00000 Cl  0  0  0  0  0  0
   1.46636  -0.58339   0.00000 H   0  0  0  0  0  0
  -1.46636   0.58339   0.00000 H   0  0  0  0  0  0
   0.36431   2.12076   0.00000 Cl  0  0  0  0  0  0
  1  6  1  0  0  0
  1  2  2  0  0  0
  2  4  1  0  0  0
  3  2  1  0  0  0
  5  1  1  0  0  0
M  END
</ModelData>
<ModelData id="T2" type="XYZVIB" baseModel="tDCE" vibrationScale=".5">
6
Model[1]: PATH=Calculation 1;Input;Convg=0.6909D-08;-V/T=2.0006;Energy=NaN;Range=M.O.s;E(RHF)=-995.827950206 A.U.;PATH=Calculation 1;Input
C       0.00000      0.00000      0.00000
C       0.00000      0.00000      1.33908
Cl      1.45962      0.00000      2.25063
H      -0.91285      0.00000      1.95689
H       0.91285      0.00000     -0.61781
Cl     -1.45962      0.00000     -0.91155
6
Model[2]: PATH=Calculation 1;Standard;Convg=0.6909D-08;-V/T=2.0006;Energy=-995.82794;Range=M.O.s;E(RHF)=-995.827950206 A.U.;PATH=Calculation 1;Standard
C      -0.36431      0.56175      0.00000
C       0.36431     -0.56175      0.00000
Cl     -0.36431     -2.12076      0.00000
H       1.46636     -0.58339      0.00000
H      -1.46636      0.58339      0.00000
Cl      0.36431      2.12076      0.00000
6
Model[3]: IRIntensity=0.9482 KM/Mole;PATH=Calculation 1;FrequenciesFrequencies;ReducedMass=8.2119 AMU;ForceConstant=0.2553 mDyne/A;FreqValue=229.7041;Frequency=229.7041 cm^-1;FrequencyLabel=AU;PATH=Calculation 1;FrequenciesFrequencies
C      -0.36431      0.56175      0.00000      0.00000      0.00000      0.48000
C       0.36431     -0.56175      0.00000      0.00000      0.00000      0.48000
Cl     -0.36431     -2.12076      0.00000      0.00000      0.00000     -0.18001
H       1.46636     -0.58339      0.00000      0.00000      0.00000      0.49001
H      -1.46636      0.58339      0.00000      0.00000      0.00000      0.49001
Cl      0.36431      2.12076      0.00000      0.00000      0.00000     -0.18001
6
Model[4]: IRIntensity=4.5756 KM/Mole;PATH=Calculation 1;FrequenciesFrequencies;ReducedMass=6.7769 AMU;ForceConstant=0.2730 mDyne/A;FreqValue=261.4711;Frequency=261.4711 cm^-1;FrequencyLabel=BU;PATH=Calculation 1;FrequenciesFrequencies
C      -0.36431      0.56175      0.00000      0.39000     -0.16000      0.00000
C       0.36431     -0.56175      0.00000      0.39000     -0.16000      0.00000
Cl     -0.36431     -2.12076      0.00000     -0.15001      0.07000      0.00000
H       1.46636     -0.58339      0.00000      0.39000     -0.37000      0.00000
H      -1.46636      0.58339      0.00000      0.39000     -0.37000      0.00000
Cl      0.36431      2.12076      0.00000     -0.15001      0.07000      0.00000
6
Model[5]: IRIntensity=0.0000 KM/Mole;PATH=Calculation 1;FrequenciesFrequencies;ReducedMass=21.5344 AMU;ForceConstant=1.8876 mDyne/A;FreqValue=385.7165;Frequency=385.7165 cm^-1;FrequencyLabel=AG;PATH=Calculation 1;FrequenciesFrequencies
C      -0.36431      0.56175      0.00000     -0.17000     -0.17000      0.00000
C       0.36431     -0.56175      0.00000      0.17000      0.17000      0.00000
Cl     -0.36431     -2.12076      0.00000      0.06000      0.53000      0.00000
H       1.46636     -0.58339      0.00000      0.18001      0.36001      0.00000
H      -1.46636      0.58339      0.00000     -0.18001     -0.36001      0.00000
Cl      0.36431      2.12076      0.00000     -0.06000     -0.53000      0.00000
6
Model[6]: IRIntensity=145.4250 KM/Mole;PATH=Calculation 1;FrequenciesFrequencies;ReducedMass=9.0780 AMU;ForceConstant=4.3937 mDyne/A;FreqValue=906.3509;Frequency=906.3509 cm^-1;FrequencyLabel=BU;PATH=Calculation 1;FrequenciesFrequencies
C      -0.36431      0.56175      0.00000      0.21000      0.46001      0.00000
C       0.36431     -0.56175      0.00000      0.21000      0.46001      0.00000
Cl     -0.36431     -2.12076      0.00000     -0.08000     -0.17000      0.00000
H       1.46636     -0.58339      0.00000      0.21000      0.40000      0.00000
H      -1.46636      0.58339      0.00000      0.21000      0.40000      0.00000
Cl      0.36431      2.12076      0.00000     -0.08000     -0.17000      0.00000
6
Model[7]: IRIntensity=0.0000 KM/Mole;PATH=Calculation 1;FrequenciesFrequencies;ReducedMass=4.7852 AMU;ForceConstant=2.6377 mDyne/A;FreqValue=967.2547;Frequency=967.2547 cm^-1;FrequencyLabel=AG;PATH=Calculation 1;FrequenciesFrequencies
C      -0.36431      0.56175      0.00000      0.33001      0.19000      0.00000
C       0.36431     -0.56175      0.00000     -0.33001     -0.19000      0.00000
Cl     -0.36431     -2.12076      0.00000      0.06000      0.06000      0.00000
H       1.46636     -0.58339      0.00000     -0.34000     -0.48000      0.00000
H      -1.46636      0.58339      0.00000      0.34000      0.48000      0.00000
Cl      0.36431      2.12076      0.00000     -0.06000     -0.06000      0.00000
6
Model[8]: IRIntensity=0.0000 KM/Mole;PATH=Calculation 1;FrequenciesFrequencies;ReducedMass=1.8463 AMU;ForceConstant=1.1155 mDyne/A;FreqValue=1012.6580;Frequency=1012.6580 cm^-1;FrequencyLabel=BG;PATH=Calculation 1;FrequenciesFrequencies
C      -0.36431      0.56175      0.00000      0.00000      0.00000     -0.19000
C       0.36431     -0.56175      0.00000      0.00000      0.00000      0.19000
Cl     -0.36431     -2.12076      0.00000      0.00000      0.00000     -0.01000
H       1.46636     -0.58339      0.00000      0.00000      0.00000     -0.68000
H      -1.46636      0.58339      0.00000      0.00000      0.00000      0.68000
Cl      0.36431      2.12076      0.00000      0.00000      0.00000      0.01000
6
Model[9]: IRIntensity=71.3035 KM/Mole;PATH=Calculation 1;FrequenciesFrequencies;ReducedMass=1.0871 AMU;ForceConstant=0.8649 mDyne/A;FreqValue=1162.0574;Frequency=1162.0574 cm^-1;FrequencyLabel=AU;PATH=Calculation 1;FrequenciesFrequencies
C      -0.36431      0.56175      0.00000      0.00000      0.00000      0.06000
C       0.36431     -0.56175      0.00000      0.00000      0.00000      0.06000
Cl     -0.36431     -2.12076      0.00000      0.00000      0.00000      0.00000
H       1.46636     -0.58339      0.00000      0.00000      0.00000     -0.70000
H      -1.46636      0.58339      0.00000      0.00000      0.00000     -0.70000
Cl      0.36431      2.12076      0.00000      0.00000      0.00000      0.00000
6
Model[10]: IRIntensity=25.0309 KM/Mole;PATH=Calculation 1;FrequenciesFrequencies;ReducedMass=1.1050 AMU;ForceConstant=1.3205 mDyne/A;FreqValue=1424.1223;Frequency=1424.1223 cm^-1;FrequencyLabel=BU;PATH=Calculation 1;FrequenciesFrequencies
C      -0.36431      0.56175      0.00000      0.02000     -0.06000      0.00000
C       0.36431     -0.56175      0.00000      0.02000     -0.06000      0.00000
Cl     -0.36431     -2.12076      0.00000     -0.01000      0.00000      0.00000
H       1.46636     -0.58339      0.00000      0.04000      0.70000      0.00000
H      -1.46636      0.58339      0.00000      0.04000      0.70000      0.00000
Cl      0.36431      2.12076      0.00000     -0.01000      0.00000      0.00000
6
Model[11]: IRIntensity=0.0000 KM/Mole;PATH=Calculation 1;FrequenciesFrequencies;ReducedMass=1.3166 AMU;ForceConstant=1.6333 mDyne/A;FreqValue=1451.0326;Frequency=1451.0326 cm^-1;FrequencyLabel=AG;PATH=Calculation 1;FrequenciesFrequencies
C      -0.36431      0.56175      0.00000     -0.11000      0.05000      0.00000
C       0.36431     -0.56175      0.00000      0.11000     -0.05000      0.00000
Cl     -0.36431     -2.12076      0.00000      0.01000      0.00000      0.00000
H       1.46636     -0.58339      0.00000      0.11000     -0.69000      0.00000
H      -1.46636      0.58339      0.00000     -0.11000      0.69000      0.00000
Cl      0.36431      2.12076      0.00000     -0.01000      0.00000      0.00000
6
Model[12]: IRIntensity=0.0000 KM/Mole;PATH=Calculation 1;FrequenciesFrequencies;ReducedMass=4.0894 AMU;ForceConstant=7.3480 mDyne/A;FreqValue=1746.3394;Frequency=1746.3394 cm^-1;FrequencyLabel=AG;PATH=Calculation 1;FrequenciesFrequencies
C      -0.36431      0.56175      0.00000     -0.12000      0.35000      0.00000
C       0.36431     -0.56175      0.00000      0.12000     -0.35000      0.00000
Cl     -0.36431     -2.12076      0.00000      0.00000      0.01000      0.00000
H       1.46636     -0.58339      0.00000      0.22000      0.56000      0.00000
H      -1.46636      0.58339      0.00000     -0.22000     -0.56000      0.00000
Cl      0.36431      2.12076      0.00000      0.00000     -0.01000      0.00000
6
Model[13]: IRIntensity=16.1874 KM/Mole;PATH=Calculation 1;FrequenciesFrequencies;ReducedMass=1.0862 AMU;ForceConstant=6.3251 mDyne/A;FreqValue=3143.7315;Frequency=3143.7315 cm^-1;FrequencyLabel=BU;PATH=Calculation 1;FrequenciesFrequencies
C      -0.36431      0.56175      0.00000      0.06000      0.00000      0.00000
C       0.36431     -0.56175      0.00000      0.06000      0.00000      0.00000
Cl     -0.36431     -2.12076      0.00000      0.00000      0.00000      0.00000
H       1.46636     -0.58339      0.00000     -0.70000      0.02000      0.00000
H      -1.46636      0.58339      0.00000     -0.70000      0.02000      0.00000
Cl      0.36431      2.12076      0.00000      0.00000      0.00000      0.00000
6
Model[14]: IRIntensity=0.0000 KM/Mole;PATH=Calculation 1;FrequenciesFrequencies;ReducedMass=1.1058 AMU;ForceConstant=6.4534 mDyne/A;FreqValue=3147.1884;Frequency=3147.1884 cm^-1;FrequencyLabel=AG;PATH=Calculation 1;FrequenciesFrequencies
C      -0.36431      0.56175      0.00000      0.07000     -0.01000      0.00000
C       0.36431     -0.56175      0.00000     -0.07000      0.01000      0.00000
Cl     -0.36431     -2.12076      0.00000      0.00000      0.00000      0.00000
H       1.46636     -0.58339      0.00000      0.70000     -0.02000      0.00000
H      -1.46636      0.58339      0.00000     -0.70000      0.02000      0.00000
Cl      0.36431      2.12076      0.00000      0.00000      0.00000      0.00000
</ModelData>
</Models>
##$PEAKS=
<Peaks type="RAMAN" xUnitsExpected="1/cm"  >
<PeakData id="1" title="Bu- asymm stretch of CH group (~3150 cm-1)" peakShape="broad" model="T2.13" xMax="3180" xMin="3150"    />
<PeakData id="2" title="Inactive Ag-symm stretch of CH group (~3140 cm-1)" peakShape="broad" model="T2.14" xMax="3150" xMin="3120"    />
<PeakData id="3" title="Ag- C=C stretch (~1576 cm-1)" peakShape="broad" model="T2.12" xMax="1760" xMin="1730"    />
<PeakData id="4" title="Ag- H-C-H scissors (~1272 cm-1)" peakShape="broad" model="T2.11" xMax="1465" xMin="1435"    />
<PeakData id="5" title="Inactive Bu- C-H scissors (~1205 cm-1)" peakShape="broad" model="T2.10" xMax="1435" xMin="1405"    />
<PeakData id="6" title="Inactive Au- C-H wagging (~900 cm-1)" peakShape="broad" model="T2.9" xMax="1180" xMin="1150"    />
<PeakData id="7" title="Bg- wag of CH group (~750 cm-1)" peakShape="broad" model="T2.8" xMax="1030" xMin="1000"    />
<PeakData id="8" title="Ag-symm stretch of CCl group (~845 cm-1)" peakShape="broad" model="T2.7" xMax="980" xMin="950"    />
<PeakData id="9" title="Inactive Bu- asymm stretch of CCl group (~830 cm-1)" peakShape="broad" model="T2.6" xMax="925" xMin="895"    />
<PeakData id="10" title="Ag-symm bend of CCl group (~350 cm-1)" peakShape="broad" model="T2.5" xMax="400" xMin="370"    />
<PeakData id="11" title="Inactive Bu-asymm bend of CCl group (~265 cm-1)" peakShape="broad" model="T2.4" xMax="285" xMin="245"    />
<PeakData id="12" title="Inactive Au-Cl-C=C-Cl torsion  (~192 cm-1)" peakShape="broad" model="T2.3" xMax="245" xMin="215"    />
</Peaks>
##XUNITS= 1/CM
##YUNITS=RAMAN INTENSITY
##XFACTOR= 1
##YFACTOR= 6.979499E-07
##FIRSTX= 3.347189E+03
##FIRSTY= 6.879730E-03
##LASTX= 2.970410E+01
##NPOINTS= 2001
##MINY= 0
##MAXY= 6.979498E-01
##XYDATA= (X++(Y..Y))
3347.1885I857J64J67J72J76J81J85J91J95K00K06K11K17K23K30K35K43A3302
$$ 9857 10021 10188 10360 10536 10717 10902 11093 11288 11488 11694 11905 12122 12345 12575 12810 13053 13302
3317.331A3558K64K72K79K88K97L06L15L25L35L46L57L68L81L93M06A8910
$$ 13558 13822 14094 14373 14661 14958 15264 15579 15904 16239 16585 16942 17310 17691 18084 18490 18910
3289.1323A9345M50M65M82M99N17N36N56N77N99O22O46O72O98P27P57B8936
$$ 19345 19795 20260 20742 21241 21758 22294 22850 23427 24026 24648 25294 25966 26664 27391 28148 28936
3260.9338B9758Q56Q94R33R74J019J065J115J167J223J283J346J414J486D6096
$$ 29758 30614 31508 32441 33415 34434 35499 36614 37781 39004 40287 41633 43047 44533 46096
3236.0527D7742J733J828J929K038K154K281K416K561K720K891L075L276H0138
$$ 47742 49475 51303 53232 55270 57424 59705 62121 64682 67402 70293 73368 76644 80138
3212.8303H3869L988M270M578M914N282N688O132O622P163P760Q421R153A67805
$$ 83869 87857 92127 96705 101619 106901 112589 118721 125343 132506 140266 148687 157840 167805
3189.608A78674J1873J2991J4239J5629J7179J8906K0828K2961K5320C66516
$$ 178674 190547 203538 217777 233406 250585 269491 290319 313280 338600 366516
3171.3618C97266L3811L7067M0459M3882M7182N0133N2431N3692N3470H60691
$$ 397266 431077 468144 508603 552485 599667 649800 702231 755923 809393 860691
3153.1155I07461L9644K9956J8101M838q815k1763l3046m2006m8361n2162G40130
$$ 907461 947105 977061 995162 1000000 991185 969422 936376 894370 846009 793847 740130
3133.2107F86675n1846m9321m6239m2883l9456l6095l2891k9895k7130C06315
$$ 686675 634829 585508 539269 496386 456930 420835 387944 358049 330919 306315
3114.9646B84002k0243j8381j6707j5205j3860j2651j1567j0594r718A46146
$$ 284002 263759 245378 228671 213466 199606 186955 175388 164794 155076 146146
3096.7183A37926p579o999o473n998n565n171m812m484m185l911l659G5662
$$ 137926 130347 123348 116875 110877 105312 100141 95329 90845 86660 82749 79090 75662
3075.1548G2447l020k839k672k518k375k243k119k005j899j800j707j620D4090
$$ 72447 69427 66588 63916 61398 59023 56780 54661 52656 50757 48957 47250 45630 44090
3051.9324D2626j394j327j265j207j152j099j052j005r62r21q83q46q11B7923
$$ 42626 41232 39905 38640 37433 36281 35182 34130 33125 32163 31242 30359 29513 28702 27923
3027.0513B7175p18o91o64o39o15n92n71n50n31n11m94m77m61m45m30A8370
$$ 27175 26457 25766 25102 24463 23848 23256 22685 22135 21604 21093 20599 20122 19661 19216 18786 18370
2998.8525A7967l89l77l65l54l42l33l22l12l03k94k86k77k69k62k54A2981
$$ 17967 17578 17201 16836 16482 16140 15807 15485 15173 14870 14576 14290 14013 13744 13482 13228 12981
2970.654A2740k33k28k21k15k10k04j99j94j89j84j79j75j70j67j62I651
$$ 12740 12507 12279 12058 11843 11633 11429 11230 11036 10847 10663 10484 10309 10139 9972 9810 9651
2942.4553I497j51j48j43j41j37j35j31j28j25j23j20j17j15j12j10j07G349
$$ 9497 9346 9198 9055 8914 8777 8642 8511 8383 8258 8135 8015 7898 7783 7671 7561 7454 7349
2912.598G245j00r9r7r5r2r1r0q7q6q4q2q1p9p8p6p5p3p2p1o9o8o7o6E303
$$ 7245 7145 7046 6949 6854 6762 6671 6581 6494 6408 6324 6242 6161 6082 6004 5928 5853 5780 5708 5637 5568 5500 5433 5367 5303
2871.1294E240o3o1o0n9n8n6Tn5Tn3n2n1Tn0m9m8m7m6Tm5Tm3Um1Ul9Ul8C690
$$ 5240 5177 5116 5056 4997 4939 4883 4827 4772 4717 4664 4612 4561 4510 4460 4411 4363 4316 4270 4224 4179 4134 4091 4048 4005 3964 3923 3882 3843 3804 3765 3727 3690
2816.3909C653l6Tl5Tl4Tl3Tl2Tl1Ul0k9l0k8k9k8Tk7Tk6Vk5Tk4k5k3B714
$$ 3653 3617 3581 3546 3511 3477 3443 3410 3377 3345 3313 3282 3251 3220 3190 3161 3131 3103 3074 3046 3018 2991 2964 2938 2912 2886 2860 2835 2810 2786 2761 2738 2714
2761.6523B691k3Tk2Vk1Uk494%U60O21NTONTOTNOZPOTPVOQPUQTPQWRQH83
2079.9094H92RVJ0RJ0VJ1J0J1VJ2J1J2UJ3J2J3UJ4WJ5UJ6VJ7UJ8UJ9UK0A556
$$ 892 901 910 919 928 938 947 957 967 977 987 998 1008 1019 1030 1041 1052 1064 1075 1087 1099 1111 1124 1136 1149 1162 1175 1189 1203 1217 1231 1245 1260 1275 1290 1306 1322 1338 1354 1371 1388 1405 1423 1441 1459 1478 1497 1516 1536 1556
1996.9723A577K1TK2TK3TK4TK5TK6TK7TK8K9TL0L1TL2L3L4TL5L6L7L8B408
$$ 1577 1598 1619 1641 1663 1686 1709 1733 1757 1782 1807 1833 1859 1886 1913 1941 1970 1999 2029 2060 2091 2123 2156 2190 2224 2259 2295 2332 2370 2408
1947.2101B448M1TM3M4TM6M8TN0N1N3TN6N7N8O0O2O4O6O7O9P2P4P6P8C950
$$ 2448 2489 2530 2573 2617 2661 2707 2755 2803 2853 2904 2957 3010 3066 3123 3181 3241 3303 3367 3433 3500 3569 3641 3715 3791 3869 3950
1902.424D033Q6Q8R2R4R8J01J04J08J12J15J20J24J28J34J38J43J49F121
$$ 4033 4119 4207 4299 4393 4491 4592 4696 4804 4916 5031 5151 5275 5403 5537 5675 5818 5967 6121
1870.9078F282J66J74J80J88J96K04K13K22K31K42K53J025K83K96L11A0791
$$ 6282 6448 6622 6802 6990 7186 7390 7603 7825 8056 8298 8551 9576 9859 10155 10466 10791
1842.7092A1132L58L75L96M15M38M61M86N14N42N74O08O44O83P26P72A9945
$$ 11132 11490 11865 12261 12676 13114 13575 14061 14575 15117 15691 16299 16943 17626 18352 19124 19945
1814.5106B0821R35R99J070J145J229J321J422J532J654J789J936K101D0237
$$ 20821 21756 22755 23825 24970 26199 27520 28942 30474 32128 33917 35853 37954 40237
1791.2882D2722K710K959L237L547L892M277M707N183N714O300O945P648A08250
$$ 42722 45432 48391 51628 55175 59067 63344 68051 73234 78948 85248 92193 99841 108250
1768.0659A17468J0060J0911J1730J2464J3034J3348J3293J2753J1630B36551
$$ 117468 127528 138439 150169 162633 175667 189015 202308 215061 226691 236551
1749.8197B44005M510J217k173n389q190j0416j1993j2937j3323j3257A59197
$$ 244005 248515 249732 247559 242170 233980 223564 211571 198634 185311 172054 159197
1729.9148A46967j1465j0631r779q944q148p404o717o089n519n005m543E8597
$$ 146967 135502 124871 115092 106148 98000 90596 83879 77790 72271 67266 62723 58597
1708.3512E4844l418l117k848k606k388k191k015j855j710j579j461j352B7050
$$ 54844 51426 48309 45461 42855 40467 38276 36261 34406 32696 31117 29656 28304 27050
1685.1288B5886j083j007r38q75q17p64p14o68o26n87n51n16m86m56m28A4967
$$ 25886 24803 23796 22858 21983 21166 20402 19688 19020 18394 17807 17256 16740 16254 15798 15370 14967
1656.9302A4588l56l35l15k97k78k62k46k31k17k04j90j78j66j55j44A0880
$$ 14588 14232 13897 13582 13285 13007 12745 12499 12268 12051 11847 11657 11479 11313 11158 11014 10880
1628.7316A0756j14j04r6q7p9p0o2n4m7l8l2k4j6rlOJ2K0K6L4M2M9N6A0230
$$ 10756 10642 10538 10442 10355 10276 10206 10144 10090 10043 10005 9973 9949 9933 9924 9921 9927 9939 9959 9985 10019 10061 10110 10166 10230
1587.263A0302P9Q8R6J04J14J22J31J41J51J61J72J83J95K07K20K32A2945
$$ 10302 10381 10469 10565 10669 10783 10905 11036 11177 11328 11489 11661 11844 12039 12246 12466 12698 12945
1557.4056A3207K77K93L10L28L48L68L89M13M36M63M90N20N51N86O21B0261
$$ 13207 13484 13777 14087 14415 14763 15131 15520 15933 16369 16832 17322 17842 18393 18979 19600 20261
1529.207B0963P48P96Q49R05R68J034J106J186J272J365J469J581J705C7787
$$ 20963 21711 22507 23356 24261 25229 26263 27369 28555 29827 31192 32661 34242 35947 37787
1504.3259C9777K154K337K537K761L008L283L589L929M309M731N203N728H9659
$$ 39777 41931 44268 46805 49566 52574 55857 59446 63375 67684 72415 77618 83346 89659
1481.1035I6620P679Q468R329J0261J1250J2282J3322J4326J5222J5922B30986
$$ 96620 104299 112767 122096 132357 143607 155889 169211 183537 198759 214681 230986
1461.1986B47224J5578J4202J2036R092N488J458k692o627j0056j2780B58213
$$ 247224 262802 277004 289040 298132 303620 305078 302386 295759 285703 272923 258213
1441.2937B42346j6338j6259j5769j5002j4064j3045j2003j0981j0007A09782
$$ 242346 226008 209749 193980 178978 164914 151869 139866 128885 118878 109782
1423.0475A01526p488o791o162n596n087m631l979l852l523l226k960D5511
$$ 101526 94038 87247 81085 75489 70402 65771 61792 57940 54417 51191 48231 45511
1401.4839D3007k310k133j973j828j696j577j468j367j277j193j117j046B3041
$$ 43007 40697 38564 36591 34763 33067 31490 30022 28655 27378 26185 25068 24022 23041
1378.2615B2119q67q16p69p25o85o48m28n79n48n20m94m69m46m24m04A2912
$$ 22119 21252 20436 19667 18942 18257 17609 17181 16602 16054 15534 15040 14571 14125 13701 13297 12912
1350.0629A2545l50l34r34l00k87k75k63k51k41k31k22k12k04j96j88G877
$$ 12545 12195 11861 10927 10627 10340 10065 9802 9551 9310 9079 8857 8645 8441 8245 8057 7877
1321.8643G703j67j61j54j49j43j38j33j28j23j19j15j11j06j03j00r5E565
$$ 7703 7536 7375 7221 7072 6929 6791 6658 6530 6407 6288 6173 6062 5956 5853 5753 5658 5565
1292.0068E476q7q3q0p8p5p2p0o8o5o3o0n9n7n4n3n0m9m7m6m4m2m0l9D057
$$ 5476 5389 5306 5226 5148 5073 5001 4931 4863 4798 4735 4675 4616 4559 4505 4452 4402 4353 4306 4260 4216 4174 4134 4095 4057
1250.5383D022l5l3l2l0k9k7Tk5k3Tk1k0j9j8j6Tj4j3j2j1j0qToTmlkC531
$$ 4022 3987 3954 3922 3892 3863 3836 3809 3784 3761 3738 3717 3697 3678 3660 3644 3628 3614 3601 3589 3578 3568 3560 3552 3546 3540 3536 3533 3531 3531
1200.776C531JLMNOPRJ0J1J2J4TJ7TJ9K1K2K3K5K7K8L0L1L4L5L7L9M1D116
$$ 3531 3532 3535 3539 3544 3550 3557 3566 3576 3587 3599 3613 3627 3644 3661 3680 3701 3723 3746 3771 3798 3826 3856 3887 3921 3956 3993 4032 4073 4116
1151.0138D161M8N0N2N5N7O0O3O6O9P3P5Q0Q2Q7R1R5J00J05J09J15J20E939
$$ 4161 4209 4259 4311 4366 4423 4483 4546 4612 4681 4754 4829 4909 4991 5078 5169 5264 5364 5469 5578 5693 5813 5939
1112.8627F072J39J45J54J61J69J79J87J98K09K20K32K45K60K74K91L08I770
$$ 6072 6211 6356 6510 6671 6840 7019 7206 7404 7613 7833 8065 8310 8570 8844 9135 9443 9770
1083.0054A0117L69L93M19M46M77N10N46N85O29O76P27P85Q47R16R93B0513
$$ 10117 10486 10879 11298 11744 12221 12731 13277 13862 14491 15167 15894 16679 17526 18442 19435 20513
1054.8068B1685J275J391P68J669J828K005K202K419K659K924L213L524E1419
$$ 21685 22960 24351 25119 26788 28616 30621 32823 35242 37901 40825 44038 47562 51419
1031.5844E5622M555M896N206N455N607N619N445N047M403L515K425J203A08948
$$ 55622 60177 65073 70279 75734 81341 86960 92405 97452 101855 105370 107795 108998 108948
1008.36194A07722k234l007l519l771l794l628l314k896k407j873j317G5211
$$ 107722 105488 102481 98962 95191 91397 87769 84455 81559 79152 77279 75962 75211
986.79834G5020L50Q62J323J714K007K171K172J983J587R89K18o66j590H5671
$$ 75020 75370 76232 77555 79269 81276 83447 85619 87602 89189 90178 90396 89730 88140 85671
961.9172H2438l832m246m476m544m483m326m105l846l570l290l018k758C3426
$$ 82438 78606 74360 69884 65340 60857 56531 52426 48580 45010 41720 38702 35944 33426
938.6948C1132k090j905j738j586j449j327j217j117j028r47q74q08A4298
$$ 31132 29042 27137 25399 23813 22364 21037 19820 18703 17675 16728 15854 15046 14298
915.4724A3604o45o00n59n22m88m56m29m01l78l55l35l16k98k82k66G021
$$ 13604 12959 12359 11800 11278 10790 10334 9905 9504 9126 8771 8436 8120 7822 7540 7274 7021
887.2738F782k28k16k05j95j86j77j69j62j54j47j41j35j29j24j19j14D071
$$ 6782 6554 6338 6133 5938 5752 5575 5406 5244 5090 4943 4802 4667 4538 4414 4295 4181 4071
857.41644C966j01r7r4r0q6q4q1p7p5p3p0o7o6o3o1n9n7n6n4n2n0m9m8B310
$$ 3966 3865 3768 3674 3584 3498 3414 3333 3256 3181 3108 3038 2971 2905 2842 2781 2722 2665 2609 2555 2503 2453 2404 2356 2310
815.9479B266m4m2m1m0l9l7Tl5Tl4l3l2l1l0Tk9k8k7J48k4Uk2k3k1Uk0A571
$$ 2266 2222 2180 2139 2099 2060 2023 1986 1951 1916 1882 1849 1817 1786 1756 1726 1697 1669 1642 1790 1766 1742 1718 1696 1673 1652 1631 1610 1590 1571
766.1856A552j8Uj7Tj6Tj5Uj4Uj3Tj2j3j2j1j2j1j0j1j0UrVqVpqpToA087
$$ 1552 1534 1516 1498 1481 1464 1448 1432 1417 1402 1387 1373 1359 1345 1332 1319 1307 1294 1282 1271 1259 1248 1238 1227 1217 1207 1197 1188 1179 1170 1161 1153 1145 1137 1129 1122 1114 1107 1100 1094 1087
698.1772A081oTnonUmnmVlmlUklkWjW%j%UJ%JVKJKULTKMLTk35OTPOPH17
$$ 1081 1075 1069 1064 1058 1053 1048 1043 1039 1034 1030 1026 1022 1018 1015 1011 1008 1005 1002 1000 997 995 993 991 989 987 986 985 984 983 982 982 981 981 981 981 982 982 983 984 985 986 988 989 991 993 995 998 1001 1003 1007 1010 1013 778 784 790 797 803 810 817
598.65265H24QVRQJ0RJ0UJ1UJ2UJ3Tj69J6TJ7UJ8TJ9K0TK1TK2K3K4TK5A212
$$ 824 832 840 848 856 865 873 883 892 902 912 922 933 944 955 967 979 991 1004 1017 848 864 880 897 914 931 949 967 986 1006 1026 1047 1068 1090 1113 1137 1161 1186 1212
533.96173A238K8TL0TL1L3L4L5L6L7L9M1M2M3M5M7M9N1N3N5N8O0O2O5B339
$$ 1238 1266 1294 1324 1354 1385 1418 1452 1487 1523 1560 1599 1640 1682 1725 1770 1817 1866 1917 1970 2025 2083 2143 2205 2270 2339
490.8344B410P5P8Q1Q6R0R4R9J04J09J15J22J28J35J42J51J60J69J79D717
$$ 2410 2485 2563 2644 2730 2820 2914 3013 3117 3226 3341 3463 3591 3726 3868 4019 4179 4348 4527 4717
457.65958D920K15K29K45K61K79K99L20L44L70L98M29M64N01N43N89O41A1745
$$ 4920 5135 5364 5609 5870 6149 6448 6768 7112 7482 7880 8309 8773 9274 9817 10406 11047 11745
427.80222A2505Q31R09R97J094J202J323J458J607J772J954K152K367C2765
$$ 12505 13336 14245 15242 16336 17538 18861 20319 21926 23698 25652 27804 30171 32765
404.57983C5597L071L302L509L669L758L743L590L273K775K096J267L39F9372
$$ 35597 38668 41970 45479 49148 52906 56649 60239 63512 66287 68383 69650 69989 69372
381.35742F7849k313k940l385l651l759l741l629l452l236l001k762k526B7152
$$ 67849 65536 62596 59211 55560 51801 48060 44431 40979 37743 34742 31980 29454 27152
358.13504B5059j898j722j562j417j286j170j064r70q85q10p41o80o25I653
$$ 25059 23161 21439 19877 18460 17174 16004 14940 13970 13085 12275 11534 10854 10229 9653
333.2539I123m90m53m20l89l62l37l14k93k73k57k39k26k11j99j87j76D131
$$ 9123 8633 8180 7760 7371 7009 6672 6358 6065 5792 5535 5296 5070 4859 4660 4473 4297 4131
303.39655C974j48j41j33j26j19j13j08j03r7r3q9q4q1p7p3p1o7o4o2B066
$$ 3974 3826 3685 3552 3426 3307 3194 3086 2983 2886 2793 2704 2620 2539 2462 2389 2318 2251 2187 2125 2066
268.56296B009n5n2n0m9m6m5m3m1m0l9l7l6l4Tl2l1l0k9k8Tk6Tk4Uk2A062
$$ 2009 1954 1902 1852 1803 1757 1712 1669 1628 1588 1549 1512 1476 1442 1408 1376 1345 1315 1286 1258 1230 1204 1178 1154 1130 1106 1084 1062
222.1182A041k1k0j9Tj8Tj7Uj6j5Uj4Uj3Tj2Vj1j2j0j1j0VrWqWpqpVoD73
$$ 1041 1020 1000 981 962 944 926 909 892 875 859 844 829 814 800 786 772 759 746 734 722 710 698 687 675 665 654 644 634 624 614 605 596 587 578 569 561 553 545 537 529 522 514 507 500 493 486 480 473
140.83983D67oXnonUomnUmnmnmslmlmlmlUmlWklUklTklklklkTlkVlB23
$$ 467 461 455 449 443 437 431 426 420 415 410 405 399 395 390 385 380 376 371 367 362 358 354 350 346 342 338 334 330 326 323 319 316 312 309 305 302 299 296 292 289 286 283 280 277 275 272 269 266 264 261 258 256 253 251 248 246 243 241 239 236 234 232 230 228 225 223
29.7041B21  $$checkpoint
##END=$$ End of RAMAN of trans-DCE
##TITLE= 1,1-dichloroethene
##JCAMP-DX= 5.01
##DATA TYPE= INFRARED SPECTRUM
##DATA CLASS= XYDATA
##BLOCK ID=5
##ORIGIN= Department of Chemistry, UWI, JAMAICA
##OWNER= public domain
##LONGDATE= 2012/02/18 12:32:26.0301 -0500 $$ export date from JSpecView
##SPECTROMETER/DATA SYSTEM= from scan
##$MODELS=
<Models>
<ModelData id="1DCE" type="MOL">
1,1-dichloroethylene
__Jmol-14_02171520543D 1   1.00000     0.00000     0
Jmol version 14.3.12_2015.02.11  2015-02-11 19:15 EXTRACT: ({0:5})
  6  5  0  0  0  0              1 V2000
   0.00000   0.00000   0.41101 C   0  0  0  0  0  0
   0.00000   0.00000   1.74967 C   0  0  0  0  0  0
   0.00000   0.93996   2.32528 H   0  0  0  0  0  0
   0.00000  -0.93996   2.32528 H   0  0  0  0  0  0
   0.00000   1.44639  -0.51808 Cl  0  0  0  0  0  0
   0.00000  -1.44639  -0.51808 Cl  0  0  0  0  0  0
  1  6  1  0  0  0
  1  5  1  0  0  0
  1  2  2  0  0  0
  2  3  1  0  0  0
  2  4  1  0  0  0
M  END
</ModelData>
<ModelData id="i1" type="XYZVIB" baseModel="1DCE" vibrationScale=".5">
6
Model[1]: PATH=Calculation 1;Input;Convg=0.4887D-08;-V/T=2.0006;Energy=NaN;Range=M.O.s;E(RHF)=-995.823662291 A.U.;PATH=Calculation 1;Input
C       0.00000      0.00000      0.00000
C       0.00000      0.00000      1.33866
H       0.93996      0.00000      1.91427
H      -0.93996      0.00000      1.91427
Cl      1.44639      0.00000     -0.92909
Cl     -1.44639      0.00000     -0.92909
6
Model[2]: PATH=Calculation 1;Standard;Convg=0.4887D-08;-V/T=2.0006;Energy=-995.82367;Range=M.O.s;E(RHF)=-995.823662291 A.U.;PATH=Calculation 1;Standard
C       0.00000      0.00000      0.41101
C       0.00000      0.00000      1.74967
H       0.00000      0.93996      2.32528
H       0.00000     -0.93996      2.32528
Cl      0.00000      1.44639     -0.51808
Cl      0.00000     -1.44639     -0.51808
6
Model[3]: IRIntensity=0.1106 KM/Mole;PATH=Calculation 1;FrequenciesFrequencies;ReducedMass=18.4273 AMU;ForceConstant=1.1552 mDyne/A;FreqValue=326.1875;Frequency=326.1875 cm^-1;FrequencyLabel=A1;PATH=Calculation 1;FrequenciesFrequencies
C       0.00000      0.00000      0.41101      0.00000      0.00000     -0.37000
C       0.00000      0.00000      1.74967      0.00000      0.00000     -0.39000
H       0.00000      0.93996      2.32528      0.00000      0.00000     -0.38000
H       0.00000     -0.93996      2.32528      0.00000      0.00000     -0.38000
Cl      0.00000      1.44639     -0.51808      0.00000      0.44000      0.14000
Cl      0.00000     -1.44639     -0.51808      0.00000     -0.44000      0.14000
6
Model[4]: IRIntensity=0.0003 KM/Mole;PATH=Calculation 1;FrequenciesFrequencies;ReducedMass=3.6118 AMU;ForceConstant=0.4422 mDyne/A;FreqValue=455.8292;Frequency=455.8292 cm^-1;FrequencyLabel=B2;PATH=Calculation 1;FrequenciesFrequencies
C       0.00000      0.00000      0.41101      0.00000     -0.07000      0.00000
C       0.00000      0.00000      1.74967      0.00000      0.34000      0.00000
H       0.00000      0.93996      2.32528      0.00000      0.55000     -0.34000
H       0.00000     -0.93996      2.32528      0.00000      0.55000      0.34000
Cl      0.00000      1.44639     -0.51808      0.00000     -0.06000      0.12000
Cl      0.00000     -1.44639     -0.51808      0.00000     -0.06000     -0.12000
6
Model[5]: IRIntensity=2.8951 KM/Mole;PATH=Calculation 1;FrequenciesFrequencies;ReducedMass=7.2233 AMU;ForceConstant=1.3108 mDyne/A;FreqValue=554.9693;Frequency=554.9693 cm^-1;FrequencyLabel=B1;PATH=Calculation 1;FrequenciesFrequencies
C       0.00000      0.00000      0.41101      0.70000      0.00000      0.00000
C       0.00000      0.00000      1.74967     -0.19000      0.00000      0.00000
H       0.00000      0.93996      2.32528     -0.48000      0.00000      0.00000
H       0.00000     -0.93996      2.32528     -0.48000      0.00000      0.00000
Cl      0.00000      1.44639     -0.51808     -0.07000      0.00000      0.00000
Cl      0.00000     -1.44639     -0.51808     -0.07000      0.00000      0.00000
6
Model[6]: IRIntensity=18.6624 KM/Mole;PATH=Calculation 1;FrequenciesFrequencies;ReducedMass=9.0383 AMU;ForceConstant=2.3129 mDyne/A;FreqValue=659.0407;Frequency=659.0407 cm^-1;FrequencyLabel=A1;PATH=Calculation 1;FrequenciesFrequencies
C       0.00000      0.00000      0.41101      0.00000      0.00000      0.36001
C       0.00000      0.00000      1.74967      0.00000      0.00000      0.48000
H       0.00000      0.93996      2.32528      0.00000     -0.01000      0.51000
H       0.00000     -0.93996      2.32528      0.00000      0.01000      0.51000
Cl      0.00000      1.44639     -0.51808      0.00000      0.19000     -0.16000
Cl      0.00000     -1.44639     -0.51808      0.00000     -0.19000     -0.16000
6
Model[7]: IRIntensity=0.0000 KM/Mole;PATH=Calculation 1;FrequenciesFrequencies;ReducedMass=1.0197 AMU;ForceConstant=0.4876 mDyne/A;FreqValue=900.8576;Frequency=900.8576 cm^-1;FrequencyLabel=A2;PATH=Calculation 1;FrequenciesFrequencies
C       0.00000      0.00000      0.41101      0.00000      0.00000      0.00000
C       0.00000      0.00000      1.74967      0.00000      0.00000      0.00000
H       0.00000      0.93996      2.32528      0.71000      0.00000      0.00000
H       0.00000     -0.93996      2.32528     -0.71000      0.00000      0.00000
Cl      0.00000      1.44639     -0.51808     -0.01000      0.00000      0.00000
Cl      0.00000     -1.44639     -0.51808      0.01000      0.00000      0.00000
6
Model[8]: IRIntensity=92.0040 KM/Mole;PATH=Calculation 1;FrequenciesFrequencies;ReducedMass=3.0785 AMU;ForceConstant=1.6024 mDyne/A;FreqValue=939.9244;Frequency=939.9244 cm^-1;FrequencyLabel=B2;PATH=Calculation 1;FrequenciesFrequencies
C       0.00000      0.00000      0.41101      0.00000      0.37000      0.00000
C       0.00000      0.00000      1.74967      0.00000      0.09000      0.00000
H       0.00000      0.93996      2.32528      0.00000     -0.27001      0.59000
H       0.00000     -0.93996      2.32528      0.00000     -0.27001     -0.59000
Cl      0.00000      1.44639     -0.51808      0.00000     -0.07000      0.04000
Cl      0.00000     -1.44639     -0.51808      0.00000     -0.07000     -0.04000
6
Model[9]: IRIntensity=52.9028 KM/Mole;PATH=Calculation 1;FrequenciesFrequencies;ReducedMass=1.3120 AMU;ForceConstant=1.0456 mDyne/A;FreqValue=1163.0605;Frequency=1163.0605 cm^-1;FrequencyLabel=B1;PATH=Calculation 1;FrequenciesFrequencies
C       0.00000      0.00000      0.41101     -0.04000      0.00000      0.00000
C       0.00000      0.00000      1.74967      0.16000      0.00000      0.00000
H       0.00000      0.93996      2.32528     -0.70000      0.00000      0.00000
H       0.00000     -0.93996      2.32528     -0.70000      0.00000      0.00000
Cl      0.00000      1.44639     -0.51808      0.00000      0.00000      0.00000
Cl      0.00000     -1.44639     -0.51808      0.00000      0.00000      0.00000
6
Model[10]: IRIntensity=85.0510 KM/Mole;PATH=Calculation 1;FrequenciesFrequencies;ReducedMass=1.8092 AMU;ForceConstant=1.7212 mDyne/A;FreqValue=1270.7289;Frequency=1270.7289 cm^-1;FrequencyLabel=B2;PATH=Calculation 1;FrequenciesFrequencies
C       0.00000      0.00000      0.41101      0.00000      0.21000      0.00000
C       0.00000      0.00000      1.74967      0.00000     -0.16000      0.00000
H       0.00000      0.93996      2.32528      0.00000      0.23001     -0.64000
H       0.00000     -0.93996      2.32528      0.00000      0.23001      0.64000
Cl      0.00000      1.44639     -0.51808      0.00000     -0.02000      0.01000
Cl      0.00000     -1.44639     -0.51808      0.00000     -0.02000     -0.01000
6
Model[11]: IRIntensity=6.8266 KM/Mole;PATH=Calculation 1;FrequenciesFrequencies;ReducedMass=1.4915 AMU;ForceConstant=2.1016 mDyne/A;FreqValue=1546.4604;Frequency=1546.4604 cm^-1;FrequencyLabel=A1;PATH=Calculation 1;FrequenciesFrequencies
C       0.00000      0.00000      0.41101      0.00000      0.00000      0.20001
C       0.00000      0.00000      1.74967      0.00000      0.00000     -0.06000
H       0.00000      0.93996      2.32528      0.00000      0.31000     -0.62000
H       0.00000     -0.93996      2.32528      0.00000     -0.31000     -0.62000
Cl      0.00000      1.44639     -0.51808      0.00000      0.01000     -0.01000
Cl      0.00000     -1.44639     -0.51808      0.00000     -0.01000     -0.01000
6
Model[12]: IRIntensity=47.1352 KM/Mole;PATH=Calculation 1;FrequenciesFrequencies;ReducedMass=2.6981 AMU;ForceConstant=4.9710 mDyne/A;FreqValue=1768.3251;Frequency=1768.3251 cm^-1;FrequencyLabel=A1;PATH=Calculation 1;FrequenciesFrequencies
C       0.00000      0.00000      0.41101      0.00000      0.00000     -0.26000
C       0.00000      0.00000      1.74967      0.00000      0.00000      0.29000
H       0.00000      0.93996      2.32528      0.00000      0.49001     -0.43000
H       0.00000     -0.93996      2.32528      0.00000     -0.49001     -0.43000
Cl      0.00000      1.44639     -0.51808      0.00000     -0.01000      0.01000
Cl      0.00000     -1.44639     -0.51808      0.00000      0.01000      0.01000
6
Model[13]: IRIntensity=0.0670 KM/Mole;PATH=Calculation 1;FrequenciesFrequencies;ReducedMass=1.0641 AMU;ForceConstant=6.0497 mDyne/A;FreqValue=3106.4325;Frequency=3106.4325 cm^-1;FrequencyLabel=A1;PATH=Calculation 1;FrequenciesFrequencies
C       0.00000      0.00000      0.41101      0.00000      0.00000      0.01000
C       0.00000      0.00000      1.74967      0.00000      0.00000     -0.07000
H       0.00000      0.93996      2.32528      0.00000      0.61000      0.36001
H       0.00000     -0.93996      2.32528      0.00000     -0.61000      0.36001
Cl      0.00000      1.44639     -0.51808      0.00000      0.00000      0.00000
Cl      0.00000     -1.44639     -0.51808      0.00000      0.00000      0.00000
6
Model[14]: IRIntensity=0.8160 KM/Mole;PATH=Calculation 1;FrequenciesFrequencies;ReducedMass=1.1196 AMU;ForceConstant=6.6677 mDyne/A;FreqValue=3179.2916;Frequency=3179.2916 cm^-1;FrequencyLabel=B2;PATH=Calculation 1;FrequenciesFrequencies
C       0.00000      0.00000      0.41101      0.00000      0.00000      0.00000
C       0.00000      0.00000      1.74967      0.00000     -0.10000      0.00000
H       0.00000      0.93996      2.32528      0.00000      0.60001      0.37000
H       0.00000     -0.93996      2.32528      0.00000      0.60001     -0.37000
Cl      0.00000      1.44639     -0.51808      0.00000      0.00000      0.00000
Cl      0.00000     -1.44639     -0.51808      0.00000      0.00000      0.00000
</ModelData>
</Models>
##$PEAKS=
<Peaks type="IR" xUnitsExpected="1/cm"  >
<PeakData id="1" title="1 (B2 ~3180 cm-1)" peakShape="broad" model="i1.14" xMax="3195" xMin="3165"    />
<PeakData id="2" title="2 (A1 ~3110 cm-1)" peakShape="broad" model="i1.13" xMax="3125" xMin="3085"    />
<PeakData id="3" title="3 (A1 ~1770 cm-1)" peakShape="broad" model="i1.12" xMax="1785" xMin="1750"    />
<PeakData id="4" title="4 (A1 ~1550 cm-1)" peakShape="broad" model="i1.10" xMax="1560" xMin="1530"    />
<PeakData id="5" title="5 (B2 ~1270 cm-1)" peakShape="broad" model="i1.11" xMax="1290" xMin="1260"    />
<PeakData id="6" title="6 (B1 ~1160 cm-1)" peakShape="broad" model="i1.9" xMax="1180" xMin="1150"    />
<PeakData id="7" title="7 (B2 ~940 cm-1)" peakShape="broad" model="i1.7" xMax="955" xMin="925"    />
<PeakData id="8" title="8 (A2 ~900 cm-1)" peakShape="broad" model="i1.6" xMax="915" xMin="885"    />
<PeakData id="9" title="9 (A1 ~660 cm-1)" peakShape="broad" model="i1.8" xMax="675" xMin="645"    />
<PeakData id="10" title="10 (B1 ~550 cm-1)" peakShape="broad" model="i1.4" xMax="570" xMin="540"    />
<PeakData id="11" title="11 (B2 ~450 cm-1)" peakShape="broad" model="i1.5" xMax="470" xMin="440"    />
<PeakData id="12" title="12 (A1 ~330 cm-1)" peakShape="broad" model="i1.3" xMax="340" xMin="310"    />
</Peaks>
##XUNITS= 1/CM
##YUNITS= TRANSMITTANCE
##XFACTOR= 1
##YFACTOR= 9.999000E-07
##FIRSTX= 3.512055E+03
##FIRSTY= 9.999363E-01
##LASTX= 2.743001E+02
##NPOINTS= 2001
##MINY= 10.000000E-05
##MAXY= 1
##XYDATA= (X++(Y..Y))
3512.0554A000036mnUpTqrj0j2j4j5j8k2k5l0l6m4n4o8q7j13j49k03k83I98401
$$ 1000036 1000032 1000027 1000022 1000017 1000010 1000003 999995 999986 999976 999964 999950 999935 999917 999895 999870 999840 999804 999760 999706 999638 999551 999438 999289 999086 998803 998401
3468.3457I97745q54j180j348q60L45J231J296R96O93M73L27K31J67J23I99477
$$ 997745 996891 995711 994363 993503 993848 995079 996375 997371 998064 998537 998864 999095 999262 999385 999477
3442.4436I99548N4M2L3K5K0J4J1PLKkmorj1j4j6k0k2k7l0l5m0m7n5o3I99284
$$ 999548 999602 999644 999677 999702 999722 999736 999747 999754 999757 999759 999757 999753 999747 999738 999727 999713 999697 999677 999655 999628 999598 999563 999523 999476 999421 999358 999284
3397.115I99196j04j24j51j84k28k86l65m75o29q53j187j691k456l568I81982
$$ 999196 999092 998968 998817 998633 998405 998119 997754 997279 996650 995797 994610 992919 990463 986895 981982
3371.2131I76387l551J440N122N415M182K921K019J393R90P23N39M12I98313
$$ 976387 972836 974276 979398 984813 988995 991916 993935 995328 996318 997041 997580 997992 998313
3348.5488I98567K04J66J38J14R7Q2P1O0N3M6M1L6L2K8K6K3K0J9J7J6I99870
$$ 998567 998771 998937 999075 999189 999286 999368 999439 999499 999552 999598 999639 999675 999707 999735 999761 999784 999804 999823 999840 999856 999870
3312.9333I99883J2J0J1RTQPTOUNUMNMLMLWKTLO9%Z14j1801l92m11m33I86608
1940.1252I86129n05n33n63n95o30o67p07p51p99q49r06r66j033j105I74336
$$ 986129 985624 985091 984528 983933 983303 982636 981929 981178 980379 979530 978624 977658 976625 975520 974336
1914.2231I73064j368j473j589j719j863k022k201k401k625k877l164I46273
$$ 973064 971696 970223 968634 966915 965052 963030 960829 958428 955803 952926 949762 946273
1893.1777I42415m281m768n328n979o736p625q670r909j1387j3158j5298H31380
$$ 942415 938134 933366 928038 922059 915323 907698 899028 889119 877732 864574 849276 831380
1872.1323H10307k4979k9802l5772m3151n2195o3052p5508q8467r9065A96554
$$ 810307 785328 755526 719754 676603 624408 561356 485848 397381 298316 196554
1854.3247A07041o0863k8538q090K699J7370M5335P8021R8360J01712D46924
$$ 107041 46178 17640 9550 12249 29619 74954 152975 251335 353047 446924
1836.5171E28419O8590N6939M7070L8958L2376K7059K2760J9270J6423H71951
$$ 528419 597009 653948 701018 739976 772352 799411 822171 841441 857864 871951
1818.7094H84108J0552R211Q082P125O311N614N014M495M045L651L308I54520
$$ 884108 894660 903871 911953 919078 925389 931003 936017 940512 944557 948208 951516 954520
1797.664I57257K500K289K101J934J783J647J525J415J314J223J141I77194
$$ 957257 959757 962046 964147 966081 967864 969511 971036 972451 973765 974988 976129 977194
1776.6185I78190R32Q75Q21P73P26O86O46O11N77N46N18M91M66M43M21I88122
$$ 978190 979122 979997 980818 981591 982317 983003 983649 984260 984837 985383 985901 986392 986858 987301 987722 988122
1749.0977I88504J1596%X1m5kjkYlklVmVnUoTpTqrTj1Tj3j4j6j7j9k2I99790
$$ 988504 1000100 1000100 1000100 1000100 1000100 1000100 1000100 1000100 1000100 1000100 1000100 1000100 1000100 1000100 1000100 1000100 1000100 1000100 1000100 1000100 1000100 1000100 1000100 1000100 1000100 1000100 1000100 1000100 1000100 1000100 1000100 1000100 1000100 1000100 1000100 1000100 1000100 1000100 1000100 1000100 1000100 1000100 1000100 1000100 1000100 1000100 1000100 1000100 1000100 1000100 1000100 1000100 1000100 1000100 1000100 1000100 1000100 1000100 1000100 1000100 1000100 1000100 1000055 1000053 1000052 1000050 1000048 1000046 1000044 1000042 1000040 1000038 1000035 1000033 1000030 1000027 1000024 1000021 1000017 1000013 1000009 1000005 1000000 999995 999990 999984 999978 999971 999964 999956 999947 999938 999927 999916 999903 999889 999873 999856 999837 999815 999790
1583.9722I99762l2l6m3m9n8o8q1r8j19j48j85k35l06m05n50p65j090I93910
$$ 999762 999730 999694 999651 999602 999544 999476 999395 999297 999178 999030 998845 998610 998304 997899 997349 996584 995494 993910
1553.2135I91608l176l623k303R34L319L502K699J883J291Q97O37M65I98480
$$ 991608 988432 984809 982506 983440 986759 990261 992960 994843 996134 997031 997668 998133 998480
1530.5492I98745K06J63J32J07Q8P4O2N3M5L9L4L0K6K3K0J9J6J5J3J2I99933
$$ 998745 998951 999114 999246 999353 999441 999515 999577 999630 999675 999714 999748 999778 999804 999827 999847 999866 999882 999897 999910 999922 999933
1494.9338I99943RQTPOUNTMNLMTLUKLKYJKTM4%Y5k3233p66q05q46q89I72624
$$ 999943 999952 999960 999968 999975 999981 999987 999993 999998 1000003 1000007 1000012 1000015 1000019 1000023 1000026 1000029 1000032 1000034 1000037 1000039 1000041 1000043 1000045 1000047 1000049 1000051 1000052 1000054 1000056 1000100 1000100 1000100 1000100 1000100 1000100 1000100 1000100 1000100 1000100 1000100 1000100 1000100 1000100 1000100 1000100 1000100 1000100 1000100 1000100 1000100 1000100 1000100 1000100 1000100 1000100 1000100 1000100 1000100 1000100 1000100 1000100 1000100 1000100 1000100 1000100 1000100 1000100 1000100 1000100 1000100 1000100 1000100 1000100 1000100 1000100 1000100 1000100 1000100 1000100 1000100 1000100 1000100 1000100 1000100 1000100 1000100 1000100 1000100 1000100 1000100 1000100 1000100 1000100 1000100 1000100 1000100 1000100 1000100 1000100 1000100 1000100 1000100 1000100 1000100 1000100 976867 976101 975296 974450 973561 972624
1313.6195I71638j040j098j160j227j298j377j460j551j649j756j872I54151
$$ 971638 970598 969500 968340 967113 965815 964438 962978 961427 959778 958022 956150 954151
1292.5741I52014k287k453k635k833l054l296l564l863m195m565m979I08847
$$ 952014 949727 947274 944639 941806 938752 935456 931892 928029 923834 919269 914290 908847
1271.5287I02882o555p222p980q845r833j0967j2274j3786j5539j7581G72334
$$ 902882 896327 889105 881125 872280 862447 851480 839206 825420 809881 792300 772334
1252.1022G49576k6035k9879l4383l9635m5696n2562o0077o7802p4787B39431
$$ 749576 723541 693662 659279 619644 573948 521386 461309 393507 318720 239431
1234.2946A60814o9669n1248k7921r710j929k37O4P77M973J8373M0631A27232
$$ 160814 91145 39897 11976 2266 337 100 164 941 5914 24287 64918 127232
1213.2491B02939P9816P7297P1173O3629N5938M8743M2306L6689L1853G38101
$$ 202939 282755 360052 431225 494854 550792 599535 641841 678530 710383 738101
1195.4415G62293K1189J8626J6435J4555J2939J1542J0332R280Q362P557H99960
$$ 762293 783482 802108 818543 833098 846037 857579 867911 877191 885553 893110 899960
1176.0149I06186N675N184M748o143L615L285K984K711K459K227K012I36756
$$ 906186 911861 917045 921793 915650 919265 922550 925534 928245 930704 932931 934943 936756
1154.9695I38382J450J284J126R73Q28O85N45M08K71J33nj48k95m46o05I43814
$$ 938382 939832 941116 942242 943215 944043 944728 945273 945681 945952 946085 946080 945932 945637 945191 944586 943814
1127.4486I42862j142j350J9661k527k770l045l359l715m123m593n133I25004
$$ 942862 941720 940370 960031 957504 954734 951689 948330 944615 940492 935899 930766 925004
1106.4032I18510p352q363r563j0993j2710j4787j7312k0403k4213k8927G29106
$$ 918510 911158 902795 893232 882239 869529 854742 837430 817027 792814 763887 729106
1086.9767F87059n1001o1835p4413q7772r9218j03307r2661o4750l1434A1462
$$ 687059 636058 574223 499810 412038 312820 209513 116852 52102 20668 11462
1069.1691A4560J9446M8970Q1696J00660J02441R3504Q0538O7405N5722G10862
$$ 14560 34006 82976 164672 265332 367773 461277 541815 609220 664942 710862
1051.3613G48775L1449K6245K2047J8648J5880J3611J1740J0186Q886I15261
$$ 748775 780224 806469 828516 847164 863044 876655 888395 898581 907467 915261
1033.5537I22130O083N409M830M330L895L516L184K892K634K406K203I65534
$$ 922130 928213 933622 938452 942782 946677 950193 953377 956269 958903 961309 963512 965534
1012.5083I67394J715J585J467J360J264J177J097J024R57Q97Q41P90I82310
$$ 967394 969109 970694 972161 973521 974785 975962 977059 978083 979040 979937 980778 981568 982310
989.844I83009O59O21N87N55N26M97j7074j41j93k44k98l52J0151p99I76660
$$ 983009 983668 984289 984876 985431 985957 986454 969380 969239 969046 968802 968504 968152 978303 977504 976660
963.94196I75768r44r99j059j125j194j271j354j444j542j649j767j896I57487
$$ 975768 974824 973825 972766 971641 970447 969176 967822 966378 964836 963187 961420 959524 957487
941.2777I55294k365k554k766k999l261l552l879m246m661n130n662I07949
$$ 955294 952929 950375 947609 944610 941349 937797 933918 929672 925011 919881 914219 907949
920.2323I00985p762q682r748j0989j2440j4142j6151j8531k1363k4743G27646
$$ 900985 893223 884541 874793 863804 851364 837222 821071 802540 781177 756434 727646
900.8057F94015l9414m6269n4265o3307p2928q1950q7991q7175p5166C4146
$$ 694015 654601 608332 554067 490760 417832 335882 247891 160716 85550 34146
882.9981I584p346j353M05L609J5029L8645O5472Q3264Q8749Q5285P7241E26270
$$ 9584 2238 885 1290 4899 19928 58573 124045 207309 296058 381343 458584 526270
861.9527E84560M9786M2412L6152L0897K6504K2835J9766J7189J5020H58305
$$ 584560 634346 676758 712910 743807 770311 793146 812912 830101 845121 858305
844.145H69930J0292R151Q166P315O576N930N365M869M429M042L697I43152
$$ 869930 880222 889373 897539 904854 911430 917360 922725 927594 932023 936065 939762 943152
823.0996I46267K870K648K449K270K106J959J824J702J590J488J394I69875
$$ 946267 949137 951785 954234 956504 958610 960569 962393 964095 965685 967173 968567 969875
802.0542I71104J155J089J026R68R16Q65Q20P76P37O99O65O32O01N73A000100
$$ 971104 972259 973348 974374 975342 976258 977123 977943 978719 979456 980155 980820 981452 982053 982626 1000100
776.15216A000100%S3m143j38j45j52j61j69j78j89j98k11k22k36k50I93442
$$ 1000100 1000100 1000100 1000100 1000100 1000100 1000100 1000100 1000100 1000100 1000100 1000100 1000100 1000100 995957 995819 995674 995522 995361 995192 995014 994825 994627 994416 994194 993958 993708 993442
730.8236I93159l01l21l43l67l92m21m53m87n25n67o14o67p24p89q63I84381
$$ 993159 992858 992537 992194 991827 991435 991014 990561 990074 989549 988982 988368 987701 986977 986188 985325 984381
703.3027I83343j143j263j400j559j740j953k199k490k832l239l728I55481
$$ 983343 982200 980937 979537 977978 976238 974285 972086 969596 966764 963525 959797 955481
682.25726I50447n915p008q380j0118j2350j5249j9066k4150l0994m0258G24222
$$ 950447 944532 937524 929144 919026 906676 891427 872361 848211 817217 776959 724222
662.83075F55124q8937j08400j16606r7496m7060J7884P7597J12047J14517F17017
$$ 655124 566187 457787 341181 243685 196625 214509 292106 404153 518670 617017
645.0231F94874N9724M5520L4887K7028K1210J6863J3581J1069R123I41476
$$ 694874 754598 800118 835005 862033 883243 900106 913687 924756 933879 941476
627.21545I47861N414M627L983K566K977K605K291K024J795J598J428I80447
$$ 947861 953275 957902 961885 964451 967428 970033 972324 974348 976143 977741 979169 980447
606.17004I81596J034R33Q42P63O90O24N66N12M62M16L74L35K96K62K27I90126
$$ 981596 982630 983563 984405 985168 985858 986482 987048 987560 988022 988438 988812 989147 989443 989705 989932 990126
578.6491I90287J30R7O5L1lm0p9j21j67k18k75l39m14m99o01L188r88I88898
$$ 990287 990417 990514 990579 990610 990607 990567 990488 990367 990200 989982 989707 989368 988954 988455 987854 991042 990054 988898
547.89044I87533j625j956k381k933l665m651o008p907j0628j4592k0427H81836
$$ 987533 985908 983952 981571 978638 974973 970322 964314 956407 945779 931187 910760 881836
526.84503H41340n2972n6558l3924J3570N0290N6720M6436L3865K3938I39623
$$ 841340 788368 731810 697886 711456 761746 818466 864902 898767 922705 939623
509.03735I51875R026O793N214M076L238K612K133J763J473J242J056I91406
$$ 951875 960901 967694 972908 976984 980222 982834 984967 986730 988203 989445 990501 991406
487.99194I92187O78N93N20M59M06L62L23K89K59K33K10J90J71J55J40I97301
$$ 992187 992865 993458 993978 994437 994843 995205 995528 995817 996076 996309 996519 996709 996880 997035 997175 997301
460.47104I97414J02R1Q0P0O0N0M1L0J9Qmj9l6n4p8j07j42j88k48l28I96322
$$ 997414 997516 997607 997687 997757 997817 997867 997908 997938 997957 997965 997961 997942 997906 997852 997774 997667 997525 997337 997089 996761 996322
424.8557I95727q43j154p91k450l558m900n580l541J433N105N397M166I91921
$$ 995727 994884 993730 992939 990489 986931 982031 976451 972910 974343 979448 984845 989011 991921
402.19144I93917J387R85P18N36M09L17K51K01J63J34J11R3P8O6N6M8I99510
$$ 993917 995304 996289 997007 997543 997952 998269 998520 998721 998884 999018 999129 999222 999300 999366 999422 999470 999510
373.05164I99545K9K4K1J6J3ROKjnrj3j9k6l3m2n4o9q9j16j53k05k81I98157
$$ 999545 999574 999598 999619 999635 999648 999657 999663 999665 999664 999659 999650 999637 999618 999592 999559 999517 999463 999394 999305 999189 999036 998831 998550 998157
332.57968I97595q20j196j653j891j202M92J740J831J411R83O75M69L33I99078
$$ 997595 996775 995579 993926 992035 990833 991325 993065 994896 996307 997290 997965 998434 998767 999078
308.29654I99258J38J07Q5O8N6M6L8L2K8K3K1J7J6J3J2J1RTPA000001
$$ 999258 999396 999503 999588 999656 999712 999758 999796 999828 999856 999879 999900 999917 999933 999946 999958 999969 999978 999987 999994 1000001
274.3001A000008  $$checkpoint
##END= $$ end of 1,1-DCE IR
##TITLE=Raman of 1,1-dichloroethylene $$ Begin of the data block
##JCAMP-DX=5.00 $$ ACD/DocManager Library v 5.00
##DATA TYPE=RAMAN SPECTRUM
##DATA CLASS=XYDATA
##BLOCK ID=6
##DATE=19 Feb 2012 10:30:00
##ORIGIN= Department of Chemistry, UWI, Jamaica
##OWNER= public domain
##SPECTROMETER/DATA SYSTEM=from scan
##$MODELS=
<Models>
<ModelData id="1DCE" type="MOL">
1,1-dichloroethylene
__Jmol-14_02171520543D 1   1.00000     0.00000     0
Jmol version 14.3.12_2015.02.11  2015-02-11 19:15 EXTRACT: ({0:5})
  6  5  0  0  0  0              1 V2000
   0.00000   0.00000   0.41101 C   0  0  0  0  0  0
   0.00000   0.00000   1.74967 C   0  0  0  0  0  0
   0.00000   0.93996   2.32528 H   0  0  0  0  0  0
   0.00000  -0.93996   2.32528 H   0  0  0  0  0  0
   0.00000   1.44639  -0.51808 Cl  0  0  0  0  0  0
   0.00000  -1.44639  -0.51808 Cl  0  0  0  0  0  0
  1  6  1  0  0  0
  1  5  1  0  0  0
  1  2  2  0  0  0
  2  3  1  0  0  0
  2  4  1  0  0  0
M  END
</ModelData>
<ModelData id="i2" type="XYZVIB" baseModel="1DCE" vibrationScale=".5">
6
Model[1]: PATH=Calculation 1;Input;Convg=0.4887D-08;-V/T=2.0006;Energy=NaN;Range=M.O.s;E(RHF)=-995.823662291 A.U.;PATH=Calculation 1;Input
C       0.00000      0.00000      0.00000
C       0.00000      0.00000      1.33866
H       0.93996      0.00000      1.91427
H      -0.93996      0.00000      1.91427
Cl      1.44639      0.00000     -0.92909
Cl     -1.44639      0.00000     -0.92909
6
Model[2]: PATH=Calculation 1;Standard;Convg=0.4887D-08;-V/T=2.0006;Energy=-995.82367;Range=M.O.s;E(RHF)=-995.823662291 A.U.;PATH=Calculation 1;Standard
C       0.00000      0.00000      0.41101
C       0.00000      0.00000      1.74967
H       0.00000      0.93996      2.32528
H       0.00000     -0.93996      2.32528
Cl      0.00000      1.44639     -0.51808
Cl      0.00000     -1.44639     -0.51808
6
Model[3]: IRIntensity=0.1106 KM/Mole;PATH=Calculation 1;FrequenciesFrequencies;ReducedMass=18.4273 AMU;ForceConstant=1.1552 mDyne/A;FreqValue=326.1875;Frequency=326.1875 cm^-1;FrequencyLabel=A1;PATH=Calculation 1;FrequenciesFrequencies
C       0.00000      0.00000      0.41101      0.00000      0.00000     -0.37000
C       0.00000      0.00000      1.74967      0.00000      0.00000     -0.39000
H       0.00000      0.93996      2.32528      0.00000      0.00000     -0.38000
H       0.00000     -0.93996      2.32528      0.00000      0.00000     -0.38000
Cl      0.00000      1.44639     -0.51808      0.00000      0.44000      0.14000
Cl      0.00000     -1.44639     -0.51808      0.00000     -0.44000      0.14000
6
Model[4]: IRIntensity=0.0003 KM/Mole;PATH=Calculation 1;FrequenciesFrequencies;ReducedMass=3.6118 AMU;ForceConstant=0.4422 mDyne/A;FreqValue=455.8292;Frequency=455.8292 cm^-1;FrequencyLabel=B2;PATH=Calculation 1;FrequenciesFrequencies
C       0.00000      0.00000      0.41101      0.00000     -0.07000      0.00000
C       0.00000      0.00000      1.74967      0.00000      0.34000      0.00000
H       0.00000      0.93996      2.32528      0.00000      0.55000     -0.34000
H       0.00000     -0.93996      2.32528      0.00000      0.55000      0.34000
Cl      0.00000      1.44639     -0.51808      0.00000     -0.06000      0.12000
Cl      0.00000     -1.44639     -0.51808      0.00000     -0.06000     -0.12000
6
Model[5]: IRIntensity=2.8951 KM/Mole;PATH=Calculation 1;FrequenciesFrequencies;ReducedMass=7.2233 AMU;ForceConstant=1.3108 mDyne/A;FreqValue=554.9693;Frequency=554.9693 cm^-1;FrequencyLabel=B1;PATH=Calculation 1;FrequenciesFrequencies
C       0.00000      0.00000      0.41101      0.70000      0.00000      0.00000
C       0.00000      0.00000      1.74967     -0.19000      0.00000      0.00000
H       0.00000      0.93996      2.32528     -0.48000      0.00000      0.00000
H       0.00000     -0.93996      2.32528     -0.48000      0.00000      0.00000
Cl      0.00000      1.44639     -0.51808     -0.07000      0.00000      0.00000
Cl      0.00000     -1.44639     -0.51808     -0.07000      0.00000      0.00000
6
Model[6]: IRIntensity=18.6624 KM/Mole;PATH=Calculation 1;FrequenciesFrequencies;ReducedMass=9.0383 AMU;ForceConstant=2.3129 mDyne/A;FreqValue=659.0407;Frequency=659.0407 cm^-1;FrequencyLabel=A1;PATH=Calculation 1;FrequenciesFrequencies
C       0.00000      0.00000      0.41101      0.00000      0.00000      0.36001
C       0.00000      0.00000      1.74967      0.00000      0.00000      0.48000
H       0.00000      0.93996      2.32528      0.00000     -0.01000      0.51000
H       0.00000     -0.93996      2.32528      0.00000      0.01000      0.51000
Cl      0.00000      1.44639     -0.51808      0.00000      0.19000     -0.16000
Cl      0.00000     -1.44639     -0.51808      0.00000     -0.19000     -0.16000
6
Model[7]: IRIntensity=0.0000 KM/Mole;PATH=Calculation 1;FrequenciesFrequencies;ReducedMass=1.0197 AMU;ForceConstant=0.4876 mDyne/A;FreqValue=900.8576;Frequency=900.8576 cm^-1;FrequencyLabel=A2;PATH=Calculation 1;FrequenciesFrequencies
C       0.00000      0.00000      0.41101      0.00000      0.00000      0.00000
C       0.00000      0.00000      1.74967      0.00000      0.00000      0.00000
H       0.00000      0.93996      2.32528      0.71000      0.00000      0.00000
H       0.00000     -0.93996      2.32528     -0.71000      0.00000      0.00000
Cl      0.00000      1.44639     -0.51808     -0.01000      0.00000      0.00000
Cl      0.00000     -1.44639     -0.51808      0.01000      0.00000      0.00000
6
Model[8]: IRIntensity=92.0040 KM/Mole;PATH=Calculation 1;FrequenciesFrequencies;ReducedMass=3.0785 AMU;ForceConstant=1.6024 mDyne/A;FreqValue=939.9244;Frequency=939.9244 cm^-1;FrequencyLabel=B2;PATH=Calculation 1;FrequenciesFrequencies
C       0.00000      0.00000      0.41101      0.00000      0.37000      0.00000
C       0.00000      0.00000      1.74967      0.00000      0.09000      0.00000
H       0.00000      0.93996      2.32528      0.00000     -0.27001      0.59000
H       0.00000     -0.93996      2.32528      0.00000     -0.27001     -0.59000
Cl      0.00000      1.44639     -0.51808      0.00000     -0.07000      0.04000
Cl      0.00000     -1.44639     -0.51808      0.00000     -0.07000     -0.04000
6
Model[9]: IRIntensity=52.9028 KM/Mole;PATH=Calculation 1;FrequenciesFrequencies;ReducedMass=1.3120 AMU;ForceConstant=1.0456 mDyne/A;FreqValue=1163.0605;Frequency=1163.0605 cm^-1;FrequencyLabel=B1;PATH=Calculation 1;FrequenciesFrequencies
C       0.00000      0.00000      0.41101     -0.04000      0.00000      0.00000
C       0.00000      0.00000      1.74967      0.16000      0.00000      0.00000
H       0.00000      0.93996      2.32528     -0.70000      0.00000      0.00000
H       0.00000     -0.93996      2.32528     -0.70000      0.00000      0.00000
Cl      0.00000      1.44639     -0.51808      0.00000      0.00000      0.00000
Cl      0.00000     -1.44639     -0.51808      0.00000      0.00000      0.00000
6
Model[10]: IRIntensity=85.0510 KM/Mole;PATH=Calculation 1;FrequenciesFrequencies;ReducedMass=1.8092 AMU;ForceConstant=1.7212 mDyne/A;FreqValue=1270.7289;Frequency=1270.7289 cm^-1;FrequencyLabel=B2;PATH=Calculation 1;FrequenciesFrequencies
C       0.00000      0.00000      0.41101      0.00000      0.21000      0.00000
C       0.00000      0.00000      1.74967      0.00000     -0.16000      0.00000
H       0.00000      0.93996      2.32528      0.00000      0.23001     -0.64000
H       0.00000     -0.93996      2.32528      0.00000      0.23001      0.64000
Cl      0.00000      1.44639     -0.51808      0.00000     -0.02000      0.01000
Cl      0.00000     -1.44639     -0.51808      0.00000     -0.02000     -0.01000
6
Model[11]: IRIntensity=6.8266 KM/Mole;PATH=Calculation 1;FrequenciesFrequencies;ReducedMass=1.4915 AMU;ForceConstant=2.1016 mDyne/A;FreqValue=1546.4604;Frequency=1546.4604 cm^-1;FrequencyLabel=A1;PATH=Calculation 1;FrequenciesFrequencies
C       0.00000      0.00000      0.41101      0.00000      0.00000      0.20001
C       0.00000      0.00000      1.74967      0.00000      0.00000     -0.06000
H       0.00000      0.93996      2.32528      0.00000      0.31000     -0.62000
H       0.00000     -0.93996      2.32528      0.00000     -0.31000     -0.62000
Cl      0.00000      1.44639     -0.51808      0.00000      0.01000     -0.01000
Cl      0.00000     -1.44639     -0.51808      0.00000     -0.01000     -0.01000
6
Model[12]: IRIntensity=47.1352 KM/Mole;PATH=Calculation 1;FrequenciesFrequencies;ReducedMass=2.6981 AMU;ForceConstant=4.9710 mDyne/A;FreqValue=1768.3251;Frequency=1768.3251 cm^-1;FrequencyLabel=A1;PATH=Calculation 1;FrequenciesFrequencies
C       0.00000      0.00000      0.41101      0.00000      0.00000     -0.26000
C       0.00000      0.00000      1.74967      0.00000      0.00000      0.29000
H       0.00000      0.93996      2.32528      0.00000      0.49001     -0.43000
H       0.00000     -0.93996      2.32528      0.00000     -0.49001     -0.43000
Cl      0.00000      1.44639     -0.51808      0.00000     -0.01000      0.01000
Cl      0.00000     -1.44639     -0.51808      0.00000      0.01000      0.01000
6
Model[13]: IRIntensity=0.0670 KM/Mole;PATH=Calculation 1;FrequenciesFrequencies;ReducedMass=1.0641 AMU;ForceConstant=6.0497 mDyne/A;FreqValue=3106.4325;Frequency=3106.4325 cm^-1;FrequencyLabel=A1;PATH=Calculation 1;FrequenciesFrequencies
C       0.00000      0.00000      0.41101      0.00000      0.00000      0.01000
C       0.00000      0.00000      1.74967      0.00000      0.00000     -0.07000
H       0.00000      0.93996      2.32528      0.00000      0.61000      0.36001
H       0.00000     -0.93996      2.32528      0.00000     -0.61000      0.36001
Cl      0.00000      1.44639     -0.51808      0.00000      0.00000      0.00000
Cl      0.00000     -1.44639     -0.51808      0.00000      0.00000      0.00000
6
Model[14]: IRIntensity=0.8160 KM/Mole;PATH=Calculation 1;FrequenciesFrequencies;ReducedMass=1.1196 AMU;ForceConstant=6.6677 mDyne/A;FreqValue=3179.2916;Frequency=3179.2916 cm^-1;FrequencyLabel=B2;PATH=Calculation 1;FrequenciesFrequencies
C       0.00000      0.00000      0.41101      0.00000      0.00000      0.00000
C       0.00000      0.00000      1.74967      0.00000     -0.10000      0.00000
H       0.00000      0.93996      2.32528      0.00000      0.60001      0.37000
H       0.00000     -0.93996      2.32528      0.00000      0.60001     -0.37000
Cl      0.00000      1.44639     -0.51808      0.00000      0.00000      0.00000
Cl      0.00000     -1.44639     -0.51808      0.00000      0.00000      0.00000
</ModelData>
</Models>
##$PEAKS=
<Peaks type="RAMAN" xUnitsExpected="1/cm"  >
<PeakData id="1" title="1 (B2 ~3180 cm-1)" peakShape="broad" model="i2.14" xMax="3195" xMin="3165"    />
<PeakData id="2" title="2 (A1 ~3110 cm-1)" peakShape="broad" model="i2.13" xMax="3125" xMin="3085"    />
<PeakData id="3" title="3 (A1 ~1770 cm-1)" peakShape="broad" model="i2.12" xMax="1785" xMin="1750"    />
<PeakData id="4" title="4 (A1 ~1550 cm-1)" peakShape="broad" model="i2.11" xMax="1560" xMin="1530"    />
<PeakData id="5" title="5 (B2 ~1270 cm-1)" peakShape="broad" model="i2.10" xMax="1290" xMin="1260"    />
<PeakData id="6" title="6 (B1 ~1160 cm-1)" peakShape="broad" model="i2.10" xMax="1180" xMin="1150"    />
<PeakData id="7" title="7 (B2 ~940 cm-1)" peakShape="broad" model="i2.9" xMax="955" xMin="925"    />
<PeakData id="8" title="8 (A2 ~900 cm-1)" peakShape="broad" model="i2.6" xMax="915" xMin="885"    />
<PeakData id="9" title="9 (A1 ~660 cm-1)" peakShape="broad" model="i2.7" xMax="675" xMin="645"    />
<PeakData id="10" title="10 (B1 ~555 cm-1)" peakShape="broad" model="i2.4" xMax="570" xMin="540"    />
<PeakData id="11" title="11 (B2 ~455 cm-1)" peakShape="broad" model="i2.5" xMax="470" xMin="440"    />
<PeakData id="12" title="12 (A1 ~330 cm-1)" peakShape="broad" model="i2.3" xMax="340" xMin="310"    />
</Peaks>
##XUNITS=1/CM
##YUNITS=RAMAN INTENSITY
##XFACTOR= 1
##YFACTOR= 1.084966E-06
##FIRSTX= 3.377665E+03
##FIRSTY= 1.382219E-02
##LASTX= 1.261875E+02
##NPOINTS= 2000
##MINY= 0
##MAXY= 1.084966
##XYDATA= (X++(Y..Y))
3377.665A2740J86J91J96J99K05K09K14K19K24K30K35K41K47K53K60A6315
$$ 12740 12926 13117 13313 13512 13717 13926 14140 14359 14583 14813 15048 15289 15536 15789 16049 16315
3350.0137A6588K80K87K95L03L11L20L28L37L46L57L66L78L88L99M12B2118
$$ 16588 16868 17155 17450 17753 18064 18384 18712 19049 19395 19752 20118 20496 20884 21283 21695 22118
3322.3623B2555M50M64M79M94N09N27N43N62N80O01O21O43O65O90P14C1838
$$ 22555 23005 23469 23948 24442 24951 25478 26021 26583 27163 27764 28385 29028 29693 30383 31097 31838
3294.711C2607P97Q28Q61Q94R30R68J007J050J094J141J191J244J301D7272
$$ 32607 33404 34232 35093 35987 36917 37885 38892 39942 41036 42177 43368 44612 45913 47272
3270.3125D8696J491J562J640J721J808J902K003K109K225K349K482K626G5395
$$ 48696 50187 51749 53389 55110 56918 58820 60823 62932 65157 67506 69988 72614 75395
3247.5408G8344L130L326L539L771M024M298M598M927N286N680O114O591A40744
$$ 78344 81474 84800 88339 92110 96134 100432 105030 109957 115243 120923 127037 133628 140744
3224.769A48441Q339R050R836J0711J1680J2757J3954J5282J6753J8382B95361
$$ 148441 156780 165830 175666 186377 198057 210814 224768 240050 256803 275185 295361
3205.2505C17504K4285K6590K9038L1586L4159L6649L8898M0695M1774F62999
$$ 317504 341789 368379 397417 429003 463162 499811 538709 579404 621178 662999
3187.3584G03510L7549L2744K6091J7823Q429j400j0892j9331k6193l1198G02815
$$ 703510 741059 773803 799894 817717 826146 824746 813854 794523 768330 737132 702815
3167.8398F67101l5670l4509l2543l0047k7237k4275k1271j8300j5404D15246
$$ 667101 631431 596922 564379 534332 507095 482820 461549 443249 427845 415246
3149.9478D05355p268m717k216K59K734N236P792J0427J3168J6035J9047D88060
$$ 405355 398087 393370 391154 391413 394147 399383 407175 417602 430770 446805 465852 488060
3128.8025E13577K8950L2458L5954L9306M2322M4739M6230M6407M4864I16043
$$ 513577 542527 574985 610939 650245 692567 737306 783536 829943 874807 916043
3110.9104I51331K7012J6699M958p351j9265k9899l8596m5011m9110n1099G08339
$$ 951331 978343 995042 1000000 992649 973384 943485 904889 859878 810768 759669 708339
3091.3918F58131m8130m5436m2402l9236l6081l3035l0159k7483k5021C08374
$$ 658131 610001 564565 522163 482927 446846 413811 383652 356169 331148 308374
3073.4998B87640j8890j7226j5728j4380j3167j2075j1091j0205r405A56791
$$ 287640 268750 251524 235796 221416 208249 196174 185083 174878 165473 156791
3055.6077A48763p436o897o408n963n556n186m846m536m250l989l746H6425
$$ 148763 141327 134430 128022 122059 116503 111317 106471 101935 97685 93696 89950 86425
3034.4626H3106l129k954k791k639k500k368k247k134k027j929j836j748E3136
$$ 83106 79977 77023 74232 71593 69093 66725 64478 62344 60317 58388 56552 54804 53136
3011.691E1545j520j451j389j328j272j219j169j121j076j033r93r55C6100
$$ 51545 50025 48574 47185 45857 44585 43366 42197 41076 40000 38967 37974 37019 36100
2988.9192C5216q51q21p90p63p35p10o86o62o41o19n98n79n61n43n26B4622
$$ 35216 34365 33544 32754 31991 31256 30546 29860 29198 28557 27938 27340 26761 26200 25657 25131 24622
2961.2678B4128m79m65m51m37m25m12m01l90l78l68l58l48l39l30l21A7913
$$ 24128 23649 23184 22733 22296 21871 21459 21058 20668 20290 19922 19564 19216 18877 18547 18226 17913
2933.6165A7608k96k90k82k74k68k62k55k49k43k37k32k26k21k15k11A3641
$$ 17608 17312 17022 16740 16466 16198 15936 15681 15432 15189 14952 14720 14494 14273 14058 13847 13641
2905.9648A3439j97j92j89j84j80j77j73j69j65j62j59j55j52j50j46A0746
$$ 13439 13242 13050 12861 12677 12497 12320 12147 11978 11813 11651 11492 11337 11185 11035 10889 10746
2878.3135A0606j38j35j32j30j27j25j23j20j18j15j14j12j09j08j05H691
$$ 10606 10468 10333 10201 10071 9944 9819 9696 9576 9458 9343 9229 9117 9008 8900 8795 8691
2850.662H589j00r8r7r4Tr1r0q9q7q6q4q3q1q0p9p8p6p5p4p3p1To9o8F533
$$ 8589 8489 8391 8294 8200 8106 8015 7925 7836 7749 7663 7579 7496 7415 7335 7256 7178 7102 7027 6953 6880 6809 6738 6669 6601 6533
2808.3718F467o5o4o3To1o0Tn9n7Tn6Tn4Tn3n2Tn1j931l4Ul2l3l2l1Tl0C177
$$ 6467 6402 6338 6275 6212 6151 6091 6031 5972 5915 5858 5802 5746 5692 5638 5585 5533 5481 5430 3499 3465 3431 3397 3365 3332 3300 3269 3238 3208 3177
2759.5752C148k9Uk8Tk7Tk6k7k5k6k5Uk4Tk3Wk2k1k2k1Vk0Uj9Tk362%@
$$ 3148 3119 3090 3061 3033 3005 2978 2951 2925 2898 2873 2847 2822 2797 2772 2748 2724 2701 2678 2655 2632 2609 2587 2566 2544 2523 2502 2481 2460 2440 2420 2400 2381 2362 0 0 0
2699.3928@%U26N72NTMNWONUONOTNOXPOPOPTOPUQPTQTPQURQTRYJ0XJ1A001
2068.2905A012J1J2J1J2J1J2J3J2J3J2J3J4J3J4UJ5J4J5J6J5J6TJ7J6A370
$$ 1012 1023 1035 1046 1058 1069 1081 1094 1106 1119 1131 1144 1158 1171 1185 1199 1213 1228 1242 1257 1273 1288 1304 1320 1337 1353 1370
2024.3738A388J8UJ9TK0J9K1VK2K3UK4TK5K6TK7TK8TK9L0TL1L2L3TL4B216
$$ 1388 1406 1424 1442 1461 1480 1500 1519 1540 1561 1582 1603 1625 1648 1671 1694 1718 1742 1767 1793 1819 1846 1873 1901 1929 1958 1988 2018 2049 2081 2114 2147 2181 2216
1969.0709B252L7TL9TM1TM3TM5M6M7M9TN1J348O4O6O8P0P1P3P6P7Q0Q1E017
$$ 2252 2289 2326 2365 2404 2445 2486 2529 2572 2617 2663 2710 2759 2808 2859 4207 4271 4337 4405 4475 4546 4619 4695 4772 4852 4933 5017
1925.154E103Q9R1R4R7R9J03J06J08J13J16J19J24J27J32J36J41J46G195
$$ 5103 5192 5283 5377 5474 5573 5676 5782 5890 6003 6119 6238 6362 6489 6621 6757 6898 7044 7195
1894.2496G351J61J68J74J80J87J95K02K09K19K27K37K46K58K68K80K93A1161
$$ 7351 7512 7680 7854 8034 8221 8416 8618 8827 9046 9273 9510 9756 10014 10282 10562 10855 11161
1864.9717A1481L35L51L69L86M06M27M48M73M98N26N55N87O21O58O97A9559
$$ 11481 11816 12167 12536 12922 13328 13755 14203 14676 15174 15700 16255 16842 17463 18121 18818 19559
1837.3203B0346Q38Q93R52J018J089J166J251J344J447J559J682J819C7373
$$ 20346 21184 22077 23029 24047 25136 26302 27553 28897 30344 31903 33585 35404 37373
1814.5486C9510K321K526K753L006L287L600L948M334M763N238N762O338I4349
$$ 39510 41831 44357 47110 50116 53403 57003 60951 65285 70048 75286 81048 87386 94349
1791.7769A01987Q354R099R849J0575J1225J1740J2036J2023J1599J0680B18372
$$ 101987 110341 119440 129289 139864 151089 162829 174865 186888 198487 209167 218372
1772.2582B25546M656J797j196m091o677q793j0359j1366j1863j1936A54035
$$ 225546 230202 231999 230803 226712 220035 211242 200883 189517 177654 165718 154035
1752.7395A42837j0562r846r096q347p624o941o305n721n187m703m265F0370
$$ 142837 132275 122429 113333 104986 97362 90421 84116 78395 73208 68505 64240 60370
1731.5944E6855l194k906k647k413k203k012j840j684j542j414j296j189C1424
$$ 56855 53661 50755 48108 45695 43492 41480 39640 37956 36414 35000 33704 32515 31424
1708.8226C0422r18q42p72p07o47n90n38m88m43m00l58l20k83k48k15B2470
$$ 30422 29504 28662 27890 27183 26536 25946 25408 24920 24477 24077 23719 23399 23116 22868 22653 22470
1681.1713B2318j22r3o5l8j1J6M2O7R4J20J45J71J98K25K52K79L09L37B4612
$$ 22318 22196 22103 22038 22000 21989 22005 22047 22114 22208 22328 22473 22644 22842 23067 23319 23598 23907 24244 24612
1648.6403B5011M31M65N01N37N75O16O58P04P51Q01Q54R12R71J037J105C7108
$$ 25011 25442 25907 26408 26945 27520 28136 28794 29498 30249 31050 31904 32816 33787 34824 35929 37108
1620.9889C8367J344J436J534J642J758J883K020K168K329K506K699K910F5738
$$ 38367 39711 41147 42681 44323 46081 47964 49984 52152 54481 56987 59686 62596 65738
1598.2172F9134L677L986M327M704N122N586O099O672P307Q015Q801R675A53750
$$ 69134 72811 76797 81124 85828 90950 96536 102635 109307 116614 124629 133430 143105 153750
1575.4454A65469J2904J4204J5620J7146J8764K0448K2146K3839K5257C62215
$$ 165469 178373 192577 208197 225343 244107 264555 286701 310540 335797 362215
1557.5533C89304K7055K6097K4013K0675J6077J0377L906k867r421j5273D69877
$$ 389304 416359 442456 466469 487144 503221 513598 517504 514637 505216 489943 469877
1538.0347D46266k5892k7022k7189k6618k5524k4092k2472k0779j9089B10131
$$ 446266 420374 393352 366163 339545 314021 289929 267457 246678 227589 210131
1520.1426A94215j4482j3165j1961j0871r885q996q197p479o833o252I0364
$$ 194215 179733 166568 154607 143736 133851 124855 116658 109179 102346 96094 90364
1500.624H5105m836m454m108l795l512l254l021k809k614k436k275k126D3875
$$ 85105 80269 75815 71707 67912 64400 61146 58125 55316 52702 50266 47991 45865 43875
1477.8523D2010j750j644j545j455j372j294j222j155j094j035r82r32B5646
$$ 42010 40260 38616 37071 35616 34244 32950 31728 30573 29479 28444 27462 26530 25646
1455.0806B4805q00p61p25o91o60o30o01n75n50n27n04m83m64m44m27A5553
$$ 24805 24005 23244 22519 21828 21168 20538 19937 19362 18812 18285 17781 17298 16834 16390 15963 15553
1427.4292A5159l78l65l50l38l25l13l02k91k81k71k62k53k44k37k28A0500
$$ 15159 14781 14416 14066 13728 13403 13090 12788 12497 12216 11945 11683 11430 11186 10949 10721 10500
1399.7777A0286k07k01j94j88j82j77j71j67j61j57j52j47j43j40j35G633
$$ 10286 10079 9878 9684 9496 9314 9137 8966 8799 8638 8481 8329 8182 8039 7899 7764 7633
1372.1263G505j24j21o81j10j06j04j01r8r5r3r1q7q6q3q1p9p7p5p2p1E030
$$ 7505 7381 7260 6579 6469 6363 6259 6158 6060 5965 5872 5781 5694 5608 5525 5444 5365 5288 5213 5141 5070 5030
1336.3423D963o5o3o2o0n8n6Tn3n2n1m9m8m6m5m4m2m1m0l8l7l6l4J03C959
$$ 4963 4898 4835 4773 4713 4655 4599 4543 4490 4438 4387 4338 4290 4244 4199 4155 4113 4072 4032 3994 3957 3921 3887 3990 3959
1295.6785C929k8k7k6k5k3k2k1k0j8j7j5Tj2Tj0qpnmk%KMNQJ0J2J4J7C704
$$ 3929 3901 3874 3848 3823 3800 3778 3757 3737 3719 3702 3687 3672 3660 3648 3638 3630 3623 3618 3614 3612 3612 3614 3618 3623 3631 3641 3653 3667 3684 3704
1245.2552C726K6K8L2L6L9M4M8N2N8O4O9P6Q2R1R8J08J18J29J40J54J68E570
$$ 3726 3752 3780 3812 3848 3887 3931 3979 4031 4089 4153 4222 4298 4380 4471 4569 4677 4795 4924 5064 5218 5386 5570
1207.8446E772K22K43K67K95L24L57L93M35M80N29N84O43P08P75Q46R17A4775
$$ 5772 5994 6237 6504 6799 7123 7480 7873 8308 8788 9317 9901 10544 11252 12027 12873 13790 14775
1178.5667A5822J097J124J123J083R97Q57O65M28J57j25l99o44q43r91A9265
$$ 15822 16919 18043 19166 20249 21246 22103 22768 23196 23353 23228 22829 22185 21342 20351 19265
1152.5419A8131j139j116j070j010k217q61p90p22o57n97n42m92m45m05E701
$$ 18131 16992 15876 14806 13796 11579 10718 9928 9206 8549 7952 7410 6918 6473 6068 5701
1126.517E367l03k76k52k30k10j92j76j61j48j36j25j14j06r7r0q3p6B522
$$ 5367 5064 4788 4536 4306 4096 3904 3728 3567 3419 3283 3158 3044 2938 2841 2751 2668 2592 2522
1095.6125B458o0n4n0m6m2l9l5l1k9k6k3k1j7j6j3j1rpnljJL43QRJ1J3B320
$$ 2458 2398 2344 2294 2248 2206 2167 2132 2101 2072 2046 2023 2002 1985 1969 1956 1945 1936 1929 1924 1921 1920 1921 2264 2272 2281 2292 2305 2320
1048.4425B337J8K1K2K4K7K8L1L2L5L7M0M2M4M7N0N3N6N9O3O6P0P4P8C437
$$ 2337 2355 2376 2398 2422 2449 2477 2508 2540 2575 2612 2652 2694 2738 2785 2835 2888 2944 3003 3066 3132 3202 3276 3354 3437
1007.7787C525R2R8J04J11J17J24J32J40J50J60J70J82J94K08K24K40F229
$$ 3525 3617 3715 3819 3930 4047 4171 4303 4443 4593 4753 4923 5105 5299 5507 5731 5971 6229
978.5008F507L00L24L50L80M11M47M85N28N73O23O77P32P91Q50J072A6011
$$ 6507 6807 7131 7481 7861 8272 8719 9204 9732 10305 10928 11605 12337 13128 13978 15050 16011
950.84937A7017J038J052J046J016R61Q89Q05P21O50O02N87O11O74P73B9350
$$ 17017 18055 19107 20153 21169 22130 23019 23824 24545 25195 25797 26384 26995 27669 28442 29350
924.8246C0420J256J459J673J891K102K294K452K554K581K506K311J980E6993
$$ 30420 31676 33135 34808 36699 38801 41095 43547 46101 48682 51188 53499 55479 56993
902.05286E7923K62m40j119j725k222k586k819k931k940k874k752k595C0763
$$ 57923 58185 57745 56626 54901 52679 50093 47274 44343 41403 38529 35777 33182 30763
879.2811B8529k053j875j709j554j411j282j163j056r60q73p95p24o61A1809
$$ 28529 26476 24601 22892 21338 19927 18645 17482 16426 15466 14593 13798 13074 12413 11809
854.8828A1384n05m62m24l90l57l30l02k79k57k37k18k00j85j70j57F768
$$ 11384 10879 10417 9993 9603 9246 8916 8614 8335 8078 7841 7623 7423 7238 7068 6911 6768
827.23145F636j21j10j01r1q3p4o7n9n2m5l9l2k7k0j5rlJPJ3J7K3K8L3E848
$$ 6636 6515 6405 6304 6213 6130 6056 5989 5930 5878 5833 5794 5762 5735 5715 5700 5691 5688 5689 5696 5709 5726 5749 5777 5810 5848
784.9411E891M9N4O0O5P0P7Q3Q8R5J02J08J16J23P7J39J48J57J66J76H030
$$ 5891 5940 5994 6054 6119 6189 6266 6349 6437 6532 6634 6742 6858 6981 7058 7197 7345 7502 7668 7844 8030
750.7835H227K09K21K35K48K64K79K97L14L34L56L78M02M28M57M88O37A4332
$$ 8227 8436 8657 8892 9140 9404 9683 9980 10294 10628 10984 11362 11764 12192 12649 13137 13774 14332
721.50555A4930O40O88P39P95Q56R25R98J081J171J271J382J504J641C0414
$$ 14930 15570 16258 16997 17792 18648 19573 20571 21652 22823 24094 25476 26980 28621 30414
697.1073C2374K148K356K587K844L127L441L784M159M561M990N434N883H4004
$$ 32374 34522 36878 39465 42309 45436 48877 52661 56820 61381 66371 71805 77688 84004
674.3356I0709P013P192P186O935O389N513M306K807J108o73k394l931A26971
$$ 90709 97722 104914 112100 119035 125424 130937 135243 138050 139158 138485 136091 132160 126971
651.5638A20852o714p007p045o891o596o213n780n328m875m437m023E2307
$$ 120852 114138 107131 100086 93195 86599 80386 74606 69278 64403 59966 55943 52307
630.41864D9028k952k653k380k133j908j702j515j343j184j038r02p73B7892
$$ 49028 46076 43423 41043 38910 37002 35300 33785 32442 31258 30220 29318 28545 27892
607.6469B7354m27l19k14j09nJ02K11L23M41N65O96Q36R87J149J322C4422
$$ 27354 26927 26608 26394 26285 26280 26382 26593 26916 27357 27922 28618 29454 30441 31590 32912 34422
579.99554C6132J923K148K378K611K834L036L197L295L303L192K938K522G1456
$$ 36132 38055 40203 42581 45192 48026 51062 54259 57554 60857 64049 66987 69509 71456
557.2238G2687M15m39j265k001k604l046l328l464l475l394l245l081D0923
$$ 72687 73102 72663 71398 69397 66793 63747 60419 56955 53480 50086 46841 43760 40923
534.4521C8313k385k166j959j764j584j418j265j125r95q78p68o66n72B0286
$$ 38313 35928 33762 31803 30039 28455 27037 25772 24647 23652 22774 22006 21340 20768 20286
510.05377A9888l17k40j63q9j3O1LK19L00L87M78N75O80P93R14J044J186B7044
$$ 19888 19571 19331 19168 19079 19066 19127 19130 19349 19649 20036 20514 21089 21769 22562 23476 24520 25706 27044
479.1493B8544J669J845K022K191K344K467K540K544K456K259J936J492E5246
$$ 28544 30213 32058 34080 36271 38615 41082 43622 46166 48622 50881 52817 54309 55246
456.37756E5553l52r91j561k026k370k590k696k709k648k537k392k229B8393
$$ 55553 55201 54210 52649 50623 48253 45663 42967 40258 37610 35073 32681 30452 28393
433.60583B6504j725j570j425j292j169j058r57q65p82p07o39n76n20A2751
$$ 26504 24779 23209 21784 20492 19323 18265 17308 16443 15661 14954 14315 13739 13219 12751
409.20755A2330l77l37l00k64k31k01j70j42j15q8o2l5j0J6M3P0R9J27A0511
$$ 12330 11953 11616 11316 11052 10821 10620 10450 10308 10193 10105 10043 10008 9998 10014 10057 10127 10226 10353 10511
376.6765A0702K25K61L01L44L91M41M97N57O25O98P79Q69R68J076J195B1253
$$ 10702 10927 11188 11489 11833 12224 12665 13162 13719 14344 15042 15821 16690 17658 18734 19929 21253
349.02512B2714J608J760J913K061K194K298K361K359K275K092J796J388D7702
$$ 22714 24322 26082 27995 30056 32250 34548 36909 39268 41543 43635 45431 46819 47702
326.2534D8011k93q74j393j819k133k335k434k448k397k299k170k026B3516
$$ 48011 47718 46844 45451 43632 41499 39164 36730 34282 31885 29586 27416 25390 23516
303.48166B1792j577j440j312j194j086r89r00q21p50o85o27n75n28m86H375
$$ 21792 20215 18775 17463 16269 15183 14194 13294 12473 11723 11038 10411 9836 9308 8822 8375
277.45685G961l82l54l28l06k84k65k47k31k17k03j90n16j66j56j47j39C698
$$ 7961 7579 7225 6897 6591 6307 6042 5795 5564 5347 5144 4954 4438 4272 4116 3969 3830 3698
248.17891C574j18j12j06j01r5r1q7q3p9p5p2o9o6o3o0n8n5n4n1m9m8A937
$$ 3574 3456 3344 3238 3137 3042 2951 2864 2781 2702 2627 2555 2486 2420 2357 2297 2239 2184 2130 2079 2030 1982 1937
210.7682A893m3m0Tl8l6Tl4l3l2l1l0k9k8k7Tk5Tk4Tk2k3k1Tk0Tj9Tj8A090
$$ 1893 1850 1810 1770 1732 1696 1660 1626 1593 1561 1530 1500 1471 1443 1416 1389 1364 1339 1315 1291 1269 1246 1225 1204 1184 1164 1145 1126 1108 1090
161.97165A073j7j6Uj78j3Vj2Uj1Vj0VF49
$$ 1073 1056 1040 1024 1008 830 817 804 791 778 766 754 742 731 720 709 698 688 678 668 658 649
126.1875F40  $$checkpoint
##END=$$ End of RAMAN of 1,1-DCE
##END= $$ end of file