##TITLE= 1,2-dichloroethylene
##JCAMP-DX=5.01
##DATA TYPE= LINK
##BLOCKS= 6
##TITLE= cis-1,2-dichloroethylene (Z)
##JCAMP-DX= 5.01
##DATA TYPE= INFRARED SPECTRUM
##DATA CLASS= XYDATA
##BLOCK ID=1
##ORIGIN= Department of Chemistry, UWI, JAMAICA
##OWNER= public domain
##LONGDATE= 2012/02/18 12:31:56.0440 -0500 $$ export date from JSpecView
##SPECTROMETER/DATA SYSTEM= from scan
##$MODELS=
<Models>
<ModelData id="cDCE" type="MOL">
cis-1,2-dichloroethylene (Z)
__Jmol-14_02171521233D 1   1.00000     0.00000     0
Jmol version 14.3.12_2015.02.11  2015-02-11 19:15 EXTRACT: ({0:5})
  6  5  0  0  0  0              1 V2000
   0.00000   0.67022   0.96140 C   0  0  0  0  0  0
   0.00000  -0.67022   0.96140 C   0  0  0  0  0  0
   0.00000  -1.65604  -0.45086 Cl  0  0  0  0  0  0
   0.00000  -1.25420   1.89597 H   0  0  0  0  0  0
   0.00000   1.65604  -0.45086 Cl  0  0  0  0  0  0
   0.00000   1.25420   1.89597 H   0  0  0  0  0  0
  1  6  1  0  0  0
  1  5  1  0  0  0
  1  2  2  0  0  0
  2  3  1  0  0  0
  2  4  1  0  0  0
M  END
</ModelData>
<ModelData id="C1" type="XYZVIB" baseModel="cDCE" vibrationScale=".5">
6
Model[1]: PATH=Calculation 1;Input;Convg=0.9764D-08;-V/T=2.0006;Energy=NaN;Range=M.O.s;E(RHF)=-995.827490213 A.U.;PATH=Calculation 1;Input
C       0.00000      0.00000      0.00000
C       0.00000      0.00000      1.34044
Cl      1.41224      0.00000      2.32626
H      -0.93457      0.00000      1.92442
Cl      1.41224      0.00000     -0.98582
H      -0.93457      0.00000     -0.58398
6
Model[2]: PATH=Calculation 1;Standard;Convg=0.9764D-08;-V/T=2.0006;Energy=-995.8275;Range=M.O.s;E(RHF)=-995.827490213 A.U.;PATH=Calculation 1;Standard
C       0.00000      0.67022      0.96140
C       0.00000     -0.67022      0.96140
Cl      0.00000     -1.65604     -0.45085
H       0.00000     -1.25420      1.89597
Cl      0.00000      1.65604     -0.45085
H       0.00000      1.25420      1.89597
6
Model[3]: IRIntensity=0.4101 KM/Mole;PATH=Calculation 1;FrequenciesFrequencies;ReducedMass=27.0583 AMU;ForceConstant=0.5615 mDyne/A;FreqValue=187.6781;Frequency=187.6781 cm^-1;FrequencyLabel=A1;PATH=Calculation 1;FrequenciesFrequencies
C       0.00000      0.67022      0.96140      0.00000     -0.01000      0.28000
C       0.00000     -0.67022      0.96140      0.00000      0.01000      0.28000
Cl      0.00000     -1.65604     -0.45085      0.00000      0.59000     -0.10000
H       0.00000     -1.25420      1.89597      0.00000     -0.20001      0.15001
Cl      0.00000      1.65604     -0.45085      0.00000     -0.59000     -0.10000
H       0.00000      1.25420      1.89597      0.00000      0.20001      0.15001
6
Model[4]: IRIntensity=0.0000 KM/Mole;PATH=Calculation 1;FrequenciesFrequencies;ReducedMass=4.0875 AMU;ForceConstant=0.6230 mDyne/A;FreqValue=508.6316;Frequency=508.6316 cm^-1;FrequencyLabel=A2;PATH=Calculation 1;FrequenciesFrequencies
C       0.00000      0.67022      0.96140      0.36001      0.00000      0.00000
$$ [...]
H       0.00000     -1.25420      1.89597      0.00000      0.29000      0.48000
Cl      0.00000      1.65604     -0.45085      0.00000     -0.01000      0.01000
H       0.00000      1.25420      1.89597      0.00000     -0.29000      0.48000
6
Model[13]: IRIntensity=11.5546 KM/Mole;PATH=Calculation 1;FrequenciesFrequencies;ReducedMass=1.0869 AMU;ForceConstant=6.2829 mDyne/A;FreqValue=3132.2904;Frequency=3132.2904 cm^-1;FrequencyLabel=B2;PATH=Calculation 1;FrequenciesFrequencies
C       0.00000      0.67022      0.96140      0.00000      0.03000      0.05000
C       0.00000     -0.67022      0.96140      0.00000      0.03000     -0.05000
Cl      0.00000     -1.65604     -0.45085      0.00000      0.00000      0.00000
H       0.00000     -1.25420      1.89597      0.00000     -0.37000      0.60001
Cl      0.00000      1.65604     -0.45085      0.00000      0.00000      0.00000
H       0.00000      1.25420      1.89597      0.00000     -0.37000     -0.60001
6
Model[14]: IRIntensity=4.5509 KM/Mole;PATH=Calculation 1;FrequenciesFrequencies;ReducedMass=1.1026 AMU;ForceConstant=6.4650 mDyne/A;FreqValue=3154.6217;Frequency=3154.6217 cm^-1;FrequencyLabel=A1;PATH=Calculation 1;FrequenciesFrequencies
C       0.00000      0.67022      0.96140      0.00000      0.04000      0.05000
C       0.00000     -0.67022      0.96140      0.00000     -0.04000      0.05000
Cl      0.00000     -1.65604     -0.45085      0.00000      0.00000      0.00000
H       0.00000     -1.25420      1.89597      0.00000      0.38000     -0.59000
Cl      0.00000      1.65604     -0.45085      0.00000      0.00000      0.00000
H       0.00000      1.25420      1.89597      0.00000     -0.38000     -0.59000
</ModelData>
</Models>
##$PEAKS=
<Peaks type="IR" xUnitsExpected="1/cm"  >
<PeakData id="1" title="1 (~3160 cm-1)" peakShape="broad" model="C1.13" xMax="3175" xMin="3145"    />
<PeakData id="2" title="2 (~3130 cm-1)" peakShape="broad" model="C1.14" xMax="3145" xMin="3115"    />
<PeakData id="3" title="3 (~1740 cm-1)" peakShape="broad" model="C1.12" xMax="1760" xMin="1720"    />
<PeakData id="4" title="4 (~1510 cm-1)" peakShape="broad" model="C1.11" xMax="1540" xMin="1515"    />
<PeakData id="5" title="5 (~1370 cm-1)" peakShape="broad" model="C1.10" xMax="1370" xMin="1340"    />
<PeakData id="7" title="7 (~960 cm-1)" peakShape="broad" model="C1.8" xMax="1050" xMin="955"    />
<PeakData id="8" title="8 (~960 cm-1)" peakShape="broad" model="C1.7" xMax="955" xMin="880"    />
<PeakData id="9" title="9 (~765 cm-1)" peakShape="broad" model="C1.6" xMax="800" xMin="740"    />
<PeakData id="10" title="10 (~615 cm-1)" peakShape="broad" model="C1.5" xMax="635" xMin="605"    />
<PeakData id="12" title="12 (~173 cm-1)" peakShape="broad" model="C1.3" xMax="205" xMin="165"    />
</Peaks>
##XUNITS= 1/CM
##YUNITS= TRANSMITTANCE
##XFACTOR= 1
##YFACTOR= 9.999000E-07
##FIRSTX= 3.352938E+03
##FIRSTY= 9.915151E-01
##LASTX= -1.232190E+01
##NPOINTS= 2000
##MINY= 10.000000E-05
##MAXY= 1
##XYDATA= (X++(Y..Y))
3352.9382I91614j34j37j41j44j47j51j55j59j62j67j72j75j80j85j90I89020
3324.319I88820k06k11k17k24k29k36k44k50k57k65k73k81k90k99l08I84712
3295.7002I84384l39l49l62l73l85l99m13m27m42m57m75m91n10n28n49I77316
3267.081I76724o15o39o65o93p21p51p83q17q52q90r31r73j018j066I64194
3240.1455I63023j228j290j356j425j501j580j667j758j857j963k078I43120
3218.2605I40786k476k632k799k981l178l393l625l879m156m457m787H97277
3196.3752H91736n971o443o959p522q137q807r535j0321j1167j2066j3015G77794
3174.4902G62796j5986j6921j7756j8430j8878j9035j8852j8308j7424E84933
$$ y = [991614, 991480, 991343, 991202, 991058, 990911, 990760, 990605, 990446, 990284, 990117, 989945, 989770, 989590, 989405, 989215, 989020, 988820, 988614, 988403, 988186, 987962, 987733, 987497, 987253, 987003, 986746, 986481, 986208, 985927, 985637, 985338, 985030, 984712, 984384, 984045, 983696, 983334, 982961, 982576, 982177, 981764, 981337, 980895, 980438, 979963, 979472, 978962, 978434, 977885, 977316, 976724, 976109, 975470, 974805, 974112, 973391, 972640, 971857, 971040, 970188, 969298, 968367, 967394, 966376, 965310, 964194, 963023, 961795, 960505, 959149, 957724, 956223, 954643, 952976, 951218, 949361, 947398, 945320, 943120, 940786, 938310, 935678, 932879, 929898, 926720, 923327, 919702, 915823, 911667, 907210, 902423, 897277, 891736, 885765, 879322, 872363, 864841, 856704, 847897, 838362, 828041, 816874, 804808, 791793, 777794, 762796, 746810, 729889, 712133, 693703, 674825, 655790, 636938, 618630, 601206, 584933]
3155.972E69953j3695j2578j1749j1267j1106j1164j1272j1227j0816D55220
3137.4539D46991n879k848P35M672Q722J2631J6172J9163K1495K3122E69046
3117.2522E93450K4224K3638K2751K1662K0447J9172J7884J6619J5399G89488
3098.734H02643J2142J1203J0338R544Q814Q147P538O979O470O004N579I00590
3076.8489I05422M505M206L930L677L445L230L032K850K681K525K381I44130
3054.9636I46252K006J899J798J705J617J536J459J389J321J258J200I64584
3033.0786I65676J043R97R54R13Q73Q38Q02P70P39P09O82O55O30O06N84I78033
3004.4595I78574N22N03M86M68M53M37M22M08L95L82L69L58L46L35L25I85099
$$ y = [569953, 556258, 543680, 531931, 520664, 509558, 498394, 487122, 475895, 465079, 455220, 446991, 441112, 438264, 438999, 443671, 452393, 465024, 481196, 500359, 521854, 544976, 569046, 593450, 617674, 641312, 664063, 685725, 706172, 725344, 743228, 759847, 775246, 789488, 802643, 814785, 825988, 836326, 845870, 854684, 862831, 870369, 877348, 883818, 889822, 895401, 900590, 905422, 909927, 914133, 918063, 921740, 925185, 928415, 931447, 934297, 936978, 939503, 941884, 944130, 946252, 948258, 950157, 951955, 953660, 955277, 956813, 958272, 959661, 960982, 962240, 963440, 964584, 965676, 966719, 967716, 968670, 969583, 970456, 971294, 972096, 972866, 973605, 974314, 974996, 975651, 976281, 976887, 977471, 978033, 978574, 979096, 979599, 980085, 980553, 981006, 981443, 981865, 982273, 982668, 983050, 983419, 983777, 984123, 984458, 984783, 985099]
2975.8406I85404K96K88K79K71K63K55K48K41K35K28K22K15K10K05J98I89252
2947.2214I89441J84J79J74J70J66J62J58J54J50J47J43J40J36J34J30I91895
2918.6025I92020J22J18J17J13J12J08J07J04J02J00R8R5R4R2R0Q8Q6I93851
2886.6165I93934Q1Q0P8P6P5P4P2P1P0O8O7O6O5O3O2TO0N9N8N7N6N5N4I95516
2844.5298I95568N1TM9TM8M7TM5TM4TM3M2M1TM0TL8L9L7L8L6UL5L4TL3I96764
2794.0256I96797L2L1UL0TK9UK8TK7UK6TK5K6K4K5K4UP07J7J8J6J7J6I98238
$$ y = [985404, 985700, 985988, 986267, 986538, 986801, 987056, 987304, 987545, 987780, 988008, 988230, 988445, 988655, 988860, 989058, 989252, 989441, 989625, 989804, 989978, 990148, 990314, 990476, 990634, 990788, 990938, 991085, 991228, 991368, 991504, 991638, 991768, 991895, 992020, 992142, 992260, 992377, 992490, 992602, 992710, 992817, 992921, 993023, 993123, 993221, 993316, 993410, 993502, 993592, 993680, 993766, 993851, 993934, 994015, 994095, 994173, 994249, 994324, 994398, 994470, 994541, 994611, 994679, 994746, 994812, 994877, 994940, 995002, 995064, 995124, 995183, 995241, 995298, 995354, 995409, 995463, 995516, 995568, 995619, 995670, 995719, 995768, 995816, 995863, 995910, 995955, 996000, 996044, 996088, 996131, 996173, 996214, 996255, 996295, 996335, 996373, 996412, 996449, 996487, 996523, 996559, 996595, 996630, 996664, 996698, 996731, 996764, 996797, 996829, 996860, 996891, 996922, 996952, 996982, 997011, 997040, 997069, 997097, 997125, 997152, 997179, 997206, 997232, 997258, 997283, 997309, 997333, 997358, 997382, 997406, 997430, 998137, 998154, 998172, 998188, 998205, 998221, 998238]
2741.838I98254J5J6J5J6J5J4J755%U52m926m1m2m3Tm4Tm5Tm6m7Tm8I94590
2112.2195I94541n0Tn1n2n3Tn4n5n6Tn7n8n9To1To2o3o4o5o6o7o8o9p0I92991
2066.7659I92919p3p4p5p7p8p9q0q2Tq4q6q7q8r0r1r2r5Tr8r9j01j02I90907
2026.3624I90801j08j10j11j14j15j18j20j22j24j26j29j31j33j36j39I88824
1997.7434I88680j47j49j53j55j59j61j65j68j72j75j79j82j86j90j94I85947
1969.1244I85745k07k11k16k20k25k31k35k41k46k52k58k64k70k76k83I81820
1940.5054I81523l04l11l19l27l36l43l53l62l71l81l91m02m12m24m35I75605
1911.8864I75146m870n21n35n50n66n81n98o16o33o52o71o91p13p34p57I60677
1883.2673I59871q31q58q87r16r46r79j012j048j084j122j163j206j249I45273
$$ y = [994541, 994491, 994441, 994390, 994338, 994285, 994232, 994178, 994123, 994067, 994011, 993954, 993896, 993837, 993778, 993717, 993656, 993594, 993531, 993467, 993402, 993336, 993269, 993201, 993132, 993062, 992991, 992919, 992846, 992772, 992697, 992620, 992542, 992463, 992383, 992301, 992219, 992135, 992049, 991962, 991874, 991784, 991693, 991601, 991506, 991411, 991313, 991214, 991113, 991011, 990907, 990801, 990693, 990583, 990472, 990358, 990243, 990125, 990005, 989883, 989759, 989633, 989504, 989373, 989240, 989104, 988965, 988824, 988680, 988533, 988384, 988231, 988076, 987917, 987756, 987591, 987423, 987251, 987076, 986897, 986715, 986529, 986339, 986145, 985947, 985745, 985538, 985327, 985111, 984891, 984666, 984435, 984200, 983959, 983713, 983461, 983203, 982939, 982669, 982393, 982110, 981820, 981523, 981219, 980908, 980589, 980262, 979926, 979583, 979230, 978868, 978497, 978116, 977725, 977323, 976911, 976487, 976052, 975605, 975146, 970276, 969755, 969220, 968670, 968104, 967523, 966925, 966309, 965676, 965024, 964353, 963662, 962949, 962215, 961458, 960677, 959871, 959040, 958182, 957295, 956379, 955433, 954454, 953442, 952394, 951310, 950188, 949025, 947819, 946570, 945273]
1858.0153I43928j397j450j508j568j631j697j767j842j919k002k090I22875
1836.1301I20595k383k494k610k734k866l006l156l314l483l664l857H82964
1814.245H78681m520m772n043n334n646n980o341o728p145p594q077H02903
1792.3599G93744r764j0416j1117j1872j2684j3555j4489j5487j6550F60132
1773.8417F41265k0114k1409k2738k4104k5418k6710k7912k8975k9832C83641
1755.3235C53001l0438k9741k8500k6695k4346k1511j8278j4760j1063A40393
1736.8053A36937L70M193Q001J1763J5413J8861K1993K4707K6915K8572C27391
1716.6036C57618L0304K9971K9301K8374K7257K6014K4693K3339K1981F19497
$$ y = [943928, 942531, 941081, 939573, 938005, 936374, 934677, 932910, 931068, 929149, 927147, 925057, 922875, 920595, 918212, 915718, 913108, 910374, 907508, 904502, 901346, 898032, 894549, 890885, 887028, 882964, 878681, 874161, 869389, 864346, 859012, 853366, 847386, 841045, 834317, 827172, 819578, 811501, 802903, 793744, 783980, 773564, 762447, 750575, 737891, 724336, 709847, 694360, 677810, 660132, 641265, 621151, 599742, 577004, 552900, 527482, 500772, 472860, 443885, 414053, 383641, 353001, 322563, 292822, 264322, 237627, 213281, 191770, 173492, 158732, 147669, 140393, 136937, 137307, 141500, 149501, 161264, 176677, 195538, 217531, 242238, 269153, 297725, 327391, 357618, 387922, 417893, 447194, 475568, 502825, 528839, 553532, 576871, 598852, 619497]
1698.0854F38844J8102J6914J5791J4731J3737J2807J1938J1130J0375G74044
1679.5673G83066Q416P852P327O838O383N959N563N193M846M523M218H54117
1657.6821H57781L411L171K946K731K527K334K150J972J804J640J484H85284
1635.797H86469J043R04P68O35N03L73K44J17j2j39k68l98n30o63p99H87308
1607.178H86227j229j381j538j701j872k049k236k430k637k852l082H59897
1585.2928H56316l854m144m454m785n140n518n925o361o830p334p877G85633
1563.4077G76542r769j0499j1286j2131j3040j4013j5054j6164j7340F38665
1544.8895F18785k1225k2604k3991k5356k6662k7855k8877k9654l0109C52293
$$ y = [638844, 656946, 673860, 689651, 704382, 718119, 730926, 742864, 753994, 764369, 774044, 783066, 791482, 799334, 806661, 813499, 819882, 825841, 831404, 836597, 841443, 845966, 850184, 854117, 857781, 861192, 864363, 867309, 870040, 872567, 874901, 877051, 879023, 880827, 882467, 883951, 885284, 886469, 887512, 888416, 889184, 889819, 890322, 890695, 890939, 891056, 891044, 890905, 890637, 890239, 889709, 889046, 888247, 887308, 886227, 884998, 883617, 882079, 880378, 878506, 876457, 874221, 871791, 869154, 866302, 863220, 859897, 856316, 852462, 848318, 843864, 839079, 833939, 828421, 822496, 816135, 809305, 801971, 794094, 785633, 776542, 766773, 756274, 744988, 732857, 719817, 705804, 690750, 674586, 657246, 638665, 618785, 597560, 574956, 550965, 525609, 498947, 471092, 442215, 412561, 382452, 352293]
1526.3713C22568k8745k7181k5027k2321j9137j5575j1744p747l658M66A66489
1506.1697A75163J2657J6461J9976K3096K5722K7785K9259L0152L0510D21178
1487.6515D51074K9085K8044K6842K5539K4181K2808K1449K0123J8847F85622
1469.1333G02098J5391J4374J3423J2537J1713J0949J0239R581Q972Q407H25568
1448.9316H32966O949O531O144N784N449N137M848M577M325M088L868H94327
1427.0465H97794L285L113K952K799K655K517K388K263K145K031J921I27679
1405.1614I29392J612J514J418J321J226J130J034R38Q41P44O47N53M64I43217
1379.9093I43532K67K42K52K98L84N06O58Q25R93J144J268J356p474j1464I33986
$$ y = [322568, 293823, 266642, 241615, 219294, 200157, 184582, 172838, 165091, 161433, 161899, 166489, 175163, 187820, 204281, 224257, 247353, 273075, 300860, 330119, 360271, 390781, 421178, 451074, 480159, 508203, 535045, 560584, 584765, 607573, 629022, 649145, 667992, 685622, 702098, 717489, 731863, 745286, 757823, 769536, 780485, 790724, 800305, 809277, 817684, 825568, 832966, 839915, 846446, 852590, 858374, 863823, 868960, 873808, 878385, 882710, 886798, 890666, 894327, 897794, 901079, 904192, 907144, 909943, 912598, 915115, 917503, 919766, 921911, 923942, 925863, 927679, 929392, 931004, 932518, 933936, 935257, 936483, 937613, 938647, 939585, 940426, 941170, 941817, 942370, 942834, 943217, 943532, 943799, 944041, 944293, 944591, 944975, 945481, 946139, 946964, 947957, 949101, 950369, 951725, 944251, 932787, 933986]
1352.9738I35151J114J054R90R24Q58P94P35O78O26N76N157M53M14L79I50249
1326.0382I50564K86K60K34K11J89J67J48J29J11R4P8O2M6L2J8Mrk2l5I52520
1290.6853I52460p1q3r4j05j17j28j38j49j60j71j81j91k02k12k23k33I49758
1260.3828I49504k64k75k86k96l06l18l28l39l50l61l72l83l95m07m18I43976
1231.7638I43534m54m66m80m91n05n18n31n45n59n73n87o02o17o32o47I34663
1203.1448I33983o96p13p31p48p66p85q04q23q43q64q84r06r27r51r73I20572
1174.5258I19551j046n022j127j154j182j210j241j271j302j335j367I00892
1152.6406H99454j473j511j549j589j630j672j716j761j807j855j904H79031
$$ y = [935151, 936265, 937319, 938309, 939233, 940091, 940885, 941620, 942298, 942924, 943500, 948657, 949110, 949524, 949903, 950249, 950564, 950850, 951110, 951344, 951555, 951744, 951911, 952059, 952188, 952299, 952393, 952471, 952533, 952579, 952611, 952629, 952633, 952624, 952602, 952567, 952520, 952460, 952389, 952306, 952212, 952107, 951990, 951862, 951724, 951575, 951415, 951244, 951063, 950872, 950670, 950458, 950235, 950002, 949758, 949504, 949240, 948965, 948679, 948383, 948077, 947759, 947431, 947092, 946742, 946381, 946009, 945626, 945231, 944824, 944406, 943976, 943534, 943080, 942614, 942134, 941643, 941138, 940620, 940089, 939544, 938985, 938412, 937825, 937223, 936606, 935974, 935327, 934663, 933983, 933287, 932574, 931843, 931095, 930329, 929544, 928740, 927917, 927074, 926210, 925326, 924420, 923493, 922542, 921569, 920572, 919551, 918505, 913483, 912356, 911202, 910020, 908810, 907569, 906298, 904996, 903661, 902294, 900892, 899454, 897981, 896470, 894921, 893332, 891702, 890030, 888314, 886553, 884746, 882891, 880987, 879031]
1130.7555H77023k063k120k178k238k301k365k432k502k573k647k725H48074
1108.8704H48979l019l106l200l294l395l498l605l716l833l953m078H06073
1086.9852H01729m485m633m785m945n111n283n463n651n847o050o262G36730
1065.1001G30016o955p205p467p738q023q318q626q946r280r627r987F27481
1043.215F16730j1154j1572j2004j2450j2910j3382j3868j4364j4870D84772
1024.6968D68870j6424j6944j7458j7962j9051j8887j9318j9706k0041B82765
1006.1785B62256k0611k0608k0482k0219j9804j9225j8471j7541j6436G3694
987.66034E9944j2223j0621q998p409n909m551l376k405j643j078o79F38
$$ y = [877023, 874960, 872840, 870662, 868424, 866123, 863758, 861326, 858824, 856251, 853604, 850879, 848074, 848979, 845960, 842854, 839654, 836360, 832965, 829467, 825862, 822146, 818313, 814360, 810282, 806073, 801729, 797244, 792611, 787826, 782881, 777770, 772487, 767024, 761373, 755526, 749476, 743214, 736730, 730016, 723061, 715856, 708389, 700651, 692628, 684310, 675684, 666738, 657458, 647831, 637844, 627481, 616730, 605576, 594004, 582000, 569550, 556640, 543258, 529390, 515026, 500156, 484772, 468870, 452446, 435502, 418044, 400082, 381031, 362144, 342826, 323120, 303079, 282765, 262256, 241645, 221037, 200555, 180336, 160532, 141307, 122836, 105295, 88859, 73694, 59944, 47721, 37100, 28102, 20693, 14784, 10233, 6857, 4452, 2809, 1731, 1052, 638]
965.7752C94j42q0m4k1pPK2M4Q1J42K46M16O82J079J644K401L364M527B0621
932.1058B7962Q901J0486J2045J3527J4890J6108J7159J8034J8731J9255A96713
911.9041B16538J9898J9850J9696J9453J9133J8749J8313J7838J7328D03592
893.3859D19839J5685J5118J4549J3979J3415J2855J2303J1760J1226E51431
874.86774E61619R686R192Q710Q236P772P316O868O425N990N559N132F47212
852.9826F51495L861L437L010K579K143J699J245P82L04j90p00j231F66648
829.414F64282k975l618m295n012n772o580p437q349r319j0347j1440E76546
807.5289E62739j5077j6397j7753j9129k0497k1825k3071k4177k5084C54015
$$ y = [394, 252, 172, 128, 107, 100, 107, 129, 173, 254, 396, 642, 1058, 1740, 2819, 4463, 6864, 10228, 14755, 20621, 27962, 36863, 47349, 59394, 72921, 87811, 103919, 121078, 139112, 157843, 177098, 196713, 216538, 236436, 256286, 275982, 295435, 314568, 333317, 351630, 369468, 386796, 403592, 419839, 435524, 450642, 465191, 479170, 492585, 505440, 517743, 529503, 540729, 551431, 561619, 571305, 580497, 589207, 597443, 605215, 612531, 619399, 625824, 631814, 637373, 642505, 647212, 651495, 655356, 658793, 661803, 664382, 666525, 668224, 669469, 670251, 670555, 670365, 669665, 668434, 666648, 664282, 661307, 657689, 653394, 648382, 642610, 636030, 628593, 620244, 610925, 600578, 589138, 576546, 562739, 547662, 531265, 513512, 494383, 473886, 452061, 428990, 404813, 379729, 354015]
789.0107C28020k5846k5204k4021k2282k0006j7246j4091j0634o972A58534
770.4925A59202M533Q363J2089J5624J8871K1723K4098K5937K7224K7973C73869
750.29083D01936K7551K6761K5770K4638K3420K2158K0886J9629J8405F28381
731.77264F44483J5036J4031J3085J2201J1372J0599R877R203Q574P986G63884
711.571G70806O439N986N557N154M772M408M062L731L411L105K806H22752
689.68585H24983J951J672J396J118Q38N53K63l6l46o67j005j358j734H25496
664.4338H22938l014l504m034m607n228n901o633p426q285r213j0211G43606
642.54865G31204j3576j4778j5976j7128j8170j9026j9600j9784j9461E55181
$$ y = [328020, 302174, 276970, 252949, 230667, 210661, 193415, 179324, 168690, 161718, 158534, 159202, 163735, 172098, 184187, 199811, 218682, 240405, 264503, 290440, 317664, 345637, 373869, 401936, 429487, 456248, 482018, 506656, 530076, 552234, 573120, 592749, 611154, 628381, 644483, 659519, 673550, 686635, 698836, 710208, 720807, 730684, 739887, 748461, 756447, 763884, 770806, 777245, 783231, 788788, 793942, 798714, 803122, 807184, 810915, 814326, 817431, 820237, 822752, 824983, 826934, 828606, 830002, 831120, 831958, 832511, 832774, 832738, 832392, 831725, 830720, 829362, 827628, 825496, 822938, 819924, 816420, 812386, 807779, 802551, 796650, 790017, 782591, 774306, 765093, 754882, 743606, 731204, 717628, 702850, 686874, 669746, 651576, 632550, 612950, 593166, 573705, 555181]
624.03046E38295j4506j1408p684l499R25N334R479J3144J6173J8483E84797
603.8288F05751K1251K1061K0496J9665J8659J7552J6403J5254J4135G83244
585.3106G95301J1116J0245R443Q708Q035P421O862O352N888N465N080H84644
563.4255H89052M115L847L601J1794J5568K874K697K534K383K245K116I44823
541.54034I46710J786J690J603J521J444J372J307J244J185J131J080I63104
519.6552I64091R44R03Q66Q31P97P65P35P06O80O54O30O06N85N65N44I75428
491.03616I75935M91M74M59M44M30M16M03L91L79L68L56L46L36L27L17I82180
462.41714I82480K91K84K75K69K61K55K48K41K36K29K24K19K13K07K03I86333
$$ y = [538295, 523789, 512381, 504697, 501198, 502123, 507457, 516936, 530080, 546253, 564736, 584797, 605751, 627002, 648063, 668559, 688224, 706883, 724435, 740838, 756092, 770227, 783244, 795301, 806417, 816662, 826105, 834813, 842848, 850269, 857131, 863483, 869371, 874836, 879916, 884644, 889052, 893167, 897014, 900615, 912409, 927977, 930851, 933548, 936082, 938465, 940710, 942826, 944823, 946710, 948496, 950186, 951789, 953310, 954754, 956126, 957433, 958677, 959862, 960993, 962073, 963104, 964091, 965035, 965938, 966804, 967635, 968432, 969197, 969932, 970638, 971318, 971972, 972602, 973208, 973793, 974358, 974902, 975428, 975935, 976426, 976900, 977359, 977803, 978233, 978649, 979052, 979443, 979822, 980190, 980546, 980892, 981228, 981555, 981872, 982180, 982480, 982771, 983055, 983330, 983599, 983860, 984115, 984363, 984604, 984840, 985069, 985293, 985512, 985725, 985932, 986135, 986333]
433.79813I86526J89J84J81J76J71J69J64J61J57J54J50J47J44J41J38I89087
405.1791I89219J29J27J24J21J20J16J14J12J10J08J05J03J01J00R7I91001
376.5601I91094R2R0Q8M330N0M8M7M6M5M3TM1M0L9L8L7L6L5L4L2TL1I96441
336.15677I96469K8K7K5TK4K2TK1J9TJ7TJ5J4J3J2J1RTPOMLJTklnorj0I96792
280.6022I96778j7j9k2k4k7l1l3l7m1m4m9n3n9o3p0p6q2r0r8j06j17I95494
241.88234I95355j51j65j80j98k17k37k61k87l17l48l84m25m70n19n75I91532
213.26332I90815p90q69r51j038j123j203j272j321j340j315j238j097I76369
189.69472I75747l05L6L74O82R38J132J259J324J339J313J259J187J106I88410
$$ y = [986526, 986715, 986899, 987080, 987256, 987427, 987596, 987760, 987921, 988078, 988232, 988382, 988529, 988673, 988814, 988952, 989087, 989219, 989348, 989475, 989599, 989720, 989840, 989956, 990070, 990182, 990292, 990400, 990505, 990608, 990709, 990809, 990906, 991001, 991094, 991186, 991276, 991364, 995694, 995744, 995792, 995839, 995885, 995930, 995973, 996016, 996057, 996097, 996136, 996174, 996211, 996247, 996282, 996316, 996348, 996380, 996411, 996441, 996469, 996497, 996524, 996549, 996574, 996598, 996620, 996642, 996663, 996682, 996701, 996718, 996735, 996750, 996764, 996777, 996789, 996800, 996809, 996818, 996825, 996831, 996835, 996838, 996839, 996840, 996838, 996835, 996830, 996824, 996815, 996805, 996792, 996778, 996761, 996742, 996720, 996696, 996669, 996638, 996605, 996568, 996527, 996483, 996434, 996381, 996322, 996259, 996189, 996113, 996031, 995941, 995843, 995737, 995620, 995494, 995355, 995204, 995039, 994859, 994661, 994444, 994207, 993946, 993659, 993342, 992994, 992610, 992185, 991715, 991196, 990621, 991532, 990815, 990025, 989156, 988205, 987167, 986044, 984841, 983569, 982248, 980908, 979593, 978355, 977258, 976369, 975747, 975442, 975478, 975852, 976534, 977472, 978604, 979863, 981187, 982526, 983839, 985098, 986285, 987391, 988410]
164.44264I89344Q52P74P03O36N77N23M74M31L91L56L25K96K71K49K28I96639
135.82362I96832J78J65J52J41J31J22J13J06R9R2Q6Q1P6P2O7O3O0N6I98745
102.15418I98795M8M5M2M1L8L7L5L3L1TK8TK6K5K4K3K2K1K0J9TJ7J8J6I99498
58.383915I99513J5J4TJ3J2J3J1J2J1J0J1J0RJ0RQRQUPTQOPOPOTNOTNI99815
-0.537597I99820NTMNMI99848
$$ y = [989344, 990196, 990970, 991673, 992309, 992886, 993409, 993883, 994314, 994705, 995061, 995386, 995682, 995953, 996202, 996430, 996639, 996832, 997010, 997175, 997327, 997468, 997599, 997721, 997834, 997940, 998039, 998131, 998217, 998298, 998374, 998446, 998513, 998576, 998636, 998692, 998745, 998795, 998843, 998888, 998930, 998971, 999009, 999046, 999081, 999114, 999145, 999176, 999204, 999232, 999258, 999283, 999307, 999330, 999352, 999373, 999393, 999412, 999431, 999448, 999466, 999482, 999498, 999513, 999528, 999542, 999556, 999569, 999581, 999594, 999605, 999617, 999628, 999638, 999649, 999659, 999668, 999678, 999687, 999695, 999704, 999712, 999720, 999728, 999735, 999742, 999750, 999756, 999763, 999769, 999776, 999782, 999788, 999793, 999799, 999805, 999810, 999815, 999820, 999825, 999830, 999834, 999839, 999843, 999848]
-12.3219I99852  $$checkpoint
##END= $$ end of cis-DCE IR
##TITLE=Raman of cis-1,2-dichloroethylene (Z) $$ Begin of the data block
##JCAMP-DX=5.00 $$ ACD/DocManager Library v 5.00
##DATA TYPE=RAMAN SPECTRUM
##DATA CLASS=XYDATA
##BLOCK ID=2
##DATE=19 Feb 2012 10:29:22
##ORIGIN= Department of Chemistry, UWI, Jamaica
##OWNER= public domain
##SPECTROMETER/DATA SYSTEM=from scan
##$MODELS=
<Models>
<ModelData id="cDCE" type="MOL">
cis-1,2-dichloroethylene (Z)
__Jmol-14_02171521233D 1   1.00000     0.00000     0
Jmol version 14.3.12_2015.02.11  2015-02-11 19:15 EXTRACT: ({0:5})
  6  5  0  0  0  0              1 V2000
   0.00000   0.67022   0.96140 C   0  0  0  0  0  0
   0.00000  -0.67022   0.96140 C   0  0  0  0  0  0
   0.00000  -1.65604  -0.45086 Cl  0  0  0  0  0  0
   0.00000  -1.25420   1.89597 H   0  0  0  0  0  0
   0.00000   1.65604  -0.45086 Cl  0  0  0  0  0  0
   0.00000   1.25420   1.89597 H   0  0  0  0  0  0
  1  6  1  0  0  0
  1  5  1  0  0  0
  1  2  2  0  0  0
  2  3  1  0  0  0
  2  4  1  0  0  0
M  END
</ModelData>
<ModelData id="C2" type="XYZVIB" baseModel="cDCE" vibrationScale=".5">
6
Model[1]: PATH=Calculation 1;Input;Convg=0.9764D-08;-V/T=2.0006;Energy=NaN;Range=M.O.s;E(RHF)=-995.827490213 A.U.;PATH=Calculation 1;Input
C       0.00000      0.00000      0.00000
C       0.00000      0.00000      1.34044
Cl      1.41224      0.00000      2.32626
H      -0.93457      0.00000      1.92442
Cl      1.41224      0.00000     -0.98582
H      -0.93457      0.00000     -0.58398
6
Model[2]: PATH=Calculation 1;Standard;Convg=0.9764D-08;-V/T=2.0006;Energy=-995.8275;Range=M.O.s;E(RHF)=-995.827490213 A.U.;PATH=Calculation 1;Standard
C       0.00000      0.67022      0.96140
C       0.00000     -0.67022      0.96140
Cl      0.00000     -1.65604     -0.45085
H       0.00000     -1.25420      1.89597
Cl      0.00000      1.65604     -0.45085
H       0.00000      1.25420      1.89597
6
Model[3]: IRIntensity=0.4101 KM/Mole;PATH=Calculation 1;FrequenciesFrequencies;ReducedMass=27.0583 AMU;ForceConstant=0.5615 mDyne/A;FreqValue=187.6781;Frequency=187.6781 cm^-1;FrequencyLabel=A1;PATH=Calculation 1;FrequenciesFrequencies
C       0.00000      0.67022      0.96140      0.00000     -0.01000      0.28000
C       0.00000     -0.67022      0.96140      0.00000      0.01000      0.28000
Cl      0.00000     -1.65604     -0.45085      0.00000      0.59000     -0.10000
H       0.00000     -1.25420      1.89597      0.00000     -0.20001      0.15001
Cl      0.00000      1.65604     -0.45085      0.00000     -0.59000     -0.10000
H       0.00000      1.25420      1.89597      0.00000      0.20001      0.15001
6
Model[4]: IRIntensity=0.0000 KM/Mole;PATH=Calculation 1;FrequenciesFrequencies;ReducedMass=4.0875 AMU;ForceConstant=0.6230 mDyne/A;FreqValue=508.6316;Frequency=508.6316 cm^-1;FrequencyLabel=A2;PATH=Calculation 1;FrequenciesFrequencies
C       0.00000      0.67022      0.96140      0.36001      0.00000      0.00000
C       0.00000     -0.67022      0.96140     -0.36001      0.00000      0.00000
Cl      0.00000     -1.65604     -0.45085      0.06000      0.00000      0.00000
H       0.00000     -1.25420      1.89597     -0.61000      0.00000      0.00000
Cl      0.00000      1.65604     -0.45085     -0.06000      0.00000      0.00000
H       0.00000      1.25420      1.89597      0.61000      0.00000      0.00000
6
Model[5]: IRIntensity=10.3585 KM/Mole;PATH=Calculation 1;FrequenciesFrequencies;ReducedMass=9.1362 AMU;ForceConstant=2.0412 mDyne/A;FreqValue=615.7893;Frequency=615.7893 cm^-1;FrequencyLabel=B2;PATH=Calculation 1;FrequenciesFrequencies
C       0.00000      0.67022      0.96140      0.00000      0.45000      0.20001
C       0.00000     -0.67022      0.96140      0.00000      0.45000     -0.20001
Cl      0.00000     -1.65604     -0.45085      0.00000     -0.17000     -0.12000
H       0.00000     -1.25420      1.89597      0.00000      0.40000     -0.24000
Cl      0.00000      1.65604     -0.45085      0.00000     -0.17000      0.12000
H       0.00000      1.25420      1.89597      0.00000      0.40000      0.24000
6
Model[6]: IRIntensity=28.3460 KM/Mole;PATH=Calculation 1;FrequenciesFrequencies;ReducedMass=9.1109 AMU;ForceConstant=3.1990 mDyne/A;FreqValue=771.9739;Frequency=771.9739 cm^-1;FrequencyLabel=A1;PATH=Calculation 1;FrequenciesFrequencies
C       0.00000      0.67022      0.96140      0.00000      0.07000      0.48000
C       0.00000     -0.67022      0.96140      0.00000     -0.07000      0.48000
Cl      0.00000     -1.65604     -0.45085      0.00000     -0.11000     -0.17000
H       0.00000     -1.25420      1.89597      0.00000     -0.33001      0.34000
Cl      0.00000      1.65604     -0.45085      0.00000      0.11000     -0.17000
H       0.00000      1.25420      1.89597      0.00000      0.33001      0.34000
6
Model[7]: IRIntensity=89.5375 KM/Mole;PATH=Calculation 1;FrequenciesFrequencies;ReducedMass=4.6319 AMU;ForceConstant=2.4956 mDyne/A;FreqValue=956.2813;Frequency=956.2813 cm^-1;FrequencyLabel=B2;PATH=Calculation 1;FrequenciesFrequencies
C       0.00000      0.67022      0.96140      0.00000     -0.06000      0.36001
C       0.00000     -0.67022      0.96140      0.00000     -0.06000     -0.36001
Cl      0.00000     -1.65604     -0.45085      0.00000      0.03000      0.09000
H       0.00000     -1.25420      1.89597      0.00000     -0.30001     -0.52000
Cl      0.00000      1.65604     -0.45085      0.00000      0.03000     -0.09000
H       0.00000      1.25420      1.89597      0.00000     -0.30001      0.52000
6
Model[8]: IRIntensity=61.4963 KM/Mole;PATH=Calculation 1;FrequenciesFrequencies;ReducedMass=1.2299 AMU;ForceConstant=0.6661 mDyne/A;FreqValue=958.7349;Frequency=958.7349 cm^-1;FrequencyLabel=B1;PATH=Calculation 1;FrequenciesFrequencies
C       0.00000      0.67022      0.96140      0.10000      0.00000      0.00000
C       0.00000     -0.67022      0.96140      0.10000      0.00000      0.00000
Cl      0.00000     -1.65604     -0.45085     -0.01000      0.00000      0.00000
H       0.00000     -1.25420      1.89597     -0.70000      0.00000      0.00000
Cl      0.00000      1.65604     -0.45085     -0.01000      0.00000      0.00000
H       0.00000      1.25420      1.89597     -0.70000      0.00000      0.00000
6
Model[9]: IRIntensity=0.0000 KM/Mole;PATH=Calculation 1;FrequenciesFrequencies;ReducedMass=1.2297 AMU;ForceConstant=0.9509 mDyne/A;FreqValue=1145.6135;Frequency=1145.6135 cm^-1;FrequencyLabel=A2;PATH=Calculation 1;FrequenciesFrequencies
C       0.00000      0.67022      0.96140     -0.10000      0.00000      0.00000
C       0.00000     -0.67022      0.96140      0.10000      0.00000      0.00000
Cl      0.00000     -1.65604     -0.45085      0.00000      0.00000      0.00000
H       0.00000     -1.25420      1.89597     -0.70000      0.00000      0.00000
Cl      0.00000      1.65604     -0.45085      0.00000      0.00000      0.00000
H       0.00000      1.25420      1.89597      0.70000      0.00000      0.00000
6
Model[10]: IRIntensity=0.2406 KM/Mole;PATH=Calculation 1;FrequenciesFrequencies;ReducedMass=1.1165 AMU;ForceConstant=1.2298 mDyne/A;FreqValue=1367.2548;Frequency=1367.2548 cm^-1;FrequencyLabel=A1;PATH=Calculation 1;FrequenciesFrequencies
C       0.00000      0.67022      0.96140      0.00000     -0.07000      0.01000
C       0.00000     -0.67022      0.96140      0.00000      0.07000      0.01000
Cl      0.00000     -1.65604     -0.45085      0.00000      0.00000     -0.01000
H       0.00000     -1.25420      1.89597      0.00000      0.61000      0.35000
Cl      0.00000      1.65604     -0.45085      0.00000      0.00000     -0.01000
H       0.00000      1.25420      1.89597      0.00000     -0.61000      0.35000
6
Model[11]: IRIntensity=29.7008 KM/Mole;PATH=Calculation 1;FrequenciesFrequencies;ReducedMass=1.2161 AMU;ForceConstant=1.6354 mDyne/A;FreqValue=1510.7919;Frequency=1510.7919 cm^-1;FrequencyLabel=B2;PATH=Calculation 1;FrequenciesFrequencies
C       0.00000      0.67022      0.96140      0.00000      0.06000     -0.08000
C       0.00000     -0.67022      0.96140      0.00000      0.06000      0.08000
Cl      0.00000     -1.65604     -0.45085      0.00000      0.00000      0.00000
H       0.00000     -1.25420      1.89597      0.00000     -0.61000     -0.35000
Cl      0.00000      1.65604     -0.45085      0.00000      0.00000      0.00000
H       0.00000      1.25420      1.89597      0.00000     -0.61000      0.35000
6
Model[12]: IRIntensity=32.4323 KM/Mole;PATH=Calculation 1;FrequenciesFrequencies;ReducedMass=5.0880 AMU;ForceConstant=9.0352 mDyne/A;FreqValue=1736.0748;Frequency=1736.0748 cm^-1;FrequencyLabel=A1;PATH=Calculation 1;FrequenciesFrequencies
C       0.00000      0.67022      0.96140      0.00000      0.43000     -0.06000
C       0.00000     -0.67022      0.96140      0.00000     -0.43000     -0.06000
Cl      0.00000     -1.65604     -0.45085      0.00000      0.01000      0.01000
H       0.00000     -1.25420      1.89597      0.00000      0.29000      0.48000
Cl      0.00000      1.65604     -0.45085      0.00000     -0.01000      0.01000
H       0.00000      1.25420      1.89597      0.00000     -0.29000      0.48000
6
Model[13]: IRIntensity=11.5546 KM/Mole;PATH=Calculation 1;FrequenciesFrequencies;ReducedMass=1.0869 AMU;ForceConstant=6.2829 mDyne/A;FreqValue=3132.2904;Frequency=3132.2904 cm^-1;FrequencyLabel=B2;PATH=Calculation 1;FrequenciesFrequencies
C       0.00000      0.67022      0.96140      0.00000      0.03000      0.05000
C       0.00000     -0.67022      0.96140      0.00000      0.03000     -0.05000
Cl      0.00000     -1.65604     -0.45085      0.00000      0.00000      0.00000
H       0.00000     -1.25420      1.89597      0.00000     -0.37000      0.60001
Cl      0.00000      1.65604     -0.45085      0.00000      0.00000      0.00000
H       0.00000      1.25420      1.89597      0.00000     -0.37000     -0.60001
6
Model[14]: IRIntensity=4.5509 KM/Mole;PATH=Calculation 1;FrequenciesFrequencies;ReducedMass=1.1026 AMU;ForceConstant=6.4650 mDyne/A;FreqValue=3154.6217;Frequency=3154.6217 cm^-1;FrequencyLabel=A1;PATH=Calculation 1;FrequenciesFrequencies
C       0.00000      0.67022      0.96140      0.00000      0.04000      0.05000
C       0.00000     -0.67022      0.96140      0.00000     -0.04000      0.05000
Cl      0.00000     -1.65604     -0.45085      0.00000      0.00000      0.00000
H       0.00000     -1.25420      1.89597      0.00000      0.38000     -0.59000
Cl      0.00000      1.65604     -0.45085      0.00000      0.00000      0.00000
H       0.00000      1.25420      1.89597      0.00000     -0.38000     -0.59000
</ModelData>
</Models>
##$PEAKS=
<Peaks type="RAMAN" xUnitsExpected="1/cm"  >
<PeakData id="1" title="1 (~3160 cm-1)" peakShape="broad" model="C2.13" xMax="3175" xMin="3145"    />
<PeakData id="2" title="2 (~3160 cm-1)" peakShape="broad" model="C2.14" xMax="3145" xMin="3115"    />
<PeakData id="3" title="3 (~1740 cm-1)" peakShape="broad" model="C2.12" xMax="1760" xMin="1720"    />
<PeakData id="5" title="5 (~1510 cm-1)" peakShape="broad" model="C2.10" xMax="1370" xMin="1340"    />
<PeakData id="6" title="6 (~1360 cm-1)" peakShape="broad" model="C2.9" xMax="1160" xMin="1130"    />
<PeakData id="7" title="7 (~960 cm-1)" peakShape="broad" model="C2.8" xMax="975" xMin="960"    />
<PeakData id="9" title="9 (~765 cm-1)" peakShape="broad" model="C2.6" xMax="800" xMin="750"    />
<PeakData id="10" title="10 (~615 cm-1)" peakShape="broad" model="C2.5" xMax="635" xMin="605"    />
<PeakData id="11" title="11 (~510 cm-1)" peakShape="broad" model="C2.4" xMax="520" xMin="480"    />
<PeakData id="12" title="12 (~173 cm-1)" peakShape="broad" model="C2.3" xMax="205" xMin="165"    />
</Peaks>
##XUNITS=1/CM
##YUNITS=RAMAN INTENSITY
##XFACTOR= 1
##YFACTOR= 9.202128E-07
##FIRSTX= 3.352938E+03
##FIRSTY= 1.064559E-02
##LASTX= -1.232190E+01
##NPOINTS= 2000
##MINY= 0
##MAXY= 9.202128E-01
##XYDATA= (X++(Y..Y))
3352.9382A1569J91J97K02K06K12K18K23K29K35K42K48K55K61K70K76A5319
3324.319A5611L02L09L19L29L38L49L59L71L82L94M07M20M33M48M63B1712
3295.7002B2207N12N29N48N68N89O10O32O56O81P07P35P64P94Q26Q60C3114
3267.081C4047R73J016J060J107J158J210J267J326J391J458J530J607E0840
3243.5125E2617J872J972K080K195K321K454K598K754K922L104L301L513H7449
3219.9438I1447M272M572M899N257N649O081O555P078P654Q291Q997R779A81179
3196.3752A92792J2689J3885J5220J6708J8366K0209K2258K4524K7019C93414
3177.8572D26105L5828L9101M2411M5610M8487N0760N2075N2041N0265H89121
$$ y = [11569, 11760, 11957, 12159, 12365, 12577, 12795, 13018, 13247, 13482, 13724, 13972, 14227, 14488, 14758, 15034, 15319, 15611, 15913, 16222, 16541, 16870, 17208, 17557, 17916, 18287, 18669, 19063, 19470, 19890, 20323, 20771, 21234, 21712, 22207, 22719, 23248, 23796, 24364, 24953, 25563, 26195, 26851, 27532, 28239, 28974, 29738, 30532, 31358, 32218, 33114, 34047, 35020, 36036, 37096, 38203, 39361, 40571, 41838, 43164, 44555, 46013, 47543, 49150, 50840, 52617, 54489, 56461, 58541, 60736, 63057, 65511, 68109, 70863, 73785, 76889, 80190, 83703, 87449, 91447, 95719, 100291, 105190, 110447, 116096, 122177, 128732, 135810, 143464, 151755, 160752, 170531, 181179, 192792, 205481, 219366, 234586, 251294, 269660, 289869, 312127, 336651, 363670, 393414, 426105, 461933, 501034, 543445, 589055, 637542, 688302, 740377, 792418, 842683, 889121]
3159.3389I29563L2433K2898J2609K497o543j3833j9029k2146k3495k3587H68348
3139.1372H45972k2154k2685k4100k6310k9034l1878l4428l6349l7441E43941
3120.6191E06887l5790l4041l1981k9756k7488k5258k3124k1121j9266B41498
3102.1008B25484j4609j3338j2194j1161j0233r395q641p961p346o789A17531
3081.8992A11701n414n036m692m378m090l827l586l363l159k971k796F5752
3060.0142F3265k350k222k103j992j890j793j703j620j541j468j399j334D0577
3036.4456C9360j162j112j064j019r76r36q98q62q28p96p65p35p08o82B6160
3009.51B5527o10n88n68n49n29n12m94m79m62m48m33m20m06l94l81A7884
$$ y = [929563, 961996, 984894, 997503, 1000000, 993457, 979624, 960595, 938449, 914954, 891367, 868348, 845972, 823818, 801133, 777033, 750723, 721689, 689811, 655383, 619034, 581593, 543941, 506887, 471097, 437056, 405075, 375319, 347831, 322573, 299449, 278328, 259062, 241498, 225484, 210875, 197537, 185343, 174182, 163949, 154554, 145913, 137952, 130606, 123817, 117531, 111701, 106287, 101251, 96559, 92181, 88091, 84264, 80678, 77315, 74156, 71185, 68389, 65752, 63265, 60915, 58693, 56590, 54598, 52708, 50915, 49212, 47592, 46051, 44583, 43184, 41850, 40577, 39360, 38198, 37086, 36022, 35003, 34027, 33091, 32193, 31331, 30503, 29707, 28942, 28207, 27499, 26817, 26160, 25527, 24917, 24329, 23761, 23212, 22683, 22171, 21677, 21198, 20736, 20288, 19855, 19435, 19029, 18635, 18254, 17884]
2980.8909A7525l49l38l28l18l10l00k92k85k76k68k62k54k48k41k35A2993
2952.272A2770k17k12k06k01j96j92j87j82j78j74j69j66j62j58j54I865
2923.6528I717j44j41j39j35j32j29j26j24j22j18j17j13j12j09j07j05G641
2893.3503G540r9r6r5r4r1r0q8q6q4Tq1q0p9p7p6p4p3p2p1o9o8o7o6o5E552
2849.58E489o1Tn9Tn7Tn5Tn4n3n2n1Tn0m9m8m7Tm6m5Tm4m3Tm2m1Tm0D053
2799.076D014l8Ul6l7l6l5Tl4Tl3Ul2Tl1Tl0Uk9Tk8Uk7k071rj0rj0rA042
$$ y = [17525, 17176, 16838, 16510, 16192, 15882, 15582, 15290, 15005, 14729, 14461, 14199, 13945, 13697, 13456, 13221, 12993, 12770, 12553, 12341, 12135, 11934, 11738, 11546, 11359, 11177, 10999, 10825, 10656, 10490, 10328, 10170, 10016, 9865, 9717, 9573, 9432, 9293, 9158, 9026, 8897, 8771, 8647, 8525, 8407, 8290, 8177, 8065, 7956, 7849, 7744, 7641, 7540, 7441, 7345, 7250, 7156, 7065, 6975, 6887, 6801, 6717, 6633, 6552, 6472, 6393, 6316, 6240, 6166, 6093, 6021, 5950, 5881, 5813, 5746, 5680, 5615, 5552, 5489, 5428, 5367, 5308, 5249, 5192, 5135, 5080, 5025, 4971, 4918, 4866, 4815, 4764, 4714, 4665, 4617, 4570, 4523, 4477, 4432, 4387, 4343, 4300, 4257, 4215, 4174, 4133, 4093, 4053, 4014, 3976, 3938, 3900, 3864, 3827, 3791, 3756, 3721, 3687, 3653, 3620, 3587, 3554, 3522, 3490, 3459, 3428, 3398, 3368, 3338, 3309, 3280, 3252, 3224, 3196, 3169, 1098, 1089, 1079, 1070, 1060, 1051, 1042]
2741.838A033rTqrqTr82%U52O24NONTOTNOYPOPOPZQPQXRQRTQRJ0RTJ0I49
2058.3484I59J0UJ1TJ0J2J1TJ2WJ3VJ4J3J4J5J4J5UJ6J5J7J6J7UJ8UJ9A489
1992.693A509K0TK1UK2K3K2K4UK5TK6K7UK9UL0L1L2TL3L4L5L6TL7L8B409
1937.1384B449M1M2M3M5TM7M8M9N0N2N4N5N6N8N9O6O3O5O7O9P1P3P5P8C900
1893.3682C982Q5Q8R1R4R7J00J04J07J11J15J19J23J27J33J37J43J48F057
1861.3822F217J66J73J80J87J95K04K12K21K32K41K53K64K77K90L03L19A0269
1831.0797A0621L69L89M10M32M56M81N08N38N70O04O40O81P24P71Q22A9892
1802.4607B0830J002J075J153J238J333J437J550J677J815J969K139K328D2084
1778.8921D4857L033L323L648M011M415M868N849N933O552P234P976Q777A20101
$$ y = [959, 969, 979, 989, 1000, 1011, 1021, 1033, 1044, 1055, 1067, 1079, 1091, 1103, 1115, 1128, 1141, 1154, 1167, 1181, 1194, 1208, 1223, 1237, 1252, 1267, 1282, 1298, 1313, 1330, 1346, 1363, 1380, 1397, 1415, 1433, 1451, 1470, 1489, 1509, 1529, 1549, 1570, 1591, 1612, 1634, 1657, 1679, 1703, 1727, 1751, 1776, 1801, 1827, 1854, 1881, 1908, 1937, 1966, 1995, 2025, 2056, 2088, 2120, 2153, 2187, 2222, 2258, 2294, 2331, 2369, 2409, 2449, 2490, 2532, 2575, 2620, 2665, 2712, 2760, 2809, 2859, 2911, 2965, 3020, 3076, 3134, 3193, 3259, 3322, 3387, 3454, 3523, 3594, 3667, 3742, 3820, 3900, 3982, 4067, 4155, 4246, 4340, 4437, 4537, 4641, 4748, 4859, 4974, 5093, 5216, 5343, 5476, 5613, 5756, 5904, 6057, 6217, 6383, 6556, 6736, 6923, 7118, 7322, 7534, 7755, 7987, 8228, 8481, 8745, 9022, 9312, 9615, 9934, 10269, 10621, 10990, 11379, 11789, 12221, 12677, 13158, 13666, 14204, 14774, 15378, 16018, 16699, 17423, 18194, 19016, 19892, 20830, 21832, 22907, 24060, 25298, 26631, 28068, 29618, 31295, 33110, 35079, 37218, 39546, 42084, 44857, 47890, 51213, 54861, 58872, 63287, 68155, 74004, 79937, 86489, 93723, 101699, 110476, 120101]
1755.3235A30604J1379J2208J2923J3437J3642J3417J2640J1217R110B46943
1736.8053B50072l62l823o974r594j1559j2842j3495j3620j3341j2777A39654
1716.6036A28466j0308r434q594p806p075o407n801n254m761m320l925E1211
1694.7185D7959k968k714k484k279k094j927j776j640j517j405j304j210B3514
1671.1499B2465r79r14q54q01p50p04o61o21n85n52n19m91m63m38m15A2326
1642.5309A1954l52l34l17l01k87k72k58k47k34k23k13k02j93j84j75G995
1613.9119G835j52j44j38j32j25j20j14j08j03r8r3q9q3q0p5p1o6o3n9E867
1578.559E816m8m4m0l7l3k9k6k2j9j5j1plJORJ5K0K4R2L7M3N0N7O5P3F056
$$ y = [130604, 141983, 154191, 167114, 180551, 194193, 207610, 220250, 231467, 240577, 246943, 250072, 249710, 245887, 238913, 229319, 217760, 204918, 191423, 177803, 164462, 151685, 139654, 128466, 118158, 108724, 100130, 92324, 85249, 78842, 73041, 67787, 63026, 58706, 54781, 51211, 47959, 44991, 42277, 39793, 37514, 35420, 33493, 31717, 30077, 28560, 27155, 25851, 24641, 23514, 22465, 21486, 20572, 19718, 18917, 18167, 17463, 16802, 16181, 15596, 15044, 14525, 14034, 13571, 13133, 12718, 12326, 11954, 11602, 11268, 10951, 10650, 10363, 10091, 9833, 9586, 9352, 9129, 8916, 8714, 8521, 8337, 8162, 7995, 7835, 7683, 7539, 7401, 7269, 7144, 7024, 6910, 6802, 6699, 6601, 6508, 6419, 6336, 6256, 6181, 6110, 6044, 5981, 5922, 5867, 5816, 5768, 5724, 5684, 5647, 5614, 5585, 5559, 5537, 5518, 5503, 5492, 5485, 5482, 5483, 5489, 5498, 5513, 5533, 5557, 5649, 5686, 5729, 5779, 5836, 5901, 5974, 6056]
1531.4218F147J00J09J19J27J34J38J39J37J29J16R8P7N5L1J1nj6k1k2G584
1496.0688G573lQK1L2M5N7P0Q3R4J07J18J31J43J56J67J81J94K08K22I844
1460.716A0096K69K86L05L24L44L67L90M16M42M72N03N37N74O13O56A7297
1432.0969A8050Q09Q70R36J009J089J176J274J380J499J629J775J936C5548
1408.5283C7864K540K789L067L378L724M111M540N015N538O107O722P372A00813
1384.9597A09532R354R903J0298J0455J0282R687Q595O979M874K391k86A89123
1363.0746A83765p367q875r794j0359j0455j0241r807r236q589p914p243G7286
1341.1895G1293n434m921m455m654l653l314l010k739k495k277k082j906B8605
$$ y = [6147, 6247, 6356, 6475, 6602, 6736, 6874, 7013, 7150, 7279, 7395, 7493, 7570, 7625, 7656, 7667, 7662, 7646, 7625, 7603, 7584, 7573, 7570, 7578, 7599, 7631, 7676, 7733, 7803, 7886, 7980, 8087, 8205, 8336, 8479, 8635, 8802, 8983, 9177, 9385, 9607, 9844, 10096, 10365, 10651, 10956, 11280, 11624, 11991, 12381, 12797, 13239, 13711, 14214, 14751, 15325, 15938, 16594, 17297, 18050, 18859, 19729, 20665, 21674, 22763, 23939, 25213, 26593, 28092, 29721, 31496, 33432, 35548, 37864, 40404, 43193, 46260, 49638, 53362, 57473, 62013, 67028, 72566, 78673, 85395, 92767, 100813, 109532, 118886, 128789, 139087, 149542, 159824, 169511, 178106, 185085, 189959, 192350, 192064, 189123, 183765, 176398, 167523, 157729, 147370, 136915, 126674, 116867, 107631, 99042, 91128, 83885, 77286, 71293, 65859, 60938, 56483, 51829, 48176, 44862, 41852, 39113, 36618, 34341, 32259, 30353, 28605]
1317.6208B7000j478j363j257j163j077r99r28q63q04p49p00o54o12n73A3242
1290.6853A2738m75m45m20l96l72l52l32l13k96k80k64k51k37k24k12G668
1262.0663G478j80j70j61j52j43j36j27j20j13j06r9r2q6q0p3o7o1n4E409
1228.3969E366l6l0k4j7j1mMJ0J9K6L5M4N4O4P4Q7J00J13J29J45J63J83F699
1187.9935F928K56K85L18L55L95M40M91N46O07Q66P50Q29R13R99J085A7230
1159.3745A8468J288J309J288J214J075Q70O03K88n2l88o96r50j142j266B0581
1132.439A9240j313j257j183j101j015r28q46p68o97o31n71n17m68m29G130
1105.5034F780l19k90k64k42k21k02j85j69j56j43j31j20j10j01r3q5C871
$$ y = [27000, 25522, 24159, 22902, 21739, 20662, 19663, 18735, 17872, 17068, 16319, 15619, 14965, 14353, 13780, 13242, 12738, 12263, 11818, 11398, 11002, 10630, 10278, 9946, 9633, 9337, 9057, 8793, 8542, 8305, 8081, 7869, 7668, 7478, 7298, 7128, 6967, 6815, 6672, 6536, 6409, 6289, 6176, 6070, 5971, 5879, 5793, 5713, 5640, 5573, 5512, 5458, 5409, 5366, 5330, 5300, 5276, 5259, 5248, 5244, 5248, 5258, 5277, 5303, 5338, 5382, 5436, 5500, 5574, 5661, 5761, 5874, 6003, 6148, 6311, 6494, 6699, 6928, 7184, 7469, 7787, 8142, 8537, 8977, 9468, 10014, 10621, 11487, 12237, 13066, 13979, 14978, 16063, 17230, 18468, 19756, 21065, 22353, 23567, 24642, 25512, 26115, 26403, 26351, 25963, 25267, 24317, 23175, 21909, 20581, 19240, 17927, 16670, 15487, 14386, 13371, 12443, 11597, 10829, 10132, 9501, 8930, 8413, 7945, 7516, 7130, 6780, 6461, 6171, 5907, 5665, 5444, 5242, 5057, 4888, 4732, 4589, 4458, 4338, 4228, 4127, 4034, 3949, 3871]
1075.2009C800o4n8n3m7m2l8l2k8k4j9j5j1pkJORJ4J8K3K7L2L7M1M8N2C727
1028.0637C792P2Q0Q7R5J04J14K11J37J49J64J78J96K13K34K57K82L09G014
996.0777G388M13M56N03N56O14O80P51Q29R13J001J094J185J272J347B0403
969.14215B1825J400Q46J176R58O72L36k6l86p13r85j189j322j390j401A8429
942.2066A7116j235j146j053r62q74p91p14o44n80n22m70m22l81l43F671
915.27106F393k50k25k02o8j62j44j29j14j01q9p7o6n6m7l7k9k1j2nLD572
878.2347D589K5L1L9M6N3O1O8P6Q4R3J01J10J19J30J40J50J63J76J88F646
842.8818F864K35K53K73K93L17L41L68L98M31M66N05N49N96O49P08P72A4863
$$ y = [3800, 3736, 3678, 3625, 3578, 3536, 3498, 3466, 3438, 3414, 3395, 3380, 3369, 3362, 3360, 3361, 3367, 3376, 3390, 3408, 3431, 3458, 3490, 3527, 3568, 3616, 3668, 3727, 3792, 3864, 3944, 4031, 4126, 4230, 4344, 4555, 4692, 4841, 5005, 5183, 5379, 5592, 5826, 6083, 6365, 6674, 7014, 7388, 7801, 8257, 8760, 9316, 9930, 10610, 11361, 12190, 13103, 14104, 15198, 16383, 17655, 19002, 20403, 21825, 23225, 24071, 25247, 26205, 26877, 27213, 27187, 26801, 26088, 25103, 23914, 22592, 21202, 19801, 18429, 17116, 15881, 14735, 13682, 12720, 11846, 11055, 10341, 9697, 9117, 8595, 8125, 7703, 7322, 6979, 6671, 6393, 6143, 5918, 5716, 5648, 5486, 5342, 5213, 5099, 4998, 4909, 4832, 4766, 4710, 4663, 4626, 4597, 4576, 4564, 4559, 4562, 4572, 4589, 4614, 4645, 4684, 4730, 4783, 4844, 4912, 4988, 5072, 5165, 5266, 5376, 5495, 5625, 5765, 5915, 6078, 6254, 6442, 6646, 6864, 7099, 7352, 7625, 7918, 8235, 8576, 8944, 9342, 9773, 10239, 10744, 11293, 11889, 12538, 13246, 14018, 14863]
812.5793A5788J015J115J227J351J490J645J816K007K216K444K689K951D0973
789.0107D4462L742L963M120M184M116L877L443K797J957R66j03j162G4234
765.4421G1305l532l923m123m160m075l900l672l412l142k873k616k372B7296
741.8735B5355j755j587j434j298j176j065r67q79p99p27o63o04n51A1347
716.6214A0888m19l83l49l18k89k62k38k14j93j72j52j34j15r8q1o5G358
686.3189G326j6%J7L4N1P0Q8J08J29J51J75K01K28K58K91L27L67M10A0672
652.6495A1183N70O35P06P87Q75R70J076J189J307J431J554J671J772B7571
627.3974B9446J847J743J550J263Q87M46l2n05r35j293j560j732j819B7473
$$ y = [15788, 16803, 17918, 19145, 20496, 21986, 23631, 25447, 27454, 29670, 32114, 34803, 37754, 40973, 44462, 48204, 52167, 56287, 60471, 64587, 68464, 71907, 74704, 76661, 77627, 77524, 76362, 74234, 71305, 67773, 63850, 59727, 55567, 51492, 47592, 43920, 40508, 37366, 34493, 31877, 29505, 27296, 25355, 23600, 22013, 20579, 19281, 18105, 17040, 16073, 15194, 14395, 13668, 13005, 12401, 11850, 11347, 10888, 10469, 10086, 9737, 9419, 9130, 8868, 8630, 8416, 8223, 8051, 7899, 7765, 7650, 7552, 7471, 7406, 7358, 7326, 7310, 7310, 7327, 7361, 7412, 7482, 7570, 7678, 7807, 7958, 8133, 8334, 8562, 8820, 9111, 9438, 9805, 10215, 10672, 11183, 11753, 12388, 13094, 13881, 14756, 15726, 16802, 17991, 19298, 20729, 22283, 23954, 25726, 27571, 29446, 31293, 33036, 34586, 35849, 36736, 37182, 37150, 36645, 35710, 34417, 32857, 31125, 29306, 27473]
602.1453B5683j708j601j481j355j229j109r94q87p55o98o15n39m69A1838
576.89325A1493k91k39j91j45j00n7j5K7O8J12J55J37K48L00L52M11M72A3278
544.9073A3893O95P85Q84R91J109J240J379J531J690J854K018K172K307C4952
519.6552C7396K404K265K007J622J122N31j07p39j314j793k152k385C6353
496.08658C3828k473k369k231k076j914j753j598j453j319j195j084r83A2488
472.51797A1677p37o73o13n61n14m72m33l99l69l40l15k92k71k52k35D982
443.89896D778j92j79j68j58j49j40j32j24j17j11j06r9r4r0q5q1p7p3B533
410.22952B467o4o0n8n5n3n1m8m6m5m2m1l9l8l6l4l3l2l1k9Tk7k6k5k14A290
$$ y = [25683, 23975, 22374, 20893, 19538, 18309, 17200, 16206, 15319, 14564, 13866, 13251, 12712, 12243, 11838, 11493, 11202, 10963, 10772, 10627, 10527, 10470, 10455, 10482, 10550, 10662, 10817, 10954, 11202, 11502, 11854, 12265, 12737, 13278, 13893, 14588, 15373, 16257, 17248, 18357, 19597, 20976, 22507, 24197, 26051, 28069, 30241, 32548, 34952, 37396, 39800, 42065, 44072, 45694, 46816, 47347, 47240, 46501, 45187, 43394, 41242, 38857, 36353, 33828, 31355, 28986, 26755, 24679, 22765, 21012, 19414, 17961, 16642, 15447, 14363, 13380, 12488, 11677, 10940, 10267, 9654, 9093, 8579, 8107, 7674, 7275, 6906, 6566, 6251, 5959, 5688, 5436, 5201, 4982, 4778, 4586, 4407, 4239, 4081, 3932, 3792, 3660, 3536, 3419, 3308, 3202, 3103, 3009, 2919, 2834, 2753, 2676, 2603, 2533, 2467, 2403, 2343, 2285, 2230, 2177, 2126, 2078, 2032, 1987, 1945, 1904, 1865, 1827, 1791, 1757, 1724, 1692, 1661, 1632, 1603, 1576, 1550, 1525, 1311, 1290]
366.45926A269k0j9j8Tj7j6j5Tj4j3Tj2Tj1j0TrTqpUonUlmlkjU%JTKTMI66
297.43692I71NOPQRTJ0J2TJ4J5J6J7J9K0K2K3K6K7K9L2L4L7L9M3M6M9A611
248.61623A669O2O8P4P9Q7R4J02J12J22J33J46J61J76J93K13K36K59K87D590
214.9468D856L88M28M72N17N65O12O57O96P23P35P22O81O04M90L41J67A3632
184.6443A3424l79n20o27o95p31p38p23o92o51o07n58n12m66m23l84D370
156.02528D055k86k59k35k14j94j78j62j48j36j25j14j06r8r0q3p8p2A410
124.039314A348n9n4n1m8m5m2l9l8l5j46l0k9k7k6k4k3k2k1k0j9j7Uj5D69
80.26905D55j4j3j2Tj1Uj0rVqUpVoVnonVmnmWlmTlVmklUklTkTA36
$$ y = [1269, 1249, 1230, 1212, 1194, 1177, 1161, 1146, 1131, 1117, 1104, 1091, 1079, 1067, 1056, 1046, 1036, 1027, 1018, 1010, 1003, 996, 989, 983, 978, 973, 968, 965, 961, 958, 956, 955, 954, 953, 953, 954, 955, 957, 959, 963, 966, 971, 976, 982, 989, 997, 1006, 1015, 1025, 1037, 1049, 1063, 1078, 1094, 1111, 1130, 1150, 1172, 1195, 1221, 1248, 1277, 1309, 1343, 1380, 1419, 1462, 1508, 1557, 1611, 1669, 1731, 1799, 1873, 1952, 2039, 2133, 2235, 2347, 2469, 2602, 2748, 2909, 3085, 3278, 3491, 3727, 3986, 4273, 4590, 4856, 5244, 5672, 6144, 6661, 7226, 7838, 8495, 9191, 9914, 10649, 11371, 12052, 12656, 13146, 13487, 13654, 13632, 13424, 13045, 12525, 11898, 11203, 10472, 9734, 9011, 8319, 7668, 7061, 6503, 5991, 5525, 5102, 4718, 4370, 4055, 3769, 3510, 3275, 3061, 2867, 2689, 2527, 2379, 2243, 2118, 2004, 1898, 1800, 1710, 1627, 1549, 1477, 1410, 1348, 1289, 1235, 1184, 1136, 1091, 1049, 1010, 972, 937, 791, 761, 732, 705, 679, 655, 632, 610, 589, 569, 550, 533, 516, 499, 484, 469, 455, 441, 428, 416, 404, 393, 382, 371, 361, 352, 343, 334, 325, 317, 309, 301, 294, 287, 280, 273, 267, 261, 255, 249, 244, 238, 233, 228, 223, 218, 214, 209, 205, 201, 197, 193, 189, 186, 182, 178, 175, 172, 169, 166, 162, 160, 157, 154, 151, 149, 146, 143, 141, 139, 136]
-12.3219A34  $$checkpoint
##END=$$ End of the RAMAN for cis-DCE
##TITLE= trans-1,2-dichloroethene (E)
##JCAMP-DX= 5.01
##DATA TYPE= INFRARED SPECTRUM
##DATA CLASS= XYDATA
##BLOCK ID=3
##ORIGIN= Department of Chemistry, UWI, JAMAICA
##OWNER= public domain
##LONGDATE= 2012/02/18 12:32:26.0301 -0500 $$ export date from JSpecView
##SPECTROMETER/DATA SYSTEM= from scan
##$MODELS=
<Models>
<ModelData id="tDCE" type="MOL">
trans-1,2-dichloroethylene (E)
__Jmol-14_02171520503D 1   1.00000     0.00000     0
Jmol version 14.3.12_2015.02.11  2015-02-11 19:15 EXTRACT: ({0:5})
  6  5  0  0  0  0              1 V2000
  -0.36431   0.56175   0.00000 C   0  0  0  0  0  0
   0.36431  -0.56175   0.00000 C   0  0  0  0  0  0
  -0.36431  -2.12076   0.00000 Cl  0  0  0  0  0  0
   1.46636  -0.58339   0.00000 H   0  0  0  0  0  0
  -1.46636   0.58339   0.00000 H   0  0  0  0  0  0
   0.36431   2.12076   0.00000 Cl  0  0  0  0  0  0
  1  6  1  0  0  0
  1  2  2  0  0  0
  2  4  1  0  0  0
  3  2  1  0  0  0
  5  1  1  0  0  0
M  END
</ModelData>
<ModelData id="T1" type="XYZVIB" baseModel="tDCE" vibrationScale=".5">
6
Model[1]: PATH=Calculation 1;Input;Convg=0.6909D-08;-V/T=2.0006;Energy=NaN;Range=M.O.s;E(RHF)=-995.827950206 A.U.;PATH=Calculation 1;Input
C       0.00000      0.00000      0.00000
C       0.00000      0.00000      1.33908
Cl      1.45962      0.00000      2.25063
H      -0.91285      0.00000      1.95689
H       0.91285      0.00000     -0.61781
Cl     -1.45962      0.00000     -0.91155
6
Model[2]: PATH=Calculation 1;Standard;Convg=0.6909D-08;-V/T=2.0006;Energy=-995.82794;Range=M.O.s;E(RHF)=-995.827950206 A.U.;PATH=Calculation 1;Standard
C      -0.36431      0.56175      0.00000
C       0.36431     -0.56175      0.00000
Cl     -0.36431     -2.12076      0.00000
H       1.46636     -0.58339      0.00000
H      -1.46636      0.58339      0.00000
Cl      0.36431      2.12076      0.00000
6
Model[3]: IRIntensity=0.9482 KM/Mole;PATH=Calculation 1;FrequenciesFrequencies;ReducedMass=8.2119 AMU;ForceConstant=0.2553 mDyne/A;FreqValue=229.7041;Frequency=229.7041 cm^-1;FrequencyLabel=AU;PATH=Calculation 1;FrequenciesFrequencies
C      -0.36431      0.56175      0.00000      0.00000      0.00000      0.48000
C       0.36431     -0.56175      0.00000      0.00000      0.00000      0.48000
Cl     -0.36431     -2.12076      0.00000      0.00000      0.00000     -0.18001
H       1.46636     -0.58339      0.00000      0.00000      0.00000      0.49001
H      -1.46636      0.58339      0.00000      0.00000      0.00000      0.49001
Cl      0.36431      2.12076      0.00000      0.00000      0.00000     -0.18001
6
Model[4]: IRIntensity=4.5756 KM/Mole;PATH=Calculation 1;FrequenciesFrequencies;ReducedMass=6.7769 AMU;ForceConstant=0.2730 mDyne/A;FreqValue=261.4711;Frequency=261.4711 cm^-1;FrequencyLabel=BU;PATH=Calculation 1;FrequenciesFrequencies
C      -0.36431      0.56175      0.00000      0.39000     -0.16000      0.00000
C       0.36431     -0.56175      0.00000      0.39000     -0.16000      0.00000
Cl     -0.36431     -2.12076      0.00000     -0.15001      0.07000      0.00000
H       1.46636     -0.58339      0.00000      0.39000     -0.37000      0.00000
H      -1.46636      0.58339      0.00000      0.39000     -0.37000      0.00000
Cl      0.36431      2.12076      0.00000     -0.15001      0.07000      0.00000
6
Model[5]: IRIntensity=0.0000 KM/Mole;PATH=Calculation 1;FrequenciesFrequencies;ReducedMass=21.5344 AMU;ForceConstant=1.8876 mDyne/A;FreqValue=385.7165;Frequency=385.7165 cm^-1;FrequencyLabel=AG;PATH=Calculation 1;FrequenciesFrequencies
C      -0.36431      0.56175      0.00000     -0.17000     -0.17000      0.00000
C       0.36431     -0.56175      0.00000      0.17000      0.17000      0.00000
Cl     -0.36431     -2.12076      0.00000      0.06000      0.53000      0.00000
H       1.46636     -0.58339      0.00000      0.18001      0.36001      0.00000
H      -1.46636      0.58339      0.00000     -0.18001     -0.36001      0.00000
Cl      0.36431      2.12076      0.00000     -0.06000     -0.53000      0.00000
6
Model[6]: IRIntensity=145.4250 KM/Mole;PATH=Calculation 1;FrequenciesFrequencies;ReducedMass=9.0780 AMU;ForceConstant=4.3937 mDyne/A;FreqValue=906.3509;Frequency=906.3509 cm^-1;FrequencyLabel=BU;PATH=Calculation 1;FrequenciesFrequencies
C      -0.36431      0.56175      0.00000      0.21000      0.46001      0.00000
C       0.36431     -0.56175      0.00000      0.21000      0.46001      0.00000
Cl     -0.36431     -2.12076      0.00000     -0.08000     -0.17000      0.00000
H       1.46636     -0.58339      0.00000      0.21000      0.40000      0.00000
H      -1.46636      0.58339      0.00000      0.21000      0.40000      0.00000
Cl      0.36431      2.12076      0.00000     -0.08000     -0.17000      0.00000
6
Model[7]: IRIntensity=0.0000 KM/Mole;PATH=Calculation 1;FrequenciesFrequencies;ReducedMass=4.7852 AMU;ForceConstant=2.6377 mDyne/A;FreqValue=967.2547;Frequency=967.2547 cm^-1;FrequencyLabel=AG;PATH=Calculation 1;FrequenciesFrequencies
C      -0.36431      0.56175      0.00000      0.33001      0.19000      0.00000
C       0.36431     -0.56175      0.00000     -0.33001     -0.19000      0.00000
Cl     -0.36431     -2.12076      0.00000      0.06000      0.06000      0.00000
H       1.46636     -0.58339      0.00000     -0.34000     -0.48000      0.00000
H      -1.46636      0.58339      0.00000      0.34000      0.48000      0.00000
Cl      0.36431      2.12076      0.00000     -0.06000     -0.06000      0.00000
6
Model[8]: IRIntensity=0.0000 KM/Mole;PATH=Calculation 1;FrequenciesFrequencies;ReducedMass=1.8463 AMU;ForceConstant=1.1155 mDyne/A;FreqValue=1012.6580;Frequency=1012.6580 cm^-1;FrequencyLabel=BG;PATH=Calculation 1;FrequenciesFrequencies
C      -0.36431      0.56175      0.00000      0.00000      0.00000     -0.19000
C       0.36431     -0.56175      0.00000      0.00000      0.00000      0.19000
Cl     -0.36431     -2.12076      0.00000      0.00000      0.00000     -0.01000
H       1.46636     -0.58339      0.00000      0.00000      0.00000     -0.68000
H      -1.46636      0.58339      0.00000      0.00000      0.00000      0.68000
Cl      0.36431      2.12076      0.00000      0.00000      0.00000      0.01000
6
Model[9]: IRIntensity=71.3035 KM/Mole;PATH=Calculation 1;FrequenciesFrequencies;ReducedMass=1.0871 AMU;ForceConstant=0.8649 mDyne/A;FreqValue=1162.0574;Frequency=1162.0574 cm^-1;FrequencyLabel=AU;PATH=Calculation 1;FrequenciesFrequencies
C      -0.36431      0.56175      0.00000      0.00000      0.00000      0.06000
C       0.36431     -0.56175      0.00000      0.00000      0.00000      0.06000
Cl     -0.36431     -2.12076      0.00000      0.00000      0.00000      0.00000
H       1.46636     -0.58339      0.00000      0.00000      0.00000     -0.70000
H      -1.46636      0.58339      0.00000      0.00000      0.00000     -0.70000
Cl      0.36431      2.12076      0.00000      0.00000      0.00000      0.00000
6
Model[10]: IRIntensity=25.0309 KM/Mole;PATH=Calculation 1;FrequenciesFrequencies;ReducedMass=1.1050 AMU;ForceConstant=1.3205 mDyne/A;FreqValue=1424.1223;Frequency=1424.1223 cm^-1;FrequencyLabel=BU;PATH=Calculation 1;FrequenciesFrequencies
C      -0.36431      0.56175      0.00000      0.02000     -0.06000      0.00000
C       0.36431     -0.56175      0.00000      0.02000     -0.06000      0.00000
Cl     -0.36431     -2.12076      0.00000     -0.01000      0.00000      0.00000
H       1.46636     -0.58339      0.00000      0.04000      0.70000      0.00000
H      -1.46636      0.58339      0.00000      0.04000      0.70000      0.00000
Cl      0.36431      2.12076      0.00000     -0.01000      0.00000      0.00000
6
Model[11]: IRIntensity=0.0000 KM/Mole;PATH=Calculation 1;FrequenciesFrequencies;ReducedMass=1.3166 AMU;ForceConstant=1.6333 mDyne/A;FreqValue=1451.0326;Frequency=1451.0326 cm^-1;FrequencyLabel=AG;PATH=Calculation 1;FrequenciesFrequencies
C      -0.36431      0.56175      0.00000     -0.11000      0.05000      0.00000
C       0.36431     -0.56175      0.00000      0.11000     -0.05000      0.00000
Cl     -0.36431     -2.12076      0.00000      0.01000      0.00000      0.00000
H       1.46636     -0.58339      0.00000      0.11000     -0.69000      0.00000
H      -1.46636      0.58339      0.00000     -0.11000      0.69000      0.00000
Cl      0.36431      2.12076      0.00000     -0.01000      0.00000      0.00000
6
Model[12]: IRIntensity=0.0000 KM/Mole;PATH=Calculation 1;FrequenciesFrequencies;ReducedMass=4.0894 AMU;ForceConstant=7.3480 mDyne/A;FreqValue=1746.3394;Frequency=1746.3394 cm^-1;FrequencyLabel=AG;PATH=Calculation 1;FrequenciesFrequencies
C      -0.36431      0.56175      0.00000     -0.12000      0.35000      0.00000
C       0.36431     -0.56175      0.00000      0.12000     -0.35000      0.00000
Cl     -0.36431     -2.12076      0.00000      0.00000      0.01000      0.00000
H       1.46636     -0.58339      0.00000      0.22000      0.56000      0.00000
H      -1.46636      0.58339      0.00000     -0.22000     -0.56000      0.00000
Cl      0.36431      2.12076      0.00000      0.00000     -0.01000      0.00000
6
Model[13]: IRIntensity=16.1874 KM/Mole;PATH=Calculation 1;FrequenciesFrequencies;ReducedMass=1.0862 AMU;ForceConstant=6.3251 mDyne/A;FreqValue=3143.7315;Frequency=3143.7315 cm^-1;FrequencyLabel=BU;PATH=Calculation 1;FrequenciesFrequencies
C      -0.36431      0.56175      0.00000      0.06000      0.00000      0.00000
C       0.36431     -0.56175      0.00000      0.06000      0.00000      0.00000
Cl     -0.36431     -2.12076      0.00000      0.00000      0.00000      0.00000
H       1.46636     -0.58339      0.00000     -0.70000      0.02000      0.00000
H      -1.46636      0.58339      0.00000     -0.70000      0.02000      0.00000
Cl      0.36431      2.12076      0.00000      0.00000      0.00000      0.00000
6
Model[14]: IRIntensity=0.0000 KM/Mole;PATH=Calculation 1;FrequenciesFrequencies;ReducedMass=1.1058 AMU;ForceConstant=6.4534 mDyne/A;FreqValue=3147.1884;Frequency=3147.1884 cm^-1;FrequencyLabel=AG;PATH=Calculation 1;FrequenciesFrequencies
C      -0.36431      0.56175      0.00000      0.07000     -0.01000      0.00000
C       0.36431     -0.56175      0.00000     -0.07000      0.01000      0.00000
Cl     -0.36431     -2.12076      0.00000      0.00000      0.00000      0.00000
H       1.46636     -0.58339      0.00000      0.70000     -0.02000      0.00000
H      -1.46636      0.58339      0.00000     -0.70000      0.02000      0.00000
Cl      0.36431      2.12076      0.00000      0.00000      0.00000      0.00000
</ModelData>
</Models>
##$PEAKS=
<Peaks type="IR" xUnitsExpected="1/cm"  >
<PeakData id="2" title="2 (~3150 cm-1)" peakShape="broad" model="T1.13" xMax="3150" xMin="3120"    />
<PeakData id="5" title="5 (~1205 cm-1)" peakShape="broad" model="T1.10" xMax="1435" xMin="1405"    />
<PeakData id="6" title="6 (~900 cm-1)" peakShape="broad" model="T1.9" xMax="1180" xMin="1150"    />
<PeakData id="9" title="9 (~830 cm-1)" peakShape="broad" model="T1.6" xMax="925" xMin="895"    />
<PeakData id="11" title="11 (~265 cm-1)" peakShape="broad" model="T1.4" xMax="295" xMin="245"    />
<PeakData id="12" title="12 (~192 cm-1)" peakShape="broad" model="T1.3" xMax="245" xMin="210"    />
</Peaks>
##XUNITS= 1/CM
##YUNITS= TRANSMITTANCE
##XFACTOR= 1
##YFACTOR= 9.999000E-07
##FIRSTX= 3.599813E+03
##FIRSTY= 1
##LASTX= 9.734400
##NPOINTS= 2140
##MINY= 1.000000E-04
##MAXY= 1
##XYDATA= (X++(Y..Y))
3599.8127A000100%S93p118j83j90j98k06k14k23k32k42k53k63k75k87I89915
3250.7075I89601l28l45l60l79l97m18m39m62m86n13n41n71o04o40o77I81723
3222.1748I80961q10q62r18r80j047j121j200j288j384j490j607j736I64638
3198.6775I62599k215k414k635k883l163l479l836m244m707n238n847I15389
3176.8584I08029q303r398j0677j2174j3928j5986j8396k1211k4472k8206G12888
3156.7175F75972m1533m5766m8855m9749m7268m0484k9206j4292K497C80272
3138.2554D13224M2951M8411M9784M8124M4603M0191L5564L1119K7061H04499
3119.793H24839J7649J5348J3384J1710J0280R059Q011P110O333N659I34456
3099.6523I39021M118L727L382L078K807K567K353K162J990J836J697I70310
$$ y = [989601, 989273, 988928, 988568, 988189, 987792, 987374, 986935, 986473, 985987, 985474, 984933, 984362, 983758, 983118, 982441, 981723, 980961, 980151, 979289, 978371, 977391, 976344, 975223, 974023, 972735, 971351, 969861, 968254, 966518, 964638, 962599, 960384, 957970, 955335, 952452, 949289, 945810, 941974, 937730, 933023, 927785, 921938, 915389, 908029, 899726, 890328, 879651, 867477, 853549, 837563, 819167, 797956, 773484, 745278, 712888, 675972, 634439, 588673, 539818, 490069, 442801, 402317, 373111, 358819, 361316, 380272, 413224, 456175, 504586, 554370, 602494, 647097, 687288, 722852, 753971, 781032, 804499, 824839, 842488, 857836, 871220, 882930, 893210, 902269, 910280, 917390, 923723, 929382, 934456, 939021, 943139, 946866, 950248, 953326, 956133, 958700, 961053, 963215, 965205, 967041, 968738, 970310]
3077.8333I71768J355J261J176J098J027R61R02Q46P96P49P05O66O28I84533
3052.6575I85095N32N05M79M55M33M11L92L73L56L40L24L10K96K84K71I91116
$$ y = [971768, 973123, 974384, 975560, 976658, 977685, 978646, 979548, 980394, 981190, 981939, 982644, 983310, 983938, 984533, 985095, 985627, 986132, 986611, 987066, 987499, 987910, 988302, 988675, 989031, 989371, 989695, 990005, 990301, 990585, 990856, 991116]
3024.1248I91366K39K29K20K12K04J95J88J82P065%Z65j0987k82k93l05I87916
1547.1406I87586l43l57l73l88m06m23m41m62m83n06n29n54n82o11o41I79813
1518.6079I79104p47p87q29q77r26r79j037j099j167j240j318j404j497I63598
1493.4321I61889j830j962k108k267k444k637k851l090l354l648l977I27376
1471.613I22617n224n749o343p019p787q664r669j0823j2149j3679j5446H02579
1449.794G82737k2555k5667k9205l3172l7527m2145m6772n0975n4093C85370
1431.3317C31847m8178l9093k6908j2760K210J7045L0743M2123N0143D01555
1412.8693D56728N3339M9819M5435M0774L6214L1965K8121K4711K1719H07941
1394.407H24797J4900J3208J1740J0467R360Q394P551O812O161N588I24059
$$ y = [987586, 987243, 986886, 986513, 986125, 985719, 985296, 984855, 984393, 983910, 983404, 982875, 982321, 981739, 981128, 980487, 979813, 979104, 978357, 977570, 976741, 975864, 974938, 973959, 972922, 971823, 970656, 969416, 968098, 966694, 965197, 963598, 961889, 960059, 958097, 955989, 953722, 951278, 948641, 945790, 942700, 939346, 935698, 931721, 927376, 922617, 917393, 911644, 905301, 898282, 890495, 881831, 872162, 861339, 849190, 835511, 820065, 802579, 782737, 760182, 734515, 705310, 672138, 634611, 592466, 545694, 494719, 440626, 385370, 331847, 283669, 244576, 217668, 204908, 207118, 224163, 254906, 297029, 347172, 401555, 456728, 510067, 559886, 605321, 646095, 682309, 714274, 742395, 767106, 788825, 807941, 824797, 839697, 852905, 864645, 875112, 884472, 892866, 900417, 907229, 913390, 918978, 924059]
1374.2664I28692M232L877L559L273L017K787K578K389K219K064J922I62403
1352.4473I64079J567J469J379J294J218J146J081J019R64R10Q63Q17I78580
1328.9497I79316O98O65O32O01N74N47N22M99M76M56M36M18M00L84L68I87345
1300.4171I87684L26L14L01j1908m569m635q50q83r18r55r94j035j078I59676
1275.2412I58503j224j278j335j397j461j529j602j680j762j850j944I39398
1253.4221I37247k265k387k519k659k810k974l148l337l541l761m000H99588
1231.603H95050m843n174n535n929o360o831p347p914q537r223r979H06565
1209.784G94831j2753j3881j5130j6513j8044j9737k1606k3663k5918E99213
$$ y = [928692, 932924, 936801, 940360, 943633, 946650, 949437, 952015, 954404, 956623, 958687, 960609, 962403, 964079, 965646, 967115, 968494, 969788, 971006, 972152, 973233, 974252, 975216, 976126, 976989, 977806, 978580, 979316, 980014, 980679, 981311, 981912, 982486, 983033, 983555, 984054, 984530, 984986, 985422, 985840, 986240, 986624, 986992, 987345, 987684, 988010, 988324, 988625, 976717, 972148, 967513, 966663, 965780, 964862, 963907, 962913, 961878, 960800, 959676, 958503, 957279, 956001, 954666, 953269, 951808, 950279, 948677, 946997, 945235, 943385, 941441, 939398, 937247, 934982, 932595, 930076, 927417, 924607, 921633, 918485, 915148, 911607, 907846, 903846, 899588, 895050, 890207, 885033, 879498, 873569, 867209, 860378, 853031, 845117, 836580, 827357, 817378, 806565, 794831, 782078, 768197, 753067, 736554, 718510, 698773, 677167, 653504, 627586, 599213]
1191.3217E68194l3838l6780l9767m2674m5312m7424m8674m8666m7003A34656
1172.8594I6821l0722k2928j5557r514n114k053L39K848O243J1119J7615G4318
1151.0403A07244L9657M4667M7683M8823M8419M6877M4580M1839L8892E44588
1132.578E77583L0224K7631K5236K3039K1039J9222J7578J6093J4750G85933
1114.1157G98376J1454J0560R749R015Q348P742P191O688O229N810N426H91662
1092.2966H96412M454M180L927L695L480L280L096K924K765K617K479I35659
1070.4775I37890K118K014J915J824J737J657J580J509J442J020%Xo31I55048
1038.5881I54240o831p736l881n454j697j723j193k029k111k198k289I14711
$$ y = [568194, 534356, 497576, 457809, 415135, 369823, 322399, 273725, 225059, 178056, 134656, 96821, 66099, 43171, 27614, 18100, 12986, 10933, 11272, 14120, 20363, 31482, 49097, 74318, 107244, 146901, 191568, 239251, 288074, 336493, 383370, 427950, 469789, 508681, 544588, 577583, 607807, 635438, 660674, 683713, 704752, 723974, 741552, 757645, 772395, 785933, 798376, 809830, 820390, 830139, 839154, 847502, 855244, 862435, 869123, 875352, 881162, 886588, 891662, 896412, 900866, 905046, 908973, 912668, 916148, 919428, 922524, 925448, 928213, 930830, 933309, 935659, 937890, 940008, 942022, 943937, 945761, 947498, 949155, 950735, 952244, 953686, 954706, 954706, 954706, 954706, 954706, 954706, 954706, 954075, 955048, 954240, 947409, 939673, 935792, 930338, 928641, 926918, 925725, 923696, 921585, 919387, 917098, 914711]
1016.76904I12222k597k711k832k961l096l239l393l554l727l910m104H71785
994.94995H67252m770n022n291n579n888o218o572o951p360p797q269G88759
973.13086G79438r910j0543j1226j1964j2757j3615j4539j5534j6606F44987
954.6686F25994k0314k1722k3216k4791k6436k8137k9868l1594l3265C51838
936.20624C15691l7157l7702l7626l6761l4953l2101k8207k3432j8138A6752
917.74396H548m623k279r84l82j38m2OO3J87N09J275K844N547R474J4373E4095
889.2113G9002K9452L3049L5589L7106L7723L7599L6902L5783L4376D29365
870.749D60456K9359K7633K5947K4320K2769K1300J9918J8621J7411F84017
$$ y = [912222, 909625, 906914, 904082, 901121, 898025, 894786, 891393, 887839, 884112, 880202, 876098, 871785, 867252, 862482, 857460, 852169, 846590, 840702, 834484, 827912, 820961, 813601, 805804, 797535, 788759, 779438, 769528, 758985, 747759, 735795, 723038, 709423, 694884, 679350, 662744, 644987, 625994, 605680, 583958, 560742, 535951, 509515, 481378, 451510, 419916, 386651, 351838, 315691, 278534, 240832, 203206, 166445, 131492, 99391, 71184, 47752, 29614, 16752, 8548, 3925, 1646, 662, 280, 142, 100, 106, 169, 356, 865, 2140, 4984, 10531, 20005, 34378, 54095, 79002, 108454, 141503, 177092, 214198, 251921, 289520, 326422, 362205, 396581, 429365, 460456, 489815, 517448, 543395, 567715, 590484, 611784, 631702, 650323, 667734, 684017]
852.2867F99251J4260J3357J2518J1741J1021J0352R733R157Q623Q127H15805
832.146H23042O837O466O118N795N493N210M946M699M467M250M047H85224
810.3269H88899L506L347L197L055K922K796K677K565K458K358K262I22214
$$ y = [699251, 713511, 726868, 739386, 751127, 762148, 772500, 782233, 791390, 800013, 808140, 815805, 823042, 829879, 836345, 842463, 848258, 853751, 858961, 863907, 868606, 873073, 877323, 881370, 885224, 888899, 892405, 895752, 898949, 902004, 904926, 907722, 910399, 912964, 915422, 917780, 920042, 922214]
788.5079I24300K005J928J854J784J718J655J595J537O1724%T26k017I98031
389.05078I97976n6n8o1o4o6o8p2p5p8q2q6q9r4r8j03j08n30j30j36j44I95627
352.12616I95468j67j77j87j98k09k22k35k50k65k83l02l22l44l69l95I91118
323.59354I90661m93n33n76o25o79p40q08q85r71j069j179j307j452j619I75914
296.73926I73879k296k600k959l383l886m486n204o067p106q355r852I06054
274.9202H92344j6062j8579k0999k2828k3298k1462j6569q664J001J0312G72516
254.7795G93664K2051K0900J8606J5850J3039J0368P906N660L623J808I13767
234.6388I13000j133n85Q97K977N043O528P200P160O661N947N185M466I67172
211.14133I70451K816K429K106J836J609J418J257J119J001Q99Q12P35I89157
$$ y = [997976, 997920, 997862, 997801, 997737, 997671, 997603, 997531, 997456, 997378, 997296, 997210, 997121, 997027, 996929, 996826, 996718, 996188, 996058, 995922, 995778, 995627, 995468, 995301, 995124, 994937, 994739, 994530, 994308, 994073, 993823, 993558, 993275, 992973, 992651, 992307, 991938, 991543, 991118, 990661, 990168, 989635, 989059, 988434, 987755, 987015, 986207, 985322, 984351, 983282, 982103, 980796, 979344, 977725, 975914, 973879, 971583, 968983, 966024, 962641, 958755, 954269, 949065, 942998, 935892, 927537, 917685, 906054, 892344, 876282, 857703, 836704, 813876, 790578, 769116, 752547, 743883, 744884, 755196, 772516, 793664, 815715, 836615, 855221, 871071, 884110, 894478, 902384, 908044, 911667, 913475, 913767, 913000, 911867, 911282, 912179, 915156, 920199, 926727, 933927, 941087, 947748, 953695, 958880, 963346, 967172, 970451, 973267, 975696, 977802, 979638, 981247, 982665, 983922, 985041, 986042, 986941, 987753, 988488, 989157]
187.64384I89766N58N12M71M35M01L73L46L22L00K81K62K46K31K18K04I95119
159.1112I95301J71J63J54J46J39J31J25J19J14J08J03R9R4R0Q6Q3P9I97381
127.22177I99405K2K1K0J9TJ7TJ6J5TJ4TJ3J2UJ1TM15%V9A000100
$$ y = [989766, 990324, 990836, 991307, 991742, 992143, 992516, 992862, 993184, 993484, 993765, 994027, 994273, 994504, 994722, 994926, 995119, 995301, 995472, 995635, 995789, 995935, 996074, 996205, 996330, 996449, 996563, 996671, 996774, 996873, 996967, 997057, 997143, 997226, 997305, 997381, 999405, 999427, 999448, 999468, 999487, 999506, 999523, 999540, 999556, 999571, 999586, 999600, 999614, 999627, 999639, 999651, 999663, 999674, 999685, 1000100, 1000100, 1000100, 1000100, 1000100, 1000100, 1000100, 1000100, 1000100, 1000100, 1000100, 1000100, 1000100, 1000100, 1000100, 1000100, 1000100, 1000100, 1000100, 1000100, 1000100, 1000100, 1000100, 1000100, 1000100, 1000100, 1000100, 1000100, 1000100, 1000100, 1000100, 1000100, 1000100, 1000100, 1000100, 1000100, 1000100, 1000100, 1000100, 1000100, 1000100, 1000100, 1000100, 1000100, 1000100, 1000100, 1000100, 1000100, 1000100, 1000100, 1000100]
9.7344A000100  $$checkpoint
##END= $$ end of trans-DCE IR
##TITLE=Raman of trans-1,2-dichloroethylene (E) $$ Begin of the data block
##JCAMP-DX=5.00 $$ ACD/DocManager Library v 5.00
##DATA TYPE=RAMAN SPECTRUM
##DATA CLASS=XYDATA
##BLOCK ID=4
##DATE=19 Feb 2012 10:30:00
##ORIGIN= Department of Chemistry, UWI, Jamaica
##OWNER= public domain
##SPECTROMETER/DATA SYSTEM=from scan
##$MODELS=
<Models>
<ModelData id="tDCE" type="MOL">
trans-1,2-dichloroethylene (E)
__Jmol-14_02171520503D 1   1.00000     0.00000     0
Jmol version 14.3.12_2015.02.11  2015-02-11 19:15 EXTRACT: ({0:5})
  6  5  0  0  0  0              1 V2000
  -0.36431   0.56175   0.00000 C   0  0  0  0  0  0
   0.36431  -0.56175   0.00000 C   0  0  0  0  0  0
  -0.36431  -2.12076   0.00000 Cl  0  0  0  0  0  0
   1.46636  -0.58339   0.00000 H   0  0  0  0  0  0
  -1.46636   0.58339   0.00000 H   0  0  0  0  0  0
   0.36431   2.12076   0.00000 Cl  0  0  0  0  0  0
  1  6  1  0  0  0
  1  2  2  0  0  0
  2  4  1  0  0  0
  3  2  1  0  0  0
  5  1  1  0  0  0
M  END
</ModelData>
<ModelData id="T2" type="XYZVIB" baseModel="tDCE" vibrationScale=".5">
6
Model[1]: PATH=Calculation 1;Input;Convg=0.6909D-08;-V/T=2.0006;Energy=NaN;Range=M.O.s;E(RHF)=-995.827950206 A.U.;PATH=Calculation 1;Input
C       0.00000      0.00000      0.00000
C       0.00000      0.00000      1.33908
Cl      1.45962      0.00000      2.25063
H      -0.91285      0.00000      1.95689
H       0.91285      0.00000     -0.61781
Cl     -1.45962      0.00000     -0.91155
6
Model[2]: PATH=Calculation 1;Standard;Convg=0.6909D-08;-V/T=2.0006;Energy=-995.82794;Range=M.O.s;E(RHF)=-995.827950206 A.U.;PATH=Calculation 1;Standard
C      -0.36431      0.56175      0.00000
C       0.36431     -0.56175      0.00000
Cl     -0.36431     -2.12076      0.00000
H       1.46636     -0.58339      0.00000
H      -1.46636      0.58339      0.00000
Cl      0.36431      2.12076      0.00000
6
Model[3]: IRIntensity=0.9482 KM/Mole;PATH=Calculation 1;FrequenciesFrequencies;ReducedMass=8.2119 AMU;ForceConstant=0.2553 mDyne/A;FreqValue=229.7041;Frequency=229.7041 cm^-1;FrequencyLabel=AU;PATH=Calculation 1;FrequenciesFrequencies
C      -0.36431      0.56175      0.00000      0.00000      0.00000      0.48000
C       0.36431     -0.56175      0.00000      0.00000      0.00000      0.48000
Cl     -0.36431     -2.12076      0.00000      0.00000      0.00000     -0.18001
H       1.46636     -0.58339      0.00000      0.00000      0.00000      0.49001
H      -1.46636      0.58339      0.00000      0.00000      0.00000      0.49001
Cl      0.36431      2.12076      0.00000      0.00000      0.00000     -0.18001
6
Model[4]: IRIntensity=4.5756 KM/Mole;PATH=Calculation 1;FrequenciesFrequencies;ReducedMass=6.7769 AMU;ForceConstant=0.2730 mDyne/A;FreqValue=261.4711;Frequency=261.4711 cm^-1;FrequencyLabel=BU;PATH=Calculation 1;FrequenciesFrequencies
C      -0.36431      0.56175      0.00000      0.39000     -0.16000      0.00000
C       0.36431     -0.56175      0.00000      0.39000     -0.16000      0.00000
Cl     -0.36431     -2.12076      0.00000     -0.15001      0.07000      0.00000
H       1.46636     -0.58339      0.00000      0.39000     -0.37000      0.00000
H      -1.46636      0.58339      0.00000      0.39000     -0.37000      0.00000
Cl      0.36431      2.12076      0.00000     -0.15001      0.07000      0.00000
6
Model[5]: IRIntensity=0.0000 KM/Mole;PATH=Calculation 1;FrequenciesFrequencies;ReducedMass=21.5344 AMU;ForceConstant=1.8876 mDyne/A;FreqValue=385.7165;Frequency=385.7165 cm^-1;FrequencyLabel=AG;PATH=Calculation 1;FrequenciesFrequencies
C      -0.36431      0.56175      0.00000     -0.17000     -0.17000      0.00000
C       0.36431     -0.56175      0.00000      0.17000      0.17000      0.00000
Cl     -0.36431     -2.12076      0.00000      0.06000      0.53000      0.00000
H       1.46636     -0.58339      0.00000      0.18001      0.36001      0.00000
H      -1.46636      0.58339      0.00000     -0.18001     -0.36001      0.00000
Cl      0.36431      2.12076      0.00000     -0.06000     -0.53000      0.00000
6
Model[6]: IRIntensity=145.4250 KM/Mole;PATH=Calculation 1;FrequenciesFrequencies;ReducedMass=9.0780 AMU;ForceConstant=4.3937 mDyne/A;FreqValue=906.3509;Frequency=906.3509 cm^-1;FrequencyLabel=BU;PATH=Calculation 1;FrequenciesFrequencies
C      -0.36431      0.56175      0.00000      0.21000      0.46001      0.00000
C       0.36431     -0.56175      0.00000      0.21000      0.46001      0.00000
Cl     -0.36431     -2.12076      0.00000     -0.08000     -0.17000      0.00000
H       1.46636     -0.58339      0.00000      0.21000      0.40000      0.00000
H      -1.46636      0.58339      0.00000      0.21000      0.40000      0.00000
Cl      0.36431      2.12076      0.00000     -0.08000     -0.17000      0.00000
6
Model[7]: IRIntensity=0.0000 KM/Mole;PATH=Calculation 1;FrequenciesFrequencies;ReducedMass=4.7852 AMU;ForceConstant=2.6377 mDyne/A;FreqValue=967.2547;Frequency=967.2547 cm^-1;FrequencyLabel=AG;PATH=Calculation 1;FrequenciesFrequencies
C      -0.36431      0.56175      0.00000      0.33001      0.19000      0.00000
C       0.36431     -0.56175      0.00000     -0.33001     -0.19000      0.00000
Cl     -0.36431     -2.12076      0.00000      0.06000      0.06000      0.00000
H       1.46636     -0.58339      0.00000     -0.34000     -0.48000      0.00000
H      -1.46636      0.58339      0.00000      0.34000      0.48000      0.00000
Cl      0.36431      2.12076      0.00000     -0.06000     -0.06000      0.00000
6
Model[8]: IRIntensity=0.0000 KM/Mole;PATH=Calculation 1;FrequenciesFrequencies;ReducedMass=1.8463 AMU;ForceConstant=1.1155 mDyne/A;FreqValue=1012.6580;Frequency=1012.6580 cm^-1;FrequencyLabel=BG;PATH=Calculation 1;FrequenciesFrequencies
C      -0.36431      0.56175      0.00000      0.00000      0.00000     -0.19000
C       0.36431     -0.56175      0.00000      0.00000      0.00000      0.19000
Cl     -0.36431     -2.12076      0.00000      0.00000      0.00000     -0.01000
H       1.46636     -0.58339      0.00000      0.00000      0.00000     -0.68000
H      -1.46636      0.58339      0.00000      0.00000      0.00000      0.68000
Cl      0.36431      2.12076      0.00000      0.00000      0.00000      0.01000
6
Model[9]: IRIntensity=71.3035 KM/Mole;PATH=Calculation 1;FrequenciesFrequencies;ReducedMass=1.0871 AMU;ForceConstant=0.8649 mDyne/A;FreqValue=1162.0574;Frequency=1162.0574 cm^-1;FrequencyLabel=AU;PATH=Calculation 1;FrequenciesFrequencies
C      -0.36431      0.56175      0.00000      0.00000      0.00000      0.06000
C       0.36431     -0.56175      0.00000      0.00000      0.00000      0.06000
Cl     -0.36431     -2.12076      0.00000      0.00000      0.00000      0.00000
H       1.46636     -0.58339      0.00000      0.00000      0.00000     -0.70000
H      -1.46636      0.58339      0.00000      0.00000      0.00000     -0.70000
Cl      0.36431      2.12076      0.00000      0.00000      0.00000      0.00000
6
Model[10]: IRIntensity=25.0309 KM/Mole;PATH=Calculation 1;FrequenciesFrequencies;ReducedMass=1.1050 AMU;ForceConstant=1.3205 mDyne/A;FreqValue=1424.1223;Frequency=1424.1223 cm^-1;FrequencyLabel=BU;PATH=Calculation 1;FrequenciesFrequencies
C      -0.36431      0.56175      0.00000      0.02000     -0.06000      0.00000
C       0.36431     -0.56175      0.00000      0.02000     -0.06000      0.00000
Cl     -0.36431     -2.12076      0.00000     -0.01000      0.00000      0.00000
H       1.46636     -0.58339      0.00000      0.04000      0.70000      0.00000
H      -1.46636      0.58339      0.00000      0.04000      0.70000      0.00000
Cl      0.36431      2.12076      0.00000     -0.01000      0.00000      0.00000
6
Model[11]: IRIntensity=0.0000 KM/Mole;PATH=Calculation 1;FrequenciesFrequencies;ReducedMass=1.3166 AMU;ForceConstant=1.6333 mDyne/A;FreqValue=1451.0326;Frequency=1451.0326 cm^-1;FrequencyLabel=AG;PATH=Calculation 1;FrequenciesFrequencies
C      -0.36431      0.56175      0.00000     -0.11000      0.05000      0.00000
C       0.36431     -0.56175      0.00000      0.11000     -0.05000      0.00000
Cl     -0.36431     -2.12076      0.00000      0.01000      0.00000      0.00000
H       1.46636     -0.58339      0.00000      0.11000     -0.69000      0.00000
H      -1.46636      0.58339      0.00000     -0.11000      0.69000      0.00000
Cl      0.36431      2.12076      0.00000     -0.01000      0.00000      0.00000
6
Model[12]: IRIntensity=0.0000 KM/Mole;PATH=Calculation 1;FrequenciesFrequencies;ReducedMass=4.0894 AMU;ForceConstant=7.3480 mDyne/A;FreqValue=1746.3394;Frequency=1746.3394 cm^-1;FrequencyLabel=AG;PATH=Calculation 1;FrequenciesFrequencies
C      -0.36431      0.56175      0.00000     -0.12000      0.35000      0.00000
C       0.36431     -0.56175      0.00000      0.12000     -0.35000      0.00000
Cl     -0.36431     -2.12076      0.00000      0.00000      0.01000      0.00000
H       1.46636     -0.58339      0.00000      0.22000      0.56000      0.00000
H      -1.46636      0.58339      0.00000     -0.22000     -0.56000      0.00000
Cl      0.36431      2.12076      0.00000      0.00000     -0.01000      0.00000
6
Model[13]: IRIntensity=16.1874 KM/Mole;PATH=Calculation 1;FrequenciesFrequencies;ReducedMass=1.0862 AMU;ForceConstant=6.3251 mDyne/A;FreqValue=3143.7315;Frequency=3143.7315 cm^-1;FrequencyLabel=BU;PATH=Calculation 1;FrequenciesFrequencies
C      -0.36431      0.56175      0.00000      0.06000      0.00000      0.00000
C       0.36431     -0.56175      0.00000      0.06000      0.00000      0.00000
Cl     -0.36431     -2.12076      0.00000      0.00000      0.00000      0.00000
H       1.46636     -0.58339      0.00000     -0.70000      0.02000      0.00000
H      -1.46636      0.58339      0.00000     -0.70000      0.02000      0.00000
Cl      0.36431      2.12076      0.00000      0.00000      0.00000      0.00000
6
Model[14]: IRIntensity=0.0000 KM/Mole;PATH=Calculation 1;FrequenciesFrequencies;ReducedMass=1.1058 AMU;ForceConstant=6.4534 mDyne/A;FreqValue=3147.1884;Frequency=3147.1884 cm^-1;FrequencyLabel=AG;PATH=Calculation 1;FrequenciesFrequencies
C      -0.36431      0.56175      0.00000      0.07000     -0.01000      0.00000
C       0.36431     -0.56175      0.00000     -0.07000      0.01000      0.00000
Cl     -0.36431     -2.12076      0.00000      0.00000      0.00000      0.00000
H       1.46636     -0.58339      0.00000      0.70000     -0.02000      0.00000
H      -1.46636      0.58339      0.00000     -0.70000      0.02000      0.00000
Cl      0.36431      2.12076      0.00000      0.00000      0.00000      0.00000
</ModelData>
</Models>
##$PEAKS=
<Peaks type="RAMAN" xUnitsExpected="1/cm"  >
<PeakData id="1" title="1 (~3140 cm-1)" peakShape="broad" model="T2.14" xMax="3180" xMin="3120"    />
<PeakData id="3" title="3 (~1576 cm-1)" peakShape="broad" model="T2.12" xMax="1760" xMin="1730"    />
<PeakData id="4" title="4 (~1272 cm-1)" peakShape="broad" model="T2.11" xMax="1465" xMin="1435"    />
<PeakData id="7" title="7 (~750 cm-1)" peakShape="broad" model="T2.8" xMax="1030" xMin="1000"    />
<PeakData id="8" title="8 (~845 cm-1)" peakShape="broad" model="T2.7" xMax="980" xMin="950"    />
<PeakData id="10" title="10 (~350 cm-1)" peakShape="broad" model="T2.5" xMax="400" xMin="370"    />
</Peaks>
##XUNITS= 1/CM
##YUNITS=RAMAN INTENSITY
##XFACTOR= 1
##YFACTOR= 9.283649E-07
##FIRSTX= 3.599813E+03
##FIRSTY= 1.666667E-03
##LASTX= 9.734400
##NPOINTS= 2140
##MINY= 1.666667E-03
##MAXY= 9.300317E-01
##XYDATA= (X++(Y..Y))
3599.8127A795%S92O968J80J88J94K02K11K19K29K38K48K59K71K83K96A2091
3250.7075A2415L39L56L74L92M13M34M56M81N08N36N66N99O34O72P13B0646
3222.1748B1452Q58R16R77J046J120J201J291J389J498J618J751J899C9080
3198.6775D1328K455K687K948L246L581L966M404M910N492O168O954P877A04976
3175.18A15220J1771J3595J5792J8444K1666K5593L0389L6240M3347C83931
3156.7175D45793P3041Q4523R4324R8949R3537P3524L8104o767m9884H64072
3138.2554G67601r8399r1796q1212o9673n8786m9218m1121l4401k8880A89757
3119.793A69102j7612j5103j3026j1294r844q624p590o711n959n312F3273
3099.6523E9004l847l479l154k869k616k391k192k014j854j710j582j465B8472
$$ y = [12415, 12754, 13110, 13484, 13876, 14289, 14723, 15179, 15660, 16168, 16704, 17270, 17869, 18503, 19175, 19888, 20646, 21452, 22310, 23226, 24203, 25249, 26369, 27570, 28861, 30250, 31748, 33366, 35117, 37016, 39080, 41328, 43783, 46470, 49418, 52664, 56245, 60211, 64615, 69525, 75017, 81185, 88139, 96016, 104976, 115220, 126991, 140586, 156378, 174822, 196488, 222081, 252470, 288710, 332057, 383931, 445793, 518834, 603357, 697681, 796630, 890167, 963691, 1001795, 995028, 945144, 864072, 767601, 669202, 577406, 496194, 426521, 367735, 318517, 277396, 242995, 214115, 189757, 169102, 151490, 136387, 123361, 112067, 102223, 93599, 86009, 79298, 73339, 68027, 63273, 59004, 55157, 51678, 48524, 45655, 43039, 40648, 38456, 36442, 34588, 32878, 31296, 29831, 28472]
3076.1548B7209j177j097j026r58q99q42p92p44p01o60o24n89n57n27A5517
3049.3005A5043m50m27m07l87l68l51l35l20l05k92k79k68k56k45k35I892
$$ y = [27209, 26032, 24935, 23909, 22951, 22052, 21210, 20418, 19674, 18973, 18313, 17689, 17100, 16543, 16016, 15517, 15043, 14593, 14166, 13759, 13372, 13004, 12653, 12318, 11998, 11693, 11401, 11122, 10854, 10598, 10353, 10118, 9892]
3020.7678I675k08k00j92j85j78o917%X75J730M4M7M8N0N3N4N7N9O1O5D130
1855.9646D200P4P7Q0Q4Q9R2R8J02J08J13J20J26J32J41J49J57J67J77F474
1822.3967F674K13K27K43K59K78K98L21L45L71M02M35M71N12N58O09O67A3615
1792.1857A4421Q89R84J093J218J364J530J727J954K224K543K921L375D0162
1768.6882D4740N377O352P543Q994J0759J2875J5354J8128K0979K3410A99070
1748.5475B22286J8248R457j679j2381k0122k3944k4422k2783k0157j7293I2620
1728.4069H0404j0206q538p168o045n127m371l749l232k804k443k140B2697
1706.5878B1031j479j318j180j060r55q63p83p12o49n94n44m99m61m24I117
1679.7335H754l38l13k92k73k54k38k23k09j97j84j74j64j55j46j38j31E201
$$ y = [4200, 4274, 4351, 4431, 4515, 4604, 4696, 4794, 4896, 5004, 5117, 5237, 5363, 5495, 5636, 5785, 5942, 6109, 6286, 6474, 6674, 6887, 7114, 7357, 7616, 7894, 8192, 8513, 8858, 9229, 9631, 10066, 10537, 11049, 11607, 12216, 12883, 13615, 14421, 15310, 16294, 17387, 18605, 19969, 21499, 23226, 25180, 27404, 29947, 32868, 36243, 40162, 44740, 50117, 56469, 64012, 73006, 83765, 96640, 111994, 130122, 151101, 174511, 199070, 222286, 240534, 249991, 248312, 235931, 215809, 191865, 167443, 144660, 124503, 107210, 92620, 80404, 70198, 61660, 54492, 48447, 43320, 38949, 35200, 31968, 29164, 26721, 24581, 22697, 21031, 19552, 18234, 17054, 15994, 15039, 14176, 13393, 12681, 12032, 11438, 10894, 10395, 9934, 9510, 9117, 8754, 8416, 8103, 7811, 7538, 7284, 7046, 6823, 6614, 6417, 6233, 6059, 5895, 5740, 5594, 5456, 5325, 5201]
1649.5225E083j11j06j01r6r2q7q3p9p6p3o9o6o4o1n8n6n4n2m9m8m6m4A795
1609.2411A795%S6K117N5N7N9O1O4O7O9P2P6P9Q2Q6R0R4R8J03J09J13E465
1547.1406E591J31J39J46J54J63J72J82J93K04K16K31K44K61K78K97L18I260
1516.9296I625L92M22M55M92N32N77O26O83P46Q16Q96R86J088J205J338B2370
1488.397B4038J874K113K392K722L112L576M130M797N603O582P774R232H8954
1464.8994A02122J5758J8792K2188K5676K8654L0059K8414K2335J1575C03517
1446.4371B88364k4628k9306k9891k7886k4670k1166j7857j4952j2491G5066
1427.9749F6293p399o275n350m588l957l431k990k620k305k039j810j614B0471
$$ y = [5083, 4972, 4866, 4765, 4669, 4577, 4490, 4407, 4328, 4252, 4179, 4110, 4044, 3980, 3919, 3861, 3805, 3751, 3699, 3650, 3602, 3556, 3512, 1795, 1795, 1795, 1795, 1795, 1795, 1795, 1795, 1795, 1795, 1795, 1795, 1795, 1795, 1795, 1795, 1795, 1795, 3912, 3967, 4024, 4083, 4144, 4208, 4275, 4344, 4416, 4492, 4571, 4653, 4739, 4829, 4923, 5021, 5124, 5233, 5346, 5465, 5591, 5722, 5861, 6007, 6161, 6324, 6496, 6678, 6871, 7075, 7291, 7522, 7766, 8027, 8305, 8602, 8920, 9260, 9625, 10017, 10439, 10894, 11386, 11918, 12495, 13121, 13804, 14550, 15366, 16262, 17248, 18336, 19541, 20879, 22370, 24038, 25912, 28025, 30417, 33139, 36251, 39827, 43957, 48754, 54357, 60939, 68713, 77945, 88954, 102122, 117880, 136672, 158860, 184536, 213190, 243249, 271663, 293998, 305573, 303517, 288364, 263736, 234430, 204539, 176653, 151983, 130817, 112960, 98008, 85517, 75066, 66293, 58894, 52619, 47269, 42681, 38724, 35293, 32303, 29683, 27378, 25339, 23529, 21915, 20471]
1404.4774A9174j169j056r59q71p95p26o66o12n63n20m80m45m13l84l57H824
1375.9447H513k91k73k56k40k27k12k01j89j79j70j60j51j44j37j30j23E312
$$ y = [19174, 18005, 16949, 15990, 15119, 14324, 13598, 12932, 12320, 11757, 11237, 10757, 10312, 9899, 9515, 9158, 8824, 8513, 8222, 7949, 7693, 7453, 7226, 7014, 6813, 6624, 6445, 6275, 6115, 5964, 5820, 5683, 5553, 5430, 5312]
1345.7336E200j06j02r7r3q9q5q1p8p4p2o8o6o3o1n8n7n4k101%S02O73B485
1139.2916B503J9K0TK1K2K3K4K5K6K8TL0L2TL5L6L8M0M1M4M7M9N2N4N72C936
1093.975D015Q3Q8R3R9J06J12J19J27J36J46J55J68J80J94K10K27K46F771
1062.0856G063L18L49L83M22M67N19N77O45P24Q16R25J052J204J385J602B0314
1033.553B2495K566L036L610M304N138O113P204Q327R288R751R249P338A02362
1010.0555A02002m492p465q909r045q349p260o065m920l883k967k156C5064
988.2364C4311j05N42J216J942K738L615M557N505O314O727O390M967H1119
964.7389H0248m017o288p396p515p005o205n337m517l798l187k680k263A8120
941.24146A6483j406j214j054r20q08p13o32n62n04m52m08l69l35l05F523
$$ y = [2503, 2522, 2542, 2562, 2583, 2605, 2628, 2652, 2677, 2703, 2731, 2759, 2789, 2821, 2853, 2888, 2924, 2962, 3002, 3043, 3087, 3134, 3183, 3235, 3289, 3861, 3936, 4015, 4098, 4186, 4279, 4378, 4484, 4596, 4715, 4842, 4978, 5124, 5279, 5447, 5627, 5821, 6031, 6258, 6504, 6771, 7063, 7381, 7730, 8113, 8535, 9002, 9521, 10098, 10743, 11467, 12283, 13208, 14260, 15464, 16849, 18451, 20314, 22495, 25061, 28097, 31707, 36011, 41149, 47262, 54466, 62793, 72081, 81832, 91081, 98419, 102362, 102002, 97510, 90045, 81136, 72091, 63742, 56482, 50417, 45497, 41614, 38647, 36491, 35064, 34311, 34206, 34748, 35964, 37906, 40644, 44259, 48816, 54321, 60635, 67362, 73752, 78719, 81119, 80248, 76231, 69943, 62547, 55032, 48027, 41822, 36485, 31968, 28170, 24983, 22303, 20040, 18120, 16483, 15077, 13863, 12809, 11889, 11081, 10368, 9736, 9174, 8670, 8218, 7810, 7441, 7106, 6801, 6523]
914.38715F268k35k15j99j85j70j59j47j38j29j20j12j06r9r4q8q3p9C836
882.49774C766o7o3p11m1l9l7l5l3l2l0k8Tk5Tk4k2Tk0Tj9j8Tj6Uj4Uj3A795
$$ y = [6268, 6033, 5818, 5619, 5434, 5264, 5105, 4958, 4820, 4691, 4571, 4459, 4353, 4254, 4160, 4072, 3989, 3910, 3836, 3766, 3699, 3636, 2925, 2884, 2845, 2808, 2773, 2740, 2708, 2678, 2650, 2622, 2597, 2572, 2548, 2526, 2504, 2484, 2464, 2445, 2427, 2409, 2393, 2377, 2361, 2347, 2333, 2319, 2306, 1795]
830.46765A795%S87M88J2J4J3J4J5TJ6J7TJ9UK1K2TK4K5K6K8K9L0L2L4B801
472.97034B839L9M2M4M7N0N3N7O0O4O8P3P9Q4R0R7J05J13J23J33J44J58D733
434.36734D921K07K27K51K77L08L44L84M32M86N52O27P16Q24R52J105A3903
405.8347A5419J791K127K536L033L630M329N111N915O601O924O545N145G1773
382.33722G1299l491n673o751o885o424n683m876m113l444k878k407k021A4948
358.83975A3503j232j057r12p90o89o04n31m69m17l72l33k98k70k43k21D864
330.3071D681j67j53j41j30j20j10j03r5q8q3p7p1o7o3n9n6n2m9m6m4B866
$$ y = [2839, 2878, 2920, 2964, 3011, 3061, 3114, 3171, 3231, 3295, 3363, 3436, 3515, 3599, 3689, 3786, 3891, 4004, 4127, 4260, 4404, 4562, 4733, 4921, 5128, 5355, 5606, 5883, 6191, 6535, 6919, 7351, 7837, 8389, 9016, 9732, 10556, 11508, 12613, 13903, 15419, 17210, 19337, 21873, 24906, 28536, 32865, 37976, 43891, 50492, 57416, 63961, 69106, 71773, 71299, 67808, 62135, 55384, 48499, 42075, 36392, 31516, 27403, 23959, 21081, 18674, 16653, 14948, 13503, 12271, 11214, 10302, 9512, 8823, 8219, 7688, 7219, 6802, 6430, 6097, 5799, 5529, 5286, 5065, 4864, 4681, 4514, 4361, 4220, 4090, 3970, 3860, 3757, 3662, 3574, 3491, 3414, 3343, 3276, 3213, 3154, 3098, 3046, 2997, 2951, 2907, 2866]
293.38248B827l7l5l3l1l0k9k7k5Tk3Tk1Tj9Tj8j7j6Tj5Tj4j3Um84%S41A795
9.7344A795  $$checkpoint
##END=$$ End of RAMAN of trans-DCE
##TITLE= 1,1-dichloroethene
##JCAMP-DX= 5.01
##DATA TYPE= INFRARED SPECTRUM
##DATA CLASS= XYDATA
##BLOCK ID=5
##ORIGIN= Department of Chemistry, UWI, JAMAICA
##OWNER= public domain
##LONGDATE= 2012/02/18 12:32:26.0301 -0500 $$ export date from JSpecView
##SPECTROMETER/DATA SYSTEM= from scan
##$MODELS=
<Models>
<ModelData id="1DCE" type="MOL">
1,1-dichloroethylene
__Jmol-14_02171520543D 1   1.00000     0.00000     0
Jmol version 14.3.12_2015.02.11  2015-02-11 19:15 EXTRACT: ({0:5})
  6  5  0  0  0  0              1 V2000
   0.00000   0.00000   0.41101 C   0  0  0  0  0  0
   0.00000   0.00000   1.74967 C   0  0  0  0  0  0
   0.00000   0.93996   2.32528 H   0  0  0  0  0  0
   0.00000  -0.93996   2.32528 H   0  0  0  0  0  0
   0.00000   1.44639  -0.51808 Cl  0  0  0  0  0  0
   0.00000  -1.44639  -0.51808 Cl  0  0  0  0  0  0
  1  6  1  0  0  0
  1  5  1  0  0  0
  1  2  2  0  0  0
  2  3  1  0  0  0
  2  4  1  0  0  0
M  END
</ModelData>
<ModelData id="i1" type="XYZVIB" baseModel="1DCE" vibrationScale=".5">
6
Model[1]: PATH=Calculation 1;Input;Convg=0.4887D-08;-V/T=2.0006;Energy=NaN;Range=M.O.s;E(RHF)=-995.823662291 A.U.;PATH=Calculation 1;Input
C       0.00000      0.00000      0.00000
C       0.00000      0.00000      1.33866
H       0.93996      0.00000      1.91427
H      -0.93996      0.00000      1.91427
Cl      1.44639      0.00000     -0.92909
Cl     -1.44639      0.00000     -0.92909
6
Model[2]: PATH=Calculation 1;Standard;Convg=0.4887D-08;-V/T=2.0006;Energy=-995.82367;Range=M.O.s;E(RHF)=-995.823662291 A.U.;PATH=Calculation 1;Standard
C       0.00000      0.00000      0.41101
C       0.00000      0.00000      1.74967
H       0.00000      0.93996      2.32528
H       0.00000     -0.93996      2.32528
Cl      0.00000      1.44639     -0.51808
Cl      0.00000     -1.44639     -0.51808
6
Model[3]: IRIntensity=0.1106 KM/Mole;PATH=Calculation 1;FrequenciesFrequencies;ReducedMass=18.4273 AMU;ForceConstant=1.1552 mDyne/A;FreqValue=326.1875;Frequency=326.1875 cm^-1;FrequencyLabel=A1;PATH=Calculation 1;FrequenciesFrequencies
C       0.00000      0.00000      0.41101      0.00000      0.00000     -0.37000
C       0.00000      0.00000      1.74967      0.00000      0.00000     -0.39000
H       0.00000      0.93996      2.32528      0.00000      0.00000     -0.38000
H       0.00000     -0.93996      2.32528      0.00000      0.00000     -0.38000
Cl      0.00000      1.44639     -0.51808      0.00000      0.44000      0.14000
Cl      0.00000     -1.44639     -0.51808      0.00000     -0.44000      0.14000
6
Model[4]: IRIntensity=0.0003 KM/Mole;PATH=Calculation 1;FrequenciesFrequencies;ReducedMass=3.6118 AMU;ForceConstant=0.4422 mDyne/A;FreqValue=455.8292;Frequency=455.8292 cm^-1;FrequencyLabel=B2;PATH=Calculation 1;FrequenciesFrequencies
C       0.00000      0.00000      0.41101      0.00000     -0.07000      0.00000
C       0.00000      0.00000      1.74967      0.00000      0.34000      0.00000
H       0.00000      0.93996      2.32528      0.00000      0.55000     -0.34000
H       0.00000     -0.93996      2.32528      0.00000      0.55000      0.34000
Cl      0.00000      1.44639     -0.51808      0.00000     -0.06000      0.12000
Cl      0.00000     -1.44639     -0.51808      0.00000     -0.06000     -0.12000
6
Model[5]: IRIntensity=2.8951 KM/Mole;PATH=Calculation 1;FrequenciesFrequencies;ReducedMass=7.2233 AMU;ForceConstant=1.3108 mDyne/A;FreqValue=554.9693;Frequency=554.9693 cm^-1;FrequencyLabel=B1;PATH=Calculation 1;FrequenciesFrequencies
C       0.00000      0.00000      0.41101      0.70000      0.00000      0.00000
C       0.00000      0.00000      1.74967     -0.19000      0.00000      0.00000
H       0.00000      0.93996      2.32528     -0.48000      0.00000      0.00000
H       0.00000     -0.93996      2.32528     -0.48000      0.00000      0.00000
Cl      0.00000      1.44639     -0.51808     -0.07000      0.00000      0.00000
Cl      0.00000     -1.44639     -0.51808     -0.07000      0.00000      0.00000
6
Model[6]: IRIntensity=18.6624 KM/Mole;PATH=Calculation 1;FrequenciesFrequencies;ReducedMass=9.0383 AMU;ForceConstant=2.3129 mDyne/A;FreqValue=659.0407;Frequency=659.0407 cm^-1;FrequencyLabel=A1;PATH=Calculation 1;FrequenciesFrequencies
C       0.00000      0.00000      0.41101      0.00000      0.00000      0.36001
C       0.00000      0.00000      1.74967      0.00000      0.00000      0.48000
H       0.00000      0.93996      2.32528      0.00000     -0.01000      0.51000
H       0.00000     -0.93996      2.32528      0.00000      0.01000      0.51000
Cl      0.00000      1.44639     -0.51808      0.00000      0.19000     -0.16000
Cl      0.00000     -1.44639     -0.51808      0.00000     -0.19000     -0.16000
6
Model[7]: IRIntensity=0.0000 KM/Mole;PATH=Calculation 1;FrequenciesFrequencies;ReducedMass=1.0197 AMU;ForceConstant=0.4876 mDyne/A;FreqValue=900.8576;Frequency=900.8576 cm^-1;FrequencyLabel=A2;PATH=Calculation 1;FrequenciesFrequencies
C       0.00000      0.00000      0.41101      0.00000      0.00000      0.00000
C       0.00000      0.00000      1.74967      0.00000      0.00000      0.00000
H       0.00000      0.93996      2.32528      0.71000      0.00000      0.00000
H       0.00000     -0.93996      2.32528     -0.71000      0.00000      0.00000
Cl      0.00000      1.44639     -0.51808     -0.01000      0.00000      0.00000
Cl      0.00000     -1.44639     -0.51808      0.01000      0.00000      0.00000
6
Model[8]: IRIntensity=92.0040 KM/Mole;PATH=Calculation 1;FrequenciesFrequencies;ReducedMass=3.0785 AMU;ForceConstant=1.6024 mDyne/A;FreqValue=939.9244;Frequency=939.9244 cm^-1;FrequencyLabel=B2;PATH=Calculation 1;FrequenciesFrequencies
C       0.00000      0.00000      0.41101      0.00000      0.37000      0.00000
C       0.00000      0.00000      1.74967      0.00000      0.09000      0.00000
H       0.00000      0.93996      2.32528      0.00000     -0.27001      0.59000
H       0.00000     -0.93996      2.32528      0.00000     -0.27001     -0.59000
Cl      0.00000      1.44639     -0.51808      0.00000     -0.07000      0.04000
Cl      0.00000     -1.44639     -0.51808      0.00000     -0.07000     -0.04000
6
Model[9]: IRIntensity=52.9028 KM/Mole;PATH=Calculation 1;FrequenciesFrequencies;ReducedMass=1.3120 AMU;ForceConstant=1.0456 mDyne/A;FreqValue=1163.0605;Frequency=1163.0605 cm^-1;FrequencyLabel=B1;PATH=Calculation 1;FrequenciesFrequencies
C       0.00000      0.00000      0.41101     -0.04000      0.00000      0.00000
C       0.00000      0.00000      1.74967      0.16000      0.00000      0.00000
H       0.00000      0.93996      2.32528     -0.70000      0.00000      0.00000
H       0.00000     -0.93996      2.32528     -0.70000      0.00000      0.00000
Cl      0.00000      1.44639     -0.51808      0.00000      0.00000      0.00000
Cl      0.00000     -1.44639     -0.51808      0.00000      0.00000      0.00000
6
Model[10]: IRIntensity=85.0510 KM/Mole;PATH=Calculation 1;FrequenciesFrequencies;ReducedMass=1.8092 AMU;ForceConstant=1.7212 mDyne/A;FreqValue=1270.7289;Frequency=1270.7289 cm^-1;FrequencyLabel=B2;PATH=Calculation 1;FrequenciesFrequencies
C       0.00000      0.00000      0.41101      0.00000      0.21000      0.00000
C       0.00000      0.00000      1.74967      0.00000     -0.16000      0.00000
H       0.00000      0.93996      2.32528      0.00000      0.23001     -0.64000
H       0.00000     -0.93996      2.32528      0.00000      0.23001      0.64000
Cl      0.00000      1.44639     -0.51808      0.00000     -0.02000      0.01000
Cl      0.00000     -1.44639     -0.51808      0.00000     -0.02000     -0.01000
6
Model[11]: IRIntensity=6.8266 KM/Mole;PATH=Calculation 1;FrequenciesFrequencies;ReducedMass=1.4915 AMU;ForceConstant=2.1016 mDyne/A;FreqValue=1546.4604;Frequency=1546.4604 cm^-1;FrequencyLabel=A1;PATH=Calculation 1;FrequenciesFrequencies
C       0.00000      0.00000      0.41101      0.00000      0.00000      0.20001
C       0.00000      0.00000      1.74967      0.00000      0.00000     -0.06000
H       0.00000      0.93996      2.32528      0.00000      0.31000     -0.62000
H       0.00000     -0.93996      2.32528      0.00000     -0.31000     -0.62000
Cl      0.00000      1.44639     -0.51808      0.00000      0.01000     -0.01000
Cl      0.00000     -1.44639     -0.51808      0.00000     -0.01000     -0.01000
6
Model[12]: IRIntensity=47.1352 KM/Mole;PATH=Calculation 1;FrequenciesFrequencies;ReducedMass=2.6981 AMU;ForceConstant=4.9710 mDyne/A;FreqValue=1768.3251;Frequency=1768.3251 cm^-1;FrequencyLabel=A1;PATH=Calculation 1;FrequenciesFrequencies
C       0.00000      0.00000      0.41101      0.00000      0.00000     -0.26000
C       0.00000      0.00000      1.74967      0.00000      0.00000      0.29000
H       0.00000      0.93996      2.32528      0.00000      0.49001     -0.43000
H       0.00000     -0.93996      2.32528      0.00000     -0.49001     -0.43000
Cl      0.00000      1.44639     -0.51808      0.00000     -0.01000      0.01000
Cl      0.00000     -1.44639     -0.51808      0.00000      0.01000      0.01000
6
Model[13]: IRIntensity=0.0670 KM/Mole;PATH=Calculation 1;FrequenciesFrequencies;ReducedMass=1.0641 AMU;ForceConstant=6.0497 mDyne/A;FreqValue=3106.4325;Frequency=3106.4325 cm^-1;FrequencyLabel=A1;PATH=Calculation 1;FrequenciesFrequencies
C       0.00000      0.00000      0.41101      0.00000      0.00000      0.01000
C       0.00000      0.00000      1.74967      0.00000      0.00000     -0.07000
H       0.00000      0.93996      2.32528      0.00000      0.61000      0.36001
H       0.00000     -0.93996      2.32528      0.00000     -0.61000      0.36001
Cl      0.00000      1.44639     -0.51808      0.00000      0.00000      0.00000
Cl      0.00000     -1.44639     -0.51808      0.00000      0.00000      0.00000
6
Model[14]: IRIntensity=0.8160 KM/Mole;PATH=Calculation 1;FrequenciesFrequencies;ReducedMass=1.1196 AMU;ForceConstant=6.6677 mDyne/A;FreqValue=3179.2916;Frequency=3179.2916 cm^-1;FrequencyLabel=B2;PATH=Calculation 1;FrequenciesFrequencies
C       0.00000      0.00000      0.41101      0.00000      0.00000      0.00000
C       0.00000      0.00000      1.74967      0.00000     -0.10000      0.00000
H       0.00000      0.93996      2.32528      0.00000      0.60001      0.37000
H       0.00000     -0.93996      2.32528      0.00000      0.60001     -0.37000
Cl      0.00000      1.44639     -0.51808      0.00000      0.00000      0.00000
Cl      0.00000     -1.44639     -0.51808      0.00000      0.00000      0.00000
</ModelData>
</Models>
##$PEAKS=
<Peaks type="IR" xUnitsExpected="1/cm"  >
<PeakData id="1" title="1 (~3180 cm-1)" peakShape="broad" model="i1.14" xMax="3195" xMin="3165"    />
<PeakData id="2" title="2 (~3110 cm-1)" peakShape="broad" model="i1.13" xMax="3125" xMin="3085"    />
<PeakData id="3" title="3 (~1770 cm-1)" peakShape="broad" model="i1.12" xMax="1785" xMin="1750"    />
<PeakData id="4" title="4 (~1550 cm-1)" peakShape="broad" model="i1.11" xMax="1560" xMin="1530"    />
<PeakData id="5" title="5 (~1270 cm-1)" peakShape="broad" model="i1.10" xMax="1290" xMin="1260"    />
<PeakData id="6" title="6 (~1160 cm-1)" peakShape="broad" model="i1.9" xMax="1180" xMin="1150"    />
<PeakData id="7" title="7 (~940 cm-1)" peakShape="broad" model="i1.7" xMax="955" xMin="925"    />
<PeakData id="9" title="9 (~660 cm-1)" peakShape="broad" model="i1.6" xMax="675" xMin="645"    />
<PeakData id="10" title="10 (~550 cm-1)" peakShape="broad" model="i1.5" xMax="570" xMin="540"    />
<PeakData id="11" title="11 (~455 cm-1)" peakShape="broad" model="i1.4" xMax="470" xMin="440"    />
<PeakData id="12" title="12 (~330 cm-1)" peakShape="broad" model="i1.3" xMax="340" xMin="310"    />
</Peaks>
##XUNITS= 1/CM
##YUNITS= TRANSMITTANCE
##XFACTOR= 1
##YFACTOR= 9.999000E-07
##FIRSTX= 3.377665E+03
##FIRSTY= 9.991514E-01
##LASTX= 1.261875E+02
##NPOINTS= 2000
##MINY= 10.000000E-05
##MAXY= 1
##XYDATA= (X++(Y..Y))
3377.665I99251j3j4j5Vj6j7Uj8Uk0j9k1k0k2Uk4Uk6Tk7k8Tl0Tl2Tl4I98497
3320.7358I98461l7l8m0m1m2m4m6m7m9n1n3n5n6o0o1o4o7p0p2p5p9q2I97146
3281.6985I97056r4r8j03j08j13j19j25j31j37j46j52j62j70j80j90k01I94614
3252.4207I94388k40k55k71k89l09l29l52l77m04m34m66n02n41n84o32I87719
3224.769I86977q07q77r56j043j141j248j367j500j647j808j986k180I68026
3201.9973I65409k854l100l346l579l785l943m026m005l848l528l031I24009
3180.8523I22485n86L93J343K193K896L423L768L949L989L918L769L566I58440
3158.0806I61526K837K594K361K145J942J757J585J430J287J158J037I82588
$$ y = [999251, 999238, 999224, 999209, 999194, 999179, 999164, 999148, 999131, 999114, 999097, 999079, 999061, 999043, 999023, 999004, 998983, 998963, 998941, 998919, 998897, 998873, 998849, 998825, 998799, 998773, 998746, 998718, 998690, 998660, 998630, 998598, 998566, 998532, 998497, 998461, 998424, 998386, 998346, 998305, 998263, 998219, 998173, 998126, 998077, 998026, 997973, 997918, 997862, 997802, 997741, 997677, 997610, 997540, 997468, 997393, 997314, 997232, 997146, 997056, 996962, 996864, 996761, 996653, 996540, 996421, 996296, 996165, 996028, 995882, 995730, 995568, 995398, 995218, 995028, 994827, 994614, 994388, 994148, 993893, 993622, 993333, 993024, 992695, 992343, 991966, 991562, 991128, 990662, 990160, 989619, 989035, 988403, 987719, 986977, 986170, 985293, 984337, 983294, 982153, 980905, 979538, 978038, 976391, 974583, 972597, 970417, 968026, 965409, 962555, 959455, 956109, 952530, 948745, 944802, 940776, 936771, 932923, 929395, 926364, 924009, 922485, 921899, 922292, 923635, 925828, 928724, 932147, 935915, 939864, 943853, 947771, 951540, 955106, 958440, 961526, 964363, 966957, 969318, 971463, 973405, 975162, 976747, 978177, 979464, 980622, 981659, 982588]
3136.9353I83415P33O47N65M88M15L47K81K21J63J11O7L1OnJK3O5J21I87883
3104.4043I88143L31L94M44M79M98N05M98M84M62M38M11L83L56L30L06I94745
3076.753I95006K42K24K08J93J80J67J56J46J37J28J20J13J07J00R5I97412
3049.1016I97498Q0P7P3O9O7O3O0N8N4N3N1M8M6M5M3M1M0L8L7L5L4L3I98675
3010.0642I98706K9TK8K7K6K5K4TK3K2TK1K0TJ9TJ8TJ7J6J7J6J5UJ4TJ3I99286
2961.2678I99299J2J3J2J1J2J1UJ0WRVQRQVPQPWOPOTPNOVNTONWMNTMNI99706
2871.8074I99710NMXLMTLMLMLMLXMKLWKLTKLKLKLKTLKTLKWLKWJKK02JA000076
$$ y = [983415, 984148, 984795, 985360, 985848, 986263, 986610, 986891, 987112, 987275, 987386, 987453, 987484, 987490, 987485, 987486, 987509, 987574, 987695, 987883, 988143, 988474, 988868, 989312, 989791, 990289, 990794, 991292, 991776, 992238, 992676, 993087, 993470, 993826, 994156, 994462, 994745, 995006, 995248, 995472, 995680, 995873, 996053, 996220, 996376, 996522, 996659, 996787, 996907, 997020, 997127, 997227, 997322, 997412, 997498, 997578, 997655, 997728, 997797, 997864, 997927, 997987, 998045, 998099, 998152, 998203, 998251, 998297, 998342, 998385, 998426, 998466, 998504, 998541, 998576, 998610, 998643, 998675, 998706, 998735, 998764, 998792, 998819, 998845, 998870, 998894, 998918, 998941, 998963, 998985, 999006, 999026, 999046, 999065, 999084, 999102, 999120, 999137, 999153, 999170, 999186, 999201, 999216, 999231, 999245, 999259, 999272, 999286, 999299, 999311, 999324, 999336, 999347, 999359, 999370, 999381, 999392, 999402, 999412, 999422, 999432, 999442, 999451, 999460, 999469, 999478, 999486, 999495, 999503, 999511, 999519, 999527, 999534, 999542, 999549, 999556, 999563, 999570, 999577, 999583, 999590, 999596, 999602, 999609, 999614, 999620, 999626, 999632, 999638, 999643, 999648, 999654, 999659, 999664, 999669, 999674, 999679, 999683, 999688, 999693, 999697, 999702, 999706, 999710, 999715, 999719, 999723, 999727, 999731, 999735, 999739, 999742, 999746, 999750, 999753, 999757, 999760, 999764, 999767, 999771, 999774, 999777, 999780, 999783, 999786, 999789, 999793, 999795, 999798, 999801, 999804, 999807, 999810, 999812, 999815, 999818, 999820, 999823, 999825, 999828, 999830, 999833, 999835, 999837, 999840, 999842, 999844, 999847, 999849, 999851, 999853, 999855, 999857, 999860, 999862, 999864, 999866, 999868, 999870, 999871, 999873, 1000075, 1000076, 1000076]
2772.5876A000076%J%VJ%VJ%VJ%VJ%WJ%XJ%XJ7%U29j1675r5r6r7r9j00I87837
2156.1245I87735j04j05j06j08j09j10j12j13j14j17Tj20Tj23j24j25I85780
2126.8464I85651j31j32j35j36j38j40j42j44j46j48j50j53j54j57j59I83325
2099.195I83161j66j68j71j73j76j79j82j84j87j89j93j96j99k01k05I80183
2071.5437I79972k15k19k21k26k29k33k37k40k45k49k52k58k61k66k71I76075
2043.8923I75795k85k90k95l00l06l11l17l23l28l35l41l47l53l61l67I70562
2016.241I70181l89l96m04m12m21m28m37m46m55m65m74m84m94n04n15I62931
1988.5896I62393n49n61n73n86n99o12o26o41o55o70o86p02p18p36p53I51955
1960.9382I51165q09q29q50q72q93r16r40r63r89k616j054j081j110j141I34931
$$ y = [987735, 987631, 987526, 987420, 987312, 987203, 987093, 986981, 986868, 986754, 986637, 986520, 986400, 986280, 986157, 986033, 985908, 985780, 985651, 985520, 985388, 985253, 985117, 984979, 984839, 984697, 984553, 984407, 984259, 984109, 983956, 983802, 983645, 983486, 983325, 983161, 982995, 982827, 982656, 982483, 982307, 982128, 981946, 981762, 981575, 981386, 981193, 980997, 980798, 980597, 980392, 980183, 979972, 979757, 979538, 979317, 979091, 978862, 978629, 978392, 978152, 977907, 977658, 977406, 977148, 976887, 976621, 976350, 976075, 975795, 975510, 975220, 974925, 974625, 974319, 974008, 973691, 973368, 973040, 972705, 972364, 972017, 971664, 971303, 970936, 970562, 970181, 969792, 969396, 968992, 968580, 968159, 967731, 967294, 966848, 966393, 965928, 965454, 964970, 964476, 963972, 963457, 962931, 962393, 961844, 961283, 960710, 960124, 959525, 958913, 958287, 957646, 956991, 956321, 955635, 954933, 954215, 953479, 952726, 951955, 951165, 950356, 949527, 948677, 947805, 946912, 945996, 945056, 944093, 943104, 940488, 939434, 938353, 937243, 936102, 934931]
1934.9133I33728j237j272j307j345j383j423j465j507j553j600j648I16290
1913.7682I14539j806j862j922j983k048k115k184k258k333k413k497H88536
1892.623H85862k769k867k972l080l194l314l438l570l707l852m004H44933
1871.4779H40602m506m691m886n091n307n534n773o025o291o572o867G71879
1850.3326G64371p855q221q608r016r446r898j0377j0881j1410j1968F54138
1830.8141F40970j3812j4484j5187j5915j6672j7451j8252j9068j9894D69513
1812.922D47972k2341k3105k3815k4451k4988k5397k5651k5714k5558B01802
1795.0299A77337k3486k2208k0644j8824j6802j4647j2450j0299q283B3225
$$ y = [933728, 932491, 931219, 929912, 928567, 927184, 925761, 924296, 922789, 921236, 919636, 917988, 916290, 914539, 912733, 910871, 908949, 906966, 904918, 902803, 900619, 898361, 896028, 893615, 891118, 888536, 885862, 883093, 880226, 877254, 874174, 870980, 867666, 864228, 860658, 856951, 853099, 849095, 844933, 840602, 836096, 831405, 826519, 821428, 816121, 810587, 804814, 798789, 792498, 785926, 779059, 771879, 764371, 756516, 748295, 739687, 730671, 721225, 711327, 700950, 690069, 678659, 666691, 654138, 640970, 627158, 612674, 597487, 581572, 564900, 547449, 529197, 510129, 490235, 469513, 447972, 425631, 402526, 378711, 354260, 329272, 303875, 278224, 252510, 226952, 201802, 177337, 153851, 131643, 110999, 92175, 75373, 60726, 48276, 37977, 29694, 23225]
1777.1378A8324l591k523j660r51l37K41Q45J533K368L397M664O188P959D6398
1752.7395E8467J4258J6416J8455K0302K1900K3215K4230K4952K5392B73165
1734.8475B98703K5304K4909K4383K3754K3047K2284K1483K0659J9827E23346
1716.9554E41516J7362J6572J5808J5068J4356J3674J3020J2395J1799F82802
1699.0634F93493J0176R689R224Q783Q364P967P590P231O889O566O258G88195
1677.9182G93880N420N166M925M693j2688M032L832L638L453L275L103H25667
1656.773H28444K623K473K327K185K046J912J778J649J520J393J268H50761
1635.6278H51779Q94P70O44N17L88K58J24j3j54l00m50o08p71r43j123H49698
$$ y = [18324, 14733, 12210, 10550, 9599, 9262, 9503, 10348, 11881, 14249, 17646, 22310, 28498, 36457, 46398, 58467, 72725, 89141, 107596, 127898, 149798, 173013, 197243, 222195, 247587, 273165, 298703, 324007, 348916, 373299, 397053, 420100, 442384, 463867, 484526, 504353, 523346, 541516, 558878, 575450, 591258, 606326, 620682, 634356, 647376, 659771, 671570, 682802, 693493, 703669, 713358, 722582, 731365, 739729, 747696, 755286, 762517, 769406, 775972, 782230, 788195, 793880, 799300, 804466, 809391, 814084, 801396, 805428, 809260, 812898, 816351, 819626, 822729, 825667, 828444, 831067, 833540, 835867, 838052, 840098, 842010, 843788, 845437, 846957, 848350, 849618, 850761, 851779, 852673, 853443, 854087, 854604, 854992, 855250, 855374, 855361, 855207, 854907, 854457, 853849, 853078, 852135, 851012, 849698]
1607.9764H48183j729j957k200k461k740l041l366l717m097m509m958H07964
1586.8313H01989o551p180p862q602r404j0269j1195j2183j3222j4306F85804
1567.3126F69291j7574j8541k7386j9723j9959j9772j9071j7776j5838D80396
1549.4205D70320o415k432J673N689R409J2669J5346J7382J8770J9555E81776
1529.902F01407J9111J8344J7410J6375J5291J4201J3130J2097J1117G48679
1512.0099G58015Q540P803P125O503N931N406M924M484M078L705L362H22922
1490.8646H25677K484K235K002J787J585J397J221J056R00P52O14M82H42548
1468.0929H42785J21J2r3j96k95l90m84n74o63p51q36r21j005j087j170H33201
$$ y = [848183, 846454, 844497, 842297, 839836, 837096, 834055, 830689, 826972, 822875, 818366, 813408, 807964, 801989, 795438, 788258, 780396, 771794, 762390, 752121, 740926, 728743, 715521, 701215, 685804, 669291, 651717, 633176, 605790, 586067, 566108, 546336, 527265, 509489, 493651, 480396, 470320, 463905, 461473, 463146, 468835, 478244, 490913, 506259, 523641, 542411, 561966, 581776, 601407, 620518, 638862, 656272, 672647, 687938, 702139, 715269, 727366, 738483, 748679, 758015, 766555, 774358, 781483, 787986, 793917, 799323, 804247, 808731, 812809, 816514, 819876, 822922, 825677, 828161, 830396, 832398, 834185, 835770, 837167, 838388, 839444, 840344, 841096, 841710, 842192, 842548, 842785, 842906, 842918, 842825, 842629, 842334, 841944, 841460, 840886, 840223, 839472, 838636, 837715, 836710, 835623, 834453, 833201]
1440.4415H31868j416j497j581j663j746j832j916k004k091k181k273H09304
1419.2964H06844k557k655k758k861k968l078l191l307l427l550l677G69007
1398.1512G65063m084m229m378m534m694m861n033n212n398n590n789G05264
1377.006F99052o436o667o909p159p419m8q124q416q720r035r362r701F01004
1354.2343E90589j0791j1180j1580j1993j2418j2852j3298j3753j4215D53316
1336.3423D38422j5352j5807j6255j6694j7115j7516j7885j8219j8506B66338
1318.4502B47440j8981j8970j8854j8619j8254j7747j7089j6278j5314G3130
1300.5581F0164j1621j0204q755p321n949m685l568k622j856j268q36I46
$$ y = [831868, 830452, 828955, 827374, 825711, 823965, 822133, 820217, 818213, 816122, 813941, 811668, 809304, 806844, 804287, 801632, 798874, 796013, 793045, 789967, 786776, 783469, 780042, 776492, 772815, 769007, 765063, 760979, 756750, 752372, 747838, 743144, 738283, 733250, 728038, 722640, 717050, 711261, 705264, 699052, 692616, 685949, 679040, 671881, 664462, 664414, 656290, 647874, 639154, 630119, 620757, 611056, 601004, 590589, 579798, 568618, 557038, 545045, 532627, 519775, 506477, 492724, 478509, 453316, 438422, 423070, 407263, 391008, 374314, 357199, 339683, 321798, 303579, 285073, 266338, 247440, 228459, 209489, 190635, 172016, 153762, 136015, 118926, 102648, 87334, 73130, 60164, 48543, 38339, 29584, 22263, 16314, 11629, 8061, 5439, 3583, 2315, 1479, 946]
1279.413F14k02j19o9l6j3PK9N9J02J72K81M49O98J051J528K138K882A3314
1248.5084A8007N691O697P660Q543R309R930J0388J0675J0786J0726J0500A29034
1227.3633A38636Q954Q192P330O382N359M273L135J958P51m76j709k939A75696
1204.5916A70365o462p529q510r383j0127j0716j1129j1345Tj1124j0677E1997
1183.4463D2820q188p106n988m894l877k976k213j590j095p05l91j22C810
1160.6746D221P41J160J706K414L310M404N693P145Q713J0423J1975J3524I0374
1137.9028A06573J7259J8110J8750J9187J9433J9509J9433J9227J8914B94905
1120.0107C12940J7503J6931J6327J5704J5069J4430J3791J3157J2533D60304
$$ y = [614, 412, 293, 224, 188, 175, 182, 211, 270, 372, 544, 825, 1274, 1972, 3023, 4551, 6689, 9571, 13314, 18007, 23698, 30395, 38055, 46598, 55907, 65837, 76225, 86900, 97686, 108412, 118912, 129034, 138636, 147590, 155782, 163112, 169494, 174853, 179126, 182261, 184219, 184970, 184494, 182785, 179846, 175696, 170365, 163903, 156374, 147864, 138481, 128354, 117638, 106509, 95164, 83819, 72695, 62018, 51997, 42820, 34632, 27526, 21538, 16644, 12767, 9791, 7578, 5988, 4893, 4188, 3797, 3675, 3810, 4221, 4962, 6122, 7828, 10242, 13552, 17956, 23649, 30794, 39507, 49930, 61905, 75429, 90374, 106573, 123832, 141942, 160692, 179879, 199312, 218821, 238254, 257481, 276395, 294905, 312940, 330443, 347374, 363701, 379405, 394474, 408904, 422695, 435852, 448385, 460304]
1102.1188D71623J0734J0164R610R074Q553Q048P560P086O628O184N753E66352
1080.9735E71280M533M148L773L406L047K697K351K013J679J349J023F01999
1059.8284F02378k734k80n96r13j231j551j871k197k524k856l192l533E75019
1037.0566E70785m594m963n338n722o115o517o930p351p784q226q680D89423
1015.9115D79806j0101j0593j1094j1602j2117j2634j3154j3671j4185C55966
998.0194C40787j5651j6095j6506j6875j7191j7445j7625j7718j7711A70378
980.1273A53030j6968j6442j5764j4935j3957j2844j1613j0295q925B3740
962.2352A7533m950l818k840k035j403r28n94l67k21j30p6m2k2pNJ9A63
$$ y = [471623, 482357, 492521, 502131, 511205, 519758, 527806, 535366, 542452, 549080, 555264, 561017, 566352, 571280, 575813, 579961, 583734, 587140, 590187, 592884, 595235, 597248, 598927, 600276, 601299, 601999, 602378, 599644, 599364, 598768, 597855, 596624, 595073, 593202, 591005, 588481, 585625, 582433, 578900, 575019, 570785, 566191, 561228, 555890, 550168, 544053, 537536, 530606, 523255, 515471, 507245, 498565, 489423, 479806, 469705, 459112, 448018, 436416, 424299, 411665, 398511, 384840, 370655, 355966, 340787, 325136, 309041, 292535, 275660, 258469, 241024, 223399, 205681, 187970, 170378, 153030, 136062, 119620, 103856, 88921, 74964, 62120, 50507, 40212, 31287, 23740, 17533, 12583, 8765, 5925, 3890, 2487, 1559, 965, 598, 377, 247, 171, 129, 107, 100, 105, 124, 163]
932.95734B33J21K05L44N58Q80J338J958K756L734M880O163P547Q985E0131
908.559F1964J3162J4381J5469J6411J7202J7839J8329J8678J8898B31334
890.667B50332J8904J8731J8491J8194J7851J7471J7061J6630J6182D25571
872.7749D40829J4791K4237J4070J3599J3135J2680J2236J1803J1381E79732
854.8828E90306J0189R817R457R109Q774Q449Q138P836P546P267O996F90621
833.7377F97108O245O012N787N571N361N160M964M776M594M417M246G58322
812.59247G62242L764L613L466L323L183L047K915K784K658K533K411G98230
791.44727H00403K057J942J828J715J604J492J382J271J161J050R39Q27H18385
$$ y = [233, 354, 559, 903, 1461, 2341, 3679, 5637, 8393, 12127, 17007, 23170, 30717, 39702, 50131, 61964, 75126, 89507, 104976, 121387, 138589, 156428, 174757, 193435, 212333, 231334, 250332, 269236, 287967, 306458, 324652, 342503, 359974, 377035, 393665, 409847, 425571, 440829, 455620, 479857, 493927, 507526, 520661, 533341, 545577, 557380, 568761, 579732, 590306, 600495, 610312, 619769, 628878, 637652, 646101, 654239, 662075, 669621, 676888, 683884, 690621, 697108, 703353, 709365, 715152, 720723, 726084, 731244, 736208, 740984, 745578, 749995, 754241, 758322, 762242, 766006, 769619, 773085, 776408, 779591, 782638, 785553, 788337, 790995, 793528, 795939, 798230, 800403, 802460, 804402, 806230, 807945, 809549, 811041, 812423, 813694, 814855, 815905, 816844, 817671, 818385]
768.67554H18984M84L66K46J0844q8k16l48m84o25p70r21j078j240j410H22156
742.65076H20382j969k175k391k619k861l116l387l674l981m306m675G80203
721.50555G74782n845o299o786p307p868q468r112r804j0545j1338j2187F66130
700.36035F52072j5080j6161j7295j8478j9698k0945k2195k3425k4601D48513
682.4683D21899k7342k7801k7920k7636k6893k5655k3910k1677j9013A78060
664.57623A65353r246n685k074J555N174Q757J2251J5588J8678K1430B55542
645.0576B81154K6956K7798K8170K8125K7728K7043K6139K5075K3900E44750
627.1655E66141K0119J8862J7636J6451J5315J4228J3194J2211J1276G15823
$$ y = [818984, 819468, 819834, 820080, 830924, 830836, 830620, 830272, 829788, 829163, 828393, 827472, 826394, 825154, 823744, 822156, 820382, 818413, 816238, 813847, 811228, 808367, 805251, 801864, 798190, 794209, 789903, 785228, 780203, 774782, 768937, 762638, 755852, 748545, 740677, 732209, 723097, 713293, 702748, 691410, 679223, 666130, 652072, 636992, 620831, 603536, 585058, 565360, 544415, 522220, 498795, 474194, 448513, 421899, 394557, 366756, 338836, 311200, 284307, 258652, 234742, 213065, 194052, 178060, 165353, 156107, 150422, 148348, 149903, 155077, 163834, 176085, 191673, 210351, 231781, 255542, 281154, 308110, 335908, 364078, 392203, 419931, 446974, 473113, 498188, 522088, 544750, 566141, 586260, 605122, 622758, 639209, 654524, 668752, 681946, 694157, 705433, 715823]
609.27344G25369Q743P974P237O527N839N169M512L862L216K569J914G84180
588.1283G84748j34q60j612k393l201m031m877n720o540p304p967q473G22883
565.35657G14147q346p524o239m499k367L9K567N042P301R214J0704J1744G44137
542.58484G56724J2509J2196K9827J1227J0558R862R169Q495P853P250H82358
523.0662H88528N694N258M860M498M167L867L594L344L117K910K720I35104
501.92102I37492K244K109J987J873J769J672J584J500J424J352J286I57516
480.77585I58682J112J062J014R70R28Q89Q52Q17P85P53P25O97O71O47I71227
454.751I71828N81N60N41N23N06M89M73M58M42M29M15M02L89L77L66I79133
$$ y = [725369, 734112, 742086, 749323, 755850, 761689, 766858, 771370, 775232, 778448, 781017, 782931, 784180, 784748, 784614, 783754, 782142, 779749, 776548, 772517, 767640, 761920, 755380, 748076, 740109, 731636, 722883, 714147, 705801, 698277, 692038, 687539, 685172, 685211, 687778, 692820, 700121, 709335, 720039, 731783, 744137, 756724, 769233, 781429, 811256, 822483, 833041, 842903, 852072, 860567, 868420, 875670, 882358, 888528, 894222, 899480, 904340, 908838, 913005, 916872, 920466, 923810, 926927, 929837, 932557, 935104, 937492, 939736, 941845, 943832, 945705, 947474, 949146, 950730, 952230, 953654, 955006, 956292, 957516, 958682, 959794, 960856, 961870, 962840, 963768, 964657, 965509, 966326, 967111, 967864, 968589, 969286, 969957, 970604, 971227, 971828, 972409, 972969, 973510, 974033, 974539, 975028, 975501, 975959, 976401, 976830, 977245, 977647, 978036, 978413, 978779, 979133]
427.09964I79477L33L23L13L04K94K86K77K68K61K52K44K37K29K22K14I83741
399.44824I83941J92J86J78J71J64J56J49J41J34J25J18J08J00R0Q1P0I86162
370.17032I86209L4K0Oj1k9m8o8r2j16j44j73k05k40k75l13l50l87m19I82954
337.63925I82493m62m43m02l33k38j22J2J52K87M08N07N80O27O49O52I85006
309.98788I85621N84N49N13M77M41M08L77L48L22K98K76K57K39K22K09I91336
282.3365I91519J73J62J54J46J38J32J25J20J14J10J05J01R7R4M650I97991
254.68512I98040M6M4M2M0L8L7L5L4L3L1L0K9K8K7K6TK4K3UK1TK0TJ9I98798
210.7682I98817J7UJ6TJ5VJ3J4TJ3TJ2WJ1VJ0WRJ0RTQRP19LKLKLKTLI99976
$$ y = [979477, 979810, 980133, 980446, 980750, 981044, 981330, 981607, 981875, 982136, 982388, 982632, 982869, 983098, 983320, 983534, 983741, 983941, 984133, 984319, 984497, 984668, 984832, 984988, 985137, 985278, 985412, 985537, 985655, 985763, 985863, 985953, 986034, 986104, 986162, 986209, 986243, 986263, 986269, 986258, 986229, 986181, 986113, 986021, 985905, 985761, 985588, 985383, 985143, 984868, 984555, 984205, 983818, 983399, 982954, 982493, 982031, 981588, 981186, 980853, 980615, 980493, 980505, 980657, 980944, 981352, 981859, 982439, 983066, 983715, 984367, 985006, 985621, 986205, 986754, 987267, 987744, 988185, 988593, 988970, 989318, 989640, 989938, 990214, 990471, 990710, 990932, 991141, 991336, 991519, 991692, 991854, 992008, 992154, 992292, 992424, 992549, 992669, 992783, 992893, 992998, 993099, 993196, 993290, 997940, 997991, 998040, 998086, 998130, 998172, 998212, 998250, 998287, 998322, 998356, 998389, 998420, 998450, 998479, 998507, 998534, 998560, 998586, 998610, 998633, 998656, 998679, 998700, 998721, 998741, 998761, 998780, 998798, 998817, 998834, 998851, 998868, 998884, 998900, 998915, 998930, 998945, 998960, 998973, 998987, 999001, 999014, 999027, 999039, 999051, 999063, 999075, 999087, 999098, 999109, 999120, 999131, 999141, 999151, 999161, 999171, 999181, 999190, 999200, 999209, 999218, 999226, 999235, 999954, 999957, 999959, 999962, 999964, 999967, 999969, 999971, 999974, 999976]
137.57336I99978KWI99989
$$ y = [999978, 999980, 999982, 999984, 999986, 999988, 999989]
126.1875I99991  $$checkpoint
##END= $$ end of 1,1-DCE IR
##TITLE=Raman of 1,1-dichloroethylene $$ Begin of the data block
##JCAMP-DX=5.00 $$ ACD/DocManager Library v 5.00
##DATA TYPE=RAMAN SPECTRUM
##DATA CLASS=XYDATA
##BLOCK ID=6
##DATE=19 Feb 2012 10:30:00
##ORIGIN= Department of Chemistry, UWI, Jamaica
##OWNER= public domain
##SPECTROMETER/DATA SYSTEM=from scan
##$MODELS=
<Models>
<ModelData id="1DCE" type="MOL">
1,1-dichloroethylene
__Jmol-14_02171520543D 1   1.00000     0.00000     0
Jmol version 14.3.12_2015.02.11  2015-02-11 19:15 EXTRACT: ({0:5})
  6  5  0  0  0  0              1 V2000
   0.00000   0.00000   0.41101 C   0  0  0  0  0  0
   0.00000   0.00000   1.74967 C   0  0  0  0  0  0
   0.00000   0.93996   2.32528 H   0  0  0  0  0  0
   0.00000  -0.93996   2.32528 H   0  0  0  0  0  0
   0.00000   1.44639  -0.51808 Cl  0  0  0  0  0  0
   0.00000  -1.44639  -0.51808 Cl  0  0  0  0  0  0
  1  6  1  0  0  0
  1  5  1  0  0  0
  1  2  2  0  0  0
  2  3  1  0  0  0
  2  4  1  0  0  0
M  END
</ModelData>
<ModelData id="i2" type="XYZVIB" baseModel="1DCE" vibrationScale=".5">
6
Model[1]: PATH=Calculation 1;Input;Convg=0.4887D-08;-V/T=2.0006;Energy=NaN;Range=M.O.s;E(RHF)=-995.823662291 A.U.;PATH=Calculation 1;Input
C       0.00000      0.00000      0.00000
C       0.00000      0.00000      1.33866
H       0.93996      0.00000      1.91427
H      -0.93996      0.00000      1.91427
Cl      1.44639      0.00000     -0.92909
Cl     -1.44639      0.00000     -0.92909
6
Model[2]: PATH=Calculation 1;Standard;Convg=0.4887D-08;-V/T=2.0006;Energy=-995.82367;Range=M.O.s;E(RHF)=-995.823662291 A.U.;PATH=Calculation 1;Standard
C       0.00000      0.00000      0.41101
C       0.00000      0.00000      1.74967
H       0.00000      0.93996      2.32528
H       0.00000     -0.93996      2.32528
Cl      0.00000      1.44639     -0.51808
Cl      0.00000     -1.44639     -0.51808
6
Model[3]: IRIntensity=0.1106 KM/Mole;PATH=Calculation 1;FrequenciesFrequencies;ReducedMass=18.4273 AMU;ForceConstant=1.1552 mDyne/A;FreqValue=326.1875;Frequency=326.1875 cm^-1;FrequencyLabel=A1;PATH=Calculation 1;FrequenciesFrequencies
C       0.00000      0.00000      0.41101      0.00000      0.00000     -0.37000
C       0.00000      0.00000      1.74967      0.00000      0.00000     -0.39000
H       0.00000      0.93996      2.32528      0.00000      0.00000     -0.38000
H       0.00000     -0.93996      2.32528      0.00000      0.00000     -0.38000
Cl      0.00000      1.44639     -0.51808      0.00000      0.44000      0.14000
Cl      0.00000     -1.44639     -0.51808      0.00000     -0.44000      0.14000
6
Model[4]: IRIntensity=0.0003 KM/Mole;PATH=Calculation 1;FrequenciesFrequencies;ReducedMass=3.6118 AMU;ForceConstant=0.4422 mDyne/A;FreqValue=455.8292;Frequency=455.8292 cm^-1;FrequencyLabel=B2;PATH=Calculation 1;FrequenciesFrequencies
C       0.00000      0.00000      0.41101      0.00000     -0.07000      0.00000
C       0.00000      0.00000      1.74967      0.00000      0.34000      0.00000
H       0.00000      0.93996      2.32528      0.00000      0.55000     -0.34000
H       0.00000     -0.93996      2.32528      0.00000      0.55000      0.34000
Cl      0.00000      1.44639     -0.51808      0.00000     -0.06000      0.12000
Cl      0.00000     -1.44639     -0.51808      0.00000     -0.06000     -0.12000
6
Model[5]: IRIntensity=2.8951 KM/Mole;PATH=Calculation 1;FrequenciesFrequencies;ReducedMass=7.2233 AMU;ForceConstant=1.3108 mDyne/A;FreqValue=554.9693;Frequency=554.9693 cm^-1;FrequencyLabel=B1;PATH=Calculation 1;FrequenciesFrequencies
C       0.00000      0.00000      0.41101      0.70000      0.00000      0.00000
C       0.00000      0.00000      1.74967     -0.19000      0.00000      0.00000
H       0.00000      0.93996      2.32528     -0.48000      0.00000      0.00000
H       0.00000     -0.93996      2.32528     -0.48000      0.00000      0.00000
Cl      0.00000      1.44639     -0.51808     -0.07000      0.00000      0.00000
Cl      0.00000     -1.44639     -0.51808     -0.07000      0.00000      0.00000
6
Model[6]: IRIntensity=18.6624 KM/Mole;PATH=Calculation 1;FrequenciesFrequencies;ReducedMass=9.0383 AMU;ForceConstant=2.3129 mDyne/A;FreqValue=659.0407;Frequency=659.0407 cm^-1;FrequencyLabel=A1;PATH=Calculation 1;FrequenciesFrequencies
C       0.00000      0.00000      0.41101      0.00000      0.00000      0.36001
C       0.00000      0.00000      1.74967      0.00000      0.00000      0.48000
H       0.00000      0.93996      2.32528      0.00000     -0.01000      0.51000
H       0.00000     -0.93996      2.32528      0.00000      0.01000      0.51000
Cl      0.00000      1.44639     -0.51808      0.00000      0.19000     -0.16000
Cl      0.00000     -1.44639     -0.51808      0.00000     -0.19000     -0.16000
6
Model[7]: IRIntensity=0.0000 KM/Mole;PATH=Calculation 1;FrequenciesFrequencies;ReducedMass=1.0197 AMU;ForceConstant=0.4876 mDyne/A;FreqValue=900.8576;Frequency=900.8576 cm^-1;FrequencyLabel=A2;PATH=Calculation 1;FrequenciesFrequencies
C       0.00000      0.00000      0.41101      0.00000      0.00000      0.00000
C       0.00000      0.00000      1.74967      0.00000      0.00000      0.00000
H       0.00000      0.93996      2.32528      0.71000      0.00000      0.00000
H       0.00000     -0.93996      2.32528     -0.71000      0.00000      0.00000
Cl      0.00000      1.44639     -0.51808     -0.01000      0.00000      0.00000
Cl      0.00000     -1.44639     -0.51808      0.01000      0.00000      0.00000
6
Model[8]: IRIntensity=92.0040 KM/Mole;PATH=Calculation 1;FrequenciesFrequencies;ReducedMass=3.0785 AMU;ForceConstant=1.6024 mDyne/A;FreqValue=939.9244;Frequency=939.9244 cm^-1;FrequencyLabel=B2;PATH=Calculation 1;FrequenciesFrequencies
C       0.00000      0.00000      0.41101      0.00000      0.37000      0.00000
C       0.00000      0.00000      1.74967      0.00000      0.09000      0.00000
H       0.00000      0.93996      2.32528      0.00000     -0.27001      0.59000
H       0.00000     -0.93996      2.32528      0.00000     -0.27001     -0.59000
Cl      0.00000      1.44639     -0.51808      0.00000     -0.07000      0.04000
Cl      0.00000     -1.44639     -0.51808      0.00000     -0.07000     -0.04000
6
Model[9]: IRIntensity=52.9028 KM/Mole;PATH=Calculation 1;FrequenciesFrequencies;ReducedMass=1.3120 AMU;ForceConstant=1.0456 mDyne/A;FreqValue=1163.0605;Frequency=1163.0605 cm^-1;FrequencyLabel=B1;PATH=Calculation 1;FrequenciesFrequencies
C       0.00000      0.00000      0.41101     -0.04000      0.00000      0.00000
C       0.00000      0.00000      1.74967      0.16000      0.00000      0.00000
H       0.00000      0.93996      2.32528     -0.70000      0.00000      0.00000
H       0.00000     -0.93996      2.32528     -0.70000      0.00000      0.00000
Cl      0.00000      1.44639     -0.51808      0.00000      0.00000      0.00000
Cl      0.00000     -1.44639     -0.51808      0.00000      0.00000      0.00000
6
Model[10]: IRIntensity=85.0510 KM/Mole;PATH=Calculation 1;FrequenciesFrequencies;ReducedMass=1.8092 AMU;ForceConstant=1.7212 mDyne/A;FreqValue=1270.7289;Frequency=1270.7289 cm^-1;FrequencyLabel=B2;PATH=Calculation 1;FrequenciesFrequencies
C       0.00000      0.00000      0.41101      0.00000      0.21000      0.00000
C       0.00000      0.00000      1.74967      0.00000     -0.16000      0.00000
H       0.00000      0.93996      2.32528      0.00000      0.23001     -0.64000
H       0.00000     -0.93996      2.32528      0.00000      0.23001      0.64000
Cl      0.00000      1.44639     -0.51808      0.00000     -0.02000      0.01000
Cl      0.00000     -1.44639     -0.51808      0.00000     -0.02000     -0.01000
6
Model[11]: IRIntensity=6.8266 KM/Mole;PATH=Calculation 1;FrequenciesFrequencies;ReducedMass=1.4915 AMU;ForceConstant=2.1016 mDyne/A;FreqValue=1546.4604;Frequency=1546.4604 cm^-1;FrequencyLabel=A1;PATH=Calculation 1;FrequenciesFrequencies
C       0.00000      0.00000      0.41101      0.00000      0.00000      0.20001
C       0.00000      0.00000      1.74967      0.00000      0.00000     -0.06000
H       0.00000      0.93996      2.32528      0.00000      0.31000     -0.62000
H       0.00000     -0.93996      2.32528      0.00000     -0.31000     -0.62000
Cl      0.00000      1.44639     -0.51808      0.00000      0.01000     -0.01000
Cl      0.00000     -1.44639     -0.51808      0.00000     -0.01000     -0.01000
6
Model[12]: IRIntensity=47.1352 KM/Mole;PATH=Calculation 1;FrequenciesFrequencies;ReducedMass=2.6981 AMU;ForceConstant=4.9710 mDyne/A;FreqValue=1768.3251;Frequency=1768.3251 cm^-1;FrequencyLabel=A1;PATH=Calculation 1;FrequenciesFrequencies
C       0.00000      0.00000      0.41101      0.00000      0.00000     -0.26000
C       0.00000      0.00000      1.74967      0.00000      0.00000      0.29000
H       0.00000      0.93996      2.32528      0.00000      0.49001     -0.43000
H       0.00000     -0.93996      2.32528      0.00000     -0.49001     -0.43000
Cl      0.00000      1.44639     -0.51808      0.00000     -0.01000      0.01000
Cl      0.00000     -1.44639     -0.51808      0.00000      0.01000      0.01000
6
Model[13]: IRIntensity=0.0670 KM/Mole;PATH=Calculation 1;FrequenciesFrequencies;ReducedMass=1.0641 AMU;ForceConstant=6.0497 mDyne/A;FreqValue=3106.4325;Frequency=3106.4325 cm^-1;FrequencyLabel=A1;PATH=Calculation 1;FrequenciesFrequencies
C       0.00000      0.00000      0.41101      0.00000      0.00000      0.01000
C       0.00000      0.00000      1.74967      0.00000      0.00000     -0.07000
H       0.00000      0.93996      2.32528      0.00000      0.61000      0.36001
H       0.00000     -0.93996      2.32528      0.00000     -0.61000      0.36001
Cl      0.00000      1.44639     -0.51808      0.00000      0.00000      0.00000
Cl      0.00000     -1.44639     -0.51808      0.00000      0.00000      0.00000
6
Model[14]: IRIntensity=0.8160 KM/Mole;PATH=Calculation 1;FrequenciesFrequencies;ReducedMass=1.1196 AMU;ForceConstant=6.6677 mDyne/A;FreqValue=3179.2916;Frequency=3179.2916 cm^-1;FrequencyLabel=B2;PATH=Calculation 1;FrequenciesFrequencies
C       0.00000      0.00000      0.41101      0.00000      0.00000      0.00000
C       0.00000      0.00000      1.74967      0.00000     -0.10000      0.00000
H       0.00000      0.93996      2.32528      0.00000      0.60001      0.37000
H       0.00000     -0.93996      2.32528      0.00000      0.60001     -0.37000
Cl      0.00000      1.44639     -0.51808      0.00000      0.00000      0.00000
Cl      0.00000     -1.44639     -0.51808      0.00000      0.00000      0.00000
</ModelData>
</Models>
##$PEAKS=
<Peaks type="RAMAN" xUnitsExpected="1/cm"  >
<PeakData id="1" title="1 (~3180 cm-1)" peakShape="broad" model="i2.14" xMax="3195" xMin="3165"    />
<PeakData id="2" title="2 (~3110 cm-1)" peakShape="broad" model="i2.13" xMax="3125" xMin="3085"    />
<PeakData id="3" title="3 (~1770 cm-1)" peakShape="broad" model="i2.12" xMax="1785" xMin="1750"    />
<PeakData id="4" title="4 (~1550 cm-1)" peakShape="broad" model="i2.11" xMax="1560" xMin="1530"    />
<PeakData id="5" title="5 (~1270 cm-1)" peakShape="broad" model="i2.10" xMax="1290" xMin="1260"    />
<PeakData id="6" title="6 (~1160 cm-1)" peakShape="broad" model="i2.9" xMax="1180" xMin="1150"    />
<PeakData id="7" title="7 (~940 cm-1)" peakShape="broad" model="i2.8" xMax="955" xMin="925"    />
<PeakData id="8" title="8 (~900 cm-1)" peakShape="broad" model="i2.7" xMax="915" xMin="885"    />
<PeakData id="9" title="9 (~660 cm-1)" peakShape="broad" model="i2.6" xMax="675" xMin="645"    />
<PeakData id="10" title="10 (~555 cm-1)" peakShape="broad" model="i2.5" xMax="570" xMin="540"    />
<PeakData id="11" title="11 (~455 cm-1)" peakShape="broad" model="i2.4" xMax="470" xMin="440"    />
<PeakData id="12" title="12 (~330 cm-1)" peakShape="broad" model="i2.3" xMax="340" xMin="310"    />
</Peaks>
##XUNITS=1/CM
##YUNITS=RAMAN INTENSITY
##XFACTOR= 1
##YFACTOR= 1.084966E-06
##FIRSTX= 3.377665E+03
##FIRSTY= 1.382219E-02
##LASTX= 1.261875E+02
##NPOINTS= 2000
##MINY= 0
##MAXY= 1.084966
##XYDATA= (X++(Y..Y))
3377.665A2740J86J91J96J99K05K09K14K19K24K30K35K41K47K53K60A6315
3350.0137A6588K80K87K95L03L11L20L28L37L46L57L66L78L88L99M12B2118
3322.3623B2555M50M64M79M94N09N27N43N62N80O01O21O43O65O90P14C1838
3294.711C2607P97Q28Q61Q94R30R68J007J050J094J141J191J244J301D7272
3270.3125D8696J491J562J640J721J808J902K003K109K225K349K482K626G5395
3247.5408G8344L130L326L539L771M024M298M598M927N286N680O114O591A40744
3224.769A48441Q339R050R836J0711J1680J2757J3954J5282J6753J8382B95361
3205.2505C17504K4285K6590K9038L1586L4159L6649L8898M0695M1774F62999
$$ y = [12740, 12926, 13117, 13313, 13512, 13717, 13926, 14140, 14359, 14583, 14813, 15048, 15289, 15536, 15789, 16049, 16315, 16588, 16868, 17155, 17450, 17753, 18064, 18384, 18712, 19049, 19395, 19752, 20118, 20496, 20884, 21283, 21695, 22118, 22555, 23005, 23469, 23948, 24442, 24951, 25478, 26021, 26583, 27163, 27764, 28385, 29028, 29693, 30383, 31097, 31838, 32607, 33404, 34232, 35093, 35987, 36917, 37885, 38892, 39942, 41036, 42177, 43368, 44612, 45913, 47272, 48696, 50187, 51749, 53389, 55110, 56918, 58820, 60823, 62932, 65157, 67506, 69988, 72614, 75395, 78344, 81474, 84800, 88339, 92110, 96134, 100432, 105030, 109957, 115243, 120923, 127037, 133628, 140744, 148441, 156780, 165830, 175666, 186377, 198057, 210814, 224768, 240050, 256803, 275185, 295361, 317504, 341789, 368379, 397417, 429003, 463162, 499811, 538709, 579404, 621178, 662999]
3187.3584G03510L7549L2744K6091J7823Q429j400j0892j9331k6193l1198G02815
3167.8398F67101l5670l4509l2543l0047k7237k4275k1271j8300j5404D15246
3149.9478D05355p268m717k216K59K734N236P792J0427J3168J6035J9047D88060
3128.8025E13577K8950L2458L5954L9306M2322M4739M6230M6407M4864I16043
3110.9104I51331K7012J6699M958p351j9265k9899l8596m5011m9110n1099G08339
3091.3918F58131m8130m5436m2402l9236l6081l3035l0159k7483k5021C08374
3073.4998B87640j8890j7226j5728j4380j3167j2075j1091j0205r405A56791
3055.6077A48763p436o897o408n963n556n186m846m536m250l989l746H6425
$$ y = [703510, 741059, 773803, 799894, 817717, 826146, 824746, 813854, 794523, 768330, 737132, 702815, 667101, 631431, 596922, 564379, 534332, 507095, 482820, 461549, 443249, 427845, 415246, 405355, 398087, 393370, 391154, 391413, 394147, 399383, 407175, 417602, 430770, 446805, 465852, 488060, 513577, 542527, 574985, 610939, 650245, 692567, 737306, 783536, 829943, 874807, 916043, 951331, 978343, 995042, 1000000, 992649, 973384, 943485, 904889, 859878, 810768, 759669, 708339, 658131, 610001, 564565, 522163, 482927, 446846, 413811, 383652, 356169, 331148, 308374, 287640, 268750, 251524, 235796, 221416, 208249, 196174, 185083, 174878, 165473, 156791, 148763, 141327, 134430, 128022, 122059, 116503, 111317, 106471, 101935, 97685, 93696, 89950, 86425]
3034.4626H3106l129k954k791k639k500k368k247k134k027j929j836j748E3136
3011.691E1545j520j451j389j328j272j219j169j121j076j033r93r55C6100
2988.9192C5216q51q21p90p63p35p10o86o62o41o19n98n79n61n43n26B4622
2961.2678B4128m79m65m51m37m25m12m01l90l78l68l58l48l39l30l21A7913
2933.6165A7608k96k90k82k74k68k62k55k49k43k37k32k26k21k15k11A3641
2905.9648A3439j97j92j89j84j80j77j73j69j65j62j59j55j52j50j46A0746
2878.3135A0606j38j35j32j30j27j25j23j20j18j15j14j12j09j08j05H691
2850.662H589j00r8r7r4Tr1r0q9q7q6q4q3q1q0p9p8p6p5p4p3p1To9o8F533
$$ y = [83106, 79977, 77023, 74232, 71593, 69093, 66725, 64478, 62344, 60317, 58388, 56552, 54804, 53136, 51545, 50025, 48574, 47185, 45857, 44585, 43366, 42197, 41076, 40000, 38967, 37974, 37019, 36100, 35216, 34365, 33544, 32754, 31991, 31256, 30546, 29860, 29198, 28557, 27938, 27340, 26761, 26200, 25657, 25131, 24622, 24128, 23649, 23184, 22733, 22296, 21871, 21459, 21058, 20668, 20290, 19922, 19564, 19216, 18877, 18547, 18226, 17913, 17608, 17312, 17022, 16740, 16466, 16198, 15936, 15681, 15432, 15189, 14952, 14720, 14494, 14273, 14058, 13847, 13641, 13439, 13242, 13050, 12861, 12677, 12497, 12320, 12147, 11978, 11813, 11651, 11492, 11337, 11185, 11035, 10889, 10746, 10606, 10468, 10333, 10201, 10071, 9944, 9819, 9696, 9576, 9458, 9343, 9229, 9117, 9008, 8900, 8795, 8691, 8589, 8489, 8391, 8294, 8200, 8106, 8015, 7925, 7836, 7749, 7663, 7579, 7496, 7415, 7335, 7256, 7178, 7102, 7027, 6953, 6880, 6809, 6738, 6669, 6601, 6533]
2808.3718F467o5o4o3To1o0Tn9n7Tn6Tn4Tn3n2Tn1j931l4Ul2l3l2l1Tl0C177
2759.5752C148k9Uk8Tk7Tk6k7k5k6k5Uk4Tk3Wk2k1k2k1Vk0Uj9Tk362%@
$$ y = [6467, 6402, 6338, 6275, 6212, 6151, 6091, 6031, 5972, 5915, 5858, 5802, 5746, 5692, 5638, 5585, 5533, 5481, 5430, 3499, 3465, 3431, 3397, 3365, 3332, 3300, 3269, 3238, 3208, 3177, 3148, 3119, 3090, 3061, 3033, 3005, 2978, 2951, 2925, 2898, 2873, 2847, 2822, 2797, 2772, 2748, 2724, 2701, 2678, 2655, 2632, 2609, 2587, 2566, 2544, 2523, 2502, 2481, 2460, 2440, 2420, 2400, 2381, 2362, 0, 0, 0]
2699.3928@%U26N72NTMNWONUONOTNOXPOPOPTOPUQPTQTPQURQTRYJ0XJ1A001
2068.2905A012J1J2J1J2J1J2J3J2J3J2J3J4J3J4UJ5J4J5J6J5J6TJ7J6A370
2024.3738A388J8UJ9TK0J9K1VK2K3UK4TK5K6TK7TK8TK9L0TL1L2L3TL4B216
1969.0709B252L7TL9TM1TM3TM5M6M7M9TN1J348O4O6O8P0P1P3P6P7Q0Q1E017
1925.154E103Q9R1R4R7R9J03J06J08J13J16J19J24J27J32J36J41J46G195
1894.2496G351J61J68J74J80J87J95K02K09K19K27K37K46K58K68K80K93A1161
1864.9717A1481L35L51L69L86M06M27M48M73M98N26N55N87O21O58O97A9559
1837.3203B0346Q38Q93R52J018J089J166J251J344J447J559J682J819C7373
1814.5486C9510K321K526K753L006L287L600L948M334M763N238N762O338I4349
$$ y = [1012, 1023, 1035, 1046, 1058, 1069, 1081, 1094, 1106, 1119, 1131, 1144, 1158, 1171, 1185, 1199, 1213, 1228, 1242, 1257, 1273, 1288, 1304, 1320, 1337, 1353, 1370, 1388, 1406, 1424, 1442, 1461, 1480, 1500, 1519, 1540, 1561, 1582, 1603, 1625, 1648, 1671, 1694, 1718, 1742, 1767, 1793, 1819, 1846, 1873, 1901, 1929, 1958, 1988, 2018, 2049, 2081, 2114, 2147, 2181, 2216, 2252, 2289, 2326, 2365, 2404, 2445, 2486, 2529, 2572, 2617, 2663, 2710, 2759, 2808, 2859, 4207, 4271, 4337, 4405, 4475, 4546, 4619, 4695, 4772, 4852, 4933, 5017, 5103, 5192, 5283, 5377, 5474, 5573, 5676, 5782, 5890, 6003, 6119, 6238, 6362, 6489, 6621, 6757, 6898, 7044, 7195, 7351, 7512, 7680, 7854, 8034, 8221, 8416, 8618, 8827, 9046, 9273, 9510, 9756, 10014, 10282, 10562, 10855, 11161, 11481, 11816, 12167, 12536, 12922, 13328, 13755, 14203, 14676, 15174, 15700, 16255, 16842, 17463, 18121, 18818, 19559, 20346, 21184, 22077, 23029, 24047, 25136, 26302, 27553, 28897, 30344, 31903, 33585, 35404, 37373, 39510, 41831, 44357, 47110, 50116, 53403, 57003, 60951, 65285, 70048, 75286, 81048, 87386, 94349]
1791.7769A01987Q354R099R849J0575J1225J1740J2036J2023J1599J0680B18372
1772.2582B25546M656J797j196m091o677q793j0359j1366j1863j1936A54035
1752.7395A42837j0562r846r096q347p624o941o305n721n187m703m265F0370
1731.5944E6855l194k906k647k413k203k012j840j684j542j414j296j189C1424
1708.8226C0422r18q42p72p07o47n90n38m88m43m00l58l20k83k48k15B2470
1681.1713B2318j22r3o5l8j1J6M2O7R4J20J45J71J98K25K52K79L09L37B4612
1648.6403B5011M31M65N01N37N75O16O58P04P51Q01Q54R12R71J037J105C7108
1620.9889C8367J344J436J534J642J758J883K020K168K329K506K699K910F5738
$$ y = [101987, 110341, 119440, 129289, 139864, 151089, 162829, 174865, 186888, 198487, 209167, 218372, 225546, 230202, 231999, 230803, 226712, 220035, 211242, 200883, 189517, 177654, 165718, 154035, 142837, 132275, 122429, 113333, 104986, 97362, 90421, 84116, 78395, 73208, 68505, 64240, 60370, 56855, 53661, 50755, 48108, 45695, 43492, 41480, 39640, 37956, 36414, 35000, 33704, 32515, 31424, 30422, 29504, 28662, 27890, 27183, 26536, 25946, 25408, 24920, 24477, 24077, 23719, 23399, 23116, 22868, 22653, 22470, 22318, 22196, 22103, 22038, 22000, 21989, 22005, 22047, 22114, 22208, 22328, 22473, 22644, 22842, 23067, 23319, 23598, 23907, 24244, 24612, 25011, 25442, 25907, 26408, 26945, 27520, 28136, 28794, 29498, 30249, 31050, 31904, 32816, 33787, 34824, 35929, 37108, 38367, 39711, 41147, 42681, 44323, 46081, 47964, 49984, 52152, 54481, 56987, 59686, 62596, 65738]
1598.2172F9134L677L986M327M704N122N586O099O672P307Q015Q801R675A53750
1575.4454A65469J2904J4204J5620J7146J8764K0448K2146K3839K5257C62215
1557.5533C89304K7055K6097K4013K0675J6077J0377L906k867r421j5273D69877
1538.0347D46266k5892k7022k7189k6618k5524k4092k2472k0779j9089B10131
1520.1426A94215j4482j3165j1961j0871r885q996q197p479o833o252I0364
1500.624H5105m836m454m108l795l512l254l021k809k614k436k275k126D3875
1477.8523D2010j750j644j545j455j372j294j222j155j094j035r82r32B5646
1455.0806B4805q00p61p25o91o60o30o01n75n50n27n04m83m64m44m27A5553
$$ y = [69134, 72811, 76797, 81124, 85828, 90950, 96536, 102635, 109307, 116614, 124629, 133430, 143105, 153750, 165469, 178373, 192577, 208197, 225343, 244107, 264555, 286701, 310540, 335797, 362215, 389304, 416359, 442456, 466469, 487144, 503221, 513598, 517504, 514637, 505216, 489943, 469877, 446266, 420374, 393352, 366163, 339545, 314021, 289929, 267457, 246678, 227589, 210131, 194215, 179733, 166568, 154607, 143736, 133851, 124855, 116658, 109179, 102346, 96094, 90364, 85105, 80269, 75815, 71707, 67912, 64400, 61146, 58125, 55316, 52702, 50266, 47991, 45865, 43875, 42010, 40260, 38616, 37071, 35616, 34244, 32950, 31728, 30573, 29479, 28444, 27462, 26530, 25646, 24805, 24005, 23244, 22519, 21828, 21168, 20538, 19937, 19362, 18812, 18285, 17781, 17298, 16834, 16390, 15963, 15553]
1427.4292A5159l78l65l50l38l25l13l02k91k81k71k62k53k44k37k28A0500
1399.7777A0286k07k01j94j88j82j77j71j67j61j57j52j47j43j40j35G633
1372.1263G505j24j21o81j10j06j04j01r8r5r3r1q7q6q3q1p9p7p5p2p1E030
1336.3423D963o5o3o2o0n8n6Tn3n2n1m9m8m6m5m4m2m1m0l8l7l6l4J03C959
1295.6785C929k8k7k6k5k3k2k1k0j8j7j5Tj2Tj0qpnmk%KMNQJ0J2J4J7C704
1245.2552C726K6K8L2L6L9M4M8N2N8O4O9P6Q2R1R8J08J18J29J40J54J68E570
1207.8446E772K22K43K67K95L24L57L93M35M80N29N84O43P08P75Q46R17A4775
1178.5667A5822J097J124J123J083R97Q57O65M28J57j25l99o44q43r91A9265
$$ y = [15159, 14781, 14416, 14066, 13728, 13403, 13090, 12788, 12497, 12216, 11945, 11683, 11430, 11186, 10949, 10721, 10500, 10286, 10079, 9878, 9684, 9496, 9314, 9137, 8966, 8799, 8638, 8481, 8329, 8182, 8039, 7899, 7764, 7633, 7505, 7381, 7260, 6579, 6469, 6363, 6259, 6158, 6060, 5965, 5872, 5781, 5694, 5608, 5525, 5444, 5365, 5288, 5213, 5141, 5070, 5030, 4963, 4898, 4835, 4773, 4713, 4655, 4599, 4543, 4490, 4438, 4387, 4338, 4290, 4244, 4199, 4155, 4113, 4072, 4032, 3994, 3957, 3921, 3887, 3990, 3959, 3929, 3901, 3874, 3848, 3823, 3800, 3778, 3757, 3737, 3719, 3702, 3687, 3672, 3660, 3648, 3638, 3630, 3623, 3618, 3614, 3612, 3612, 3614, 3618, 3623, 3631, 3641, 3653, 3667, 3684, 3704, 3726, 3752, 3780, 3812, 3848, 3887, 3931, 3979, 4031, 4089, 4153, 4222, 4298, 4380, 4471, 4569, 4677, 4795, 4924, 5064, 5218, 5386, 5570, 5772, 5994, 6237, 6504, 6799, 7123, 7480, 7873, 8308, 8788, 9317, 9901, 10544, 11252, 12027, 12873, 13790, 14775, 15822, 16919, 18043, 19166, 20249, 21246, 22103, 22768, 23196, 23353, 23228, 22829, 22185, 21342, 20351, 19265]
1152.5419A8131j139j116j070j010k217q61p90p22o57n97n42m92m45m05E701
1126.517E367l03k76k52k30k10j92j76j61j48j36j25j14j06r7r0q3p6B522
1095.6125B458o0n4n0m6m2l9l5l1k9k6k3k1j7j6j3j1rpnljJL43QRJ1J3B320
1048.4425B337J8K1K2K4K7K8L1L2L5L7M0M2M4M7N0N3N6N9O3O6P0P4P8C437
1007.7787C525R2R8J04J11J17J24J32J40J50J60J70J82J94K08K24K40F229
978.5008F507L00L24L50L80M11M47M85N28N73O23O77P32P91Q50J072A6011
950.84937A7017J038J052J046J016R61Q89Q05P21O50O02N87O11O74P73B9350
924.8246C0420J256J459J673J891K102K294K452K554K581K506K311J980E6993
$$ y = [18131, 16992, 15876, 14806, 13796, 11579, 10718, 9928, 9206, 8549, 7952, 7410, 6918, 6473, 6068, 5701, 5367, 5064, 4788, 4536, 4306, 4096, 3904, 3728, 3567, 3419, 3283, 3158, 3044, 2938, 2841, 2751, 2668, 2592, 2522, 2458, 2398, 2344, 2294, 2248, 2206, 2167, 2132, 2101, 2072, 2046, 2023, 2002, 1985, 1969, 1956, 1945, 1936, 1929, 1924, 1921, 1920, 1921, 2264, 2272, 2281, 2292, 2305, 2320, 2337, 2355, 2376, 2398, 2422, 2449, 2477, 2508, 2540, 2575, 2612, 2652, 2694, 2738, 2785, 2835, 2888, 2944, 3003, 3066, 3132, 3202, 3276, 3354, 3437, 3525, 3617, 3715, 3819, 3930, 4047, 4171, 4303, 4443, 4593, 4753, 4923, 5105, 5299, 5507, 5731, 5971, 6229, 6507, 6807, 7131, 7481, 7861, 8272, 8719, 9204, 9732, 10305, 10928, 11605, 12337, 13128, 13978, 15050, 16011, 17017, 18055, 19107, 20153, 21169, 22130, 23019, 23824, 24545, 25195, 25797, 26384, 26995, 27669, 28442, 29350, 30420, 31676, 33135, 34808, 36699, 38801, 41095, 43547, 46101, 48682, 51188, 53499, 55479, 56993]
902.05286E7923K62m40j119j725k222k586k819k931k940k874k752k595C0763
879.2811B8529k053j875j709j554j411j282j163j056r60q73p95p24o61A1809
854.8828A1384n05m62m24l90l57l30l02k79k57k37k18k00j85j70j57F768
827.23145F636j21j10j01r1q3p4o7n9n2m5l9l2k7k0j5rlJPJ3J7K3K8L3E848
784.9411E891M9N4O0O5P0P7Q3Q8R5J02J08J16J23P7J39J48J57J66J76H030
750.7835H227K09K21K35K48K64K79K97L14L34L56L78M02M28M57M88O37A4332
721.50555A4930O40O88P39P95Q56R25R98J081J171J271J382J504J641C0414
697.1073C2374K148K356K587K844L127L441L784M159M561M990N434N883H4004
$$ y = [57923, 58185, 57745, 56626, 54901, 52679, 50093, 47274, 44343, 41403, 38529, 35777, 33182, 30763, 28529, 26476, 24601, 22892, 21338, 19927, 18645, 17482, 16426, 15466, 14593, 13798, 13074, 12413, 11809, 11384, 10879, 10417, 9993, 9603, 9246, 8916, 8614, 8335, 8078, 7841, 7623, 7423, 7238, 7068, 6911, 6768, 6636, 6515, 6405, 6304, 6213, 6130, 6056, 5989, 5930, 5878, 5833, 5794, 5762, 5735, 5715, 5700, 5691, 5688, 5689, 5696, 5709, 5726, 5749, 5777, 5810, 5848, 5891, 5940, 5994, 6054, 6119, 6189, 6266, 6349, 6437, 6532, 6634, 6742, 6858, 6981, 7058, 7197, 7345, 7502, 7668, 7844, 8030, 8227, 8436, 8657, 8892, 9140, 9404, 9683, 9980, 10294, 10628, 10984, 11362, 11764, 12192, 12649, 13137, 13774, 14332, 14930, 15570, 16258, 16997, 17792, 18648, 19573, 20571, 21652, 22823, 24094, 25476, 26980, 28621, 30414, 32374, 34522, 36878, 39465, 42309, 45436, 48877, 52661, 56820, 61381, 66371, 71805, 77688, 84004]
674.3356I0709P013P192P186O935O389N513M306K807J108o73k394l931A26971
651.5638A20852o714p007p045o891o596o213n780n328m875m437m023E2307
630.41864D9028k952k653k380k133j908j702j515j343j184j038r02p73B7892
607.6469B7354m27l19k14j09nJ02K11L23M41N65O96Q36R87J149J322C4422
579.99554C6132J923K148K378K611K834L036L197L295L303L192K938K522G1456
557.2238G2687M15m39j265k001k604l046l328l464l475l394l245l081D0923
534.4521C8313k385k166j959j764j584j418j265j125r95q78p68o66n72B0286
510.05377A9888l17k40j63q9j3O1LK19L00L87M78N75O80P93R14J044J186B7044
$$ y = [90709, 97722, 104914, 112100, 119035, 125424, 130937, 135243, 138050, 139158, 138485, 136091, 132160, 126971, 120852, 114138, 107131, 100086, 93195, 86599, 80386, 74606, 69278, 64403, 59966, 55943, 52307, 49028, 46076, 43423, 41043, 38910, 37002, 35300, 33785, 32442, 31258, 30220, 29318, 28545, 27892, 27354, 26927, 26608, 26394, 26285, 26280, 26382, 26593, 26916, 27357, 27922, 28618, 29454, 30441, 31590, 32912, 34422, 36132, 38055, 40203, 42581, 45192, 48026, 51062, 54259, 57554, 60857, 64049, 66987, 69509, 71456, 72687, 73102, 72663, 71398, 69397, 66793, 63747, 60419, 56955, 53480, 50086, 46841, 43760, 40923, 38313, 35928, 33762, 31803, 30039, 28455, 27037, 25772, 24647, 23652, 22774, 22006, 21340, 20768, 20286, 19888, 19571, 19331, 19168, 19079, 19066, 19127, 19130, 19349, 19649, 20036, 20514, 21089, 21769, 22562, 23476, 24520, 25706, 27044]
479.1493B8544J669J845K022K191K344K467K540K544K456K259J936J492E5246
456.37756E5553l52r91j561k026k370k590k696k709k648k537k392k229B8393
433.60583B6504j725j570j425j292j169j058r57q65p82p07o39n76n20A2751
409.20755A2330l77l37l00k64k31k01j70j42j15q8o2l5j0J6M3P0R9J27A0511
376.6765A0702K25K61L01L44L91M41M97N57O25O98P79Q69R68J076J195B1253
349.02512B2714J608J760J913K061K194K298K361K359K275K092J796J388D7702
326.2534D8011k93q74j393j819k133k335k434k448k397k299k170k026B3516
303.48166B1792j577j440j312j194j086r89r00q21p50o85o27n75n28m86H375
$$ y = [28544, 30213, 32058, 34080, 36271, 38615, 41082, 43622, 46166, 48622, 50881, 52817, 54309, 55246, 55553, 55201, 54210, 52649, 50623, 48253, 45663, 42967, 40258, 37610, 35073, 32681, 30452, 28393, 26504, 24779, 23209, 21784, 20492, 19323, 18265, 17308, 16443, 15661, 14954, 14315, 13739, 13219, 12751, 12330, 11953, 11616, 11316, 11052, 10821, 10620, 10450, 10308, 10193, 10105, 10043, 10008, 9998, 10014, 10057, 10127, 10226, 10353, 10511, 10702, 10927, 11188, 11489, 11833, 12224, 12665, 13162, 13719, 14344, 15042, 15821, 16690, 17658, 18734, 19929, 21253, 22714, 24322, 26082, 27995, 30056, 32250, 34548, 36909, 39268, 41543, 43635, 45431, 46819, 47702, 48011, 47718, 46844, 45451, 43632, 41499, 39164, 36730, 34282, 31885, 29586, 27416, 25390, 23516, 21792, 20215, 18775, 17463, 16269, 15183, 14194, 13294, 12473, 11723, 11038, 10411, 9836, 9308, 8822, 8375]
277.45685G961l82l54l28l06k84k65k47k31k17k03j90n16j66j56j47j39C698
248.17891C574j18j12j06j01r5r1q7q3p9p5p2o9o6o3o0n8n5n4n1m9m8A937
210.7682A893m3m0Tl8l6Tl4l3l2l1l0k9k8k7Tk5Tk4Tk2k3k1Tk0Tj9Tj8A090
161.97165A073j7j6Uj78j3Vj2Uj1Vj0VF49
$$ y = [7961, 7579, 7225, 6897, 6591, 6307, 6042, 5795, 5564, 5347, 5144, 4954, 4438, 4272, 4116, 3969, 3830, 3698, 3574, 3456, 3344, 3238, 3137, 3042, 2951, 2864, 2781, 2702, 2627, 2555, 2486, 2420, 2357, 2297, 2239, 2184, 2130, 2079, 2030, 1982, 1937, 1893, 1850, 1810, 1770, 1732, 1696, 1660, 1626, 1593, 1561, 1530, 1500, 1471, 1443, 1416, 1389, 1364, 1339, 1315, 1291, 1269, 1246, 1225, 1204, 1184, 1164, 1145, 1126, 1108, 1090, 1073, 1056, 1040, 1024, 1008, 830, 817, 804, 791, 778, 766, 754, 742, 731, 720, 709, 698, 688, 678, 668, 658, 649]
126.1875F40  $$checkpoint
##END=$$ End of RAMAN of 1,1-DCE
##END= $$ end of file