##TITLE= 1,2-dichloroethylene
##JCAMP-DX=5.01
##DATA TYPE= LINK
##BLOCKS= 6
##TITLE= cis-1,2-dichloroethylene (Z)
##JCAMP-DX= 5.01
##DATA TYPE= INFRARED SPECTRUM
##DATA CLASS= XYDATA
##BLOCK ID=1
##ORIGIN= Department of Chemistry, UWI, JAMAICA
##OWNER= public domain
##LONGDATE= 2012/02/18 12:31:56.0440 -0500 $$ export date from JSpecView
##SPECTROMETER/DATA SYSTEM= from scan
##$MODELS=
<Models>
<ModelData id="cDCE" type="MOL">
cis-1,2-dichloroethylene (Z)
__Jmol-14_02171521233D 1   1.00000     0.00000     0
Jmol version 14.3.12_2015.02.11  2015-02-11 19:15 EXTRACT: ({0:5})
  6  5  0  0  0  0              1 V2000
   0.00000   0.67022   0.96140 C   0  0  0  0  0  0
   0.00000  -0.67022   0.96140 C   0  0  0  0  0  0
   0.00000  -1.65604  -0.45086 Cl  0  0  0  0  0  0
   0.00000  -1.25420   1.89597 H   0  0  0  0  0  0
   0.00000   1.65604  -0.45086 Cl  0  0  0  0  0  0
   0.00000   1.25420   1.89597 H   0  0  0  0  0  0
  1  6  1  0  0  0
  1  5  1  0  0  0
  1  2  2  0  0  0
  2  3  1  0  0  0
  2  4  1  0  0  0
M  END
</ModelData>
<ModelData id="C1" type="XYZVIB" baseModel="cDCE" vibrationScale=".5">
6
Model[1]: PATH=Calculation 1;Input;Convg=0.9764D-08;-V/T=2.0006;Energy=NaN;Range=M.O.s;E(RHF)=-995.827490213 A.U.;PATH=Calculation 1;Input
C       0.00000      0.00000      0.00000
C       0.00000      0.00000      1.34044
Cl      1.41224      0.00000      2.32626
H      -0.93457      0.00000      1.92442
Cl      1.41224      0.00000     -0.98582
H      -0.93457      0.00000     -0.58398
6
Model[2]: PATH=Calculation 1;Standard;Convg=0.9764D-08;-V/T=2.0006;Energy=-995.8275;Range=M.O.s;E(RHF)=-995.827490213 A.U.;PATH=Calculation 1;Standard
C       0.00000      0.67022      0.96140
C       0.00000     -0.67022      0.96140
Cl      0.00000     -1.65604     -0.45085
H       0.00000     -1.25420      1.89597
Cl      0.00000      1.65604     -0.45085
H       0.00000      1.25420      1.89597
6
Model[3]: IRIntensity=0.4101 KM/Mole;PATH=Calculation 1;FrequenciesFrequencies;ReducedMass=27.0583 AMU;ForceConstant=0.5615 mDyne/A;FreqValue=187.6781;Frequency=187.6781 cm^-1;FrequencyLabel=A1;PATH=Calculation 1;FrequenciesFrequencies
C       0.00000      0.67022      0.96140      0.00000     -0.01000      0.28000
C       0.00000     -0.67022      0.96140      0.00000      0.01000      0.28000
Cl      0.00000     -1.65604     -0.45085      0.00000      0.59000     -0.10000
H       0.00000     -1.25420      1.89597      0.00000     -0.20001      0.15001
Cl      0.00000      1.65604     -0.45085      0.00000     -0.59000     -0.10000
H       0.00000      1.25420      1.89597      0.00000      0.20001      0.15001
6
Model[4]: IRIntensity=0.0000 KM/Mole;PATH=Calculation 1;FrequenciesFrequencies;ReducedMass=4.0875 AMU;ForceConstant=0.6230 mDyne/A;FreqValue=508.6316;Frequency=508.6316 cm^-1;FrequencyLabel=A2;PATH=Calculation 1;FrequenciesFrequencies
C       0.00000      0.67022      0.96140      0.36001      0.00000      0.00000
$$ [...]
6
Model[13]: IRIntensity=11.5546 KM/Mole;PATH=Calculation 1;FrequenciesFrequencies;ReducedMass=1.0869 AMU;ForceConstant=6.2829 mDyne/A;FreqValue=3132.2904;Frequency=3132.2904 cm^-1;FrequencyLabel=B2;PATH=Calculation 1;FrequenciesFrequencies
C       0.00000      0.67022      0.96140      0.00000      0.03000      0.05000
C       0.00000     -0.67022      0.96140      0.00000      0.03000     -0.05000
Cl      0.00000     -1.65604     -0.45085      0.00000      0.00000      0.00000
H       0.00000     -1.25420      1.89597      0.00000     -0.37000      0.60001
Cl      0.00000      1.65604     -0.45085      0.00000      0.00000      0.00000
H       0.00000      1.25420      1.89597      0.00000     -0.37000     -0.60001
6
Model[14]: IRIntensity=4.5509 KM/Mole;PATH=Calculation 1;FrequenciesFrequencies;ReducedMass=1.1026 AMU;ForceConstant=6.4650 mDyne/A;FreqValue=3154.6217;Frequency=3154.6217 cm^-1;FrequencyLabel=A1;PATH=Calculation 1;FrequenciesFrequencies
C       0.00000      0.67022      0.96140      0.00000      0.04000      0.05000
C       0.00000     -0.67022      0.96140      0.00000     -0.04000      0.05000
Cl      0.00000     -1.65604     -0.45085      0.00000      0.00000      0.00000
H       0.00000     -1.25420      1.89597      0.00000      0.38000     -0.59000
Cl      0.00000      1.65604     -0.45085      0.00000      0.00000      0.00000
H       0.00000      1.25420      1.89597      0.00000     -0.38000     -0.59000
</ModelData>
</Models>
##$PEAKS=
<Peaks type="IR" xUnitsExpected="1/cm"  >
<PeakData id="1" title="1 (~3160 cm-1)" peakShape="broad" model="C1.13" xMax="3175" xMin="3145"    />
<PeakData id="2" title="2 (~3160 cm-1)" peakShape="broad" model="C1.14" xMax="3145" xMin="3115"    />
<PeakData id="3" title="3 (~1740 cm-1)" peakShape="broad" model="C1.12" xMax="1760" xMin="1720"    />
<PeakData id="4" title="4 (~1510 cm-1)" peakShape="broad" model="C1.11" xMax="1540" xMin="1515"    />
<PeakData id="5" title="5 (~1510 cm-1)" peakShape="broad" model="C1.10" xMax="1370" xMin="1340"    />
<PeakData id="6" title="6 (~1360 cm-1)" peakShape="broad" model="C1.10" xMax="1160" xMin="1130"    />
<PeakData id="7" title="7 (~960 cm-1)" peakShape="broad" model="C1.9" xMax="975" xMin="960"    />
<PeakData id="8" title="8 (~960 cm-1)" peakShape="broad" model="C1.6" xMax="795" xMin="755"    />
<PeakData id="9" title="9 (~765 cm-1)" peakShape="broad" model="C1.7" xMax="720" xMin="670"    />
<PeakData id="10" title="10 (~615 cm-1)" peakShape="broad" model="C1.4" xMax="635" xMin="605"    />
<PeakData id="11" title="11 (~510 cm-1)" peakShape="broad" model="C1.5" xMax="520" xMin="480"    />
<PeakData id="12" title="12 (~173 cm-1)" peakShape="broad" model="C1.3" xMax="205" xMin="165"    />
</Peaks>
##XUNITS= 1/CM
##YUNITS= TRANSMITTANCE
##XFACTOR= 1
##YFACTOR= 9.999000E-07
##FIRSTX= 3.352938E+03
##FIRSTY= 9.915151E-01
##LASTX= -1.232190E+01
##NPOINTS= 2000
##MINY= 10.000000E-05
##MAXY= 1
##XYDATA= (X++(Y..Y))
3352.9382I91614j34j37j41j44j47j51j55j59j62j67j72j75j80j85j90I89020
$$ 991614 991480 991343 991202 991058 990911 990760 990605 990446 990284 990117 989945 989770 989590 989405 989215 989020
3324.319I88820k06k11k17k24k29k36k44k50k57k65k73k81k90k99l08I84712
$$ 988820 988614 988403 988186 987962 987733 987497 987253 987003 986746 986481 986208 985927 985637 985338 985030 984712
3295.7002I84384l39l49l62l73l85l99m13m27m42m57m75m91n10n28n49I77316
$$ 984384 984045 983696 983334 982961 982576 982177 981764 981337 980895 980438 979963 979472 978962 978434 977885 977316
3267.081I76724o15o39o65o93p21p51p83q17q52q90r31r73j018j066I64194
$$ 976724 976109 975470 974805 974112 973391 972640 971857 971040 970188 969298 968367 967394 966376 965310 964194
3240.1455I63023j228j290j356j425j501j580j667j758j857j963k078I43120
$$ 963023 961795 960505 959149 957724 956223 954643 952976 951218 949361 947398 945320 943120
3218.2605I40786k476k632k799k981l178l393l625l879m156m457m787H97277
$$ 940786 938310 935678 932879 929898 926720 923327 919702 915823 911667 907210 902423 897277
3196.3752H91736n971o443o959p522q137q807r535j0321j1167j2066j3015G77794
$$ 891736 885765 879322 872363 864841 856704 847897 838362 828041 816874 804808 791793 777794
3174.4902G62796j5986j6921j7756j8430j8878j9035j8852j8308j7424E84933
$$ 762796 746810 729889 712133 693703 674825 655790 636938 618630 601206 584933
3155.972E69953j3695j2578j1749j1267j1106j1164j1272j1227j0816D55220
$$ 569953 556258 543680 531931 520664 509558 498394 487122 475895 465079 455220
3137.4539D46991n879k848P35M672Q722J2631J6172J9163K1495K3122E69046
$$ 446991 441112 438264 438999 443671 452393 465024 481196 500359 521854 544976 569046
3117.2522E93450K4224K3638K2751K1662K0447J9172J7884J6619J5399G89488
$$ 593450 617674 641312 664063 685725 706172 725344 743228 759847 775246 789488
3098.734H02643J2142J1203J0338R544Q814Q147P538O979O470O004N579I00590
$$ 802643 814785 825988 836326 845870 854684 862831 870369 877348 883818 889822 895401 900590
3076.8489I05422M505M206L930L677L445L230L032K850K681K525K381I44130
$$ 905422 909927 914133 918063 921740 925185 928415 931447 934297 936978 939503 941884 944130
3054.9636I46252K006J899J798J705J617J536J459J389J321J258J200I64584
$$ 946252 948258 950157 951955 953660 955277 956813 958272 959661 960982 962240 963440 964584
3033.0786I65676J043R97R54R13Q73Q38Q02P70P39P09O82O55O30O06N84I78033
$$ 965676 966719 967716 968670 969583 970456 971294 972096 972866 973605 974314 974996 975651 976281 976887 977471 978033
3004.4595I78574N22N03M86M68M53M37M22M08L95L82L69L58L46L35L25I85099
$$ 978574 979096 979599 980085 980553 981006 981443 981865 982273 982668 983050 983419 983777 984123 984458 984783 985099
2975.8406I85404K96K88K79K71K63K55K48K41K35K28K22K15K10K05J98I89252
$$ 985404 985700 985988 986267 986538 986801 987056 987304 987545 987780 988008 988230 988445 988655 988860 989058 989252
2947.2214I89441J84J79J74J70J66J62J58J54J50J47J43J40J36J34J30I91895
$$ 989441 989625 989804 989978 990148 990314 990476 990634 990788 990938 991085 991228 991368 991504 991638 991768 991895
2918.6025I92020J22J18J17J13J12J08J07J04J02J00R8R5R4R2R0Q8Q6I93851
$$ 992020 992142 992260 992377 992490 992602 992710 992817 992921 993023 993123 993221 993316 993410 993502 993592 993680 993766 993851
2886.6165I93934Q1Q0P8P6P5P4P2P1P0O8O7O6O5O3O2TO0N9N8N7N6N5N4I95516
$$ 993934 994015 994095 994173 994249 994324 994398 994470 994541 994611 994679 994746 994812 994877 994940 995002 995064 995124 995183 995241 995298 995354 995409 995463 995516
2844.5298I95568N1TM9TM8M7TM5TM4TM3M2M1TM0TL8L9L7L8L6UL5L4TL3I96764
$$ 995568 995619 995670 995719 995768 995816 995863 995910 995955 996000 996044 996088 996131 996173 996214 996255 996295 996335 996373 996412 996449 996487 996523 996559 996595 996630 996664 996698 996731 996764
2794.0256I96797L2L1UL0TK9UK8TK7UK6TK5K6K4K5K4UP07J7J8J6J7J6I98238
$$ 996797 996829 996860 996891 996922 996952 996982 997011 997040 997069 997097 997125 997152 997179 997206 997232 997258 997283 997309 997333 997358 997382 997406 997430 998137 998154 998172 998188 998205 998221 998238
2741.838I98254J5J6J5J6J5J4J755%U52m926m1m2m3Tm4Tm5Tm6m7Tm8I94590
2112.2195I94541n0Tn1n2n3Tn4n5n6Tn7n8n9To1To2o3o4o5o6o7o8o9p0I92991
$$ 994541 994491 994441 994390 994338 994285 994232 994178 994123 994067 994011 993954 993896 993837 993778 993717 993656 993594 993531 993467 993402 993336 993269 993201 993132 993062 992991
2066.7659I92919p3p4p5p7p8p9q0q2Tq4q6q7q8r0r1r2r5Tr8r9j01j02I90907
$$ 992919 992846 992772 992697 992620 992542 992463 992383 992301 992219 992135 992049 991962 991874 991784 991693 991601 991506 991411 991313 991214 991113 991011 990907
2026.3624I90801j08j10j11j14j15j18j20j22j24j26j29j31j33j36j39I88824
$$ 990801 990693 990583 990472 990358 990243 990125 990005 989883 989759 989633 989504 989373 989240 989104 988965 988824
1997.7434I88680j47j49j53j55j59j61j65j68j72j75j79j82j86j90j94I85947
$$ 988680 988533 988384 988231 988076 987917 987756 987591 987423 987251 987076 986897 986715 986529 986339 986145 985947
1969.1244I85745k07k11k16k20k25k31k35k41k46k52k58k64k70k76k83I81820
$$ 985745 985538 985327 985111 984891 984666 984435 984200 983959 983713 983461 983203 982939 982669 982393 982110 981820
1940.5054I81523l04l11l19l27l36l43l53l62l71l81l91m02m12m24m35I75605
$$ 981523 981219 980908 980589 980262 979926 979583 979230 978868 978497 978116 977725 977323 976911 976487 976052 975605
1911.8864I75146m870n21n35n50n66n81n98o16o33o52o71o91p13p34p57I60677
$$ 975146 970276 969755 969220 968670 968104 967523 966925 966309 965676 965024 964353 963662 962949 962215 961458 960677
1883.2673I59871q31q58q87r16r46r79j012j048j084j122j163j206j249I45273
$$ 959871 959040 958182 957295 956379 955433 954454 953442 952394 951310 950188 949025 947819 946570 945273
1858.0153I43928j397j450j508j568j631j697j767j842j919k002k090I22875
$$ 943928 942531 941081 939573 938005 936374 934677 932910 931068 929149 927147 925057 922875
1836.1301I20595k383k494k610k734k866l006l156l314l483l664l857H82964
$$ 920595 918212 915718 913108 910374 907508 904502 901346 898032 894549 890885 887028 882964
1814.245H78681m520m772n043n334n646n980o341o728p145p594q077H02903
$$ 878681 874161 869389 864346 859012 853366 847386 841045 834317 827172 819578 811501 802903
1792.3599G93744r764j0416j1117j1872j2684j3555j4489j5487j6550F60132
$$ 793744 783980 773564 762447 750575 737891 724336 709847 694360 677810 660132
1773.8417F41265k0114k1409k2738k4104k5418k6710k7912k8975k9832C83641
$$ 641265 621151 599742 577004 552900 527482 500772 472860 443885 414053 383641
1755.3235C53001l0438k9741k8500k6695k4346k1511j8278j4760j1063A40393
$$ 353001 322563 292822 264322 237627 213281 191770 173492 158732 147669 140393
1736.8053A36937L70M193Q001J1763J5413J8861K1993K4707K6915K8572C27391
$$ 136937 137307 141500 149501 161264 176677 195538 217531 242238 269153 297725 327391
1716.6036C57618L0304K9971K9301K8374K7257K6014K4693K3339K1981F19497
$$ 357618 387922 417893 447194 475568 502825 528839 553532 576871 598852 619497
1698.0854F38844J8102J6914J5791J4731J3737J2807J1938J1130J0375G74044
$$ 638844 656946 673860 689651 704382 718119 730926 742864 753994 764369 774044
1679.5673G83066Q416P852P327O838O383N959N563N193M846M523M218H54117
$$ 783066 791482 799334 806661 813499 819882 825841 831404 836597 841443 845966 850184 854117
1657.6821H57781L411L171K946K731K527K334K150J972J804J640J484H85284
$$ 857781 861192 864363 867309 870040 872567 874901 877051 879023 880827 882467 883951 885284
1635.797H86469J043R04P68O35N03L73K44J17j2j39k68l98n30o63p99H87308
$$ 886469 887512 888416 889184 889819 890322 890695 890939 891056 891044 890905 890637 890239 889709 889046 888247 887308
1607.178H86227j229j381j538j701j872k049k236k430k637k852l082H59897
$$ 886227 884998 883617 882079 880378 878506 876457 874221 871791 869154 866302 863220 859897
1585.2928H56316l854m144m454m785n140n518n925o361o830p334p877G85633
$$ 856316 852462 848318 843864 839079 833939 828421 822496 816135 809305 801971 794094 785633
1563.4077G76542r769j0499j1286j2131j3040j4013j5054j6164j7340F38665
$$ 776542 766773 756274 744988 732857 719817 705804 690750 674586 657246 638665
1544.8895F18785k1225k2604k3991k5356k6662k7855k8877k9654l0109C52293
$$ 618785 597560 574956 550965 525609 498947 471092 442215 412561 382452 352293
1526.3713C22568k8745k7181k5027k2321j9137j5575j1744p747l658M66A66489
$$ 322568 293823 266642 241615 219294 200157 184582 172838 165091 161433 161899 166489
1506.1697A75163J2657J6461J9976K3096K5722K7785K9259L0152L0510D21178
$$ 175163 187820 204281 224257 247353 273075 300860 330119 360271 390781 421178
1487.6515D51074K9085K8044K6842K5539K4181K2808K1449K0123J8847F85622
$$ 451074 480159 508203 535045 560584 584765 607573 629022 649145 667992 685622
1469.1333G02098J5391J4374J3423J2537J1713J0949J0239R581Q972Q407H25568
$$ 702098 717489 731863 745286 757823 769536 780485 790724 800305 809277 817684 825568
1448.9316H32966O949O531O144N784N449N137M848M577M325M088L868H94327
$$ 832966 839915 846446 852590 858374 863823 868960 873808 878385 882710 886798 890666 894327
1427.0465H97794L285L113K952K799K655K517K388K263K145K031J921I27679
$$ 897794 901079 904192 907144 909943 912598 915115 917503 919766 921911 923942 925863 927679
1405.1614I29392J612J514J418J321J226J130J034R38Q41P44O47N53M64I43217
$$ 929392 931004 932518 933936 935257 936483 937613 938647 939585 940426 941170 941817 942370 942834 943217
1379.9093I43532K67K42K52K98L84N06O58Q25R93J144J268J356p474j1464I33986
$$ 943532 943799 944041 944293 944591 944975 945481 946139 946964 947957 949101 950369 951725 944251 932787 933986
1352.9738I35151J114J054R90R24Q58P94P35O78O26N76N157M53M14L79I50249
$$ 935151 936265 937319 938309 939233 940091 940885 941620 942298 942924 943500 948657 949110 949524 949903 950249
1326.0382I50564K86K60K34K11J89J67J48J29J11R4P8O2M6L2J8Mrk2l5I52520
$$ 950564 950850 951110 951344 951555 951744 951911 952059 952188 952299 952393 952471 952533 952579 952611 952629 952633 952624 952602 952567 952520
1290.6853I52460p1q3r4j05j17j28j38j49j60j71j81j91k02k12k23k33I49758
$$ 952460 952389 952306 952212 952107 951990 951862 951724 951575 951415 951244 951063 950872 950670 950458 950235 950002 949758
1260.3828I49504k64k75k86k96l06l18l28l39l50l61l72l83l95m07m18I43976
$$ 949504 949240 948965 948679 948383 948077 947759 947431 947092 946742 946381 946009 945626 945231 944824 944406 943976
1231.7638I43534m54m66m80m91n05n18n31n45n59n73n87o02o17o32o47I34663
$$ 943534 943080 942614 942134 941643 941138 940620 940089 939544 938985 938412 937825 937223 936606 935974 935327 934663
1203.1448I33983o96p13p31p48p66p85q04q23q43q64q84r06r27r51r73I20572
$$ 933983 933287 932574 931843 931095 930329 929544 928740 927917 927074 926210 925326 924420 923493 922542 921569 920572
1174.5258I19551j046n022j127j154j182j210j241j271j302j335j367I00892
$$ 919551 918505 913483 912356 911202 910020 908810 907569 906298 904996 903661 902294 900892
1152.6406H99454j473j511j549j589j630j672j716j761j807j855j904H79031
$$ 899454 897981 896470 894921 893332 891702 890030 888314 886553 884746 882891 880987 879031
1130.7555H77023k063k120k178k238k301k365k432k502k573k647k725H48074
$$ 877023 874960 872840 870662 868424 866123 863758 861326 858824 856251 853604 850879 848074
1108.8704H48979l019l106l200l294l395l498l605l716l833l953m078H06073
$$ 848979 845960 842854 839654 836360 832965 829467 825862 822146 818313 814360 810282 806073
1086.9852H01729m485m633m785m945n111n283n463n651n847o050o262G36730
$$ 801729 797244 792611 787826 782881 777770 772487 767024 761373 755526 749476 743214 736730
1065.1001G30016o955p205p467p738q023q318q626q946r280r627r987F27481
$$ 730016 723061 715856 708389 700651 692628 684310 675684 666738 657458 647831 637844 627481
1043.215F16730j1154j1572j2004j2450j2910j3382j3868j4364j4870D84772
$$ 616730 605576 594004 582000 569550 556640 543258 529390 515026 500156 484772
1024.6968D68870j6424j6944j7458j7962j9051j8887j9318j9706k0041B82765
$$ 468870 452446 435502 418044 400082 381031 362144 342826 323120 303079 282765
1006.1785B62256k0611k0608k0482k0219j9804j9225j8471j7541j6436G3694
$$ 262256 241645 221037 200555 180336 160532 141307 122836 105295 88859 73694
987.66034E9944j2223j0621q998p409n909m551l376k405j643j078o79F38
$$ 59944 47721 37100 28102 20693 14784 10233 6857 4452 2809 1731 1052 638
965.7752C94j42q0m4k1pPK2M4Q1J42K46M16O82J079J644K401L364M527B0621
$$ 394 252 172 128 107 100 107 129 173 254 396 642 1058 1740 2819 4463 6864 10228 14755 20621
932.1058B7962Q901J0486J2045J3527J4890J6108J7159J8034J8731J9255A96713
$$ 27962 36863 47349 59394 72921 87811 103919 121078 139112 157843 177098 196713
911.9041B16538J9898J9850J9696J9453J9133J8749J8313J7838J7328D03592
$$ 216538 236436 256286 275982 295435 314568 333317 351630 369468 386796 403592
893.3859D19839J5685J5118J4549J3979J3415J2855J2303J1760J1226E51431
$$ 419839 435524 450642 465191 479170 492585 505440 517743 529503 540729 551431
874.86774E61619R686R192Q710Q236P772P316O868O425N990N559N132F47212
$$ 561619 571305 580497 589207 597443 605215 612531 619399 625824 631814 637373 642505 647212
852.9826F51495L861L437L010K579K143J699J245P82L04j90p00j231F66648
$$ 651495 655356 658793 661803 664382 666525 668224 669469 670251 670555 670365 669665 668434 666648
829.414F64282k975l618m295n012n772o580p437q349r319j0347j1440E76546
$$ 664282 661307 657689 653394 648382 642610 636030 628593 620244 610925 600578 589138 576546
807.5289E62739j5077j6397j7753j9129k0497k1825k3071k4177k5084C54015
$$ 562739 547662 531265 513512 494383 473886 452061 428990 404813 379729 354015
789.0107C28020k5846k5204k4021k2282k0006j7246j4091j0634o972A58534
$$ 328020 302174 276970 252949 230667 210661 193415 179324 168690 161718 158534
770.4925A59202M533Q363J2089J5624J8871K1723K4098K5937K7224K7973C73869
$$ 159202 163735 172098 184187 199811 218682 240405 264503 290440 317664 345637 373869
750.29083D01936K7551K6761K5770K4638K3420K2158K0886J9629J8405F28381
$$ 401936 429487 456248 482018 506656 530076 552234 573120 592749 611154 628381
731.77264F44483J5036J4031J3085J2201J1372J0599R877R203Q574P986G63884
$$ 644483 659519 673550 686635 698836 710208 720807 730684 739887 748461 756447 763884
711.571G70806O439N986N557N154M772M408M062L731L411L105K806H22752
$$ 770806 777245 783231 788788 793942 798714 803122 807184 810915 814326 817431 820237 822752
689.68585H24983J951J672J396J118Q38N53K63l6l46o67j005j358j734H25496
$$ 824983 826934 828606 830002 831120 831958 832511 832774 832738 832392 831725 830720 829362 827628 825496
664.4338H22938l014l504m034m607n228n901o633p426q285r213j0211G43606
$$ 822938 819924 816420 812386 807779 802551 796650 790017 782591 774306 765093 754882 743606
642.54865G31204j3576j4778j5976j7128j8170j9026j9600j9784j9461E55181
$$ 731204 717628 702850 686874 669746 651576 632550 612950 593166 573705 555181
624.03046E38295j4506j1408p684l499R25N334R479J3144J6173J8483E84797
$$ 538295 523789 512381 504697 501198 502123 507457 516936 530080 546253 564736 584797
603.8288F05751K1251K1061K0496J9665J8659J7552J6403J5254J4135G83244
$$ 605751 627002 648063 668559 688224 706883 724435 740838 756092 770227 783244
585.3106G95301J1116J0245R443Q708Q035P421O862O352N888N465N080H84644
$$ 795301 806417 816662 826105 834813 842848 850269 857131 863483 869371 874836 879916 884644
563.4255H89052M115L847L601J1794J5568K874K697K534K383K245K116I44823
$$ 889052 893167 897014 900615 912409 927977 930851 933548 936082 938465 940710 942826 944823
541.54034I46710J786J690J603J521J444J372J307J244J185J131J080I63104
$$ 946710 948496 950186 951789 953310 954754 956126 957433 958677 959862 960993 962073 963104
519.6552I64091R44R03Q66Q31P97P65P35P06O80O54O30O06N85N65N44I75428
$$ 964091 965035 965938 966804 967635 968432 969197 969932 970638 971318 971972 972602 973208 973793 974358 974902 975428
491.03616I75935M91M74M59M44M30M16M03L91L79L68L56L46L36L27L17I82180
$$ 975935 976426 976900 977359 977803 978233 978649 979052 979443 979822 980190 980546 980892 981228 981555 981872 982180
462.41714I82480K91K84K75K69K61K55K48K41K36K29K24K19K13K07K03I86333
$$ 982480 982771 983055 983330 983599 983860 984115 984363 984604 984840 985069 985293 985512 985725 985932 986135 986333
433.79813I86526J89J84J81J76J71J69J64J61J57J54J50J47J44J41J38I89087
$$ 986526 986715 986899 987080 987256 987427 987596 987760 987921 988078 988232 988382 988529 988673 988814 988952 989087
405.1791I89219J29J27J24J21J20J16J14J12J10J08J05J03J01J00R7I91001
$$ 989219 989348 989475 989599 989720 989840 989956 990070 990182 990292 990400 990505 990608 990709 990809 990906 991001
376.5601I91094R2R0Q8M330N0M8M7M6M5M3TM1M0L9L8L7L6L5L4L2TL1I96441
$$ 991094 991186 991276 991364 995694 995744 995792 995839 995885 995930 995973 996016 996057 996097 996136 996174 996211 996247 996282 996316 996348 996380 996411 996441
336.15677I96469K8K7K5TK4K2TK1J9TJ7TJ5J4J3J2J1RTPOMLJTklnorj0I96792
$$ 996469 996497 996524 996549 996574 996598 996620 996642 996663 996682 996701 996718 996735 996750 996764 996777 996789 996800 996809 996818 996825 996831 996835 996838 996839 996840 996838 996835 996830 996824 996815 996805 996792
280.6022I96778j7j9k2k4k7l1l3l7m1m4m9n3n9o3p0p6q2r0r8j06j17I95494
$$ 996778 996761 996742 996720 996696 996669 996638 996605 996568 996527 996483 996434 996381 996322 996259 996189 996113 996031 995941 995843 995737 995620 995494
241.88234I95355j51j65j80j98k17k37k61k87l17l48l84m25m70n19n75I91532
$$ 995355 995204 995039 994859 994661 994444 994207 993946 993659 993342 992994 992610 992185 991715 991196 990621 991532
213.26332I90815p90q69r51j038j123j203j272j321j340j315j238j097I76369
$$ 990815 990025 989156 988205 987167 986044 984841 983569 982248 980908 979593 978355 977258 976369
189.69472I75747l05L6L74O82R38J132J259J324J339J313J259J187J106I88410
$$ 975747 975442 975478 975852 976534 977472 978604 979863 981187 982526 983839 985098 986285 987391 988410
164.44264I89344Q52P74P03O36N77N23M74M31L91L56L25K96K71K49K28I96639
$$ 989344 990196 990970 991673 992309 992886 993409 993883 994314 994705 995061 995386 995682 995953 996202 996430 996639
135.82362I96832J78J65J52J41J31J22J13J06R9R2Q6Q1P6P2O7O3O0N6I98745
$$ 996832 997010 997175 997327 997468 997599 997721 997834 997940 998039 998131 998217 998298 998374 998446 998513 998576 998636 998692 998745
102.15418I98795M8M5M2M1L8L7L5L3L1TK8TK6K5K4K3K2K1K0J9TJ7J8J6I99498
$$ 998795 998843 998888 998930 998971 999009 999046 999081 999114 999145 999176 999204 999232 999258 999283 999307 999330 999352 999373 999393 999412 999431 999448 999466 999482 999498
58.383915I99513J5J4TJ3J2J3J1J2J1J0J1J0RJ0RQRQUPTQOPOPOTNOTNI99815
$$ 999513 999528 999542 999556 999569 999581 999594 999605 999617 999628 999638 999649 999659 999668 999678 999687 999695 999704 999712 999720 999728 999735 999742 999750 999756 999763 999769 999776 999782 999788 999793 999799 999805 999810 999815
-0.537597I99820NTMNMI99848
$$ 999820 999825 999830 999834 999839 999843 999848
-12.3219I99852  $$checkpoint
##END= $$ end of cis-DCE IR
##TITLE=Raman of cis-1,2-dichloroethylene (Z) $$ Begin of the data block
##JCAMP-DX=5.00 $$ ACD/DocManager Library v 5.00
##DATA TYPE=RAMAN SPECTRUM
##DATA CLASS=XYDATA
##BLOCK ID=2
##DATE=19 Feb 2012 10:29:22
##ORIGIN= Department of Chemistry, UWI, Jamaica
##OWNER= public domain
##SPECTROMETER/DATA SYSTEM=from scan
##$MODELS=
<Models>
<ModelData id="cDCE" type="MOL">
cis-1,2-dichloroethylene (Z)
__Jmol-14_02171521233D 1   1.00000     0.00000     0
Jmol version 14.3.12_2015.02.11  2015-02-11 19:15 EXTRACT: ({0:5})
  6  5  0  0  0  0              1 V2000
   0.00000   0.67022   0.96140 C   0  0  0  0  0  0
   0.00000  -0.67022   0.96140 C   0  0  0  0  0  0
   0.00000  -1.65604  -0.45086 Cl  0  0  0  0  0  0
   0.00000  -1.25420   1.89597 H   0  0  0  0  0  0
   0.00000   1.65604  -0.45086 Cl  0  0  0  0  0  0
   0.00000   1.25420   1.89597 H   0  0  0  0  0  0
  1  6  1  0  0  0
  1  5  1  0  0  0
  1  2  2  0  0  0
  2  3  1  0  0  0
  2  4  1  0  0  0
M  END
</ModelData>
<ModelData id="C2" type="XYZVIB" baseModel="cDCE" vibrationScale=".5">
6
Model[1]: PATH=Calculation 1;Input;Convg=0.9764D-08;-V/T=2.0006;Energy=NaN;Range=M.O.s;E(RHF)=-995.827490213 A.U.;PATH=Calculation 1;Input
C       0.00000      0.00000      0.00000
C       0.00000      0.00000      1.34044
Cl      1.41224      0.00000      2.32626
H      -0.93457      0.00000      1.92442
Cl      1.41224      0.00000     -0.98582
H      -0.93457      0.00000     -0.58398
6
Model[2]: PATH=Calculation 1;Standard;Convg=0.9764D-08;-V/T=2.0006;Energy=-995.8275;Range=M.O.s;E(RHF)=-995.827490213 A.U.;PATH=Calculation 1;Standard
C       0.00000      0.67022      0.96140
C       0.00000     -0.67022      0.96140
Cl      0.00000     -1.65604     -0.45085
H       0.00000     -1.25420      1.89597
Cl      0.00000      1.65604     -0.45085
H       0.00000      1.25420      1.89597
6
Model[3]: IRIntensity=0.4101 KM/Mole;PATH=Calculation 1;FrequenciesFrequencies;ReducedMass=27.0583 AMU;ForceConstant=0.5615 mDyne/A;FreqValue=187.6781;Frequency=187.6781 cm^-1;FrequencyLabel=A1;PATH=Calculation 1;FrequenciesFrequencies
C       0.00000      0.67022      0.96140      0.00000     -0.01000      0.28000
C       0.00000     -0.67022      0.96140      0.00000      0.01000      0.28000
Cl      0.00000     -1.65604     -0.45085      0.00000      0.59000     -0.10000
H       0.00000     -1.25420      1.89597      0.00000     -0.20001      0.15001
Cl      0.00000      1.65604     -0.45085      0.00000     -0.59000     -0.10000
H       0.00000      1.25420      1.89597      0.00000      0.20001      0.15001
6
Model[4]: IRIntensity=0.0000 KM/Mole;PATH=Calculation 1;FrequenciesFrequencies;ReducedMass=4.0875 AMU;ForceConstant=0.6230 mDyne/A;FreqValue=508.6316;Frequency=508.6316 cm^-1;FrequencyLabel=A2;PATH=Calculation 1;FrequenciesFrequencies
C       0.00000      0.67022      0.96140      0.36001      0.00000      0.00000
C       0.00000     -0.67022      0.96140     -0.36001      0.00000      0.00000
Cl      0.00000     -1.65604     -0.45085      0.06000      0.00000      0.00000
H       0.00000     -1.25420      1.89597     -0.61000      0.00000      0.00000
Cl      0.00000      1.65604     -0.45085     -0.06000      0.00000      0.00000
H       0.00000      1.25420      1.89597      0.61000      0.00000      0.00000
6
Model[5]: IRIntensity=10.3585 KM/Mole;PATH=Calculation 1;FrequenciesFrequencies;ReducedMass=9.1362 AMU;ForceConstant=2.0412 mDyne/A;FreqValue=615.7893;Frequency=615.7893 cm^-1;FrequencyLabel=B2;PATH=Calculation 1;FrequenciesFrequencies
C       0.00000      0.67022      0.96140      0.00000      0.45000      0.20001
C       0.00000     -0.67022      0.96140      0.00000      0.45000     -0.20001
Cl      0.00000     -1.65604     -0.45085      0.00000     -0.17000     -0.12000
H       0.00000     -1.25420      1.89597      0.00000      0.40000     -0.24000
Cl      0.00000      1.65604     -0.45085      0.00000     -0.17000      0.12000
H       0.00000      1.25420      1.89597      0.00000      0.40000      0.24000
6
Model[6]: IRIntensity=28.3460 KM/Mole;PATH=Calculation 1;FrequenciesFrequencies;ReducedMass=9.1109 AMU;ForceConstant=3.1990 mDyne/A;FreqValue=771.9739;Frequency=771.9739 cm^-1;FrequencyLabel=A1;PATH=Calculation 1;FrequenciesFrequencies
C       0.00000      0.67022      0.96140      0.00000      0.07000      0.48000
C       0.00000     -0.67022      0.96140      0.00000     -0.07000      0.48000
Cl      0.00000     -1.65604     -0.45085      0.00000     -0.11000     -0.17000
H       0.00000     -1.25420      1.89597      0.00000     -0.33001      0.34000
Cl      0.00000      1.65604     -0.45085      0.00000      0.11000     -0.17000
H       0.00000      1.25420      1.89597      0.00000      0.33001      0.34000
6
Model[7]: IRIntensity=89.5375 KM/Mole;PATH=Calculation 1;FrequenciesFrequencies;ReducedMass=4.6319 AMU;ForceConstant=2.4956 mDyne/A;FreqValue=956.2813;Frequency=956.2813 cm^-1;FrequencyLabel=B2;PATH=Calculation 1;FrequenciesFrequencies
C       0.00000      0.67022      0.96140      0.00000     -0.06000      0.36001
C       0.00000     -0.67022      0.96140      0.00000     -0.06000     -0.36001
Cl      0.00000     -1.65604     -0.45085      0.00000      0.03000      0.09000
H       0.00000     -1.25420      1.89597      0.00000     -0.30001     -0.52000
Cl      0.00000      1.65604     -0.45085      0.00000      0.03000     -0.09000
H       0.00000      1.25420      1.89597      0.00000     -0.30001      0.52000
6
Model[8]: IRIntensity=61.4963 KM/Mole;PATH=Calculation 1;FrequenciesFrequencies;ReducedMass=1.2299 AMU;ForceConstant=0.6661 mDyne/A;FreqValue=958.7349;Frequency=958.7349 cm^-1;FrequencyLabel=B1;PATH=Calculation 1;FrequenciesFrequencies
C       0.00000      0.67022      0.96140      0.10000      0.00000      0.00000
C       0.00000     -0.67022      0.96140      0.10000      0.00000      0.00000
Cl      0.00000     -1.65604     -0.45085     -0.01000      0.00000      0.00000
H       0.00000     -1.25420      1.89597     -0.70000      0.00000      0.00000
Cl      0.00000      1.65604     -0.45085     -0.01000      0.00000      0.00000
H       0.00000      1.25420      1.89597     -0.70000      0.00000      0.00000
6
Model[9]: IRIntensity=0.0000 KM/Mole;PATH=Calculation 1;FrequenciesFrequencies;ReducedMass=1.2297 AMU;ForceConstant=0.9509 mDyne/A;FreqValue=1145.6135;Frequency=1145.6135 cm^-1;FrequencyLabel=A2;PATH=Calculation 1;FrequenciesFrequencies
C       0.00000      0.67022      0.96140     -0.10000      0.00000      0.00000
C       0.00000     -0.67022      0.96140      0.10000      0.00000      0.00000
Cl      0.00000     -1.65604     -0.45085      0.00000      0.00000      0.00000
H       0.00000     -1.25420      1.89597     -0.70000      0.00000      0.00000
Cl      0.00000      1.65604     -0.45085      0.00000      0.00000      0.00000
H       0.00000      1.25420      1.89597      0.70000      0.00000      0.00000
6
Model[10]: IRIntensity=0.2406 KM/Mole;PATH=Calculation 1;FrequenciesFrequencies;ReducedMass=1.1165 AMU;ForceConstant=1.2298 mDyne/A;FreqValue=1367.2548;Frequency=1367.2548 cm^-1;FrequencyLabel=A1;PATH=Calculation 1;FrequenciesFrequencies
C       0.00000      0.67022      0.96140      0.00000     -0.07000      0.01000
C       0.00000     -0.67022      0.96140      0.00000      0.07000      0.01000
Cl      0.00000     -1.65604     -0.45085      0.00000      0.00000     -0.01000
H       0.00000     -1.25420      1.89597      0.00000      0.61000      0.35000
Cl      0.00000      1.65604     -0.45085      0.00000      0.00000     -0.01000
H       0.00000      1.25420      1.89597      0.00000     -0.61000      0.35000
6
Model[11]: IRIntensity=29.7008 KM/Mole;PATH=Calculation 1;FrequenciesFrequencies;ReducedMass=1.2161 AMU;ForceConstant=1.6354 mDyne/A;FreqValue=1510.7919;Frequency=1510.7919 cm^-1;FrequencyLabel=B2;PATH=Calculation 1;FrequenciesFrequencies
C       0.00000      0.67022      0.96140      0.00000      0.06000     -0.08000
C       0.00000     -0.67022      0.96140      0.00000      0.06000      0.08000
Cl      0.00000     -1.65604     -0.45085      0.00000      0.00000      0.00000
H       0.00000     -1.25420      1.89597      0.00000     -0.61000     -0.35000
Cl      0.00000      1.65604     -0.45085      0.00000      0.00000      0.00000
H       0.00000      1.25420      1.89597      0.00000     -0.61000      0.35000
6
Model[12]: IRIntensity=32.4323 KM/Mole;PATH=Calculation 1;FrequenciesFrequencies;ReducedMass=5.0880 AMU;ForceConstant=9.0352 mDyne/A;FreqValue=1736.0748;Frequency=1736.0748 cm^-1;FrequencyLabel=A1;PATH=Calculation 1;FrequenciesFrequencies
C       0.00000      0.67022      0.96140      0.00000      0.43000     -0.06000
C       0.00000     -0.67022      0.96140      0.00000     -0.43000     -0.06000
Cl      0.00000     -1.65604     -0.45085      0.00000      0.01000      0.01000
H       0.00000     -1.25420      1.89597      0.00000      0.29000      0.48000
Cl      0.00000      1.65604     -0.45085      0.00000     -0.01000      0.01000
H       0.00000      1.25420      1.89597      0.00000     -0.29000      0.48000
6
Model[13]: IRIntensity=11.5546 KM/Mole;PATH=Calculation 1;FrequenciesFrequencies;ReducedMass=1.0869 AMU;ForceConstant=6.2829 mDyne/A;FreqValue=3132.2904;Frequency=3132.2904 cm^-1;FrequencyLabel=B2;PATH=Calculation 1;FrequenciesFrequencies
C       0.00000      0.67022      0.96140      0.00000      0.03000      0.05000
C       0.00000     -0.67022      0.96140      0.00000      0.03000     -0.05000
Cl      0.00000     -1.65604     -0.45085      0.00000      0.00000      0.00000
H       0.00000     -1.25420      1.89597      0.00000     -0.37000      0.60001
Cl      0.00000      1.65604     -0.45085      0.00000      0.00000      0.00000
H       0.00000      1.25420      1.89597      0.00000     -0.37000     -0.60001
6
Model[14]: IRIntensity=4.5509 KM/Mole;PATH=Calculation 1;FrequenciesFrequencies;ReducedMass=1.1026 AMU;ForceConstant=6.4650 mDyne/A;FreqValue=3154.6217;Frequency=3154.6217 cm^-1;FrequencyLabel=A1;PATH=Calculation 1;FrequenciesFrequencies
C       0.00000      0.67022      0.96140      0.00000      0.04000      0.05000
C       0.00000     -0.67022      0.96140      0.00000     -0.04000      0.05000
Cl      0.00000     -1.65604     -0.45085      0.00000      0.00000      0.00000
H       0.00000     -1.25420      1.89597      0.00000      0.38000     -0.59000
Cl      0.00000      1.65604     -0.45085      0.00000      0.00000      0.00000
H       0.00000      1.25420      1.89597      0.00000     -0.38000     -0.59000
</ModelData>
</Models>
##$PEAKS=
<Peaks type="RAMAN" xUnitsExpected="1/cm"  >
<PeakData id="1" title="1 (~3160 cm-1)" peakShape="broad" model="C2.13" xMax="3175" xMin="3145"    />
<PeakData id="2" title="2 (~3160 cm-1)" peakShape="broad" model="C2.14" xMax="3145" xMin="3115"    />
<PeakData id="3" title="3 (~1740 cm-1)" peakShape="broad" model="C2.12" xMax="1760" xMin="1720"    />
<PeakData id="4" title="4 (~1510 cm-1)" peakShape="broad" model="C2.11" xMax="1540" xMin="1515"    />
<PeakData id="5" title="5 (~1510 cm-1)" peakShape="broad" model="C2.10" xMax="1370" xMin="1340"    />
<PeakData id="6" title="6 (~1360 cm-1)" peakShape="broad" model="C2.8" xMax="1160" xMin="1130"    />
<PeakData id="7" title="7 (~960 cm-1)" peakShape="broad" model="C2.9" xMax="975" xMin="960"    />
<PeakData id="8" title="8 (~960 cm-1)" peakShape="broad" model="C2.6" xMax="795" xMin="755"    />
<PeakData id="9" title="9 (~765 cm-1)" peakShape="broad" model="C2.7" xMax="720" xMin="670"    />
<PeakData id="10" title="10 (~615 cm-1)" peakShape="broad" model="C2.4" xMax="635" xMin="605"    />
<PeakData id="11" title="11 (~510 cm-1)" peakShape="broad" model="C2.5" xMax="520" xMin="480"    />
<PeakData id="12" title="12 (~173 cm-1)" peakShape="broad" model="C2.3" xMax="205" xMin="165"    />
</Peaks>
##XUNITS=1/CM
##YUNITS=RAMAN INTENSITY
##XFACTOR= 1
##YFACTOR= 9.202128E-07
##FIRSTX= 3.352938E+03
##FIRSTY= 1.064559E-02
##LASTX= -1.232190E+01
##NPOINTS= 2000
##MINY= 0
##MAXY= 9.202128E-01
##XYDATA= (X++(Y..Y))
3352.9382A1569J91J97K02K06K12K18K23K29K35K42K48K55K61K70K76A5319
$$ 11569 11760 11957 12159 12365 12577 12795 13018 13247 13482 13724 13972 14227 14488 14758 15034 15319
3324.319A5611L02L09L19L29L38L49L59L71L82L94M07M20M33M48M63B1712
$$ 15611 15913 16222 16541 16870 17208 17557 17916 18287 18669 19063 19470 19890 20323 20771 21234 21712
3295.7002B2207N12N29N48N68N89O10O32O56O81P07P35P64P94Q26Q60C3114
$$ 22207 22719 23248 23796 24364 24953 25563 26195 26851 27532 28239 28974 29738 30532 31358 32218 33114
3267.081C4047R73J016J060J107J158J210J267J326J391J458J530J607E0840
$$ 34047 35020 36036 37096 38203 39361 40571 41838 43164 44555 46013 47543 49150 50840
3243.5125E2617J872J972K080K195K321K454K598K754K922L104L301L513H7449
$$ 52617 54489 56461 58541 60736 63057 65511 68109 70863 73785 76889 80190 83703 87449
3219.9438I1447M272M572M899N257N649O081O555P078P654Q291Q997R779A81179
$$ 91447 95719 100291 105190 110447 116096 122177 128732 135810 143464 151755 160752 170531 181179
3196.3752A92792J2689J3885J5220J6708J8366K0209K2258K4524K7019C93414
$$ 192792 205481 219366 234586 251294 269660 289869 312127 336651 363670 393414
3177.8572D26105L5828L9101M2411M5610M8487N0760N2075N2041N0265H89121
$$ 426105 461933 501034 543445 589055 637542 688302 740377 792418 842683 889121
3159.3389I29563L2433K2898J2609K497o543j3833j9029k2146k3495k3587H68348
$$ 929563 961996 984894 997503 1000000 993457 979624 960595 938449 914954 891367 868348
3139.1372H45972k2154k2685k4100k6310k9034l1878l4428l6349l7441E43941
$$ 845972 823818 801133 777033 750723 721689 689811 655383 619034 581593 543941
3120.6191E06887l5790l4041l1981k9756k7488k5258k3124k1121j9266B41498
$$ 506887 471097 437056 405075 375319 347831 322573 299449 278328 259062 241498
3102.1008B25484j4609j3338j2194j1161j0233r395q641p961p346o789A17531
$$ 225484 210875 197537 185343 174182 163949 154554 145913 137952 130606 123817 117531
3081.8992A11701n414n036m692m378m090l827l586l363l159k971k796F5752
$$ 111701 106287 101251 96559 92181 88091 84264 80678 77315 74156 71185 68389 65752
3060.0142F3265k350k222k103j992j890j793j703j620j541j468j399j334D0577
$$ 63265 60915 58693 56590 54598 52708 50915 49212 47592 46051 44583 43184 41850 40577
3036.4456C9360j162j112j064j019r76r36q98q62q28p96p65p35p08o82B6160
$$ 39360 38198 37086 36022 35003 34027 33091 32193 31331 30503 29707 28942 28207 27499 26817 26160
3009.51B5527o10n88n68n49n29n12m94m79m62m48m33m20m06l94l81A7884
$$ 25527 24917 24329 23761 23212 22683 22171 21677 21198 20736 20288 19855 19435 19029 18635 18254 17884
2980.8909A7525l49l38l28l18l10l00k92k85k76k68k62k54k48k41k35A2993
$$ 17525 17176 16838 16510 16192 15882 15582 15290 15005 14729 14461 14199 13945 13697 13456 13221 12993
2952.272A2770k17k12k06k01j96j92j87j82j78j74j69j66j62j58j54I865
$$ 12770 12553 12341 12135 11934 11738 11546 11359 11177 10999 10825 10656 10490 10328 10170 10016 9865
2923.6528I717j44j41j39j35j32j29j26j24j22j18j17j13j12j09j07j05G641
$$ 9717 9573 9432 9293 9158 9026 8897 8771 8647 8525 8407 8290 8177 8065 7956 7849 7744 7641
2893.3503G540r9r6r5r4r1r0q8q6q4Tq1q0p9p7p6p4p3p2p1o9o8o7o6o5E552
$$ 7540 7441 7345 7250 7156 7065 6975 6887 6801 6717 6633 6552 6472 6393 6316 6240 6166 6093 6021 5950 5881 5813 5746 5680 5615 5552
2849.58E489o1Tn9Tn7Tn5Tn4n3n2n1Tn0m9m8m7Tm6m5Tm4m3Tm2m1Tm0D053
$$ 5489 5428 5367 5308 5249 5192 5135 5080 5025 4971 4918 4866 4815 4764 4714 4665 4617 4570 4523 4477 4432 4387 4343 4300 4257 4215 4174 4133 4093 4053
2799.076D014l8Ul6l7l6l5Tl4Tl3Ul2Tl1Tl0Uk9Tk8Uk7k071rj0rj0rA042
$$ 4014 3976 3938 3900 3864 3827 3791 3756 3721 3687 3653 3620 3587 3554 3522 3490 3459 3428 3398 3368 3338 3309 3280 3252 3224 3196 3169 1098 1089 1079 1070 1060 1051 1042
2741.838A033rTqrqTr82%U52O24NONTOTNOYPOPOPZQPQXRQRTQRJ0RTJ0I49
2058.3484I59J0UJ1TJ0J2J1TJ2WJ3VJ4J3J4J5J4J5UJ6J5J7J6J7UJ8UJ9A489
$$ 959 969 979 989 1000 1011 1021 1033 1044 1055 1067 1079 1091 1103 1115 1128 1141 1154 1167 1181 1194 1208 1223 1237 1252 1267 1282 1298 1313 1330 1346 1363 1380 1397 1415 1433 1451 1470 1489
1992.693A509K0TK1UK2K3K2K4UK5TK6K7UK9UL0L1L2TL3L4L5L6TL7L8B409
$$ 1509 1529 1549 1570 1591 1612 1634 1657 1679 1703 1727 1751 1776 1801 1827 1854 1881 1908 1937 1966 1995 2025 2056 2088 2120 2153 2187 2222 2258 2294 2331 2369 2409
1937.1384B449M1M2M3M5TM7M8M9N0N2N4N5N6N8N9O6O3O5O7O9P1P3P5P8C900
$$ 2449 2490 2532 2575 2620 2665 2712 2760 2809 2859 2911 2965 3020 3076 3134 3193 3259 3322 3387 3454 3523 3594 3667 3742 3820 3900
1893.3682C982Q5Q8R1R4R7J00J04J07J11J15J19J23J27J33J37J43J48F057
$$ 3982 4067 4155 4246 4340 4437 4537 4641 4748 4859 4974 5093 5216 5343 5476 5613 5756 5904 6057
1861.3822F217J66J73J80J87J95K04K12K21K32K41K53K64K77K90L03L19A0269
$$ 6217 6383 6556 6736 6923 7118 7322 7534 7755 7987 8228 8481 8745 9022 9312 9615 9934 10269
1831.0797A0621L69L89M10M32M56M81N08N38N70O04O40O81P24P71Q22A9892
$$ 10621 10990 11379 11789 12221 12677 13158 13666 14204 14774 15378 16018 16699 17423 18194 19016 19892
1802.4607B0830J002J075J153J238J333J437J550J677J815J969K139K328D2084
$$ 20830 21832 22907 24060 25298 26631 28068 29618 31295 33110 35079 37218 39546 42084
1778.8921D4857L033L323L648M011M415M868N849N933O552P234P976Q777A20101
$$ 44857 47890 51213 54861 58872 63287 68155 74004 79937 86489 93723 101699 110476 120101
1755.3235A30604J1379J2208J2923J3437J3642J3417J2640J1217R110B46943
$$ 130604 141983 154191 167114 180551 194193 207610 220250 231467 240577 246943
1736.8053B50072l62l823o974r594j1559j2842j3495j3620j3341j2777A39654
$$ 250072 249710 245887 238913 229319 217760 204918 191423 177803 164462 151685 139654
1716.6036A28466j0308r434q594p806p075o407n801n254m761m320l925E1211
$$ 128466 118158 108724 100130 92324 85249 78842 73041 67787 63026 58706 54781 51211
1694.7185D7959k968k714k484k279k094j927j776j640j517j405j304j210B3514
$$ 47959 44991 42277 39793 37514 35420 33493 31717 30077 28560 27155 25851 24641 23514
1671.1499B2465r79r14q54q01p50p04o61o21n85n52n19m91m63m38m15A2326
$$ 22465 21486 20572 19718 18917 18167 17463 16802 16181 15596 15044 14525 14034 13571 13133 12718 12326
1642.5309A1954l52l34l17l01k87k72k58k47k34k23k13k02j93j84j75G995
$$ 11954 11602 11268 10951 10650 10363 10091 9833 9586 9352 9129 8916 8714 8521 8337 8162 7995
1613.9119G835j52j44j38j32j25j20j14j08j03r8r3q9q3q0p5p1o6o3n9E867
$$ 7835 7683 7539 7401 7269 7144 7024 6910 6802 6699 6601 6508 6419 6336 6256 6181 6110 6044 5981 5922 5867
1578.559E816m8m4m0l7l3k9k6k2j9j5j1plJORJ5K0K4R2L7M3N0N7O5P3F056
$$ 5816 5768 5724 5684 5647 5614 5585 5559 5537 5518 5503 5492 5485 5482 5483 5489 5498 5513 5533 5557 5649 5686 5729 5779 5836 5901 5974 6056
1531.4218F147J00J09J19J27J34J38J39J37J29J16R8P7N5L1J1nj6k1k2G584
$$ 6147 6247 6356 6475 6602 6736 6874 7013 7150 7279 7395 7493 7570 7625 7656 7667 7662 7646 7625 7603 7584
1496.0688G573lQK1L2M5N7P0Q3R4J07J18J31J43J56J67J81J94K08K22I844
$$ 7573 7570 7578 7599 7631 7676 7733 7803 7886 7980 8087 8205 8336 8479 8635 8802 8983 9177 9385 9607 9844
1460.716A0096K69K86L05L24L44L67L90M16M42M72N03N37N74O13O56A7297
$$ 10096 10365 10651 10956 11280 11624 11991 12381 12797 13239 13711 14214 14751 15325 15938 16594 17297
1432.0969A8050Q09Q70R36J009J089J176J274J380J499J629J775J936C5548
$$ 18050 18859 19729 20665 21674 22763 23939 25213 26593 28092 29721 31496 33432 35548
1408.5283C7864K540K789L067L378L724M111M540N015N538O107O722P372A00813
$$ 37864 40404 43193 46260 49638 53362 57473 62013 67028 72566 78673 85395 92767 100813
1384.9597A09532R354R903J0298J0455J0282R687Q595O979M874K391k86A89123
$$ 109532 118886 128789 139087 149542 159824 169511 178106 185085 189959 192350 192064 189123
1363.0746A83765p367q875r794j0359j0455j0241r807r236q589p914p243G7286
$$ 183765 176398 167523 157729 147370 136915 126674 116867 107631 99042 91128 83885 77286
1341.1895G1293n434m921m455m654l653l314l010k739k495k277k082j906B8605
$$ 71293 65859 60938 56483 51829 48176 44862 41852 39113 36618 34341 32259 30353 28605
1317.6208B7000j478j363j257j163j077r99r28q63q04p49p00o54o12n73A3242
$$ 27000 25522 24159 22902 21739 20662 19663 18735 17872 17068 16319 15619 14965 14353 13780 13242
1290.6853A2738m75m45m20l96l72l52l32l13k96k80k64k51k37k24k12G668
$$ 12738 12263 11818 11398 11002 10630 10278 9946 9633 9337 9057 8793 8542 8305 8081 7869 7668
1262.0663G478j80j70j61j52j43j36j27j20j13j06r9r2q6q0p3o7o1n4E409
$$ 7478 7298 7128 6967 6815 6672 6536 6409 6289 6176 6070 5971 5879 5793 5713 5640 5573 5512 5458 5409
1228.3969E366l6l0k4j7j1mMJ0J9K6L5M4N4O4P4Q7J00J13J29J45J63J83F699
$$ 5366 5330 5300 5276 5259 5248 5244 5248 5258 5277 5303 5338 5382 5436 5500 5574 5661 5761 5874 6003 6148 6311 6494 6699
1187.9935F928K56K85L18L55L95M40M91N46O07Q66P50Q29R13R99J085A7230
$$ 6928 7184 7469 7787 8142 8537 8977 9468 10014 10621 11487 12237 13066 13979 14978 16063 17230
1159.3745A8468J288J309J288J214J075Q70O03K88n2l88o96r50j142j266B0581
$$ 18468 19756 21065 22353 23567 24642 25512 26115 26403 26351 25963 25267 24317 23175 21909 20581
1132.439A9240j313j257j183j101j015r28q46p68o97o31n71n17m68m29G130
$$ 19240 17927 16670 15487 14386 13371 12443 11597 10829 10132 9501 8930 8413 7945 7516 7130
1105.5034F780l19k90k64k42k21k02j85j69j56j43j31j20j10j01r3q5C871
$$ 6780 6461 6171 5907 5665 5444 5242 5057 4888 4732 4589 4458 4338 4228 4127 4034 3949 3871
1075.2009C800o4n8n3m7m2l8l2k8k4j9j5j1pkJORJ4J8K3K7L2L7M1M8N2C727
$$ 3800 3736 3678 3625 3578 3536 3498 3466 3438 3414 3395 3380 3369 3362 3360 3361 3367 3376 3390 3408 3431 3458 3490 3527 3568 3616 3668 3727
1028.0637C792P2Q0Q7R5J04J14K11J37J49J64J78J96K13K34K57K82L09G014
$$ 3792 3864 3944 4031 4126 4230 4344 4555 4692 4841 5005 5183 5379 5592 5826 6083 6365 6674 7014
996.0777G388M13M56N03N56O14O80P51Q29R13J001J094J185J272J347B0403
$$ 7388 7801 8257 8760 9316 9930 10610 11361 12190 13103 14104 15198 16383 17655 19002 20403
969.14215B1825J400Q46J176R58O72L36k6l86p13r85j189j322j390j401A8429
$$ 21825 23225 24071 25247 26205 26877 27213 27187 26801 26088 25103 23914 22592 21202 19801 18429
942.2066A7116j235j146j053r62q74p91p14o44n80n22m70m22l81l43F671
$$ 17116 15881 14735 13682 12720 11846 11055 10341 9697 9117 8595 8125 7703 7322 6979 6671
915.27106F393k50k25k02o8j62j44j29j14j01q9p7o6n6m7l7k9k1j2nLD572
$$ 6393 6143 5918 5716 5648 5486 5342 5213 5099 4998 4909 4832 4766 4710 4663 4626 4597 4576 4564 4559 4562 4572
878.2347D589K5L1L9M6N3O1O8P6Q4R3J01J10J19J30J40J50J63J76J88F646
$$ 4589 4614 4645 4684 4730 4783 4844 4912 4988 5072 5165 5266 5376 5495 5625 5765 5915 6078 6254 6442 6646
842.8818F864K35K53K73K93L17L41L68L98M31M66N05N49N96O49P08P72A4863
$$ 6864 7099 7352 7625 7918 8235 8576 8944 9342 9773 10239 10744 11293 11889 12538 13246 14018 14863
812.5793A5788J015J115J227J351J490J645J816K007K216K444K689K951D0973
$$ 15788 16803 17918 19145 20496 21986 23631 25447 27454 29670 32114 34803 37754 40973
789.0107D4462L742L963M120M184M116L877L443K797J957R66j03j162G4234
$$ 44462 48204 52167 56287 60471 64587 68464 71907 74704 76661 77627 77524 76362 74234
765.4421G1305l532l923m123m160m075l900l672l412l142k873k616k372B7296
$$ 71305 67773 63850 59727 55567 51492 47592 43920 40508 37366 34493 31877 29505 27296
741.8735B5355j755j587j434j298j176j065r67q79p99p27o63o04n51A1347
$$ 25355 23600 22013 20579 19281 18105 17040 16073 15194 14395 13668 13005 12401 11850 11347
716.6214A0888m19l83l49l18k89k62k38k14j93j72j52j34j15r8q1o5G358
$$ 10888 10469 10086 9737 9419 9130 8868 8630 8416 8223 8051 7899 7765 7650 7552 7471 7406 7358
686.3189G326j6%J7L4N1P0Q8J08J29J51J75K01K28K58K91L27L67M10A0672
$$ 7326 7310 7310 7327 7361 7412 7482 7570 7678 7807 7958 8133 8334 8562 8820 9111 9438 9805 10215 10672
652.6495A1183N70O35P06P87Q75R70J076J189J307J431J554J671J772B7571
$$ 11183 11753 12388 13094 13881 14756 15726 16802 17991 19298 20729 22283 23954 25726 27571
627.3974B9446J847J743J550J263Q87M46l2n05r35j293j560j732j819B7473
$$ 29446 31293 33036 34586 35849 36736 37182 37150 36645 35710 34417 32857 31125 29306 27473
602.1453B5683j708j601j481j355j229j109r94q87p55o98o15n39m69A1838
$$ 25683 23975 22374 20893 19538 18309 17200 16206 15319 14564 13866 13251 12712 12243 11838
576.89325A1493k91k39j91j45j00n7j5K7O8J12J55J37K48L00L52M11M72A3278
$$ 11493 11202 10963 10772 10627 10527 10470 10455 10482 10550 10662 10817 10954 11202 11502 11854 12265 12737 13278
544.9073A3893O95P85Q84R91J109J240J379J531J690J854K018K172K307C4952
$$ 13893 14588 15373 16257 17248 18357 19597 20976 22507 24197 26051 28069 30241 32548 34952
519.6552C7396K404K265K007J622J122N31j07p39j314j793k152k385C6353
$$ 37396 39800 42065 44072 45694 46816 47347 47240 46501 45187 43394 41242 38857 36353
496.08658C3828k473k369k231k076j914j753j598j453j319j195j084r83A2488
$$ 33828 31355 28986 26755 24679 22765 21012 19414 17961 16642 15447 14363 13380 12488
472.51797A1677p37o73o13n61n14m72m33l99l69l40l15k92k71k52k35D982
$$ 11677 10940 10267 9654 9093 8579 8107 7674 7275 6906 6566 6251 5959 5688 5436 5201 4982
443.89896D778j92j79j68j58j49j40j32j24j17j11j06r9r4r0q5q1p7p3B533
$$ 4778 4586 4407 4239 4081 3932 3792 3660 3536 3419 3308 3202 3103 3009 2919 2834 2753 2676 2603 2533
410.22952B467o4o0n8n5n3n1m8m6m5m2m1l9l8l6l4l3l2l1k9Tk7k6k5k14A290
$$ 2467 2403 2343 2285 2230 2177 2126 2078 2032 1987 1945 1904 1865 1827 1791 1757 1724 1692 1661 1632 1603 1576 1550 1525 1311 1290
366.45926A269k0j9j8Tj7j6j5Tj4j3Tj2Tj1j0TrTqpUonUlmlkjU%JTKTMI66
$$ 1269 1249 1230 1212 1194 1177 1161 1146 1131 1117 1104 1091 1079 1067 1056 1046 1036 1027 1018 1010 1003 996 989 983 978 973 968 965 961 958 956 955 954 953 953 954 955 957 959 963 966
297.43692I71NOPQRTJ0J2TJ4J5J6J7J9K0K2K3K6K7K9L2L4L7L9M3M6M9A611
$$ 971 976 982 989 997 1006 1015 1025 1037 1049 1063 1078 1094 1111 1130 1150 1172 1195 1221 1248 1277 1309 1343 1380 1419 1462 1508 1557 1611
248.61623A669O2O8P4P9Q7R4J02J12J22J33J46J61J76J93K13K36K59K87D590
$$ 1669 1731 1799 1873 1952 2039 2133 2235 2347 2469 2602 2748 2909 3085 3278 3491 3727 3986 4273 4590
214.9468D856L88M28M72N17N65O12O57O96P23P35P22O81O04M90L41J67A3632
$$ 4856 5244 5672 6144 6661 7226 7838 8495 9191 9914 10649 11371 12052 12656 13146 13487 13654 13632
184.6443A3424l79n20o27o95p31p38p23o92o51o07n58n12m66m23l84D370
$$ 13424 13045 12525 11898 11203 10472 9734 9011 8319 7668 7061 6503 5991 5525 5102 4718 4370
156.02528D055k86k59k35k14j94j78j62j48j36j25j14j06r8r0q3p8p2A410
$$ 4055 3769 3510 3275 3061 2867 2689 2527 2379 2243 2118 2004 1898 1800 1710 1627 1549 1477 1410
124.039314A348n9n4n1m8m5m2l9l8l5j46l0k9k7k6k4k3k2k1k0j9j7Uj5D69
$$ 1348 1289 1235 1184 1136 1091 1049 1010 972 937 791 761 732 705 679 655 632 610 589 569 550 533 516 499 484 469
80.26905D55j4j3j2Tj1Uj0rVqUpVoVnonVmnmWlmTlVmklUklTkTA36
$$ 455 441 428 416 404 393 382 371 361 352 343 334 325 317 309 301 294 287 280 273 267 261 255 249 244 238 233 228 223 218 214 209 205 201 197 193 189 186 182 178 175 172 169 166 162 160 157 154 151 149 146 143 141 139 136
-12.3219A34  $$checkpoint
##END=$$ End of the RAMAN for cis-DCE
##TITLE= trans-1,2-dichloroethene (E)
##JCAMP-DX= 5.01
##DATA TYPE= INFRARED SPECTRUM
##DATA CLASS= XYDATA
##BLOCK ID=3
##ORIGIN= Department of Chemistry, UWI, JAMAICA
##OWNER= public domain
##LONGDATE= 2012/02/18 12:32:26.0301 -0500 $$ export date from JSpecView
##SPECTROMETER/DATA SYSTEM= from scan
##$MODELS=
<Models>
<ModelData id="tDCE" type="MOL">
trans-1,2-dichloroethylene (E)
__Jmol-14_02171520503D 1   1.00000     0.00000     0
Jmol version 14.3.12_2015.02.11  2015-02-11 19:15 EXTRACT: ({0:5})
  6  5  0  0  0  0              1 V2000
  -0.36431   0.56175   0.00000 C   0  0  0  0  0  0
   0.36431  -0.56175   0.00000 C   0  0  0  0  0  0
  -0.36431  -2.12076   0.00000 Cl  0  0  0  0  0  0
   1.46636  -0.58339   0.00000 H   0  0  0  0  0  0
  -1.46636   0.58339   0.00000 H   0  0  0  0  0  0
   0.36431   2.12076   0.00000 Cl  0  0  0  0  0  0
  1  6  1  0  0  0
  1  2  2  0  0  0
  2  4  1  0  0  0
  3  2  1  0  0  0
  5  1  1  0  0  0
M  END
</ModelData>
<ModelData id="T1" type="XYZVIB" baseModel="tDCE" vibrationScale=".5">
6
Model[1]: PATH=Calculation 1;Input;Convg=0.6909D-08;-V/T=2.0006;Energy=NaN;Range=M.O.s;E(RHF)=-995.827950206 A.U.;PATH=Calculation 1;Input
C       0.00000      0.00000      0.00000
C       0.00000      0.00000      1.33908
Cl      1.45962      0.00000      2.25063
H      -0.91285      0.00000      1.95689
H       0.91285      0.00000     -0.61781
Cl     -1.45962      0.00000     -0.91155
6
Model[2]: PATH=Calculation 1;Standard;Convg=0.6909D-08;-V/T=2.0006;Energy=-995.82794;Range=M.O.s;E(RHF)=-995.827950206 A.U.;PATH=Calculation 1;Standard
C      -0.36431      0.56175      0.00000
C       0.36431     -0.56175      0.00000
Cl     -0.36431     -2.12076      0.00000
H       1.46636     -0.58339      0.00000
H      -1.46636      0.58339      0.00000
Cl      0.36431      2.12076      0.00000
6
Model[3]: IRIntensity=0.9482 KM/Mole;PATH=Calculation 1;FrequenciesFrequencies;ReducedMass=8.2119 AMU;ForceConstant=0.2553 mDyne/A;FreqValue=229.7041;Frequency=229.7041 cm^-1;FrequencyLabel=AU;PATH=Calculation 1;FrequenciesFrequencies
C      -0.36431      0.56175      0.00000      0.00000      0.00000      0.48000
C       0.36431     -0.56175      0.00000      0.00000      0.00000      0.48000
Cl     -0.36431     -2.12076      0.00000      0.00000      0.00000     -0.18001
H       1.46636     -0.58339      0.00000      0.00000      0.00000      0.49001
H      -1.46636      0.58339      0.00000      0.00000      0.00000      0.49001
Cl      0.36431      2.12076      0.00000      0.00000      0.00000     -0.18001
6
Model[4]: IRIntensity=4.5756 KM/Mole;PATH=Calculation 1;FrequenciesFrequencies;ReducedMass=6.7769 AMU;ForceConstant=0.2730 mDyne/A;FreqValue=261.4711;Frequency=261.4711 cm^-1;FrequencyLabel=BU;PATH=Calculation 1;FrequenciesFrequencies
C      -0.36431      0.56175      0.00000      0.39000     -0.16000      0.00000
C       0.36431     -0.56175      0.00000      0.39000     -0.16000      0.00000
Cl     -0.36431     -2.12076      0.00000     -0.15001      0.07000      0.00000
H       1.46636     -0.58339      0.00000      0.39000     -0.37000      0.00000
H      -1.46636      0.58339      0.00000      0.39000     -0.37000      0.00000
Cl      0.36431      2.12076      0.00000     -0.15001      0.07000      0.00000
6
Model[5]: IRIntensity=0.0000 KM/Mole;PATH=Calculation 1;FrequenciesFrequencies;ReducedMass=21.5344 AMU;ForceConstant=1.8876 mDyne/A;FreqValue=385.7165;Frequency=385.7165 cm^-1;FrequencyLabel=AG;PATH=Calculation 1;FrequenciesFrequencies
C      -0.36431      0.56175      0.00000     -0.17000     -0.17000      0.00000
C       0.36431     -0.56175      0.00000      0.17000      0.17000      0.00000
Cl     -0.36431     -2.12076      0.00000      0.06000      0.53000      0.00000
H       1.46636     -0.58339      0.00000      0.18001      0.36001      0.00000
H      -1.46636      0.58339      0.00000     -0.18001     -0.36001      0.00000
Cl      0.36431      2.12076      0.00000     -0.06000     -0.53000      0.00000
6
Model[6]: IRIntensity=145.4250 KM/Mole;PATH=Calculation 1;FrequenciesFrequencies;ReducedMass=9.0780 AMU;ForceConstant=4.3937 mDyne/A;FreqValue=906.3509;Frequency=906.3509 cm^-1;FrequencyLabel=BU;PATH=Calculation 1;FrequenciesFrequencies
C      -0.36431      0.56175      0.00000      0.21000      0.46001      0.00000
C       0.36431     -0.56175      0.00000      0.21000      0.46001      0.00000
Cl     -0.36431     -2.12076      0.00000     -0.08000     -0.17000      0.00000
H       1.46636     -0.58339      0.00000      0.21000      0.40000      0.00000
H      -1.46636      0.58339      0.00000      0.21000      0.40000      0.00000
Cl      0.36431      2.12076      0.00000     -0.08000     -0.17000      0.00000
6
Model[7]: IRIntensity=0.0000 KM/Mole;PATH=Calculation 1;FrequenciesFrequencies;ReducedMass=4.7852 AMU;ForceConstant=2.6377 mDyne/A;FreqValue=967.2547;Frequency=967.2547 cm^-1;FrequencyLabel=AG;PATH=Calculation 1;FrequenciesFrequencies
C      -0.36431      0.56175      0.00000      0.33001      0.19000      0.00000
C       0.36431     -0.56175      0.00000     -0.33001     -0.19000      0.00000
Cl     -0.36431     -2.12076      0.00000      0.06000      0.06000      0.00000
H       1.46636     -0.58339      0.00000     -0.34000     -0.48000      0.00000
H      -1.46636      0.58339      0.00000      0.34000      0.48000      0.00000
Cl      0.36431      2.12076      0.00000     -0.06000     -0.06000      0.00000
6
Model[8]: IRIntensity=0.0000 KM/Mole;PATH=Calculation 1;FrequenciesFrequencies;ReducedMass=1.8463 AMU;ForceConstant=1.1155 mDyne/A;FreqValue=1012.6580;Frequency=1012.6580 cm^-1;FrequencyLabel=BG;PATH=Calculation 1;FrequenciesFrequencies
C      -0.36431      0.56175      0.00000      0.00000      0.00000     -0.19000
C       0.36431     -0.56175      0.00000      0.00000      0.00000      0.19000
Cl     -0.36431     -2.12076      0.00000      0.00000      0.00000     -0.01000
H       1.46636     -0.58339      0.00000      0.00000      0.00000     -0.68000
H      -1.46636      0.58339      0.00000      0.00000      0.00000      0.68000
Cl      0.36431      2.12076      0.00000      0.00000      0.00000      0.01000
6
Model[9]: IRIntensity=71.3035 KM/Mole;PATH=Calculation 1;FrequenciesFrequencies;ReducedMass=1.0871 AMU;ForceConstant=0.8649 mDyne/A;FreqValue=1162.0574;Frequency=1162.0574 cm^-1;FrequencyLabel=AU;PATH=Calculation 1;FrequenciesFrequencies
C      -0.36431      0.56175      0.00000      0.00000      0.00000      0.06000
C       0.36431     -0.56175      0.00000      0.00000      0.00000      0.06000
Cl     -0.36431     -2.12076      0.00000      0.00000      0.00000      0.00000
H       1.46636     -0.58339      0.00000      0.00000      0.00000     -0.70000
H      -1.46636      0.58339      0.00000      0.00000      0.00000     -0.70000
Cl      0.36431      2.12076      0.00000      0.00000      0.00000      0.00000
6
Model[10]: IRIntensity=25.0309 KM/Mole;PATH=Calculation 1;FrequenciesFrequencies;ReducedMass=1.1050 AMU;ForceConstant=1.3205 mDyne/A;FreqValue=1424.1223;Frequency=1424.1223 cm^-1;FrequencyLabel=BU;PATH=Calculation 1;FrequenciesFrequencies
C      -0.36431      0.56175      0.00000      0.02000     -0.06000      0.00000
C       0.36431     -0.56175      0.00000      0.02000     -0.06000      0.00000
Cl     -0.36431     -2.12076      0.00000     -0.01000      0.00000      0.00000
H       1.46636     -0.58339      0.00000      0.04000      0.70000      0.00000
H      -1.46636      0.58339      0.00000      0.04000      0.70000      0.00000
Cl      0.36431      2.12076      0.00000     -0.01000      0.00000      0.00000
6
Model[11]: IRIntensity=0.0000 KM/Mole;PATH=Calculation 1;FrequenciesFrequencies;ReducedMass=1.3166 AMU;ForceConstant=1.6333 mDyne/A;FreqValue=1451.0326;Frequency=1451.0326 cm^-1;FrequencyLabel=AG;PATH=Calculation 1;FrequenciesFrequencies
C      -0.36431      0.56175      0.00000     -0.11000      0.05000      0.00000
C       0.36431     -0.56175      0.00000      0.11000     -0.05000      0.00000
Cl     -0.36431     -2.12076      0.00000      0.01000      0.00000      0.00000
H       1.46636     -0.58339      0.00000      0.11000     -0.69000      0.00000
H      -1.46636      0.58339      0.00000     -0.11000      0.69000      0.00000
Cl      0.36431      2.12076      0.00000     -0.01000      0.00000      0.00000
6
Model[12]: IRIntensity=0.0000 KM/Mole;PATH=Calculation 1;FrequenciesFrequencies;ReducedMass=4.0894 AMU;ForceConstant=7.3480 mDyne/A;FreqValue=1746.3394;Frequency=1746.3394 cm^-1;FrequencyLabel=AG;PATH=Calculation 1;FrequenciesFrequencies
C      -0.36431      0.56175      0.00000     -0.12000      0.35000      0.00000
C       0.36431     -0.56175      0.00000      0.12000     -0.35000      0.00000
Cl     -0.36431     -2.12076      0.00000      0.00000      0.01000      0.00000
H       1.46636     -0.58339      0.00000      0.22000      0.56000      0.00000
H      -1.46636      0.58339      0.00000     -0.22000     -0.56000      0.00000
Cl      0.36431      2.12076      0.00000      0.00000     -0.01000      0.00000
6
Model[13]: IRIntensity=16.1874 KM/Mole;PATH=Calculation 1;FrequenciesFrequencies;ReducedMass=1.0862 AMU;ForceConstant=6.3251 mDyne/A;FreqValue=3143.7315;Frequency=3143.7315 cm^-1;FrequencyLabel=BU;PATH=Calculation 1;FrequenciesFrequencies
C      -0.36431      0.56175      0.00000      0.06000      0.00000      0.00000
C       0.36431     -0.56175      0.00000      0.06000      0.00000      0.00000
Cl     -0.36431     -2.12076      0.00000      0.00000      0.00000      0.00000
H       1.46636     -0.58339      0.00000     -0.70000      0.02000      0.00000
H      -1.46636      0.58339      0.00000     -0.70000      0.02000      0.00000
Cl      0.36431      2.12076      0.00000      0.00000      0.00000      0.00000
6
Model[14]: IRIntensity=0.0000 KM/Mole;PATH=Calculation 1;FrequenciesFrequencies;ReducedMass=1.1058 AMU;ForceConstant=6.4534 mDyne/A;FreqValue=3147.1884;Frequency=3147.1884 cm^-1;FrequencyLabel=AG;PATH=Calculation 1;FrequenciesFrequencies
C      -0.36431      0.56175      0.00000      0.07000     -0.01000      0.00000
C       0.36431     -0.56175      0.00000     -0.07000      0.01000      0.00000
Cl     -0.36431     -2.12076      0.00000      0.00000      0.00000      0.00000
H       1.46636     -0.58339      0.00000      0.70000     -0.02000      0.00000
H      -1.46636      0.58339      0.00000     -0.70000      0.02000      0.00000
Cl      0.36431      2.12076      0.00000      0.00000      0.00000      0.00000
</ModelData>
</Models>
##$PEAKS=
<Peaks type="IR" xUnitsExpected="1/cm"  >
<PeakData id="1" title="1 (~3150 cm-1)" peakShape="broad" model="T1.13" xMax="3180" xMin="3150"    />
<PeakData id="2" title="2 (~3140 cm-1)" peakShape="broad" model="T1.14" xMax="3155" xMin="3120"    />
<PeakData id="3" title="3 (~1576 cm-1)" peakShape="broad" model="T1.12" xMax="1760" xMin="1730"    />
<PeakData id="4" title="4 (~1272 cm-1)" peakShape="broad" model="T1.11" xMax="1465" xMin="1435"    />
<PeakData id="5" title="5 (~1205 cm-1)" peakShape="broad" model="T1.10" xMax="1435" xMin="1405"    />
<PeakData id="6" title="6 (~900 cm-1)" peakShape="broad" model="T1.9" xMax="1180" xMin="1150"    />
<PeakData id="7" title="7 (~750 cm-1)" peakShape="broad" model="T1.8" xMax="1030" xMin="1000"    />
<PeakData id="8" title="8 (~845 cm-1)" peakShape="broad" model="T1.7" xMax="980" xMin="950"    />
<PeakData id="9" title="9 (~830 cm-1)" peakShape="broad" model="T1.6" xMax="925" xMin="895"    />
<PeakData id="10" title="10 (~350 cm-1)" peakShape="broad" model="T1.5" xMax="400" xMin="370"    />
<PeakData id="11" title="11 (~265 cm-1)" peakShape="broad" model="T1.4" xMax="285" xMin="245"    />
<PeakData id="12" title="12  (~192 cm-1)" peakShape="broad" model="T1.3" xMax="245" xMin="215"    />
</Peaks>
##XUNITS= 1/CM
##YUNITS= TRANSMITTANCE
##XFACTOR= 1
##YFACTOR= 9.999000E-07
##FIRSTX= 3.347189E+03
##FIRSTY= 9.902938E-01
##LASTX= 2.970410E+01
##NPOINTS= 2001
##MINY= 10.000000E-05
##MAXY= 1
##XYDATA= (X++(Y..Y))
3347.1885I90393j58j61j66j69j74j78j83j88j92j97k03k08k13k19k25I87327
$$ 990393 990235 990074 989908 989739 989565 989387 989204 989016 988824 988627 988424 988216 988003 987784 987559 987327
3318.9897I87089k44k51k59k66k74k81k90k99l08l17l27l37l48l58l71I82177
$$ 987089 986845 986594 986335 986069 985795 985514 985224 984925 984617 984300 983973 983636 983288 982930 982559 982177
3290.7913I81783m08m22m35m51m66m82m99n18n36n55n76n98o20o44o69I73209
$$ 981783 981375 980953 980518 980067 979601 979119 978620 978102 977566 977011 976435 975837 975217 974573 973904 973209
3262.5925I72486p52p82q15q49q85r23r64j005j051j098j149j203j259I58431
$$ 972486 971734 970952 970137 969288 968403 967480 966516 965511 964460 963362 962213 961010 959751 958431
3237.7114I57047j453j526j603j686j775j869j971k080k195k321k455I33515
$$ 957047 955594 954068 952465 950779 949004 947135 945164 943084 940889 938568 936113 933515
3216.1477I30760k921l102l297l507l735l981m249m540m854n198n570H79830
$$ 930760 927839 924737 921440 917933 914198 910217 905968 901428 896574 891376 885806 879830
3194.5842H73412o901p427q000q625r308j0051j0858j1737j2687j3714G59287
$$ 873412 866511 859084 851084 842459 833151 823100 812242 800505 787818 774104 759287
3174.6792G43293j7242j8551j9904k1277k2635k3933k5108k6085k6770E14723
$$ 743293 726051 707500 687596 666319 643684 619751 594643 568558 541788 514723
3156.433D87862k6054k4564k2337j9369j5709j1454o754j783L257Q168C84018
$$ 487862 461808 437244 414907 395538 379829 368375 361621 359838 363095 371263 384018
3136.528D00866K0315K3067K5075K6359K6978K7026K6605K5824K4780F50458
$$ 400866 421181 444248 469323 495682 522660 549686 576291 602115 626895 650458
3118.282F72699K0874J9504J8162J6869J5642J4485J3405J2401J1472H26128
$$ 672699 693573 713077 731239 748108 763750 778235 791640 804041 815513 826128
3100.036H35954R101Q437P827P268O755O284N854N457N094M760M451I11411
$$ 835954 845055 853492 861319 868587 875342 881626 887480 892937 898031 902791 907242 911411
3078.4722I15318L666L444L238L047K872K707K556K414K283K161K047I47693
$$ 915318 918984 922428 925666 928713 931585 934292 936848 939262 941545 943706 945753 947693
3056.9084I49534J748J662J580J503J432J365J302J242J187J134J084I65810
$$ 949534 951282 952944 954524 956027 957459 958824 960126 961368 962555 963689 964773 965810
3035.345I66803R51R12Q74Q39Q05P74P43P15O87O62O36O14N91N70N50I78256
$$ 966803 967754 968666 969540 970379 971184 971958 972701 973416 974103 974765 975401 976015 976606 977176 977726 978256
3007.1462I78768M94M77M62M46M31M18M04L90L79L67L55L45L34L24L14I85013
$$ 978768 979262 979739 980201 980647 981078 981496 981900 982290 982669 983036 983391 983736 984070 984394 984708 985013
2978.9478I85309K88K79K72K64K56K49K43K36K29K24K17K12K06K01J96I89072
$$ 985309 985597 985876 986148 986412 986668 986917 987160 987396 987625 987849 988066 988278 988484 988685 988881 989072
2950.749I89258J81J77J73J68J64J61J56J53J49J46J43J39J36J33J30I91694
$$ 989258 989439 989616 989789 989957 990121 990282 990438 990591 990740 990886 991029 991168 991304 991437 991567 991694
2922.5503I91818J22J18J17J14J11J09J07J04J03J00R8R6R5R2R0Q9Q7I93655
$$ 991818 991940 992058 992175 992289 992400 992509 992616 992720 992823 992923 993021 993117 993212 993304 993394 993483 993570 993655
2891.0344I93739Q2Q1P8TP6P4TP1TO9O8O7O5TO3O2O1O0N9N8N7N6N5N4I95396
$$ 993739 993821 993902 993980 994058 994134 994208 994282 994353 994424 994493 994561 994628 994693 994758 994821 994883 994944 995004 995063 995121 995178 995234 995289 995343 995396
2847.907I95448N2N0TM9M8TM6TM5TM4M3M2TM1M0TL9TL8TL7L6TL5TL4I96620
$$ 995448 995500 995550 995600 995649 995697 995745 995791 995837 995882 995927 995971 996014 996056 996098 996139 996179 996219 996258 996297 996335 996373 996410 996446 996482 996517 996552 996586 996620
2799.8035I96654L2L3L2L1UL0TK9UK8TK7UK6UK5UK4UK3K4K2K3K2UK1TK547A000100
$$ 996654 996686 996719 996751 996782 996813 996844 996874 996904 996933 996962 996991 997019 997047 997074 997101 997128 997154 997180 997206 997231 997256 997281 997305 997329 997353 997376 997400 997422 997445 997467 997489 997511 997532 997553 1000100 1000100
2738.43A000100%W50l945l2l4l3l4l5Ul6Tl7Tl8Tl9Tm0Tm1Tm2m3Tm4I95239
1782.9945I95194m5m6m7m8Tm9Tn0n1n2Tn4Un6Tn8Tn9o0o1To3o4To6o7I93634
$$ 995194 995149 995103 995056 995008 994960 994911 994862 994812 994761 994709 994657 994603 994549 994495 994439 994383 994325 994267 994208 994148 994087 994026 993963 993899 993835 993769 993702 993634
1734.891I93565p0p1p2p3p5p6p7p8q0q1q3Tq6Tq9Tr2r3r4r7r8r9j02I91518
$$ 993565 993495 993424 993352 993279 993204 993128 993051 992973 992893 992812 992729 992646 992560 992474 992385 992296 992204 992111 992017 991920 991822 991723 991621 991518
1693.4225I91412j07j09j12j13j16j17j20j23j24j27j30j32j35j38j40I89426
$$ 991412 991305 991196 991084 990971 990855 990738 990618 990495 990371 990244 990114 989982 989847 989709 989569 989426
1665.2239I89280j49j52j56j58j62j66j69j72j77j80j84j88j93j97k01I86470
$$ 989280 989131 988979 988823 988665 988503 988337 988168 987996 987819 987639 987455 987267 987074 986877 986676 986470
1637.0253I86259k15k21k26k31k37k42k48k55k61k67k74k81k88k95l04I82103
$$ 986259 986044 985823 985597 985366 985129 984887 984639 984384 984123 983856 983582 983301 983013 982718 982414 982103
1608.8267I81784l28l37l45l56l65l75l86l97m08m20m32m45m58m72m86I75273
$$ 981784 981456 981119 980774 980418 980053 979678 979292 978895 978487 978067 977635 977190 976732 976260 975774 975273
1580.628I74756n33n49n67n85o05o24o44o67o89p13j1571q45q72r01I53460
$$ 974756 974223 973674 973107 972522 971917 971293 970649 969982 969293 968580 957009 956164 955292 954391 953460
1554.0881I52497r97j031j067j106j146j189j233j279j329j380j435j492I36260
$$ 952497 951500 950469 949402 948296 947150 945961 944728 943449 942120 940740 939305 937813 936260
1530.8657I34644j685j755j832j911j996k086k182k282k390k505k627I08637
$$ 934644 932959 931204 929372 927461 925465 923379 921197 918915 916525 914020 911393 908637
1509.3021I05742l042l201l369l549l743l949m172m411m667m942n239H55899
$$ 905742 902700 899499 896130 892581 888838 884889 880717 876306 871639 866697 861458 855899
1487.7384H49995o275o676p109p578q083q631r223r862j0553j1299j2105G39629
$$ 849995 843720 837044 829935 822357 814274 805643 796420 786558 776005 764706 752601 739629
1466.1748G25725j4903j5971j7105j8305j9561k0867k2204k3552k4880E22231
$$ 725725 710822 694851 677746 659441 639880 619013 596809 573257 548377 522231
1447.9286D94929k8286k9022k9435k9437k8952k7911k6276k4036k1226B32437
$$ 494929 466643 437621 408186 378749 349797 321886 295610 271574 250348 232437
1429.6825B18252j0159n934j605K746P044J1202J5127J8709K1848K4454C28158
$$ 218252 208093 202159 200554 203300 210344 221546 236673 255382 277230 301684 328158
1409.7776C56045K8715K9007K8837K8284K7433K6363K5142K3829K2471F17232
$$ 356045 384760 413767 442604 470888 498321 524684 549826 573655 596126 617232
1391.5314F36991J8451J7198J6004J4879J3820J2831J1908J1049J0252G72896
$$ 636991 655442 672640 688644 703523 717343 730174 742082 753131 763383 772896
1373.2853G81724Q192P604P058O553O084N648N244M867M517M189L885H49164
$$ 781724 789916 797520 804578 811131 817215 822863 828107 832974 837491 841680 845565 849164
1351.7216H52497L082K846K625K417K219K033J857J689J529J376J231H76493
$$ 852497 855579 858425 861050 863467 865686 867719 869576 871265 872794 874170 875401 876493
1330.158H77450Q29P04N83M67L53K43J34K8p6j79k81l81m81n81k0613H57273
$$ 877450 878279 878983 879566 880033 880386 880629 880763 880791 880715 880536 880255 879874 879393 878812 858199 857273
1301.9594H56247j126j227j329j432j538j644j753j865j979k095k216H35704
$$ 856247 855121 853894 852565 851133 849595 847951 846198 844333 842354 840259 838043 835704
1280.3956H33237k598k735k876l021l174l332l495l667l846m032m227G91802
$$ 833237 830639 827904 825028 822007 818833 815501 812006 808339 804493 800461 796234 791802
1258.832G87157m869n105n351n610n884o170o471o790p124p478p849G10214
$$ 787157 782288 777183 771832 766222 760338 754168 747697 740907 733783 726305 718456 710214
1237.2684G01559r091r552j0035j0547j1084j1650j2245j2869j3524j4208E71833
$$ 701559 692468 682916 672881 662334 651250 639600 627355 614486 600962 586754 571833
1217.3635E56168j6433j7228j8042j8871j9709k0547k1373k2174k2931C55232
$$ 556168 539735 522507 504465 485594 465885 445338 423965 401791 378860 355232
1199.1173C30996k4731k5082k5255k5217k4932k4372k3516k2350k0881I5524
$$ 330996 306265 281183 255928 230711 205779 181407 157891 135541 114660 95524
1180.8711G8364j5027j2821j0642q578o709n081l712k589j673r09k35A0803
$$ 78364 63337 50516 39874 31296 24587 19506 15794 13205 11532 10623 10388 10803
1159.3075A1907J902K864M042N467P140R038J1098J3243J5374J7402J9242A39552
$$ 11907 13809 16673 20715 26182 33322 42360 53458 66701 82075 99477 118719 139552
1137.7439A61689K3134K3825K4227K4366K4274K3982K3530K2944K2258C95726
$$ 161689 184823 208648 232875 257241 281515 305497 329027 351971 374229 395726
1119.4977D16409J9834J8967J8095J7226J6371J5534J4719J3931J3171E76697
$$ 416409 436243 455210 473305 490531 506902 522436 537155 551086 564257 576697
1101.2516E88436J1068J0427R816R232Q677Q146P641P160O701O263N846F84860
$$ 588436 599504 609931 619747 628979 637656 645802 653443 660603 667304 673567 679413 684860
1079.6879F89925M701M350M016L693L384L086K797K520K250J989J736G25935
$$ 689925 694626 698976 702992 706685 710069 713155 715952 718472 720722 722711 724447 725935
1058.1243G27183J012P82N56L32J14j04l18n31p43r54j165j376j588j801G19384
$$ 727183 728195 728977 729533 729865 729979 729875 729557 729026 728283 727329 726164 724788 723200 721399 719384
1031.5844G17152k451k673k897l126o07l634l876m125m380m641m909n185F69180
$$ 717152 714701 712028 709131 706005 705398 701764 697888 693763 689383 684742 679833 674648 669180
1008.36194F63420o061o371o691p021p362p714q078q454q842r243r656E67844
$$ 663420 657359 650988 644297 637276 629914 622200 614122 605668 596826 587583 577927 567844
986.79834E57322j0975j1440j1917j2406j2905j3414j3931j4453j4979D25397
$$ 557322 546347 534907 522990 510584 497679 484265 470334 455881 440902 425397
968.5522D09369j6543j7044j7526j7983j8403j8780j9103j9357j9534B25479
$$ 409369 392826 375782 358256 340273 321870 303090 283987 264630 245096 225479
950.30597B05888j9445j9160j8728j8135j7375j6446j5354j4109j2736D3135
$$ 205888 186443 167283 148555 130420 113045 96599 81245 67136 54400 43135
932.0598C3397q204o716n325m077l008k131j451r49n98l64k15j25p2A23
$$ 33397 25193 18477 13152 9075 6067 3936 2485 1536 938 574 359 234 162 123
907.1787A05nQK5M7Q4J48K53M25O91J088J645K389L335M474N788P236C6508
$$ 105 100 108 133 180 264 412 665 1090 1781 2869 4514 6903 10238 14712 20500 27736 36508
877.32135D6850J1891J3376J4755J5998J7087J8008J8761J9348J9776B15908
$$ 46850 58741 72117 86872 102870 119957 137965 156726 176074 195850 215908
859.0752B36113K0234K0156J9990J9745J9437J9074J8671J8234J7772D26716
$$ 236113 256347 276503 296493 316238 335675 354749 373420 391654 409426 426716
840.82904D43514J6299J5796J5294J4797J4306J3823J3350J2888J2439E84508
$$ 443514 459813 475609 490903 505700 520006 533829 547179 560067 572506 584508
822.5828E96087J1168J0772J0390J0020R664R321Q992Q675Q370Q078F99332
$$ 596087 607255 618027 628417 638437 648101 657422 666414 675089 683459 691537 699332
802.6779G06858P266P017O778O549O328O116N913N719N531N351N179G79617
$$ 706858 714124 721141 727919 734468 740796 746912 752825 758544 764075 769426 774605 779617
781.1143G84471M700M553M412M276M145M020L898L782L671L562L458H41629
$$ 784471 789171 793724 798136 802412 806557 810577 814475 818257 821928 825490 828948 841629
759.55066H44851L128L038K951K868K787K709K635K561K492K425K360H77101
$$ 844851 847979 851017 853968 856836 859623 862332 864967 867528 870020 872445 874805 877101
737.987H79337K177K121K065K013J961J912J864J817J773J729J686I02101
$$ 879337 881514 883635 885700 887713 889674 891586 893450 895267 897040 898769 900455 902101
716.42334I03708J568J531J495J460J426J394J361J331J300J272J243I20305
$$ 903708 905276 906807 908302 909762 911188 912582 913943 915274 916574 917846 919089 920305
694.8597I21494J163J138J113J090J067J044J022J001R80R60R40R22I34837
$$ 921494 922657 923795 924908 925998 927065 928109 929131 930132 931112 932072 933012 933934 934837
671.6373I35721Q67Q50Q34Q17Q01J06P64P50P35P21P07O94O81O68O56I47016
$$ 935721 936588 937438 938272 939089 939890 939996 940760 941510 942245 942966 943673 944367 945048 945716 946372 947016
643.4387I47647O21O09N97N87N77N66N56N46L95N25N17N08M99M90M82I56195
$$ 947647 948268 948877 949474 950061 950638 951204 951760 952306 952701 953226 953743 954251 954750 955240 955722 956195
615.24005I56661M57M50M42M35M27M20M14M06M00L93L86L81L74L68L62I63132
$$ 956661 957118 957568 958010 958445 958872 959292 959706 960112 960512 960905 961291 961672 962046 962414 962776 963132
587.04144I63482L45L39L34L28L23L18L13L08L03K98K94K88K85K79K76I68384
$$ 963482 963827 964166 964500 964828 965151 965469 965782 966090 966393 966691 966985 967273 967558 967837 968113 968384
558.84283I68651K62K59K54K50K47K42K39K35K31K27K24K20K17K14K09I72388
$$ 968651 968913 969172 969426 969676 969923 970165 970404 970639 970870 971097 971321 971541 971758 971972 972181 972388
530.6442I72591K00J96J94J90J87J84J80J78J75J71J69J66J63J60J57I97826
$$ 972591 972791 972987 973181 973371 973558 973742 973922 974100 974275 974446 974615 974781 974944 975104 975261 997826
502.44562I97795l1l2l3Tl4l5Tl7Ul9m0Tm1m3Tm4m5m6m8Tn0n1n2n3n5I96658
$$ 997795 997764 997732 997699 997666 997632 997597 997562 997525 997488 997451 997412 997372 997332 997291 997248 997205 997161 997116 997070 997022 996974 996924 996873 996821 996768 996713 996658
456.00082I96600n9o0o2o3o5o7o8p1p2p4p6p9q0q3q5q8r0r3r6r8j01j05I94758
$$ 996600 996541 996481 996419 996356 996291 996224 996156 996085 996013 995939 995863 995784 995704 995621 995536 995448 995358 995265 995169 995071 994970 994865 994758
416.191I94647j15j18j22j26j30j34j39j44j48j54j58j65j70j77j83I92274
$$ 994647 994532 994414 994292 994166 994036 993902 993763 993619 993471 993317 993159 992994 992824 992647 992464 992274
387.9924I92077k05k12k21k29k39k48k58k69k81k93l05l18l33l48l64I87573
$$ 992077 991872 991660 991439 991210 990971 990723 990465 990196 989915 989622 989317 988999 988666 988318 987954 987573
359.7938I87174m18m38m60m84n08n34n62n93o25o60o97p37p80q27q77I77043
$$ 987174 986756 986318 985858 985374 984866 984332 983770 983177 982552 981892 981195 980458 979678 978851 977974 977043
331.59518I76053j052j122j197j277j366j463j568j683j809j947k099I57205
$$ 976053 975001 973879 972682 971405 970039 968576 967008 965325 963516 961569 959470 957205
310.03152I54755k651k875l121l394l695m027m396m801n249n742o281I01653
$$ 954755 952104 949229 946108 942714 939019 934992 930596 925795 920546 914804 908523 901653
288.46786H94146q189q912r662j0420j1160j1840j2408j2795j2926j2710G71054
$$ 894146 885957 877045 867383 856963 845803 833963 821555 808760 795834 783124 771054
268.56296G60112r297p167m640j867R59L635N982P866R223J0044J0375G95518
$$ 760112 750815 743648 739008 737141 738100 741735 747717 755583 764806 774850 785225 795518
246.99933H05406R255Q483P650O828O076N445M971M681M577M643M839H77965
$$ 805406 814661 823144 830794 837622 843698 849143 854114 858795 863372 868015 872854 877965
225.43567H83364N647N815N881N842N709N498N232M931M613M290L974I44466
$$ 883364 889011 894826 900707 906549 912258 917756 922988 927919 932532 936822 940796 944466
203.87202I47851L118K871K645K438K248K077J919J777J648J529J422I72867
$$ 947851 950969 953840 956485 958923 961171 963248 965167 966944 968592 970121 971543 972867
182.30838I74102J152J078J010R46Q88Q35P86P40O98O60O23N90N59N30I85700
$$ 974102 975254 976332 977342 978288 979176 980011 980797 981537 982235 982895 983518 984108 984667 985197 985700
155.76851I86178M54M32M12L92L74L57L42L26L12K99K86K74K63K52K42I91428
$$ 986178 986632 987064 987476 987868 988242 988599 988941 989267 989579 989878 990164 990438 990701 990953 991195 991428
127.569885I91651K15K07J99J92J85J78J72J66J60J54J50J44J39J35J31I94304
$$ 991651 991866 992073 992272 992464 992649 992827 992999 993165 993325 993479 993629 993773 993912 994047 994178 994304
99.37127I94427J18J15J11J08J05J01R9R5R3R0Q8Q5Q3Q0P9P6P4P2P1I96238
$$ 994427 994545 994660 994771 994879 994984 995085 995184 995279 995372 995462 995550 995635 995718 995798 995877 995953 996027 996099 996170 996238
64.53768I96305O5O3O2O0N8N7N6N5N3N2N0TM8M7M6M5TM3M2I97343
$$ 996305 996370 996433 996495 996555 996613 996670 996726 996781 996834 996886 996936 996986 997034 997081 997127 997172 997217 997260 997302 997343
29.7041I97383  $$checkpoint
##END= $$ end of trans-DCE IR
##TITLE=Raman of trans-1,2-dichloroethylene (E) $$ Begin of the data block
##JCAMP-DX=5.00 $$ ACD/DocManager Library v 5.00
##DATA TYPE=RAMAN SPECTRUM
##DATA CLASS=XYDATA
##BLOCK ID=4
##DATE=19 Feb 2012 10:30:00
##ORIGIN= Department of Chemistry, UWI, Jamaica
##OWNER= public domain
##SPECTROMETER/DATA SYSTEM=from scan
##$MODELS=
<Models>
<ModelData id="tDCE" type="MOL">
trans-1,2-dichloroethylene (E)
__Jmol-14_02171520503D 1   1.00000     0.00000     0
Jmol version 14.3.12_2015.02.11  2015-02-11 19:15 EXTRACT: ({0:5})
  6  5  0  0  0  0              1 V2000
  -0.36431   0.56175   0.00000 C   0  0  0  0  0  0
   0.36431  -0.56175   0.00000 C   0  0  0  0  0  0
  -0.36431  -2.12076   0.00000 Cl  0  0  0  0  0  0
   1.46636  -0.58339   0.00000 H   0  0  0  0  0  0
  -1.46636   0.58339   0.00000 H   0  0  0  0  0  0
   0.36431   2.12076   0.00000 Cl  0  0  0  0  0  0
  1  6  1  0  0  0
  1  2  2  0  0  0
  2  4  1  0  0  0
  3  2  1  0  0  0
  5  1  1  0  0  0
M  END
</ModelData>
<ModelData id="T2" type="XYZVIB" baseModel="tDCE" vibrationScale=".5">
6
Model[1]: PATH=Calculation 1;Input;Convg=0.6909D-08;-V/T=2.0006;Energy=NaN;Range=M.O.s;E(RHF)=-995.827950206 A.U.;PATH=Calculation 1;Input
C       0.00000      0.00000      0.00000
C       0.00000      0.00000      1.33908
Cl      1.45962      0.00000      2.25063
H      -0.91285      0.00000      1.95689
H       0.91285      0.00000     -0.61781
Cl     -1.45962      0.00000     -0.91155
6
Model[2]: PATH=Calculation 1;Standard;Convg=0.6909D-08;-V/T=2.0006;Energy=-995.82794;Range=M.O.s;E(RHF)=-995.827950206 A.U.;PATH=Calculation 1;Standard
C      -0.36431      0.56175      0.00000
C       0.36431     -0.56175      0.00000
Cl     -0.36431     -2.12076      0.00000
H       1.46636     -0.58339      0.00000
H      -1.46636      0.58339      0.00000
Cl      0.36431      2.12076      0.00000
6
Model[3]: IRIntensity=0.9482 KM/Mole;PATH=Calculation 1;FrequenciesFrequencies;ReducedMass=8.2119 AMU;ForceConstant=0.2553 mDyne/A;FreqValue=229.7041;Frequency=229.7041 cm^-1;FrequencyLabel=AU;PATH=Calculation 1;FrequenciesFrequencies
C      -0.36431      0.56175      0.00000      0.00000      0.00000      0.48000
C       0.36431     -0.56175      0.00000      0.00000      0.00000      0.48000
Cl     -0.36431     -2.12076      0.00000      0.00000      0.00000     -0.18001
H       1.46636     -0.58339      0.00000      0.00000      0.00000      0.49001
H      -1.46636      0.58339      0.00000      0.00000      0.00000      0.49001
Cl      0.36431      2.12076      0.00000      0.00000      0.00000     -0.18001
6
Model[4]: IRIntensity=4.5756 KM/Mole;PATH=Calculation 1;FrequenciesFrequencies;ReducedMass=6.7769 AMU;ForceConstant=0.2730 mDyne/A;FreqValue=261.4711;Frequency=261.4711 cm^-1;FrequencyLabel=BU;PATH=Calculation 1;FrequenciesFrequencies
C      -0.36431      0.56175      0.00000      0.39000     -0.16000      0.00000
C       0.36431     -0.56175      0.00000      0.39000     -0.16000      0.00000
Cl     -0.36431     -2.12076      0.00000     -0.15001      0.07000      0.00000
H       1.46636     -0.58339      0.00000      0.39000     -0.37000      0.00000
H      -1.46636      0.58339      0.00000      0.39000     -0.37000      0.00000
Cl      0.36431      2.12076      0.00000     -0.15001      0.07000      0.00000
6
Model[5]: IRIntensity=0.0000 KM/Mole;PATH=Calculation 1;FrequenciesFrequencies;ReducedMass=21.5344 AMU;ForceConstant=1.8876 mDyne/A;FreqValue=385.7165;Frequency=385.7165 cm^-1;FrequencyLabel=AG;PATH=Calculation 1;FrequenciesFrequencies
C      -0.36431      0.56175      0.00000     -0.17000     -0.17000      0.00000
C       0.36431     -0.56175      0.00000      0.17000      0.17000      0.00000
Cl     -0.36431     -2.12076      0.00000      0.06000      0.53000      0.00000
H       1.46636     -0.58339      0.00000      0.18001      0.36001      0.00000
H      -1.46636      0.58339      0.00000     -0.18001     -0.36001      0.00000
Cl      0.36431      2.12076      0.00000     -0.06000     -0.53000      0.00000
6
Model[6]: IRIntensity=145.4250 KM/Mole;PATH=Calculation 1;FrequenciesFrequencies;ReducedMass=9.0780 AMU;ForceConstant=4.3937 mDyne/A;FreqValue=906.3509;Frequency=906.3509 cm^-1;FrequencyLabel=BU;PATH=Calculation 1;FrequenciesFrequencies
C      -0.36431      0.56175      0.00000      0.21000      0.46001      0.00000
C       0.36431     -0.56175      0.00000      0.21000      0.46001      0.00000
Cl     -0.36431     -2.12076      0.00000     -0.08000     -0.17000      0.00000
H       1.46636     -0.58339      0.00000      0.21000      0.40000      0.00000
H      -1.46636      0.58339      0.00000      0.21000      0.40000      0.00000
Cl      0.36431      2.12076      0.00000     -0.08000     -0.17000      0.00000
6
Model[7]: IRIntensity=0.0000 KM/Mole;PATH=Calculation 1;FrequenciesFrequencies;ReducedMass=4.7852 AMU;ForceConstant=2.6377 mDyne/A;FreqValue=967.2547;Frequency=967.2547 cm^-1;FrequencyLabel=AG;PATH=Calculation 1;FrequenciesFrequencies
C      -0.36431      0.56175      0.00000      0.33001      0.19000      0.00000
C       0.36431     -0.56175      0.00000     -0.33001     -0.19000      0.00000
Cl     -0.36431     -2.12076      0.00000      0.06000      0.06000      0.00000
H       1.46636     -0.58339      0.00000     -0.34000     -0.48000      0.00000
H      -1.46636      0.58339      0.00000      0.34000      0.48000      0.00000
Cl      0.36431      2.12076      0.00000     -0.06000     -0.06000      0.00000
6
Model[8]: IRIntensity=0.0000 KM/Mole;PATH=Calculation 1;FrequenciesFrequencies;ReducedMass=1.8463 AMU;ForceConstant=1.1155 mDyne/A;FreqValue=1012.6580;Frequency=1012.6580 cm^-1;FrequencyLabel=BG;PATH=Calculation 1;FrequenciesFrequencies
C      -0.36431      0.56175      0.00000      0.00000      0.00000     -0.19000
C       0.36431     -0.56175      0.00000      0.00000      0.00000      0.19000
Cl     -0.36431     -2.12076      0.00000      0.00000      0.00000     -0.01000
H       1.46636     -0.58339      0.00000      0.00000      0.00000     -0.68000
H      -1.46636      0.58339      0.00000      0.00000      0.00000      0.68000
Cl      0.36431      2.12076      0.00000      0.00000      0.00000      0.01000
6
Model[9]: IRIntensity=71.3035 KM/Mole;PATH=Calculation 1;FrequenciesFrequencies;ReducedMass=1.0871 AMU;ForceConstant=0.8649 mDyne/A;FreqValue=1162.0574;Frequency=1162.0574 cm^-1;FrequencyLabel=AU;PATH=Calculation 1;FrequenciesFrequencies
C      -0.36431      0.56175      0.00000      0.00000      0.00000      0.06000
C       0.36431     -0.56175      0.00000      0.00000      0.00000      0.06000
Cl     -0.36431     -2.12076      0.00000      0.00000      0.00000      0.00000
H       1.46636     -0.58339      0.00000      0.00000      0.00000     -0.70000
H      -1.46636      0.58339      0.00000      0.00000      0.00000     -0.70000
Cl      0.36431      2.12076      0.00000      0.00000      0.00000      0.00000
6
Model[10]: IRIntensity=25.0309 KM/Mole;PATH=Calculation 1;FrequenciesFrequencies;ReducedMass=1.1050 AMU;ForceConstant=1.3205 mDyne/A;FreqValue=1424.1223;Frequency=1424.1223 cm^-1;FrequencyLabel=BU;PATH=Calculation 1;FrequenciesFrequencies
C      -0.36431      0.56175      0.00000      0.02000     -0.06000      0.00000
C       0.36431     -0.56175      0.00000      0.02000     -0.06000      0.00000
Cl     -0.36431     -2.12076      0.00000     -0.01000      0.00000      0.00000
H       1.46636     -0.58339      0.00000      0.04000      0.70000      0.00000
H      -1.46636      0.58339      0.00000      0.04000      0.70000      0.00000
Cl      0.36431      2.12076      0.00000     -0.01000      0.00000      0.00000
6
Model[11]: IRIntensity=0.0000 KM/Mole;PATH=Calculation 1;FrequenciesFrequencies;ReducedMass=1.3166 AMU;ForceConstant=1.6333 mDyne/A;FreqValue=1451.0326;Frequency=1451.0326 cm^-1;FrequencyLabel=AG;PATH=Calculation 1;FrequenciesFrequencies
C      -0.36431      0.56175      0.00000     -0.11000      0.05000      0.00000
C       0.36431     -0.56175      0.00000      0.11000     -0.05000      0.00000
Cl     -0.36431     -2.12076      0.00000      0.01000      0.00000      0.00000
H       1.46636     -0.58339      0.00000      0.11000     -0.69000      0.00000
H      -1.46636      0.58339      0.00000     -0.11000      0.69000      0.00000
Cl      0.36431      2.12076      0.00000     -0.01000      0.00000      0.00000
6
Model[12]: IRIntensity=0.0000 KM/Mole;PATH=Calculation 1;FrequenciesFrequencies;ReducedMass=4.0894 AMU;ForceConstant=7.3480 mDyne/A;FreqValue=1746.3394;Frequency=1746.3394 cm^-1;FrequencyLabel=AG;PATH=Calculation 1;FrequenciesFrequencies
C      -0.36431      0.56175      0.00000     -0.12000      0.35000      0.00000
C       0.36431     -0.56175      0.00000      0.12000     -0.35000      0.00000
Cl     -0.36431     -2.12076      0.00000      0.00000      0.01000      0.00000
H       1.46636     -0.58339      0.00000      0.22000      0.56000      0.00000
H      -1.46636      0.58339      0.00000     -0.22000     -0.56000      0.00000
Cl      0.36431      2.12076      0.00000      0.00000     -0.01000      0.00000
6
Model[13]: IRIntensity=16.1874 KM/Mole;PATH=Calculation 1;FrequenciesFrequencies;ReducedMass=1.0862 AMU;ForceConstant=6.3251 mDyne/A;FreqValue=3143.7315;Frequency=3143.7315 cm^-1;FrequencyLabel=BU;PATH=Calculation 1;FrequenciesFrequencies
C      -0.36431      0.56175      0.00000      0.06000      0.00000      0.00000
C       0.36431     -0.56175      0.00000      0.06000      0.00000      0.00000
Cl     -0.36431     -2.12076      0.00000      0.00000      0.00000      0.00000
H       1.46636     -0.58339      0.00000     -0.70000      0.02000      0.00000
H      -1.46636      0.58339      0.00000     -0.70000      0.02000      0.00000
Cl      0.36431      2.12076      0.00000      0.00000      0.00000      0.00000
6
Model[14]: IRIntensity=0.0000 KM/Mole;PATH=Calculation 1;FrequenciesFrequencies;ReducedMass=1.1058 AMU;ForceConstant=6.4534 mDyne/A;FreqValue=3147.1884;Frequency=3147.1884 cm^-1;FrequencyLabel=AG;PATH=Calculation 1;FrequenciesFrequencies
C      -0.36431      0.56175      0.00000      0.07000     -0.01000      0.00000
C       0.36431     -0.56175      0.00000     -0.07000      0.01000      0.00000
Cl     -0.36431     -2.12076      0.00000      0.00000      0.00000      0.00000
H       1.46636     -0.58339      0.00000      0.70000     -0.02000      0.00000
H      -1.46636      0.58339      0.00000     -0.70000      0.02000      0.00000
Cl      0.36431      2.12076      0.00000      0.00000      0.00000      0.00000
</ModelData>
</Models>
##$PEAKS=
<Peaks type="RAMAN" xUnitsExpected="1/cm"  >
<PeakData id="1" title="1 (~3150 cm-1)" peakShape="broad" model="T2.13" xMax="3180" xMin="3150"    />
<PeakData id="2" title="2 (~3140 cm-1)" peakShape="broad" model="T2.14" xMax="3155" xMin="3120"    />
<PeakData id="3" title="3 (~1576 cm-1)" peakShape="broad" model="T2.12" xMax="1760" xMin="1730"    />
<PeakData id="4" title="4 (~1272 cm-1)" peakShape="broad" model="T2.11" xMax="1465" xMin="1435"    />
<PeakData id="5" title="5 (~1205 cm-1)" peakShape="broad" model="T2.10" xMax="1435" xMin="1405"    />
<PeakData id="6" title="6 (~900 cm-1)" peakShape="broad" model="T2.9" xMax="1180" xMin="1150"    />
<PeakData id="7" title="7 (~750 cm-1)" peakShape="broad" model="T2.8" xMax="1030" xMin="1000"    />
<PeakData id="8" title="8 (~845 cm-1)" peakShape="broad" model="T2.7" xMax="980" xMin="950"    />
<PeakData id="9" title="9 (~830 cm-1)" peakShape="broad" model="T2.6" xMax="925" xMin="895"    />
<PeakData id="10" title="10 (~350 cm-1)" peakShape="broad" model="T2.5" xMax="400" xMin="370"    />
<PeakData id="11" title="11 (~265 cm-1)" peakShape="broad" model="T2.4" xMax="285" xMin="245"    />
<PeakData id="12" title="12 (~192 cm-1)" peakShape="broad" model="T2.3" xMax="245" xMin="215"    />
</Peaks>
##XUNITS= 1/CM
##YUNITS=RAMAN INTENSITY
##XFACTOR= 1
##YFACTOR= 6.979499E-07
##FIRSTX= 3.347189E+03
##FIRSTY= 6.879730E-03
##LASTX= 2.970410E+01
##NPOINTS= 2001
##MINY= 0
##MAXY= 6.979498E-01
##XYDATA= (X++(Y..Y))
3347.1885I857J64J67J72J76J81J85J91J95K00K06K11K17K23K30K35K43A3302
$$ 9857 10021 10188 10360 10536 10717 10902 11093 11288 11488 11694 11905 12122 12345 12575 12810 13053 13302
3317.331A3558K64K72K79K88K97L06L15L25L35L46L57L68L81L93M06A8910
$$ 13558 13822 14094 14373 14661 14958 15264 15579 15904 16239 16585 16942 17310 17691 18084 18490 18910
3289.1323A9345M50M65M82M99N17N36N56N77N99O22O46O72O98P27P57B8936
$$ 19345 19795 20260 20742 21241 21758 22294 22850 23427 24026 24648 25294 25966 26664 27391 28148 28936
3260.9338B9758Q56Q94R33R74J019J065J115J167J223J283J346J414J486D6096
$$ 29758 30614 31508 32441 33415 34434 35499 36614 37781 39004 40287 41633 43047 44533 46096
3236.0527D7742J733J828J929K038K154K281K416K561K720K891L075L276H0138
$$ 47742 49475 51303 53232 55270 57424 59705 62121 64682 67402 70293 73368 76644 80138
3212.8303H3869L988M270M578M914N282N688O132O622P163P760Q421R153A67805
$$ 83869 87857 92127 96705 101619 106901 112589 118721 125343 132506 140266 148687 157840 167805
3189.608A78674J1873J2991J4239J5629J7179J8906K0828K2961K5320C66516
$$ 178674 190547 203538 217777 233406 250585 269491 290319 313280 338600 366516
3171.3618C97266L3811L7067M0459M3882M7182N0133N2431N3692N3470H60691
$$ 397266 431077 468144 508603 552485 599667 649800 702231 755923 809393 860691
3153.1155I07461L9644K9956J8101M838q815k1763l3046m2006m8361n2162G40130
$$ 907461 947105 977061 995162 1000000 991185 969422 936376 894370 846009 793847 740130
3133.2107F86675n1846m9321m6239m2883l9456l6095l2891k9895k7130C06315
$$ 686675 634829 585508 539269 496386 456930 420835 387944 358049 330919 306315
3114.9646B84002k0243j8381j6707j5205j3860j2651j1567j0594r718A46146
$$ 284002 263759 245378 228671 213466 199606 186955 175388 164794 155076 146146
3096.7183A37926p579o999o473n998n565n171m812m484m185l911l659G5662
$$ 137926 130347 123348 116875 110877 105312 100141 95329 90845 86660 82749 79090 75662
3075.1548G2447l020k839k672k518k375k243k119k005j899j800j707j620D4090
$$ 72447 69427 66588 63916 61398 59023 56780 54661 52656 50757 48957 47250 45630 44090
3051.9324D2626j394j327j265j207j152j099j052j005r62r21q83q46q11B7923
$$ 42626 41232 39905 38640 37433 36281 35182 34130 33125 32163 31242 30359 29513 28702 27923
3027.0513B7175p18o91o64o39o15n92n71n50n31n11m94m77m61m45m30A8370
$$ 27175 26457 25766 25102 24463 23848 23256 22685 22135 21604 21093 20599 20122 19661 19216 18786 18370
2998.8525A7967l89l77l65l54l42l33l22l12l03k94k86k77k69k62k54A2981
$$ 17967 17578 17201 16836 16482 16140 15807 15485 15173 14870 14576 14290 14013 13744 13482 13228 12981
2970.654A2740k33k28k21k15k10k04j99j94j89j84j79j75j70j67j62I651
$$ 12740 12507 12279 12058 11843 11633 11429 11230 11036 10847 10663 10484 10309 10139 9972 9810 9651
2942.4553I497j51j48j43j41j37j35j31j28j25j23j20j17j15j12j10j07G349
$$ 9497 9346 9198 9055 8914 8777 8642 8511 8383 8258 8135 8015 7898 7783 7671 7561 7454 7349
2912.598G245j00r9r7r5r2r1r0q7q6q4q2q1p9p8p6p5p3p2p1o9o8o7o6E303
$$ 7245 7145 7046 6949 6854 6762 6671 6581 6494 6408 6324 6242 6161 6082 6004 5928 5853 5780 5708 5637 5568 5500 5433 5367 5303
2871.1294E240o3o1o0n9n8n6Tn5Tn3n2n1Tn0m9m8m7m6Tm5Tm3Um1Ul9Ul8C690
$$ 5240 5177 5116 5056 4997 4939 4883 4827 4772 4717 4664 4612 4561 4510 4460 4411 4363 4316 4270 4224 4179 4134 4091 4048 4005 3964 3923 3882 3843 3804 3765 3727 3690
2816.3909C653l6Tl5Tl4Tl3Tl2Tl1Ul0k9l0k8k9k8Tk7Tk6Vk5Tk4k5k3B714
$$ 3653 3617 3581 3546 3511 3477 3443 3410 3377 3345 3313 3282 3251 3220 3190 3161 3131 3103 3074 3046 3018 2991 2964 2938 2912 2886 2860 2835 2810 2786 2761 2738 2714
2761.6523B691k3Tk2Vk1Uk494%U60O21NTONTOTNOZPOTPVOQPUQTPQWRQH83
2079.9094H92RVJ0RJ0VJ1J0J1VJ2J1J2UJ3J2J3UJ4WJ5UJ6VJ7UJ8UJ9UK0A556
$$ 892 901 910 919 928 938 947 957 967 977 987 998 1008 1019 1030 1041 1052 1064 1075 1087 1099 1111 1124 1136 1149 1162 1175 1189 1203 1217 1231 1245 1260 1275 1290 1306 1322 1338 1354 1371 1388 1405 1423 1441 1459 1478 1497 1516 1536 1556
1996.9723A577K1TK2TK3TK4TK5TK6TK7TK8K9TL0L1TL2L3L4TL5L6L7L8B408
$$ 1577 1598 1619 1641 1663 1686 1709 1733 1757 1782 1807 1833 1859 1886 1913 1941 1970 1999 2029 2060 2091 2123 2156 2190 2224 2259 2295 2332 2370 2408
1947.2101B448M1TM3M4TM6M8TN0N1N3TN6N7N8O0O2O4O6O7O9P2P4P6P8C950
$$ 2448 2489 2530 2573 2617 2661 2707 2755 2803 2853 2904 2957 3010 3066 3123 3181 3241 3303 3367 3433 3500 3569 3641 3715 3791 3869 3950
1902.424D033Q6Q8R2R4R8J01J04J08J12J15J20J24J28J34J38J43J49F121
$$ 4033 4119 4207 4299 4393 4491 4592 4696 4804 4916 5031 5151 5275 5403 5537 5675 5818 5967 6121
1870.9078F282J66J74J80J88J96K04K13K22K31K42K53J025K83K96L11A0791
$$ 6282 6448 6622 6802 6990 7186 7390 7603 7825 8056 8298 8551 9576 9859 10155 10466 10791
1842.7092A1132L58L75L96M15M38M61M86N14N42N74O08O44O83P26P72A9945
$$ 11132 11490 11865 12261 12676 13114 13575 14061 14575 15117 15691 16299 16943 17626 18352 19124 19945
1814.5106B0821R35R99J070J145J229J321J422J532J654J789J936K101D0237
$$ 20821 21756 22755 23825 24970 26199 27520 28942 30474 32128 33917 35853 37954 40237
1791.2882D2722K710K959L237L547L892M277M707N183N714O300O945P648A08250
$$ 42722 45432 48391 51628 55175 59067 63344 68051 73234 78948 85248 92193 99841 108250
1768.0659A17468J0060J0911J1730J2464J3034J3348J3293J2753J1630B36551
$$ 117468 127528 138439 150169 162633 175667 189015 202308 215061 226691 236551
1749.8197B44005M510J217k173n389q190j0416j1993j2937j3323j3257A59197
$$ 244005 248515 249732 247559 242170 233980 223564 211571 198634 185311 172054 159197
1729.9148A46967j1465j0631r779q944q148p404o717o089n519n005m543E8597
$$ 146967 135502 124871 115092 106148 98000 90596 83879 77790 72271 67266 62723 58597
1708.3512E4844l418l117k848k606k388k191k015j855j710j579j461j352B7050
$$ 54844 51426 48309 45461 42855 40467 38276 36261 34406 32696 31117 29656 28304 27050
1685.1288B5886j083j007r38q75q17p64p14o68o26n87n51n16m86m56m28A4967
$$ 25886 24803 23796 22858 21983 21166 20402 19688 19020 18394 17807 17256 16740 16254 15798 15370 14967
1656.9302A4588l56l35l15k97k78k62k46k31k17k04j90j78j66j55j44A0880
$$ 14588 14232 13897 13582 13285 13007 12745 12499 12268 12051 11847 11657 11479 11313 11158 11014 10880
1628.7316A0756j14j04r6q7p9p0o2n4m7l8l2k4j6rlOJ2K0K6L4M2M9N6A0230
$$ 10756 10642 10538 10442 10355 10276 10206 10144 10090 10043 10005 9973 9949 9933 9924 9921 9927 9939 9959 9985 10019 10061 10110 10166 10230
1587.263A0302P9Q8R6J04J14J22J31J41J51J61J72J83J95K07K20K32A2945
$$ 10302 10381 10469 10565 10669 10783 10905 11036 11177 11328 11489 11661 11844 12039 12246 12466 12698 12945
1557.4056A3207K77K93L10L28L48L68L89M13M36M63M90N20N51N86O21B0261
$$ 13207 13484 13777 14087 14415 14763 15131 15520 15933 16369 16832 17322 17842 18393 18979 19600 20261
1529.207B0963P48P96Q49R05R68J034J106J186J272J365J469J581J705C7787
$$ 20963 21711 22507 23356 24261 25229 26263 27369 28555 29827 31192 32661 34242 35947 37787
1504.3259C9777K154K337K537K761L008L283L589L929M309M731N203N728H9659
$$ 39777 41931 44268 46805 49566 52574 55857 59446 63375 67684 72415 77618 83346 89659
1481.1035I6620P679Q468R329J0261J1250J2282J3322J4326J5222J5922B30986
$$ 96620 104299 112767 122096 132357 143607 155889 169211 183537 198759 214681 230986
1461.1986B47224J5578J4202J2036R092N488J458k692o627j0056j2780B58213
$$ 247224 262802 277004 289040 298132 303620 305078 302386 295759 285703 272923 258213
1441.2937B42346j6338j6259j5769j5002j4064j3045j2003j0981j0007A09782
$$ 242346 226008 209749 193980 178978 164914 151869 139866 128885 118878 109782
1423.0475A01526p488o791o162n596n087m631l979l852l523l226k960D5511
$$ 101526 94038 87247 81085 75489 70402 65771 61792 57940 54417 51191 48231 45511
1401.4839D3007k310k133j973j828j696j577j468j367j277j193j117j046B3041
$$ 43007 40697 38564 36591 34763 33067 31490 30022 28655 27378 26185 25068 24022 23041
1378.2615B2119q67q16p69p25o85o48m28n79n48n20m94m69m46m24m04A2912
$$ 22119 21252 20436 19667 18942 18257 17609 17181 16602 16054 15534 15040 14571 14125 13701 13297 12912
1350.0629A2545l50l34r34l00k87k75k63k51k41k31k22k12k04j96j88G877
$$ 12545 12195 11861 10927 10627 10340 10065 9802 9551 9310 9079 8857 8645 8441 8245 8057 7877
1321.8643G703j67j61j54j49j43j38j33j28j23j19j15j11j06j03j00r5E565
$$ 7703 7536 7375 7221 7072 6929 6791 6658 6530 6407 6288 6173 6062 5956 5853 5753 5658 5565
1292.0068E476q7q3q0p8p5p2p0o8o5o3o0n9n7n4n3n0m9m7m6m4m2m0l9D057
$$ 5476 5389 5306 5226 5148 5073 5001 4931 4863 4798 4735 4675 4616 4559 4505 4452 4402 4353 4306 4260 4216 4174 4134 4095 4057
1250.5383D022l5l3l2l0k9k7Tk5k3Tk1k0j9j8j6Tj4j3j2j1j0qToTmlkC531
$$ 4022 3987 3954 3922 3892 3863 3836 3809 3784 3761 3738 3717 3697 3678 3660 3644 3628 3614 3601 3589 3578 3568 3560 3552 3546 3540 3536 3533 3531 3531
1200.776C531JLMNOPRJ0J1J2J4TJ7TJ9K1K2K3K5K7K8L0L1L4L5L7L9M1D116
$$ 3531 3532 3535 3539 3544 3550 3557 3566 3576 3587 3599 3613 3627 3644 3661 3680 3701 3723 3746 3771 3798 3826 3856 3887 3921 3956 3993 4032 4073 4116
1151.0138D161M8N0N2N5N7O0O3O6O9P3P5Q0Q2Q7R1R5J00J05J09J15J20E939
$$ 4161 4209 4259 4311 4366 4423 4483 4546 4612 4681 4754 4829 4909 4991 5078 5169 5264 5364 5469 5578 5693 5813 5939
1112.8627F072J39J45J54J61J69J79J87J98K09K20K32K45K60K74K91L08I770
$$ 6072 6211 6356 6510 6671 6840 7019 7206 7404 7613 7833 8065 8310 8570 8844 9135 9443 9770
1083.0054A0117L69L93M19M46M77N10N46N85O29O76P27P85Q47R16R93B0513
$$ 10117 10486 10879 11298 11744 12221 12731 13277 13862 14491 15167 15894 16679 17526 18442 19435 20513
1054.8068B1685J275J391P68J669J828K005K202K419K659K924L213L524E1419
$$ 21685 22960 24351 25119 26788 28616 30621 32823 35242 37901 40825 44038 47562 51419
1031.5844E5622M555M896N206N455N607N619N445N047M403L515K425J203A08948
$$ 55622 60177 65073 70279 75734 81341 86960 92405 97452 101855 105370 107795 108998 108948
1008.36194A07722k234l007l519l771l794l628l314k896k407j873j317G5211
$$ 107722 105488 102481 98962 95191 91397 87769 84455 81559 79152 77279 75962 75211
986.79834G5020L50Q62J323J714K007K171K172J983J587R89K18o66j590H5671
$$ 75020 75370 76232 77555 79269 81276 83447 85619 87602 89189 90178 90396 89730 88140 85671
961.9172H2438l832m246m476m544m483m326m105l846l570l290l018k758C3426
$$ 82438 78606 74360 69884 65340 60857 56531 52426 48580 45010 41720 38702 35944 33426
938.6948C1132k090j905j738j586j449j327j217j117j028r47q74q08A4298
$$ 31132 29042 27137 25399 23813 22364 21037 19820 18703 17675 16728 15854 15046 14298
915.4724A3604o45o00n59n22m88m56m29m01l78l55l35l16k98k82k66G021
$$ 13604 12959 12359 11800 11278 10790 10334 9905 9504 9126 8771 8436 8120 7822 7540 7274 7021
887.2738F782k28k16k05j95j86j77j69j62j54j47j41j35j29j24j19j14D071
$$ 6782 6554 6338 6133 5938 5752 5575 5406 5244 5090 4943 4802 4667 4538 4414 4295 4181 4071
857.41644C966j01r7r4r0q6q4q1p7p5p3p0o7o6o3o1n9n7n6n4n2n0m9m8B310
$$ 3966 3865 3768 3674 3584 3498 3414 3333 3256 3181 3108 3038 2971 2905 2842 2781 2722 2665 2609 2555 2503 2453 2404 2356 2310
815.9479B266m4m2m1m0l9l7Tl5Tl4l3l2l1l0Tk9k8k7J48k4Uk2k3k1Uk0A571
$$ 2266 2222 2180 2139 2099 2060 2023 1986 1951 1916 1882 1849 1817 1786 1756 1726 1697 1669 1642 1790 1766 1742 1718 1696 1673 1652 1631 1610 1590 1571
766.1856A552j8Uj7Tj6Tj5Uj4Uj3Tj2j3j2j1j2j1j0j1j0UrVqVpqpToA087
$$ 1552 1534 1516 1498 1481 1464 1448 1432 1417 1402 1387 1373 1359 1345 1332 1319 1307 1294 1282 1271 1259 1248 1238 1227 1217 1207 1197 1188 1179 1170 1161 1153 1145 1137 1129 1122 1114 1107 1100 1094 1087
698.1772A081oTnonUmnmVlmlUklkWjW%j%UJ%JVKJKULTKMLTk35OTPOPH17
$$ 1081 1075 1069 1064 1058 1053 1048 1043 1039 1034 1030 1026 1022 1018 1015 1011 1008 1005 1002 1000 997 995 993 991 989 987 986 985 984 983 982 982 981 981 981 981 982 982 983 984 985 986 988 989 991 993 995 998 1001 1003 1007 1010 1013 778 784 790 797 803 810 817
598.65265H24QVRQJ0RJ0UJ1UJ2UJ3Tj69J6TJ7UJ8TJ9K0TK1TK2K3K4TK5A212
$$ 824 832 840 848 856 865 873 883 892 902 912 922 933 944 955 967 979 991 1004 1017 848 864 880 897 914 931 949 967 986 1006 1026 1047 1068 1090 1113 1137 1161 1186 1212
533.96173A238K8TL0TL1L3L4L5L6L7L9M1M2M3M5M7M9N1N3N5N8O0O2O5B339
$$ 1238 1266 1294 1324 1354 1385 1418 1452 1487 1523 1560 1599 1640 1682 1725 1770 1817 1866 1917 1970 2025 2083 2143 2205 2270 2339
490.8344B410P5P8Q1Q6R0R4R9J04J09J15J22J28J35J42J51J60J69J79D717
$$ 2410 2485 2563 2644 2730 2820 2914 3013 3117 3226 3341 3463 3591 3726 3868 4019 4179 4348 4527 4717
457.65958D920K15K29K45K61K79K99L20L44L70L98M29M64N01N43N89O41A1745
$$ 4920 5135 5364 5609 5870 6149 6448 6768 7112 7482 7880 8309 8773 9274 9817 10406 11047 11745
427.80222A2505Q31R09R97J094J202J323J458J607J772J954K152K367C2765
$$ 12505 13336 14245 15242 16336 17538 18861 20319 21926 23698 25652 27804 30171 32765
404.57983C5597L071L302L509L669L758L743L590L273K775K096J267L39F9372
$$ 35597 38668 41970 45479 49148 52906 56649 60239 63512 66287 68383 69650 69989 69372
381.35742F7849k313k940l385l651l759l741l629l452l236l001k762k526B7152
$$ 67849 65536 62596 59211 55560 51801 48060 44431 40979 37743 34742 31980 29454 27152
358.13504B5059j898j722j562j417j286j170j064r70q85q10p41o80o25I653
$$ 25059 23161 21439 19877 18460 17174 16004 14940 13970 13085 12275 11534 10854 10229 9653
333.2539I123m90m53m20l89l62l37l14k93k73k57k39k26k11j99j87j76D131
$$ 9123 8633 8180 7760 7371 7009 6672 6358 6065 5792 5535 5296 5070 4859 4660 4473 4297 4131
303.39655C974j48j41j33j26j19j13j08j03r7r3q9q4q1p7p3p1o7o4o2B066
$$ 3974 3826 3685 3552 3426 3307 3194 3086 2983 2886 2793 2704 2620 2539 2462 2389 2318 2251 2187 2125 2066
268.56296B009n5n2n0m9m6m5m3m1m0l9l7l6l4Tl2l1l0k9k8Tk6Tk4Uk2A062
$$ 2009 1954 1902 1852 1803 1757 1712 1669 1628 1588 1549 1512 1476 1442 1408 1376 1345 1315 1286 1258 1230 1204 1178 1154 1130 1106 1084 1062
222.1182A041k1k0j9Tj8Tj7Uj6j5Uj4Uj3Tj2Vj1j2j0j1j0VrWqWpqpVoD73
$$ 1041 1020 1000 981 962 944 926 909 892 875 859 844 829 814 800 786 772 759 746 734 722 710 698 687 675 665 654 644 634 624 614 605 596 587 578 569 561 553 545 537 529 522 514 507 500 493 486 480 473
140.83983D67oXnonUomnUmnmnmslmlmlmlUmlWklUklTklklklkTlkVlB23
$$ 467 461 455 449 443 437 431 426 420 415 410 405 399 395 390 385 380 376 371 367 362 358 354 350 346 342 338 334 330 326 323 319 316 312 309 305 302 299 296 292 289 286 283 280 277 275 272 269 266 264 261 258 256 253 251 248 246 243 241 239 236 234 232 230 228 225 223
29.7041B21  $$checkpoint
##END=$$ End of RAMAN of trans-DCE
##TITLE= 1,1-dichloroethene
##JCAMP-DX= 5.01
##DATA TYPE= INFRARED SPECTRUM
##DATA CLASS= XYDATA
##BLOCK ID=5
##ORIGIN= Department of Chemistry, UWI, JAMAICA
##OWNER= public domain
##LONGDATE= 2012/02/18 12:32:26.0301 -0500 $$ export date from JSpecView
##SPECTROMETER/DATA SYSTEM= from scan
##$MODELS=
<Models>
<ModelData id="1DCE" type="MOL">
1,1-dichloroethylene
__Jmol-14_02171520543D 1   1.00000     0.00000     0
Jmol version 14.3.12_2015.02.11  2015-02-11 19:15 EXTRACT: ({0:5})
  6  5  0  0  0  0              1 V2000
   0.00000   0.00000   0.41101 C   0  0  0  0  0  0
   0.00000   0.00000   1.74967 C   0  0  0  0  0  0
   0.00000   0.93996   2.32528 H   0  0  0  0  0  0
   0.00000  -0.93996   2.32528 H   0  0  0  0  0  0
   0.00000   1.44639  -0.51808 Cl  0  0  0  0  0  0
   0.00000  -1.44639  -0.51808 Cl  0  0  0  0  0  0
  1  6  1  0  0  0
  1  5  1  0  0  0
  1  2  2  0  0  0
  2  3  1  0  0  0
  2  4  1  0  0  0
M  END
</ModelData>
<ModelData id="i1" type="XYZVIB" baseModel="1DCE" vibrationScale=".5">
6
Model[1]: PATH=Calculation 1;Input;Convg=0.4887D-08;-V/T=2.0006;Energy=NaN;Range=M.O.s;E(RHF)=-995.823662291 A.U.;PATH=Calculation 1;Input
C       0.00000      0.00000      0.00000
C       0.00000      0.00000      1.33866
H       0.93996      0.00000      1.91427
H      -0.93996      0.00000      1.91427
Cl      1.44639      0.00000     -0.92909
Cl     -1.44639      0.00000     -0.92909
6
Model[2]: PATH=Calculation 1;Standard;Convg=0.4887D-08;-V/T=2.0006;Energy=-995.82367;Range=M.O.s;E(RHF)=-995.823662291 A.U.;PATH=Calculation 1;Standard
C       0.00000      0.00000      0.41101
C       0.00000      0.00000      1.74967
H       0.00000      0.93996      2.32528
H       0.00000     -0.93996      2.32528
Cl      0.00000      1.44639     -0.51808
Cl      0.00000     -1.44639     -0.51808
6
Model[3]: IRIntensity=0.1106 KM/Mole;PATH=Calculation 1;FrequenciesFrequencies;ReducedMass=18.4273 AMU;ForceConstant=1.1552 mDyne/A;FreqValue=326.1875;Frequency=326.1875 cm^-1;FrequencyLabel=A1;PATH=Calculation 1;FrequenciesFrequencies
C       0.00000      0.00000      0.41101      0.00000      0.00000     -0.37000
C       0.00000      0.00000      1.74967      0.00000      0.00000     -0.39000
H       0.00000      0.93996      2.32528      0.00000      0.00000     -0.38000
H       0.00000     -0.93996      2.32528      0.00000      0.00000     -0.38000
Cl      0.00000      1.44639     -0.51808      0.00000      0.44000      0.14000
Cl      0.00000     -1.44639     -0.51808      0.00000     -0.44000      0.14000
6
Model[4]: IRIntensity=0.0003 KM/Mole;PATH=Calculation 1;FrequenciesFrequencies;ReducedMass=3.6118 AMU;ForceConstant=0.4422 mDyne/A;FreqValue=455.8292;Frequency=455.8292 cm^-1;FrequencyLabel=B2;PATH=Calculation 1;FrequenciesFrequencies
C       0.00000      0.00000      0.41101      0.00000     -0.07000      0.00000
C       0.00000      0.00000      1.74967      0.00000      0.34000      0.00000
H       0.00000      0.93996      2.32528      0.00000      0.55000     -0.34000
H       0.00000     -0.93996      2.32528      0.00000      0.55000      0.34000
Cl      0.00000      1.44639     -0.51808      0.00000     -0.06000      0.12000
Cl      0.00000     -1.44639     -0.51808      0.00000     -0.06000     -0.12000
6
Model[5]: IRIntensity=2.8951 KM/Mole;PATH=Calculation 1;FrequenciesFrequencies;ReducedMass=7.2233 AMU;ForceConstant=1.3108 mDyne/A;FreqValue=554.9693;Frequency=554.9693 cm^-1;FrequencyLabel=B1;PATH=Calculation 1;FrequenciesFrequencies
C       0.00000      0.00000      0.41101      0.70000      0.00000      0.00000
C       0.00000      0.00000      1.74967     -0.19000      0.00000      0.00000
H       0.00000      0.93996      2.32528     -0.48000      0.00000      0.00000
H       0.00000     -0.93996      2.32528     -0.48000      0.00000      0.00000
Cl      0.00000      1.44639     -0.51808     -0.07000      0.00000      0.00000
Cl      0.00000     -1.44639     -0.51808     -0.07000      0.00000      0.00000
6
Model[6]: IRIntensity=18.6624 KM/Mole;PATH=Calculation 1;FrequenciesFrequencies;ReducedMass=9.0383 AMU;ForceConstant=2.3129 mDyne/A;FreqValue=659.0407;Frequency=659.0407 cm^-1;FrequencyLabel=A1;PATH=Calculation 1;FrequenciesFrequencies
C       0.00000      0.00000      0.41101      0.00000      0.00000      0.36001
C       0.00000      0.00000      1.74967      0.00000      0.00000      0.48000
H       0.00000      0.93996      2.32528      0.00000     -0.01000      0.51000
H       0.00000     -0.93996      2.32528      0.00000      0.01000      0.51000
Cl      0.00000      1.44639     -0.51808      0.00000      0.19000     -0.16000
Cl      0.00000     -1.44639     -0.51808      0.00000     -0.19000     -0.16000
6
Model[7]: IRIntensity=0.0000 KM/Mole;PATH=Calculation 1;FrequenciesFrequencies;ReducedMass=1.0197 AMU;ForceConstant=0.4876 mDyne/A;FreqValue=900.8576;Frequency=900.8576 cm^-1;FrequencyLabel=A2;PATH=Calculation 1;FrequenciesFrequencies
C       0.00000      0.00000      0.41101      0.00000      0.00000      0.00000
C       0.00000      0.00000      1.74967      0.00000      0.00000      0.00000
H       0.00000      0.93996      2.32528      0.71000      0.00000      0.00000
H       0.00000     -0.93996      2.32528     -0.71000      0.00000      0.00000
Cl      0.00000      1.44639     -0.51808     -0.01000      0.00000      0.00000
Cl      0.00000     -1.44639     -0.51808      0.01000      0.00000      0.00000
6
Model[8]: IRIntensity=92.0040 KM/Mole;PATH=Calculation 1;FrequenciesFrequencies;ReducedMass=3.0785 AMU;ForceConstant=1.6024 mDyne/A;FreqValue=939.9244;Frequency=939.9244 cm^-1;FrequencyLabel=B2;PATH=Calculation 1;FrequenciesFrequencies
C       0.00000      0.00000      0.41101      0.00000      0.37000      0.00000
C       0.00000      0.00000      1.74967      0.00000      0.09000      0.00000
H       0.00000      0.93996      2.32528      0.00000     -0.27001      0.59000
H       0.00000     -0.93996      2.32528      0.00000     -0.27001     -0.59000
Cl      0.00000      1.44639     -0.51808      0.00000     -0.07000      0.04000
Cl      0.00000     -1.44639     -0.51808      0.00000     -0.07000     -0.04000
6
Model[9]: IRIntensity=52.9028 KM/Mole;PATH=Calculation 1;FrequenciesFrequencies;ReducedMass=1.3120 AMU;ForceConstant=1.0456 mDyne/A;FreqValue=1163.0605;Frequency=1163.0605 cm^-1;FrequencyLabel=B1;PATH=Calculation 1;FrequenciesFrequencies
C       0.00000      0.00000      0.41101     -0.04000      0.00000      0.00000
C       0.00000      0.00000      1.74967      0.16000      0.00000      0.00000
H       0.00000      0.93996      2.32528     -0.70000      0.00000      0.00000
H       0.00000     -0.93996      2.32528     -0.70000      0.00000      0.00000
Cl      0.00000      1.44639     -0.51808      0.00000      0.00000      0.00000
Cl      0.00000     -1.44639     -0.51808      0.00000      0.00000      0.00000
6
Model[10]: IRIntensity=85.0510 KM/Mole;PATH=Calculation 1;FrequenciesFrequencies;ReducedMass=1.8092 AMU;ForceConstant=1.7212 mDyne/A;FreqValue=1270.7289;Frequency=1270.7289 cm^-1;FrequencyLabel=B2;PATH=Calculation 1;FrequenciesFrequencies
C       0.00000      0.00000      0.41101      0.00000      0.21000      0.00000
C       0.00000      0.00000      1.74967      0.00000     -0.16000      0.00000
H       0.00000      0.93996      2.32528      0.00000      0.23001     -0.64000
H       0.00000     -0.93996      2.32528      0.00000      0.23001      0.64000
Cl      0.00000      1.44639     -0.51808      0.00000     -0.02000      0.01000
Cl      0.00000     -1.44639     -0.51808      0.00000     -0.02000     -0.01000
6
Model[11]: IRIntensity=6.8266 KM/Mole;PATH=Calculation 1;FrequenciesFrequencies;ReducedMass=1.4915 AMU;ForceConstant=2.1016 mDyne/A;FreqValue=1546.4604;Frequency=1546.4604 cm^-1;FrequencyLabel=A1;PATH=Calculation 1;FrequenciesFrequencies
C       0.00000      0.00000      0.41101      0.00000      0.00000      0.20001
C       0.00000      0.00000      1.74967      0.00000      0.00000     -0.06000
H       0.00000      0.93996      2.32528      0.00000      0.31000     -0.62000
H       0.00000     -0.93996      2.32528      0.00000     -0.31000     -0.62000
Cl      0.00000      1.44639     -0.51808      0.00000      0.01000     -0.01000
Cl      0.00000     -1.44639     -0.51808      0.00000     -0.01000     -0.01000
6
Model[12]: IRIntensity=47.1352 KM/Mole;PATH=Calculation 1;FrequenciesFrequencies;ReducedMass=2.6981 AMU;ForceConstant=4.9710 mDyne/A;FreqValue=1768.3251;Frequency=1768.3251 cm^-1;FrequencyLabel=A1;PATH=Calculation 1;FrequenciesFrequencies
C       0.00000      0.00000      0.41101      0.00000      0.00000     -0.26000
C       0.00000      0.00000      1.74967      0.00000      0.00000      0.29000
H       0.00000      0.93996      2.32528      0.00000      0.49001     -0.43000
H       0.00000     -0.93996      2.32528      0.00000     -0.49001     -0.43000
Cl      0.00000      1.44639     -0.51808      0.00000     -0.01000      0.01000
Cl      0.00000     -1.44639     -0.51808      0.00000      0.01000      0.01000
6
Model[13]: IRIntensity=0.0670 KM/Mole;PATH=Calculation 1;FrequenciesFrequencies;ReducedMass=1.0641 AMU;ForceConstant=6.0497 mDyne/A;FreqValue=3106.4325;Frequency=3106.4325 cm^-1;FrequencyLabel=A1;PATH=Calculation 1;FrequenciesFrequencies
C       0.00000      0.00000      0.41101      0.00000      0.00000      0.01000
C       0.00000      0.00000      1.74967      0.00000      0.00000     -0.07000
H       0.00000      0.93996      2.32528      0.00000      0.61000      0.36001
H       0.00000     -0.93996      2.32528      0.00000     -0.61000      0.36001
Cl      0.00000      1.44639     -0.51808      0.00000      0.00000      0.00000
Cl      0.00000     -1.44639     -0.51808      0.00000      0.00000      0.00000
6
Model[14]: IRIntensity=0.8160 KM/Mole;PATH=Calculation 1;FrequenciesFrequencies;ReducedMass=1.1196 AMU;ForceConstant=6.6677 mDyne/A;FreqValue=3179.2916;Frequency=3179.2916 cm^-1;FrequencyLabel=B2;PATH=Calculation 1;FrequenciesFrequencies
C       0.00000      0.00000      0.41101      0.00000      0.00000      0.00000
C       0.00000      0.00000      1.74967      0.00000     -0.10000      0.00000
H       0.00000      0.93996      2.32528      0.00000      0.60001      0.37000
H       0.00000     -0.93996      2.32528      0.00000      0.60001     -0.37000
Cl      0.00000      1.44639     -0.51808      0.00000      0.00000      0.00000
Cl      0.00000     -1.44639     -0.51808      0.00000      0.00000      0.00000
</ModelData>
</Models>
##$PEAKS=
<Peaks type="IR" xUnitsExpected="1/cm"  >
<PeakData id="1" title="1 (~3160 cm-1)" peakShape="broad" model="i1.14" xMax="3195" xMin="3165"    />
<PeakData id="2" title="2 (~3160 cm-1)" peakShape="broad" model="i1.13" xMax="3125" xMin="3085"    />
<PeakData id="3" title="3 (~1740 cm-1)" peakShape="broad" model="i1.12" xMax="1785" xMin="1750"    />
<PeakData id="4" title="4 (~1510 cm-1)" peakShape="broad" model="i1.10" xMax="1560" xMin="1530"    />
<PeakData id="5" title="5 (~1510 cm-1)" peakShape="broad" model="i1.11" xMax="1290" xMin="1260"    />
<PeakData id="6" title="6 (~1360 cm-1)" peakShape="broad" model="i1.9" xMax="1180" xMin="1150"    />
<PeakData id="7" title="7 (~960 cm-1)" peakShape="broad" model="i1.7" xMax="955" xMin="925"    />
<PeakData id="8" title="8 (~960 cm-1)" peakShape="broad" model="i1.6" xMax="915" xMin="885"    />
<PeakData id="9" title="9 (~765 cm-1)" peakShape="broad" model="i1.8" xMax="675" xMin="645"    />
<PeakData id="10" title="10 (~615 cm-1)" peakShape="broad" model="i1.4" xMax="570" xMin="540"    />
<PeakData id="11" title="11 (~510 cm-1)" peakShape="broad" model="i1.5" xMax="470" xMin="440"    />
<PeakData id="12" title="12 (~173 cm-1)" peakShape="broad" model="i1.3" xMax="340" xMin="310"    />
</Peaks>
##XUNITS= 1/CM
##YUNITS= TRANSMITTANCE
##XFACTOR= 1
##YFACTOR= 9.999000E-07
##FIRSTX= 3.377665E+03
##FIRSTY= 9.991514E-01
##LASTX= 1.261875E+02
##NPOINTS= 2000
##MINY= 10.000000E-05
##MAXY= 1
##XYDATA= (X++(Y..Y))
3377.665I99251j3j4j5Vj6j7Uj8Uk0j9k1k0k2Uk4Uk6Tk7k8Tl0Tl2Tl4I98497
$$ 999251 999238 999224 999209 999194 999179 999164 999148 999131 999114 999097 999079 999061 999043 999023 999004 998983 998963 998941 998919 998897 998873 998849 998825 998799 998773 998746 998718 998690 998660 998630 998598 998566 998532 998497
3320.7358I98461l7l8m0m1m2m4m6m7m9n1n3n5n6o0o1o4o7p0p2p5p9q2I97146
$$ 998461 998424 998386 998346 998305 998263 998219 998173 998126 998077 998026 997973 997918 997862 997802 997741 997677 997610 997540 997468 997393 997314 997232 997146
3281.6985I97056r4r8j03j08j13j19j25j31j37j46j52j62j70j80j90k01I94614
$$ 997056 996962 996864 996761 996653 996540 996421 996296 996165 996028 995882 995730 995568 995398 995218 995028 994827 994614
3252.4207I94388k40k55k71k89l09l29l52l77m04m34m66n02n41n84o32I87719
$$ 994388 994148 993893 993622 993333 993024 992695 992343 991966 991562 991128 990662 990160 989619 989035 988403 987719
3224.769I86977q07q77r56j043j141j248j367j500j647j808j986k180I68026
$$ 986977 986170 985293 984337 983294 982153 980905 979538 978038 976391 974583 972597 970417 968026
3201.9973I65409k854l100l346l579l785l943m026m005l848l528l031I24009
$$ 965409 962555 959455 956109 952530 948745 944802 940776 936771 932923 929395 926364 924009
3180.8523I22485n86L93J343K193K896L423L768L949L989L918L769L566I58440
$$ 922485 921899 922292 923635 925828 928724 932147 935915 939864 943853 947771 951540 955106 958440
3158.0806I61526K837K594K361K145J942J757J585J430J287J158J037I82588
$$ 961526 964363 966957 969318 971463 973405 975162 976747 978177 979464 980622 981659 982588
3136.9353I83415P33O47N65M88M15L47K81K21J63J11O7L1OnJK3O5J21I87883
$$ 983415 984148 984795 985360 985848 986263 986610 986891 987112 987275 987386 987453 987484 987490 987485 987486 987509 987574 987695 987883
3104.4043I88143L31L94M44M79M98N05M98M84M62M38M11L83L56L30L06I94745
$$ 988143 988474 988868 989312 989791 990289 990794 991292 991776 992238 992676 993087 993470 993826 994156 994462 994745
3076.753I95006K42K24K08J93J80J67J56J46J37J28J20J13J07J00R5I97412
$$ 995006 995248 995472 995680 995873 996053 996220 996376 996522 996659 996787 996907 997020 997127 997227 997322 997412
3049.1016I97498Q0P7P3O9O7O3O0N8N4N3N1M8M6M5M3M1M0L8L7L5L4L3I98675
$$ 997498 997578 997655 997728 997797 997864 997927 997987 998045 998099 998152 998203 998251 998297 998342 998385 998426 998466 998504 998541 998576 998610 998643 998675
3010.0642I98706K9TK8K7K6K5K4TK3K2TK1K0TJ9TJ8TJ7J6J7J6J5UJ4TJ3I99286
$$ 998706 998735 998764 998792 998819 998845 998870 998894 998918 998941 998963 998985 999006 999026 999046 999065 999084 999102 999120 999137 999153 999170 999186 999201 999216 999231 999245 999259 999272 999286
2961.2678I99299J2J3J2J1J2J1UJ0WRVQRQVPQPWOPOTPNOVNTONWMNTMNI99706
$$ 999299 999311 999324 999336 999347 999359 999370 999381 999392 999402 999412 999422 999432 999442 999451 999460 999469 999478 999486 999495 999503 999511 999519 999527 999534 999542 999549 999556 999563 999570 999577 999583 999590 999596 999602 999609 999614 999620 999626 999632 999638 999643 999648 999654 999659 999664 999669 999674 999679 999683 999688 999693 999697 999702 999706
2871.8074I99710NMXLMTLMLMLMLXMKLWKLTKLKLKLKTLKTLKWLKWJKK02JA000076
$$ 999710 999715 999719 999723 999727 999731 999735 999739 999742 999746 999750 999753 999757 999760 999764 999767 999771 999774 999777 999780 999783 999786 999789 999793 999795 999798 999801 999804 999807 999810 999812 999815 999818 999820 999823 999825 999828 999830 999833 999835 999837 999840 999842 999844 999847 999849 999851 999853 999855 999857 999860 999862 999864 999866 999868 999870 999871 999873 1000075 1000076 1000076
2772.5876A000076%J%VJ%VJ%VJ%VJ%WJ%XJ%XJ7%U29j1675r5r6r7r9j00I87837
2156.1245I87735j04j05j06j08j09j10j12j13j14j17Tj20Tj23j24j25I85780
$$ 987735 987631 987526 987420 987312 987203 987093 986981 986868 986754 986637 986520 986400 986280 986157 986033 985908 985780
2126.8464I85651j31j32j35j36j38j40j42j44j46j48j50j53j54j57j59I83325
$$ 985651 985520 985388 985253 985117 984979 984839 984697 984553 984407 984259 984109 983956 983802 983645 983486 983325
2099.195I83161j66j68j71j73j76j79j82j84j87j89j93j96j99k01k05I80183
$$ 983161 982995 982827 982656 982483 982307 982128 981946 981762 981575 981386 981193 980997 980798 980597 980392 980183
2071.5437I79972k15k19k21k26k29k33k37k40k45k49k52k58k61k66k71I76075
$$ 979972 979757 979538 979317 979091 978862 978629 978392 978152 977907 977658 977406 977148 976887 976621 976350 976075
2043.8923I75795k85k90k95l00l06l11l17l23l28l35l41l47l53l61l67I70562
$$ 975795 975510 975220 974925 974625 974319 974008 973691 973368 973040 972705 972364 972017 971664 971303 970936 970562
2016.241I70181l89l96m04m12m21m28m37m46m55m65m74m84m94n04n15I62931
$$ 970181 969792 969396 968992 968580 968159 967731 967294 966848 966393 965928 965454 964970 964476 963972 963457 962931
1988.5896I62393n49n61n73n86n99o12o26o41o55o70o86p02p18p36p53I51955
$$ 962393 961844 961283 960710 960124 959525 958913 958287 957646 956991 956321 955635 954933 954215 953479 952726 951955
1960.9382I51165q09q29q50q72q93r16r40r63r89k616j054j081j110j141I34931
$$ 951165 950356 949527 948677 947805 946912 945996 945056 944093 943104 940488 939434 938353 937243 936102 934931
1934.9133I33728j237j272j307j345j383j423j465j507j553j600j648I16290
$$ 933728 932491 931219 929912 928567 927184 925761 924296 922789 921236 919636 917988 916290
1913.7682I14539j806j862j922j983k048k115k184k258k333k413k497H88536
$$ 914539 912733 910871 908949 906966 904918 902803 900619 898361 896028 893615 891118 888536
1892.623H85862k769k867k972l080l194l314l438l570l707l852m004H44933
$$ 885862 883093 880226 877254 874174 870980 867666 864228 860658 856951 853099 849095 844933
1871.4779H40602m506m691m886n091n307n534n773o025o291o572o867G71879
$$ 840602 836096 831405 826519 821428 816121 810587 804814 798789 792498 785926 779059 771879
1850.3326G64371p855q221q608r016r446r898j0377j0881j1410j1968F54138
$$ 764371 756516 748295 739687 730671 721225 711327 700950 690069 678659 666691 654138
1830.8141F40970j3812j4484j5187j5915j6672j7451j8252j9068j9894D69513
$$ 640970 627158 612674 597487 581572 564900 547449 529197 510129 490235 469513
1812.922D47972k2341k3105k3815k4451k4988k5397k5651k5714k5558B01802
$$ 447972 425631 402526 378711 354260 329272 303875 278224 252510 226952 201802
1795.0299A77337k3486k2208k0644j8824j6802j4647j2450j0299q283B3225
$$ 177337 153851 131643 110999 92175 75373 60726 48276 37977 29694 23225
1777.1378A8324l591k523j660r51l37K41Q45J533K368L397M664O188P959D6398
$$ 18324 14733 12210 10550 9599 9262 9503 10348 11881 14249 17646 22310 28498 36457 46398
1752.7395E8467J4258J6416J8455K0302K1900K3215K4230K4952K5392B73165
$$ 58467 72725 89141 107596 127898 149798 173013 197243 222195 247587 273165
1734.8475B98703K5304K4909K4383K3754K3047K2284K1483K0659J9827E23346
$$ 298703 324007 348916 373299 397053 420100 442384 463867 484526 504353 523346
1716.9554E41516J7362J6572J5808J5068J4356J3674J3020J2395J1799F82802
$$ 541516 558878 575450 591258 606326 620682 634356 647376 659771 671570 682802
1699.0634F93493J0176R689R224Q783Q364P967P590P231O889O566O258G88195
$$ 693493 703669 713358 722582 731365 739729 747696 755286 762517 769406 775972 782230 788195
1677.9182G93880N420N166M925M693j2688M032L832L638L453L275L103H25667
$$ 793880 799300 804466 809391 814084 801396 805428 809260 812898 816351 819626 822729 825667
1656.773H28444K623K473K327K185K046J912J778J649J520J393J268H50761
$$ 828444 831067 833540 835867 838052 840098 842010 843788 845437 846957 848350 849618 850761
1635.6278H51779Q94P70O44N17L88K58J24j3j54l00m50o08p71r43j123H49698
$$ 851779 852673 853443 854087 854604 854992 855250 855374 855361 855207 854907 854457 853849 853078 852135 851012 849698
1607.9764H48183j729j957k200k461k740l041l366l717m097m509m958H07964
$$ 848183 846454 844497 842297 839836 837096 834055 830689 826972 822875 818366 813408 807964
1586.8313H01989o551p180p862q602r404j0269j1195j2183j3222j4306F85804
$$ 801989 795438 788258 780396 771794 762390 752121 740926 728743 715521 701215 685804
1567.3126F69291j7574j8541k7386j9723j9959j9772j9071j7776j5838D80396
$$ 669291 651717 633176 605790 586067 566108 546336 527265 509489 493651 480396
1549.4205D70320o415k432J673N689R409J2669J5346J7382J8770J9555E81776
$$ 470320 463905 461473 463146 468835 478244 490913 506259 523641 542411 561966 581776
1529.902F01407J9111J8344J7410J6375J5291J4201J3130J2097J1117G48679
$$ 601407 620518 638862 656272 672647 687938 702139 715269 727366 738483 748679
1512.0099G58015Q540P803P125O503N931N406M924M484M078L705L362H22922
$$ 758015 766555 774358 781483 787986 793917 799323 804247 808731 812809 816514 819876 822922
1490.8646H25677K484K235K002J787J585J397J221J056R00P52O14M82H42548
$$ 825677 828161 830396 832398 834185 835770 837167 838388 839444 840344 841096 841710 842192 842548
1468.0929H42785J21J2r3j96k95l90m84n74o63p51q36r21j005j087j170H33201
$$ 842785 842906 842918 842825 842629 842334 841944 841460 840886 840223 839472 838636 837715 836710 835623 834453 833201
1440.4415H31868j416j497j581j663j746j832j916k004k091k181k273H09304
$$ 831868 830452 828955 827374 825711 823965 822133 820217 818213 816122 813941 811668 809304
1419.2964H06844k557k655k758k861k968l078l191l307l427l550l677G69007
$$ 806844 804287 801632 798874 796013 793045 789967 786776 783469 780042 776492 772815 769007
1398.1512G65063m084m229m378m534m694m861n033n212n398n590n789G05264
$$ 765063 760979 756750 752372 747838 743144 738283 733250 728038 722640 717050 711261 705264
1377.006F99052o436o667o909p159p419m8q124q416q720r035r362r701F01004
$$ 699052 692616 685949 679040 671881 664462 664414 656290 647874 639154 630119 620757 611056 601004
1354.2343E90589j0791j1180j1580j1993j2418j2852j3298j3753j4215D53316
$$ 590589 579798 568618 557038 545045 532627 519775 506477 492724 478509 453316
1336.3423D38422j5352j5807j6255j6694j7115j7516j7885j8219j8506B66338
$$ 438422 423070 407263 391008 374314 357199 339683 321798 303579 285073 266338
1318.4502B47440j8981j8970j8854j8619j8254j7747j7089j6278j5314G3130
$$ 247440 228459 209489 190635 172016 153762 136015 118926 102648 87334 73130
1300.5581F0164j1621j0204q755p321n949m685l568k622j856j268q36I46
$$ 60164 48543 38339 29584 22263 16314 11629 8061 5439 3583 2315 1479 946
1279.413F14k02j19o9l6j3PK9N9J02J72K81M49O98J051J528K138K882A3314
$$ 614 412 293 224 188 175 182 211 270 372 544 825 1274 1972 3023 4551 6689 9571 13314
1248.5084A8007N691O697P660Q543R309R930J0388J0675J0786J0726J0500A29034
$$ 18007 23698 30395 38055 46598 55907 65837 76225 86900 97686 108412 118912 129034
1227.3633A38636Q954Q192P330O382N359M273L135J958P51m76j709k939A75696
$$ 138636 147590 155782 163112 169494 174853 179126 182261 184219 184970 184494 182785 179846 175696
1204.5916A70365o462p529q510r383j0127j0716j1129j1345Tj1124j0677E1997
$$ 170365 163903 156374 147864 138481 128354 117638 106509 95164 83819 72695 62018 51997
1183.4463D2820q188p106n988m894l877k976k213j590j095p05l91j22C810
$$ 42820 34632 27526 21538 16644 12767 9791 7578 5988 4893 4188 3797 3675 3810
1160.6746D221P41J160J706K414L310M404N693P145Q713J0423J1975J3524I0374
$$ 4221 4962 6122 7828 10242 13552 17956 23649 30794 39507 49930 61905 75429 90374
1137.9028A06573J7259J8110J8750J9187J9433J9509J9433J9227J8914B94905
$$ 106573 123832 141942 160692 179879 199312 218821 238254 257481 276395 294905
1120.0107C12940J7503J6931J6327J5704J5069J4430J3791J3157J2533D60304
$$ 312940 330443 347374 363701 379405 394474 408904 422695 435852 448385 460304
1102.1188D71623J0734J0164R610R074Q553Q048P560P086O628O184N753E66352
$$ 471623 482357 492521 502131 511205 519758 527806 535366 542452 549080 555264 561017 566352
1080.9735E71280M533M148L773L406L047K697K351K013J679J349J023F01999
$$ 571280 575813 579961 583734 587140 590187 592884 595235 597248 598927 600276 601299 601999
1059.8284F02378k734k80n96r13j231j551j871k197k524k856l192l533E75019
$$ 602378 599644 599364 598768 597855 596624 595073 593202 591005 588481 585625 582433 578900 575019
1037.0566E70785m594m963n338n722o115o517o930p351p784q226q680D89423
$$ 570785 566191 561228 555890 550168 544053 537536 530606 523255 515471 507245 498565 489423
1015.9115D79806j0101j0593j1094j1602j2117j2634j3154j3671j4185C55966
$$ 479806 469705 459112 448018 436416 424299 411665 398511 384840 370655 355966
998.0194C40787j5651j6095j6506j6875j7191j7445j7625j7718j7711A70378
$$ 340787 325136 309041 292535 275660 258469 241024 223399 205681 187970 170378
980.1273A53030j6968j6442j5764j4935j3957j2844j1613j0295q925B3740
$$ 153030 136062 119620 103856 88921 74964 62120 50507 40212 31287 23740
962.2352A7533m950l818k840k035j403r28n94l67k21j30p6m2k2pNJ9A63
$$ 17533 12583 8765 5925 3890 2487 1559 965 598 377 247 171 129 107 100 105 124 163
932.95734B33J21K05L44N58Q80J338J958K756L734M880O163P547Q985E0131
$$ 233 354 559 903 1461 2341 3679 5637 8393 12127 17007 23170 30717 39702 50131
908.559F1964J3162J4381J5469J6411J7202J7839J8329J8678J8898B31334
$$ 61964 75126 89507 104976 121387 138589 156428 174757 193435 212333 231334
890.667B50332J8904J8731J8491J8194J7851J7471J7061J6630J6182D25571
$$ 250332 269236 287967 306458 324652 342503 359974 377035 393665 409847 425571
872.7749D40829J4791K4237J4070J3599J3135J2680J2236J1803J1381E79732
$$ 440829 455620 479857 493927 507526 520661 533341 545577 557380 568761 579732
854.8828E90306J0189R817R457R109Q774Q449Q138P836P546P267O996F90621
$$ 590306 600495 610312 619769 628878 637652 646101 654239 662075 669621 676888 683884 690621
833.7377F97108O245O012N787N571N361N160M964M776M594M417M246G58322
$$ 697108 703353 709365 715152 720723 726084 731244 736208 740984 745578 749995 754241 758322
812.59247G62242L764L613L466L323L183L047K915K784K658K533K411G98230
$$ 762242 766006 769619 773085 776408 779591 782638 785553 788337 790995 793528 795939 798230
791.44727H00403K057J942J828J715J604J492J382J271J161J050R39Q27H18385
$$ 800403 802460 804402 806230 807945 809549 811041 812423 813694 814855 815905 816844 817671 818385
768.67554H18984M84L66K46J0844q8k16l48m84o25p70r21j078j240j410H22156
$$ 818984 819468 819834 820080 830924 830836 830620 830272 829788 829163 828393 827472 826394 825154 823744 822156
742.65076H20382j969k175k391k619k861l116l387l674l981m306m675G80203
$$ 820382 818413 816238 813847 811228 808367 805251 801864 798190 794209 789903 785228 780203
721.50555G74782n845o299o786p307p868q468r112r804j0545j1338j2187F66130
$$ 774782 768937 762638 755852 748545 740677 732209 723097 713293 702748 691410 679223 666130
700.36035F52072j5080j6161j7295j8478j9698k0945k2195k3425k4601D48513
$$ 652072 636992 620831 603536 585058 565360 544415 522220 498795 474194 448513
682.4683D21899k7342k7801k7920k7636k6893k5655k3910k1677j9013A78060
$$ 421899 394557 366756 338836 311200 284307 258652 234742 213065 194052 178060
664.57623A65353r246n685k074J555N174Q757J2251J5588J8678K1430B55542
$$ 165353 156107 150422 148348 149903 155077 163834 176085 191673 210351 231781 255542
645.0576B81154K6956K7798K8170K8125K7728K7043K6139K5075K3900E44750
$$ 281154 308110 335908 364078 392203 419931 446974 473113 498188 522088 544750
627.1655E66141K0119J8862J7636J6451J5315J4228J3194J2211J1276G15823
$$ 566141 586260 605122 622758 639209 654524 668752 681946 694157 705433 715823
609.27344G25369Q743P974P237O527N839N169M512L862L216K569J914G84180
$$ 725369 734112 742086 749323 755850 761689 766858 771370 775232 778448 781017 782931 784180
588.1283G84748j34q60j612k393l201m031m877n720o540p304p967q473G22883
$$ 784748 784614 783754 782142 779749 776548 772517 767640 761920 755380 748076 740109 731636 722883
565.35657G14147q346p524o239m499k367L9K567N042P301R214J0704J1744G44137
$$ 714147 705801 698277 692038 687539 685172 685211 687778 692820 700121 709335 720039 731783 744137
542.58484G56724J2509J2196K9827J1227J0558R862R169Q495P853P250H82358
$$ 756724 769233 781429 811256 822483 833041 842903 852072 860567 868420 875670 882358
523.0662H88528N694N258M860M498M167L867L594L344L117K910K720I35104
$$ 888528 894222 899480 904340 908838 913005 916872 920466 923810 926927 929837 932557 935104
501.92102I37492K244K109J987J873J769J672J584J500J424J352J286I57516
$$ 937492 939736 941845 943832 945705 947474 949146 950730 952230 953654 955006 956292 957516
480.77585I58682J112J062J014R70R28Q89Q52Q17P85P53P25O97O71O47I71227
$$ 958682 959794 960856 961870 962840 963768 964657 965509 966326 967111 967864 968589 969286 969957 970604 971227
454.751I71828N81N60N41N23N06M89M73M58M42M29M15M02L89L77L66I79133
$$ 971828 972409 972969 973510 974033 974539 975028 975501 975959 976401 976830 977245 977647 978036 978413 978779 979133
427.09964I79477L33L23L13L04K94K86K77K68K61K52K44K37K29K22K14I83741
$$ 979477 979810 980133 980446 980750 981044 981330 981607 981875 982136 982388 982632 982869 983098 983320 983534 983741
399.44824I83941J92J86J78J71J64J56J49J41J34J25J18J08J00R0Q1P0I86162
$$ 983941 984133 984319 984497 984668 984832 984988 985137 985278 985412 985537 985655 985763 985863 985953 986034 986104 986162
370.17032I86209L4K0Oj1k9m8o8r2j16j44j73k05k40k75l13l50l87m19I82954
$$ 986209 986243 986263 986269 986258 986229 986181 986113 986021 985905 985761 985588 985383 985143 984868 984555 984205 983818 983399 982954
337.63925I82493m62m43m02l33k38j22J2J52K87M08N07N80O27O49O52I85006
$$ 982493 982031 981588 981186 980853 980615 980493 980505 980657 980944 981352 981859 982439 983066 983715 984367 985006
309.98788I85621N84N49N13M77M41M08L77L48L22K98K76K57K39K22K09I91336
$$ 985621 986205 986754 987267 987744 988185 988593 988970 989318 989640 989938 990214 990471 990710 990932 991141 991336
282.3365I91519J73J62J54J46J38J32J25J20J14J10J05J01R7R4M650I97991
$$ 991519 991692 991854 992008 992154 992292 992424 992549 992669 992783 992893 992998 993099 993196 993290 997940 997991
254.68512I98040M6M4M2M0L8L7L5L4L3L1L0K9K8K7K6TK4K3UK1TK0TJ9I98798
$$ 998040 998086 998130 998172 998212 998250 998287 998322 998356 998389 998420 998450 998479 998507 998534 998560 998586 998610 998633 998656 998679 998700 998721 998741 998761 998780 998798
210.7682I98817J7UJ6TJ5VJ3J4TJ3TJ2WJ1VJ0WRJ0RTQRP19LKLKLKTLI99976
$$ 998817 998834 998851 998868 998884 998900 998915 998930 998945 998960 998973 998987 999001 999014 999027 999039 999051 999063 999075 999087 999098 999109 999120 999131 999141 999151 999161 999171 999181 999190 999200 999209 999218 999226 999235 999954 999957 999959 999962 999964 999967 999969 999971 999974 999976
137.57336I99978KWI99989
$$ 999978 999980 999982 999984 999986 999988 999989
126.1875I99991  $$checkpoint
##END= $$ end of 1,1-DCE IR
##TITLE=Raman of 1,1-dichloroethylene $$ Begin of the data block
##JCAMP-DX=5.00 $$ ACD/DocManager Library v 5.00
##DATA TYPE=RAMAN SPECTRUM
##DATA CLASS=XYDATA
##BLOCK ID=6
##DATE=19 Feb 2012 10:30:00
##ORIGIN= Department of Chemistry, UWI, Jamaica
##OWNER= public domain
##SPECTROMETER/DATA SYSTEM=from scan
##$MODELS=
<Models>
<ModelData id="1DCE" type="MOL">
1,1-dichloroethylene
__Jmol-14_02171520543D 1   1.00000     0.00000     0
Jmol version 14.3.12_2015.02.11  2015-02-11 19:15 EXTRACT: ({0:5})
  6  5  0  0  0  0              1 V2000
   0.00000   0.00000   0.41101 C   0  0  0  0  0  0
   0.00000   0.00000   1.74967 C   0  0  0  0  0  0
   0.00000   0.93996   2.32528 H   0  0  0  0  0  0
   0.00000  -0.93996   2.32528 H   0  0  0  0  0  0
   0.00000   1.44639  -0.51808 Cl  0  0  0  0  0  0
   0.00000  -1.44639  -0.51808 Cl  0  0  0  0  0  0
  1  6  1  0  0  0
  1  5  1  0  0  0
  1  2  2  0  0  0
  2  3  1  0  0  0
  2  4  1  0  0  0
M  END
</ModelData>
<ModelData id="i2" type="XYZVIB" baseModel="1DCE" vibrationScale=".5">
6
Model[1]: PATH=Calculation 1;Input;Convg=0.4887D-08;-V/T=2.0006;Energy=NaN;Range=M.O.s;E(RHF)=-995.823662291 A.U.;PATH=Calculation 1;Input
C       0.00000      0.00000      0.00000
C       0.00000      0.00000      1.33866
H       0.93996      0.00000      1.91427
H      -0.93996      0.00000      1.91427
Cl      1.44639      0.00000     -0.92909
Cl     -1.44639      0.00000     -0.92909
6
Model[2]: PATH=Calculation 1;Standard;Convg=0.4887D-08;-V/T=2.0006;Energy=-995.82367;Range=M.O.s;E(RHF)=-995.823662291 A.U.;PATH=Calculation 1;Standard
C       0.00000      0.00000      0.41101
C       0.00000      0.00000      1.74967
H       0.00000      0.93996      2.32528
H       0.00000     -0.93996      2.32528
Cl      0.00000      1.44639     -0.51808
Cl      0.00000     -1.44639     -0.51808
6
Model[3]: IRIntensity=0.1106 KM/Mole;PATH=Calculation 1;FrequenciesFrequencies;ReducedMass=18.4273 AMU;ForceConstant=1.1552 mDyne/A;FreqValue=326.1875;Frequency=326.1875 cm^-1;FrequencyLabel=A1;PATH=Calculation 1;FrequenciesFrequencies
C       0.00000      0.00000      0.41101      0.00000      0.00000     -0.37000
C       0.00000      0.00000      1.74967      0.00000      0.00000     -0.39000
H       0.00000      0.93996      2.32528      0.00000      0.00000     -0.38000
H       0.00000     -0.93996      2.32528      0.00000      0.00000     -0.38000
Cl      0.00000      1.44639     -0.51808      0.00000      0.44000      0.14000
Cl      0.00000     -1.44639     -0.51808      0.00000     -0.44000      0.14000
6
Model[4]: IRIntensity=0.0003 KM/Mole;PATH=Calculation 1;FrequenciesFrequencies;ReducedMass=3.6118 AMU;ForceConstant=0.4422 mDyne/A;FreqValue=455.8292;Frequency=455.8292 cm^-1;FrequencyLabel=B2;PATH=Calculation 1;FrequenciesFrequencies
C       0.00000      0.00000      0.41101      0.00000     -0.07000      0.00000
C       0.00000      0.00000      1.74967      0.00000      0.34000      0.00000
H       0.00000      0.93996      2.32528      0.00000      0.55000     -0.34000
H       0.00000     -0.93996      2.32528      0.00000      0.55000      0.34000
Cl      0.00000      1.44639     -0.51808      0.00000     -0.06000      0.12000
Cl      0.00000     -1.44639     -0.51808      0.00000     -0.06000     -0.12000
6
Model[5]: IRIntensity=2.8951 KM/Mole;PATH=Calculation 1;FrequenciesFrequencies;ReducedMass=7.2233 AMU;ForceConstant=1.3108 mDyne/A;FreqValue=554.9693;Frequency=554.9693 cm^-1;FrequencyLabel=B1;PATH=Calculation 1;FrequenciesFrequencies
C       0.00000      0.00000      0.41101      0.70000      0.00000      0.00000
C       0.00000      0.00000      1.74967     -0.19000      0.00000      0.00000
H       0.00000      0.93996      2.32528     -0.48000      0.00000      0.00000
H       0.00000     -0.93996      2.32528     -0.48000      0.00000      0.00000
Cl      0.00000      1.44639     -0.51808     -0.07000      0.00000      0.00000
Cl      0.00000     -1.44639     -0.51808     -0.07000      0.00000      0.00000
6
Model[6]: IRIntensity=18.6624 KM/Mole;PATH=Calculation 1;FrequenciesFrequencies;ReducedMass=9.0383 AMU;ForceConstant=2.3129 mDyne/A;FreqValue=659.0407;Frequency=659.0407 cm^-1;FrequencyLabel=A1;PATH=Calculation 1;FrequenciesFrequencies
C       0.00000      0.00000      0.41101      0.00000      0.00000      0.36001
C       0.00000      0.00000      1.74967      0.00000      0.00000      0.48000
H       0.00000      0.93996      2.32528      0.00000     -0.01000      0.51000
H       0.00000     -0.93996      2.32528      0.00000      0.01000      0.51000
Cl      0.00000      1.44639     -0.51808      0.00000      0.19000     -0.16000
Cl      0.00000     -1.44639     -0.51808      0.00000     -0.19000     -0.16000
6
Model[7]: IRIntensity=0.0000 KM/Mole;PATH=Calculation 1;FrequenciesFrequencies;ReducedMass=1.0197 AMU;ForceConstant=0.4876 mDyne/A;FreqValue=900.8576;Frequency=900.8576 cm^-1;FrequencyLabel=A2;PATH=Calculation 1;FrequenciesFrequencies
C       0.00000      0.00000      0.41101      0.00000      0.00000      0.00000
C       0.00000      0.00000      1.74967      0.00000      0.00000      0.00000
H       0.00000      0.93996      2.32528      0.71000      0.00000      0.00000
H       0.00000     -0.93996      2.32528     -0.71000      0.00000      0.00000
Cl      0.00000      1.44639     -0.51808     -0.01000      0.00000      0.00000
Cl      0.00000     -1.44639     -0.51808      0.01000      0.00000      0.00000
6
Model[8]: IRIntensity=92.0040 KM/Mole;PATH=Calculation 1;FrequenciesFrequencies;ReducedMass=3.0785 AMU;ForceConstant=1.6024 mDyne/A;FreqValue=939.9244;Frequency=939.9244 cm^-1;FrequencyLabel=B2;PATH=Calculation 1;FrequenciesFrequencies
C       0.00000      0.00000      0.41101      0.00000      0.37000      0.00000
C       0.00000      0.00000      1.74967      0.00000      0.09000      0.00000
H       0.00000      0.93996      2.32528      0.00000     -0.27001      0.59000
H       0.00000     -0.93996      2.32528      0.00000     -0.27001     -0.59000
Cl      0.00000      1.44639     -0.51808      0.00000     -0.07000      0.04000
Cl      0.00000     -1.44639     -0.51808      0.00000     -0.07000     -0.04000
6
Model[9]: IRIntensity=52.9028 KM/Mole;PATH=Calculation 1;FrequenciesFrequencies;ReducedMass=1.3120 AMU;ForceConstant=1.0456 mDyne/A;FreqValue=1163.0605;Frequency=1163.0605 cm^-1;FrequencyLabel=B1;PATH=Calculation 1;FrequenciesFrequencies
C       0.00000      0.00000      0.41101     -0.04000      0.00000      0.00000
C       0.00000      0.00000      1.74967      0.16000      0.00000      0.00000
H       0.00000      0.93996      2.32528     -0.70000      0.00000      0.00000
H       0.00000     -0.93996      2.32528     -0.70000      0.00000      0.00000
Cl      0.00000      1.44639     -0.51808      0.00000      0.00000      0.00000
Cl      0.00000     -1.44639     -0.51808      0.00000      0.00000      0.00000
6
Model[10]: IRIntensity=85.0510 KM/Mole;PATH=Calculation 1;FrequenciesFrequencies;ReducedMass=1.8092 AMU;ForceConstant=1.7212 mDyne/A;FreqValue=1270.7289;Frequency=1270.7289 cm^-1;FrequencyLabel=B2;PATH=Calculation 1;FrequenciesFrequencies
C       0.00000      0.00000      0.41101      0.00000      0.21000      0.00000
C       0.00000      0.00000      1.74967      0.00000     -0.16000      0.00000
H       0.00000      0.93996      2.32528      0.00000      0.23001     -0.64000
H       0.00000     -0.93996      2.32528      0.00000      0.23001      0.64000
Cl      0.00000      1.44639     -0.51808      0.00000     -0.02000      0.01000
Cl      0.00000     -1.44639     -0.51808      0.00000     -0.02000     -0.01000
6
Model[11]: IRIntensity=6.8266 KM/Mole;PATH=Calculation 1;FrequenciesFrequencies;ReducedMass=1.4915 AMU;ForceConstant=2.1016 mDyne/A;FreqValue=1546.4604;Frequency=1546.4604 cm^-1;FrequencyLabel=A1;PATH=Calculation 1;FrequenciesFrequencies
C       0.00000      0.00000      0.41101      0.00000      0.00000      0.20001
C       0.00000      0.00000      1.74967      0.00000      0.00000     -0.06000
H       0.00000      0.93996      2.32528      0.00000      0.31000     -0.62000
H       0.00000     -0.93996      2.32528      0.00000     -0.31000     -0.62000
Cl      0.00000      1.44639     -0.51808      0.00000      0.01000     -0.01000
Cl      0.00000     -1.44639     -0.51808      0.00000     -0.01000     -0.01000
6
Model[12]: IRIntensity=47.1352 KM/Mole;PATH=Calculation 1;FrequenciesFrequencies;ReducedMass=2.6981 AMU;ForceConstant=4.9710 mDyne/A;FreqValue=1768.3251;Frequency=1768.3251 cm^-1;FrequencyLabel=A1;PATH=Calculation 1;FrequenciesFrequencies
C       0.00000      0.00000      0.41101      0.00000      0.00000     -0.26000
C       0.00000      0.00000      1.74967      0.00000      0.00000      0.29000
H       0.00000      0.93996      2.32528      0.00000      0.49001     -0.43000
H       0.00000     -0.93996      2.32528      0.00000     -0.49001     -0.43000
Cl      0.00000      1.44639     -0.51808      0.00000     -0.01000      0.01000
Cl      0.00000     -1.44639     -0.51808      0.00000      0.01000      0.01000
6
Model[13]: IRIntensity=0.0670 KM/Mole;PATH=Calculation 1;FrequenciesFrequencies;ReducedMass=1.0641 AMU;ForceConstant=6.0497 mDyne/A;FreqValue=3106.4325;Frequency=3106.4325 cm^-1;FrequencyLabel=A1;PATH=Calculation 1;FrequenciesFrequencies
C       0.00000      0.00000      0.41101      0.00000      0.00000      0.01000
C       0.00000      0.00000      1.74967      0.00000      0.00000     -0.07000
H       0.00000      0.93996      2.32528      0.00000      0.61000      0.36001
H       0.00000     -0.93996      2.32528      0.00000     -0.61000      0.36001
Cl      0.00000      1.44639     -0.51808      0.00000      0.00000      0.00000
Cl      0.00000     -1.44639     -0.51808      0.00000      0.00000      0.00000
6
Model[14]: IRIntensity=0.8160 KM/Mole;PATH=Calculation 1;FrequenciesFrequencies;ReducedMass=1.1196 AMU;ForceConstant=6.6677 mDyne/A;FreqValue=3179.2916;Frequency=3179.2916 cm^-1;FrequencyLabel=B2;PATH=Calculation 1;FrequenciesFrequencies
C       0.00000      0.00000      0.41101      0.00000      0.00000      0.00000
C       0.00000      0.00000      1.74967      0.00000     -0.10000      0.00000
H       0.00000      0.93996      2.32528      0.00000      0.60001      0.37000
H       0.00000     -0.93996      2.32528      0.00000      0.60001     -0.37000
Cl      0.00000      1.44639     -0.51808      0.00000      0.00000      0.00000
Cl      0.00000     -1.44639     -0.51808      0.00000      0.00000      0.00000
</ModelData>
</Models>
##$PEAKS=
<Peaks type="RAMAN" xUnitsExpected="1/cm"  >
<PeakData id="1" title="1 (~3160 cm-1)" peakShape="broad" model="i2.14" xMax="3195" xMin="3165"    />
<PeakData id="2" title="2 (~3160 cm-1)" peakShape="broad" model="i2.13" xMax="3125" xMin="3085"    />
<PeakData id="3" title="3 (~1740 cm-1)" peakShape="broad" model="i2.12" xMax="1785" xMin="1750"    />
<PeakData id="4" title="4 (~1510 cm-1)" peakShape="broad" model="i2.11" xMax="1560" xMin="1530"    />
<PeakData id="5" title="5 (~1510 cm-1)" peakShape="broad" model="i2.10" xMax="1290" xMin="1260"    />
<PeakData id="6" title="6 (~1360 cm-1)" peakShape="broad" model="i2.10" xMax="1180" xMin="1150"    />
<PeakData id="7" title="7 (~960 cm-1)" peakShape="broad" model="i2.9" xMax="955" xMin="925"    />
<PeakData id="8" title="8 (~960 cm-1)" peakShape="broad" model="i2.6" xMax="915" xMin="885"    />
<PeakData id="9" title="9 (~765 cm-1)" peakShape="broad" model="i2.7" xMax="675" xMin="645"    />
<PeakData id="10" title="10 (~615 cm-1)" peakShape="broad" model="i2.4" xMax="570" xMin="540"    />
<PeakData id="11" title="11 (~510 cm-1)" peakShape="broad" model="i2.5" xMax="470" xMin="440"    />
<PeakData id="12" title="12 (~173 cm-1)" peakShape="broad" model="i2.3" xMax="340" xMin="310"    />
</Peaks>
##XUNITS=1/CM
##YUNITS=RAMAN INTENSITY
##XFACTOR= 1
##YFACTOR= 1.084966E-06
##FIRSTX= 3.377665E+03
##FIRSTY= 1.382219E-02
##LASTX= 1.261875E+02
##NPOINTS= 2000
##MINY= 0
##MAXY= 1.084966
##XYDATA= (X++(Y..Y))
3377.665A2740J86J91J96J99K05K09K14K19K24K30K35K41K47K53K60A6315
$$ 12740 12926 13117 13313 13512 13717 13926 14140 14359 14583 14813 15048 15289 15536 15789 16049 16315
3350.0137A6588K80K87K95L03L11L20L28L37L46L57L66L78L88L99M12B2118
$$ 16588 16868 17155 17450 17753 18064 18384 18712 19049 19395 19752 20118 20496 20884 21283 21695 22118
3322.3623B2555M50M64M79M94N09N27N43N62N80O01O21O43O65O90P14C1838
$$ 22555 23005 23469 23948 24442 24951 25478 26021 26583 27163 27764 28385 29028 29693 30383 31097 31838
3294.711C2607P97Q28Q61Q94R30R68J007J050J094J141J191J244J301D7272
$$ 32607 33404 34232 35093 35987 36917 37885 38892 39942 41036 42177 43368 44612 45913 47272
3270.3125D8696J491J562J640J721J808J902K003K109K225K349K482K626G5395
$$ 48696 50187 51749 53389 55110 56918 58820 60823 62932 65157 67506 69988 72614 75395
3247.5408G8344L130L326L539L771M024M298M598M927N286N680O114O591A40744
$$ 78344 81474 84800 88339 92110 96134 100432 105030 109957 115243 120923 127037 133628 140744
3224.769A48441Q339R050R836J0711J1680J2757J3954J5282J6753J8382B95361
$$ 148441 156780 165830 175666 186377 198057 210814 224768 240050 256803 275185 295361
3205.2505C17504K4285K6590K9038L1586L4159L6649L8898M0695M1774F62999
$$ 317504 341789 368379 397417 429003 463162 499811 538709 579404 621178 662999
3187.3584G03510L7549L2744K6091J7823Q429j400j0892j9331k6193l1198G02815
$$ 703510 741059 773803 799894 817717 826146 824746 813854 794523 768330 737132 702815
3167.8398F67101l5670l4509l2543l0047k7237k4275k1271j8300j5404D15246
$$ 667101 631431 596922 564379 534332 507095 482820 461549 443249 427845 415246
3149.9478D05355p268m717k216K59K734N236P792J0427J3168J6035J9047D88060
$$ 405355 398087 393370 391154 391413 394147 399383 407175 417602 430770 446805 465852 488060
3128.8025E13577K8950L2458L5954L9306M2322M4739M6230M6407M4864I16043
$$ 513577 542527 574985 610939 650245 692567 737306 783536 829943 874807 916043
3110.9104I51331K7012J6699M958p351j9265k9899l8596m5011m9110n1099G08339
$$ 951331 978343 995042 1000000 992649 973384 943485 904889 859878 810768 759669 708339
3091.3918F58131m8130m5436m2402l9236l6081l3035l0159k7483k5021C08374
$$ 658131 610001 564565 522163 482927 446846 413811 383652 356169 331148 308374
3073.4998B87640j8890j7226j5728j4380j3167j2075j1091j0205r405A56791
$$ 287640 268750 251524 235796 221416 208249 196174 185083 174878 165473 156791
3055.6077A48763p436o897o408n963n556n186m846m536m250l989l746H6425
$$ 148763 141327 134430 128022 122059 116503 111317 106471 101935 97685 93696 89950 86425
3034.4626H3106l129k954k791k639k500k368k247k134k027j929j836j748E3136
$$ 83106 79977 77023 74232 71593 69093 66725 64478 62344 60317 58388 56552 54804 53136
3011.691E1545j520j451j389j328j272j219j169j121j076j033r93r55C6100
$$ 51545 50025 48574 47185 45857 44585 43366 42197 41076 40000 38967 37974 37019 36100
2988.9192C5216q51q21p90p63p35p10o86o62o41o19n98n79n61n43n26B4622
$$ 35216 34365 33544 32754 31991 31256 30546 29860 29198 28557 27938 27340 26761 26200 25657 25131 24622
2961.2678B4128m79m65m51m37m25m12m01l90l78l68l58l48l39l30l21A7913
$$ 24128 23649 23184 22733 22296 21871 21459 21058 20668 20290 19922 19564 19216 18877 18547 18226 17913
2933.6165A7608k96k90k82k74k68k62k55k49k43k37k32k26k21k15k11A3641
$$ 17608 17312 17022 16740 16466 16198 15936 15681 15432 15189 14952 14720 14494 14273 14058 13847 13641
2905.9648A3439j97j92j89j84j80j77j73j69j65j62j59j55j52j50j46A0746
$$ 13439 13242 13050 12861 12677 12497 12320 12147 11978 11813 11651 11492 11337 11185 11035 10889 10746
2878.3135A0606j38j35j32j30j27j25j23j20j18j15j14j12j09j08j05H691
$$ 10606 10468 10333 10201 10071 9944 9819 9696 9576 9458 9343 9229 9117 9008 8900 8795 8691
2850.662H589j00r8r7r4Tr1r0q9q7q6q4q3q1q0p9p8p6p5p4p3p1To9o8F533
$$ 8589 8489 8391 8294 8200 8106 8015 7925 7836 7749 7663 7579 7496 7415 7335 7256 7178 7102 7027 6953 6880 6809 6738 6669 6601 6533
2808.3718F467o5o4o3To1o0Tn9n7Tn6Tn4Tn3n2Tn1j931l4Ul2l3l2l1Tl0C177
$$ 6467 6402 6338 6275 6212 6151 6091 6031 5972 5915 5858 5802 5746 5692 5638 5585 5533 5481 5430 3499 3465 3431 3397 3365 3332 3300 3269 3238 3208 3177
2759.5752C148k9Uk8Tk7Tk6k7k5k6k5Uk4Tk3Wk2k1k2k1Vk0Uj9Tk362%@
$$ 3148 3119 3090 3061 3033 3005 2978 2951 2925 2898 2873 2847 2822 2797 2772 2748 2724 2701 2678 2655 2632 2609 2587 2566 2544 2523 2502 2481 2460 2440 2420 2400 2381 2362 0 0 0
2699.3928@%U26N72NTMNWONUONOTNOXPOPOPTOPUQPTQTPQURQTRYJ0XJ1A001
2068.2905A012J1J2J1J2J1J2J3J2J3J2J3J4J3J4UJ5J4J5J6J5J6TJ7J6A370
$$ 1012 1023 1035 1046 1058 1069 1081 1094 1106 1119 1131 1144 1158 1171 1185 1199 1213 1228 1242 1257 1273 1288 1304 1320 1337 1353 1370
2024.3738A388J8UJ9TK0J9K1VK2K3UK4TK5K6TK7TK8TK9L0TL1L2L3TL4B216
$$ 1388 1406 1424 1442 1461 1480 1500 1519 1540 1561 1582 1603 1625 1648 1671 1694 1718 1742 1767 1793 1819 1846 1873 1901 1929 1958 1988 2018 2049 2081 2114 2147 2181 2216
1969.0709B252L7TL9TM1TM3TM5M6M7M9TN1J348O4O6O8P0P1P3P6P7Q0Q1E017
$$ 2252 2289 2326 2365 2404 2445 2486 2529 2572 2617 2663 2710 2759 2808 2859 4207 4271 4337 4405 4475 4546 4619 4695 4772 4852 4933 5017
1925.154E103Q9R1R4R7R9J03J06J08J13J16J19J24J27J32J36J41J46G195
$$ 5103 5192 5283 5377 5474 5573 5676 5782 5890 6003 6119 6238 6362 6489 6621 6757 6898 7044 7195
1894.2496G351J61J68J74J80J87J95K02K09K19K27K37K46K58K68K80K93A1161
$$ 7351 7512 7680 7854 8034 8221 8416 8618 8827 9046 9273 9510 9756 10014 10282 10562 10855 11161
1864.9717A1481L35L51L69L86M06M27M48M73M98N26N55N87O21O58O97A9559
$$ 11481 11816 12167 12536 12922 13328 13755 14203 14676 15174 15700 16255 16842 17463 18121 18818 19559
1837.3203B0346Q38Q93R52J018J089J166J251J344J447J559J682J819C7373
$$ 20346 21184 22077 23029 24047 25136 26302 27553 28897 30344 31903 33585 35404 37373
1814.5486C9510K321K526K753L006L287L600L948M334M763N238N762O338I4349
$$ 39510 41831 44357 47110 50116 53403 57003 60951 65285 70048 75286 81048 87386 94349
1791.7769A01987Q354R099R849J0575J1225J1740J2036J2023J1599J0680B18372
$$ 101987 110341 119440 129289 139864 151089 162829 174865 186888 198487 209167 218372
1772.2582B25546M656J797j196m091o677q793j0359j1366j1863j1936A54035
$$ 225546 230202 231999 230803 226712 220035 211242 200883 189517 177654 165718 154035
1752.7395A42837j0562r846r096q347p624o941o305n721n187m703m265F0370
$$ 142837 132275 122429 113333 104986 97362 90421 84116 78395 73208 68505 64240 60370
1731.5944E6855l194k906k647k413k203k012j840j684j542j414j296j189C1424
$$ 56855 53661 50755 48108 45695 43492 41480 39640 37956 36414 35000 33704 32515 31424
1708.8226C0422r18q42p72p07o47n90n38m88m43m00l58l20k83k48k15B2470
$$ 30422 29504 28662 27890 27183 26536 25946 25408 24920 24477 24077 23719 23399 23116 22868 22653 22470
1681.1713B2318j22r3o5l8j1J6M2O7R4J20J45J71J98K25K52K79L09L37B4612
$$ 22318 22196 22103 22038 22000 21989 22005 22047 22114 22208 22328 22473 22644 22842 23067 23319 23598 23907 24244 24612
1648.6403B5011M31M65N01N37N75O16O58P04P51Q01Q54R12R71J037J105C7108
$$ 25011 25442 25907 26408 26945 27520 28136 28794 29498 30249 31050 31904 32816 33787 34824 35929 37108
1620.9889C8367J344J436J534J642J758J883K020K168K329K506K699K910F5738
$$ 38367 39711 41147 42681 44323 46081 47964 49984 52152 54481 56987 59686 62596 65738
1598.2172F9134L677L986M327M704N122N586O099O672P307Q015Q801R675A53750
$$ 69134 72811 76797 81124 85828 90950 96536 102635 109307 116614 124629 133430 143105 153750
1575.4454A65469J2904J4204J5620J7146J8764K0448K2146K3839K5257C62215
$$ 165469 178373 192577 208197 225343 244107 264555 286701 310540 335797 362215
1557.5533C89304K7055K6097K4013K0675J6077J0377L906k867r421j5273D69877
$$ 389304 416359 442456 466469 487144 503221 513598 517504 514637 505216 489943 469877
1538.0347D46266k5892k7022k7189k6618k5524k4092k2472k0779j9089B10131
$$ 446266 420374 393352 366163 339545 314021 289929 267457 246678 227589 210131
$$ [...]
126.1875F40  $$checkpoint
##END=$$ End of RAMAN of 1,1-DCE
##END= $$ end of file