##TITLE= 1,2-dichloroethylene
##JCAMP-DX=5.01
##DATA TYPE= LINK
##BLOCKS= 6
##TITLE= cis-1,2-dichloroethylene (Z)
##JCAMP-DX= 5.01
##DATA TYPE= INFRARED SPECTRUM
##DATA CLASS= XYDATA
##BLOCK ID=1
##ORIGIN= Department of Chemistry, UWI, JAMAICA
##OWNER= public domain
##LONGDATE= 2012/02/18 12:31:56.0440 -0500 $$ export date from JSpecView
##SPECTROMETER/DATA SYSTEM= from scan
##$MODELS=
<Models>
<ModelData id="Cc2h2cl2" type="MOL">
cis-1,2-dichloroethylene (Z)
__Jmol-14_02171521233D 1   1.00000     0.00000     0
Jmol version 14.29.49  2019-08-01 14:38 EXTRACT: ({0:5})
  6  5  0  0  0  0            999 V2000
    0.0000    0.6703    0.9615 C   0  0  0  0  0  0
    0.0000    1.6559   -0.4509 Cl  0  0  0  0  0  0
    0.0000   -0.6703    0.9615 C   0  0  0  0  0  0
    0.0000   -1.2543    1.8960 H   0  0  0  0  0  0
    0.0000   -1.6559   -0.4509 Cl  0  0  0  0  0  0
    0.0000    1.2543    1.8960 H   0  0  0  0  0  0
  1  3  2  0  0  0
  1  6  1  0  0  0
  1  2  1  0  0  0
  3  5  1  0  0  0
  3  4  1  0  0  0
M  END
</ModelData>
<ModelData id="C1" type="XYZVIB" baseModel="Cc2h2cl2" vibrationScale=".5">
6
Model[1]: Convg=0.2429D-08;-V/T=1.0002;Energy=NaN;E(RPM3)=0.919026666692E-02 A.U.;Range=M.O.s;PATH=Calculation 1;Input
C     0.00000    0.00000    0.00000
Cl    0.00000    0.00000    1.72231
C     1.09934    0.00000   -0.76714
H     1.04351    0.00000   -1.86773
Cl    2.71588    0.00000   -0.17287
H    -1.01374    0.00000   -0.43215
6
Model[2]: Convg=0.2429D-08;-V/T=1.0002;Energy=0.009190267;E(RPM3)=0.919026666692E-02 A.U.;Range=M.O.s;PATH=Calculation 1;Standard
C     0.00000    0.67027    0.96153
Cl    0.00000    1.65587   -0.45089
C     0.00000   -0.67027    0.96153
H     0.00000   -1.25431    1.89604
Cl    0.00000   -1.65587   -0.45089
H     0.00000    1.25431    1.89604
6
Model[3]: IRIntensity=0.1623 KM/Mole;ReducedMass=27.1796 AMU;ForceConstant=0.3452 mDyne/A;Frequency=146.8263 cm^-1;FrequencyLabel=A1;PATH=Calculation 1;FrequenciesFrequencies
C     0.00000    0.67027    0.96153    0.00000    0.00000   -0.28000
Cl    0.00000    1.65587   -0.45089    0.00000    0.59000    0.10000
C     0.00000   -0.67027    0.96153    0.00000    0.00000   -0.28000
H     0.00000   -1.25431    1.89604    0.00000    0.20000   -0.14000
Cl    0.00000   -1.65587   -0.45089    0.00000   -0.59000    0.10000
H     0.00000    1.25431    1.89604    0.00000   -0.20000   -0.14000
6
Model[4]: IRIntensity=0.0000 KM/Mole;ReducedMass=2.7386 AMU;ForceConstant=0.2504 mDyne/A;Frequency=393.9051 cm^-1;FrequencyLabel=A2;PATH=Calculation 1;FrequenciesFrequencies
C     0.00000    0.67027    0.96153    0.27000    0.00000    0.00000
Cl    0.00000    1.65587   -0.45089   -0.05000    0.00000    0.00000
C     0.00000   -0.67027    0.96153   -0.27000    0.00000    0.00000
H     0.00000   -1.25431    1.89604   -0.65000    0.00000    0.00000
Cl    0.00000   -1.65587   -0.45089    0.05000    0.00000    0.00000
H     0.00000    1.25431    1.89604    0.65000    0.00000    0.00000
6
$$ [...]
6
Model[13]: IRIntensity=41.8464 KM/Mole;ReducedMass=1.0801 AMU;ForceConstant=5.7403 mDyne/A;Frequency=3003.3938 cm^-1;FrequencyLabel=B2;PATH=Calculation 1;FrequenciesFrequencies
C     0.00000    0.67027    0.96153    0.00000    0.03000    0.05000
Cl    0.00000    1.65587   -0.45089    0.00000    0.00000    0.00000
C     0.00000   -0.67027    0.96153    0.00000    0.03000   -0.05000
H     0.00000   -1.25431    1.89604    0.00000   -0.36000    0.60000
Cl    0.00000   -1.65587   -0.45089    0.00000    0.00000    0.00000
H     0.00000    1.25431    1.89604    0.00000   -0.36000   -0.60000
6
Model[14]: IRIntensity=36.4698 KM/Mole;ReducedMass=1.0964 AMU;ForceConstant=5.9009 mDyne/A;Frequency=3022.3735 cm^-1;FrequencyLabel=A1;PATH=Calculation 1;FrequenciesFrequencies
C     0.00000    0.67027    0.96153    0.00000    0.04000    0.05000
Cl    0.00000    1.65587   -0.45089    0.00000    0.00000    0.00000
C     0.00000   -0.67027    0.96153    0.00000   -0.04000    0.05000
H     0.00000   -1.25431    1.89604    0.00000    0.37000   -0.60000
Cl    0.00000   -1.65587   -0.45089    0.00000    0.00000    0.00000
H     0.00000    1.25431    1.89604    0.00000   -0.37000   -0.60000
</ModelData>
</Models>
##$PEAKS=
<Peaks type="IR" xUnitsExpected="1/cm"  >
<PeakData id="1" title="B1-asymm stretch of C-H group (~3088 cm-1)" peakShape="broad" model="C1.13" xMax="3120" xMin="3080"    />
<PeakData id="2" title="A1-symm stretch of C-H group (~3080 cm-1)" peakShape="broad" model="C1.14" xMax="3100" xMin="3060"    />
<PeakData id="3" title="A1- C=C stretch (~1590 cm-1)" peakShape="broad" model="C1.12" xMax="1620" xMin="1555"    />
<PeakData id="4" title="B1-asymm C-H bend (~1300 cm-1)" peakShape="broad" model="C1.11" xMax="1320" xMin="1240"    />
<PeakData id="5" title="A1- C-H scissors (~1210 cm-1)" peakShape="broad" model="C1.10" xMax="1230" xMin="1160"    />
<PeakData id="6" title="Inactive A2- C-H rocking (~875 cm-1)" peakShape="broad" model="C1.8" xMax="890" xMin="860"    />
<PeakData id="7" title="B1-asymm stretch of C-Cl group (~850 cm-1)" peakShape="broad" model="C1.7" xMax="870" xMin="830"    />
<PeakData id="8" title="A1-symm stretch of C-Cl group (~760 cm-1)" peakShape="broad" model="C1.6" xMax="780" xMin="740"    />
<PeakData id="9" title="B2-asym C-H flap (~700 cm-1)" peakShape="broad" model="C1.9" xMax="720" xMin="670"    />
<PeakData id="10" title="B1-asymm bend of C-Cl group (~570 cm-1)" peakShape="broad" model="C1.5" xMax="590" xMin="550"    />
<PeakData id="11" title="Inactive A2- Cl-C=C-Cl torsion (~406 cm-1)" peakShape="broad" model="C1.4" xMax="420" xMin="380"    />
<PeakData id="12" title="A1-symm bend of C-Cl group (~173 cm-1)" peakShape="broad" model="C1.3" xMax="190" xMin="150"    />

</Peaks>
#XUNITS= 1/CM
##YUNITS= TRANSMITTANCE
##XFACTOR= 1
##YFACTOR= 8.849600E-07
##FIRSTX= 3.991084E+03
##FIRSTY= 9.009000E-01
##LASTX= 4.125230E+02
##NPOINTS= 1322
##MINY= 6.523000E-02
##MAXY= 9.501900E-01
##XYDATA= (X++(Y..Y))
$$ plain form
3991.084 1018012 1017458 1016893 1016340 1015775 1015221 1014667 1014102 1013549 1012995 1012441 1011888 1010950 1009707 1008452 1007198 1005955
3945.031 1004701 997593 989163 980801 972315 963897 956088 954586 953094 951602 950111 948619 951263 961704
3907.106 972259 982768 993220 1003785 1009063 1011040 1013006 1014972 1016939 1018905 1019379 1019662 1019944 1020227
3869.18 1020509 1020781 1021007 1021233 1021447 1021673 1021899 1021899 1021617 1021334 1021052 1020781 1020498 1020204 1019922 1019639 1019357 1019074 1018792
3817.709 1016735 1014633 1012520 1010419 1008305 1006204 1004079 1001966 999853 997729 995616 994373 993966 993559
3779.784 993152 992745 992339 994158 996621 999096 1001559 1004023 1006464 1008238 1010012 1011786 1013549 1015323 1016690 1017131
3736.44 1017583 1018035 1018487 1018927 1018950 1018668 1018385 1018103 1017820 1017538 1017289 1017052 1016826 1016588 1016351 1016204 1016679 1017153
3687.678 1017617 1018091 1018566 1019040 1019504 1019978 1020453 1020927 1021402 1019707 1016916 1014136 1011345 1008554 1005774 1005413
$$ packed form
3991.084A018012n54n65n53n65n54Tn65n53n54Tn53r38j243j255j254A005955
3945.031A004701p108q430q362q486q418p809j502j492Tj491j492K644I61704
3907.106I72259J0509J0452J0565N278J977J966TJ967J966M74K83K82A020227
3869.18A020509K72K26TK14K26T%k82k83k82k71k83k94k82k83k82k83A018792
3817.709A016735k102k113k101k114k101k125k113Tk124k113j243m07I93559
3779.784I93152m07m06J819K463K475K463K464K441J774UJ763J774J367A017131
3736.44A017583M52TM40K3k82k83k82k83k82k49k37k26k38k37j47M75A017153
3687.678A017617M74M75M74M64M74M75M74M75j695k791k780k791Tk780A005413
$$ plain form
3644.335 1005232 1005040 1004848 1004656 1005153 1008351 1011549 1014758 1017956 1021153 1023142 1023775 1024397 1025029 1025651 1026284 1026905
3598.282 1027538 1028159 1028792 1029414 1030035 1030227 1030408 1030600 1030792 1030973 1031143 1031278 1031403 1031538 1031662 1031798 1031922
3552.229 1032047 1032171 1032295 1032420 1032544 1032352 1032103 1031843 1031595 1031335 1031086 1030826 1030578 1030318 1030069 1029809 1029561
3506.177 1029335 1029097 1028860 1028623 1028397 1028227 1028103 1027979 1027854 1027730 1027606 1027481 1027357 1027233 1027109 1026984 1026883 1026871 1026860 1026849 1026837 1026826
3446.579 1026939 1027210 1027481 1027753 1028035 1028306 1028578 1028860 1029131 1029414 1029685 1029967 1030431 1030917 1031391 1031866 1032340
3400.5261 1032838 1033403 1033968 1034533 1035098 1035663 1036182 1036668 1037154 1037640 1038126 1038612 1038612 1038476 1038352 1038216 1038092 1037957 1037832 1037697 1037572 1037437 1037312 1037188 1037086
3332.802 1036996 1036894 1036793 1036702 1036657 1036657 1036657 1036657 1036657 1036657 1036657 1036657 1036657 1036657 1036657 1036601 1036194 1035787 1035380 1034973 1034567 1033889 1032815 1031730 1030657 1029572 1028498 1027583
3256.951 1026747 1025899 1025063 1024227 1023391 1022950 1022532 1022103 1021685 1021266 1020848 1020430 1020012 1019583 1019165 1018747 1017933 1016690 1015447 1014204 1012961 1011729 1010113
$$ packed form
3644.335A005232j92UM97L198TL209L198L197J989O33O22O32O22O33A026905
3598.282A027538O21O33O22O21J92J81J92TJ81J70J35J25J35J24J36A031922
3552.229A032047J24TJ25J24j92k49k60k48k60k49k60k48k60k49k60A029561
3506.177A029335k38k37Tk26j70j24Tj25j24Tj25j24Uj25j01j2j1Tj2A026826
3446.579A026939K71TK72K82K71K72K82K71K83K71K82M64M86M74M75A032340
3400.5261A032838N65WN19M86W%j36j24j36j24j35j25j35j25j35j25j24A037086
3332.802A036996j02j01r1m5%S0n6m07Vm06o78j074j085j073j085j074A027583
3256.951A026747q48q36Um41m18m29m18m19m18Um29m18Tq14j243Vj232A010113
$$ plain form
3194.644 1008385 1006656 1004915 1003187 1001277 992497 983796 975129 966360 957670 950857 948393 945930
3159.427 943466 941003 938551 937444 937376 937308 937240 937184 937116 931771 925420 919104 912719 906380 899419 887023 874797
3113.375 862615 850242 838038 810715 760136 712721 663307 612886 566308 516645 468044
3083.576 424008 372469 324342 282442 334128 406900 493785 559630 634243 707896 737988
3053.777 769368 800940 831292 862796 883283 889396 895543 901668 907781 913940 917318 919623
3021.269 921929 924223 926528 928833 941059 953523 966078 978406 990881 1000655 1002418 1004192 1005955
2986.053 1007718 1009492 1011300 1013153 1015018 1016871 1018724 1020577 1022374 1024148 1025922 1027696 1029470 1031165 1031775 1032397 1033007 1033629
2937.291 1034239 1034793 1035211 1035629 1036047 1036465 1036894 1037109 1037211 1037312 1037414 1037516 1037618 1036962 1036205 1035448 1034691 1033934 1031764 1021696 1011729 1001774
$$ packed form
3194.644A008385j729j741j728j910q780q701q667q769q690o813k464I45930
3159.427I43466k463k452j107o8Un6o8n345o351o316o385o339o961j2396H74797
3113.375H62615j2373j2204k7323n0579m7415m9414n0421m6578m9663D68044
3083.576D24008n1539m8127m1900N1686P2772Q6885O5845P4613P3653G37988
3053.777G69368L1572L0352L1504K0487O113O147O125O113O159L378I19623
3021.269I21929K294K305TJ2226J2464J2555J2328J2475R774J763J774A005955
2986.053A007718J774J808J853J865J853UJ797J774VJ695O10O22O10A033629
2937.291A034239N54M18VM29K15J02J01J02Uo56p57Vk170j0068r967A001774
$$ plain form
2877.694 991717 981762 970304 956789 943466 930031 916550 903250 909069 923601 938370 952834
2845.186 967400 982203 993367 1004497 1015718 1026747 1037889 1047143 1049663 1052194 1054726 1057246
2812.678 1059777 1060941 1060737 1060534 1060330 1060127 1059924 1059630 1059313 1058997 1058681 1058364 1057957 1055336 1052726 1050115 1047494
2766.626 1044883 1043019 1042838 1042669 1042488 1042307 1042137 1043742 1046669 1049595 1052511 1055438 1058364 1060071 1061540
2725.991 1063020 1064500 1065969 1067291 1067393 1067483 1067585 1067687 1067788 1067845 1067845 1067845 1067845 1067845 1067845 1067856 1067879 1067890 1067913 1067924 1067947 1068195 1068478
2663.684 1068749 1069020 1069291 1069574 1069845 1070127 1070399 1070681 1070952 1071190 1071404 1071608 1071811 1072015 1072218 1072365 1072500
2617.632 1072636 1072760 1072896 1073020 1073156 1073280 1073416 1073540 1073676 1073710 1073506 1073303 1073099 1072885 1072681 1072365 1071947
2571.579 1071517 1071099 1070681 1070263 1069856 1069438 1069031 1068625 1068218 1067845 1067845 1067845 1067845 1067845 1067845 1067845 1067845 1067845 1067845 1067845 1067845 1067822 1067777 1067732 1067698 1067653 1067608 1067382 1067122 1066873 1066613
$$ packed form
2877.694I91717r955j1458j3515j3323j3435j3481j3300N819J4532J4769I52834
2845.186I67400J4803J1164J1130J1221J1029J1142R254K520K531K532A057246
2812.678A059777J164k04k03k04k03Tk94l17l16Tl17m07k621k610k611A047494
2766.626A044883j864j81j69j81Tj70J605K927K926K916K927K926J707A061540
2725.991A063020J480J469J322J02R0J02TJ01N7%WJ1K3J1K3J1K3K48A068478
2663.684A068749K71TK83K71K82K72K82K71K38K14K04K03K04K03J47A072500
2617.632A072636J24J36J24J36J24J36J24J36L4k04k03k04k14k04l16A071947
2571.579A071517m18Um07m18m07m06m07l73%S1k3m5Tl4m5Tk26k60k49A066613
$$ plain form
2487.601 1066365 1066105 1065856 1065596 1065348 1065088 1064839 1064534 1064172 1063799 1063438 1063076 1062715 1062150 1061517 1060884 1060251 1059619 1058986
2436.1301 1058342 1057709 1057076 1056443 1055810 1055325 1055325 1055313 1055313 1055313 1055302 1055302 1055302 1055302 1055302 1055302 1055302 1055302 1055302 1055302 1055302 1055302 1055302 1055302 1055302 1055302 1055302 1055302 1055302 1055302 1055302 1055302 1055302 1055302 1054997 1054477 1053957 1053437 1052906 1052387 1051776 1051155 1050522 1049901 1049268 1048793
2311.517 1049347 1049901 1050454 1051008 1051562 1052466 1053923 1055381 1056839 1058285 1059743 1061065 1062319 1063585 1064839 1066093
2268.173 1067348 1068161 1068941 1069732 1070512 1071291 1071913 1071913 1071913 1071913 1071913 1071913 1071913 1071913 1071913 1071913 1071913 1071913 1071913 1071913 1071913 1071913 1071913 1071913 1071913 1071913 1071913 1071913 1071913 1071913 1071913 1071913 1071913 1071913 1071913 1071280 1070161 1069043 1067913 1066794 1065664 1062816
2154.396 1059607 1056421 1053211 1050002 1047143 1047415 1047686 1047957 1048228 1048499 1049403 1051392 1053392 1055381 1057381 1059381 1060794 1061890
2105.635 1062975 1064071 1065155 1066252 1066591 1066850 1067110 1067370 1067630 1067845 1067845 1067845 1067845 1067845 1067845 1067901 1068014 1068127 1068240 1068353 1068466 1068681 1068930 1069178 1069427 1069675
2035.201 1069924 1070161 1070410 1070659 1070907 1071156 1071314 1071212 1071111 1070998 1070896 1070794 1070749 1070749 1070749 1070082 1069065 1068048 1067845 1067845
1981.022 1067845 1067845 1067845 1067845 1067845 1067845 1068184 1068726 1069291 1069856 1070421 1070986 1071551 1071947 1072003 1071992 1071981 1071969 1071958 1071935 1071924 1071868 1071450 1070941 1070433 1069924 1069427 1068918
$$ packed form
2487.601A066365k60k49k60k48k60k49l05l62l73l61l62l61n65o33Uo32A058986
2436.1301A058342o33Vm85%j2%Tj1%T3l05n20Un31n19o11o21o33o21o33A048793
2311.517A049347N54N53N54TR04J457J458TJ446J458J322J254J266J254A066093
2268.173A067348Q13P80P91P80P79O22%T8o33j119j118j130j119j130A062816
2154.396A059607l186l210l209k859K72K71VR04J989K000J989K000TJ413A061890
2105.635A062975J096J084J097L39K59K60UK15%WN6J13WK15K49K48K49A069675
2035.201A069924K37K49TK48K49J58j02j01j13j02Tm5%To67j017Tk03A067845
1981.022A067845%WL39N42N65WL96N6j1Tj2j1k3j1n6m18n09n08n09m97A068918
$$ plain form
1905.17 1068410 1067901 1067743 1067732 1067732 1067732 1067732 1067732 1067732 1067732 1067732 1067732 1067732 1067732 1067732 1067732 1067732 1067732 1067732 1067732 1067732 1067732 1067732 1067732 1067732 1067732 1067732 1067721 1067698 1067687 1067675 1067664 1067653 1067630 1067619 1067167 1066545 1065913 1065280 1064647 1064014 1063415 1062895 1062398
1785.975 1061912 1061415 1060918 1060432 1059935 1059291 1056353 1052839 1049313 1045799 1040024 1033448 1029063 1028261 1028227
1745.3401 1028578 1031685 1035471 1039267 1038137 1034872 1031369 1027877 1022137 1014905 1006825 996282 963637
1710.124 937828 914313 859779 825631 811890 836038 867531 901984 955433 987615 999571
1680.325 1005334 1010373 1013481 1014600 1015323 1016046 1016769 1017492 1015876 1013097 1010159 1007221 1004283 1000000 995085 990113 984124 976914
1631.563 969388 958992 944924 924449 908052 896142 858999 831292 792363 749311 705998
1601.765 663262 587326 436370 340094 272815 170979 191014 259639 330230 369587 401137
1571.9661 435217 461942 474699 508430 583484 629317 668979 724406 768521 833156 877644
$$ packed form
1905.17A068410n09j58j1%T3j1k3j1j2j1Tk3j1m52o22o32o33Un99n20A062398
1785.975A061912m97Tm86m97o44k938l514l526l514n775o576m385q02A028227
1745.3401A028578L107L786L796j130l265l503l492n740p232q080j0543I63637
1710.124I37828k3515n4534l4148j3741K4148L1493L4453N3449L2182I99571
1680.325A005334N039L108J119P23Vj616k779k938Um283m915m972n989I76914
1631.563I69388j0396j4068k0475j6397j1910l7143k7707l8929m3052G05998
1601.765F63262p5936j50956r6276o7279j01836K0035O8625P0591L9357D01137
1571.9661D35217K6725J2757L3731P5054M5833L9662N5427M4115O4635H77644
$$ plain form
1542.167 904402 929963 955196 970360 976971 982010 987502 994034 1000825 1006859 1012588 1018295 1023673
1506.9501 1028781 1033821 1037459 1037900 1037584 1037279 1036973 1036668 1036352 1032340 1026024 1018295 1006836 1002283
1469.025 1005786 1010984 1017425 1024171 1025538 1022769 1019278 1015786 1009142 998768 1000169 1007142 1011345
1433.808 1009560 1006452 1003175 998034 992418 986802 983513 981536 979739 977943 976146 974349 977909 982948 988033
1393.173 991084 992791 994271 995751 1000158 1007277 1014001 1015594 1015899 1016204 1016509 1016826 1017131 1016182 1013933 1011424 1008916
1347.121 1006407 1003017 998802 994452 989389 982383 974925 965174 953049 933861 920765 887588
1314.613 861768 838151 767312 625531 537550 423522 315946 206699 289957 411126
1287.5231 530668 635882 657872 666471 677307 704427 741118 810037 870390 901679 916234
$$ packed form
1542.167I04402K5561K5233J5164O611N039N492O532O791O034N729N707A023673
1506.9501A028781N040L638M41l16l05l06l05l16m012o316p729j1459A002283
1469.025A005786N198O441O746J367k769l491l492o644j0374J401O973A011345
1433.808A009560l108l277n141n616Tl289j977j797j796j797TL560N039I88033
1393.173I91084J707J480TM407P119O724J593L05UL17L05r49k249k509A008916
1347.121A006407l390m215m350n063p006p458r751j2125j9188j3096H87588
1314.613H61768k3617p0839j41781q7981j14028j07576j09247Q3258D11126
1287.5231E30668J05214K1990Q599J0836K7120L6691O8919O0353L1289I16234
$$ plain form
1257.724 927454 937862 941930 942099 941658 941229 940788 933703 922098 901690 845824 814624 743028
1222.508 676403 612898 575371 671951 782352 843055 899894 931963 941093 941624 940969 938901
1190. 934935 930584 929454 943173 955840 965027 972869 979897 985344 990429 995537 1001955 1008690
1154.7831 1013153 1015368 1017165 1018950 1020735 1022521 1022137 1020690 1019131 1017571 1016012 1014464 1012667 1009944
1116.857 1007006 1004079 1001141 999390 1001424 1004362 1007300 1010238 1013571 1017775 1022193 1026363 1026216 1024973 1023719
1076.223 1022476 1021221 1019978 1015187 1005164 970033 923239 936958 975310 996248 1008373 1011368
1043.7151 1012215 1013063 1013899 1014588 1013571 1012125 1010678 1009232 1007786 1007300 1009243 1011763 1014283 1016803 1019312 1019978 1018701
997.66205 1017029 1015368 1013707 1009650 1003413 997582 998938 1002102 1005277 1008023 1010577 1013097 1015617 1018148 1018419
$$ packed form
1257.724I27454J0408M068J69m41m29m41p085j1605k0408n5866l1200G43028
1222.508F76403o3505l7527R6580J10401O0703N6839L2069R130N31o55I38901
1190.I34935m351j130J3719J2667R187P842P028N447N085N108O418A008690
1154.7831A013153K215J797J785TJ786l84j447j559j560j559j548j797A009944
1116.857A007006k927k938j751K034K938UL333M204M418M170j47j243A023719
1076.223A022476j255j243m791j0023l5131m6794J3719L8352K0938J2125A011368
1043.7151A012215Q48Q36O89j017j446j447j446Tm86J943K520UK509O66A018701
997.66205A017029j661Tm057o237n831J356L164L175K746K554K520TK531A018419
$$ plain form
957.028 1017843 1017210 1016577 1015944 1015311 1013232 1007447 1000791 996474 993322 990316 987310 985446 984451 983615 982768 981920 978734
908.26605 973999 969027 957987 941794 929443 918313 905171 883735 861508 845066 833145
878.46704 779866 748226 709320 650086 603078 543979 480519 349575 256690 189364 126322
848.669 79190 73710 111745 164313 264419 420821 503887 594162 658188 691986 708507
818.87 704326 713433 739118 779561 808353 817110 816048 811935 803166 787527 765210 742678
786.362 686766 655171 616118 556952 493616 379825 289787 239231 196664 174562 188020
756.563 224089 261379 311167 381339 452156 486677 505334 511910 498655 477332 453885
726.76404 414866 321314 267560 224168 181319 137498 123034 115452 102547 91744 87767
$$ packed form
957.028A017843o33Vk079n785o656m317l152l006Tj864r95q36q47q48I78734
908.26605I73999m972j1040j6193j2351j1130j3142k1436k2227j6442H33145
878.46704G79866l1640l8906n9234m7008n9099o3460j30944r2885o7326A26322
848.669G9190n480L8035N2568J00106J56402Q3066R0275O4026L3798G08507
818.87G04326R107K5685M0443K8792Q757j062m113q769j5639k2317G42678
786.362F86766l1595l9053n9166o3336j13791r0038n0556m2567k2102A88020
756.563B24089L7290M9788P0172P0817L4521J8657O576j3255k1323D53885
726.76404D14866r3552n3754m3392m2849m3821j4464p582j2905j0803H7767
$$ plain form
696.966 79427 111915 146911 187681 263989 366604 425149 474180 514204 574094 613632
667.16705 653498 709117 749333 791380 814082 826727 839157 851620 863305 881170 895498
637.36804 907566 920155 929861 937059 943930 951410 959038 964236 967976 971502 975027 975999 974937
602.152 973502 972078 970654 969219 961094 948201 915013 898447 864649 822726 697806 468304
569.644 344920 375068 470213 641261 754339 880797 940370 964891 979434 989378 996621
539.84503 1002768 1005254 1006836 1008418 1010000 1011582 1013164 1013775 1013402 1012837 1012272 1011707 1011142 1010588 1010125 1010249 1010520 1010791 1011074 1011345 1011616 1011899 1013266 1015323
474.82904 1017492 1019651 1021809 1023978 1028385 1033414 1038454 1044951 1052432 1058330 1059042 1058522 1058003 1056262
436.90402 1046996 1030984 1009311 993785 981208 945602 928358 911714 895781
$$ packed form
696.966G9427L2488L4996M0770P6308J02615N8545M9031M0024N9890F13632
667.16705F53498N5619M0216M2047K2702J2645J2430J2463J1685J7865H95498
637.36804I07566J2589R706P198O871P480P628N198L740L526L525R72I74937
602.152I73502j424Tj435q125j2893l3188j6566l3798m1923j24920D68304
569.644C44920L0148R5145J71048J13078J26458N9573K4521J4543R944I96621
539.84503A002768K486J582WO11l73n65Vn54m63J24K71TK83K71TK83J367A015323
474.82904A017492K159K158K169M407N029N040O497P481N898P12n20n19A056262
436.90402A046996j6012k1673j5526j2577l5606j7244j6644H95781
412.523H83791  $$checkpoint
##END= $$ end of cis-DCE IR
##TITLE=Raman of cis-1,2-dichloroethylene (Z) $$ Begin of the data block
##JCAMP-DX=5.00 $$ ACD/DocManager Library v 5.00
##DATA TYPE=RAMAN SPECTRUM
##DATA CLASS=XYDATA
##BLOCK ID=2
##DATE=19 Feb 2012 10:29:22
##ORIGIN= Department of Chemistry, UWI, Jamaica
##OWNER= public domain
##SPECTROMETER/DATA SYSTEM=from scan
##$MODELS=
<Models>
<ModelData id="id="Cc2h2cl2"" type="MOL">
cis-1,2-dichloroethylene (Z)
__Jmol-14_02171521233D 1   1.00000     0.00000     0
Jmol version 14.29.49  2019-08-01 14:38 EXTRACT: ({0:5})
  6  5  0  0  0  0            999 V2000
    0.0000    0.6703    0.9615 C   0  0  0  0  0  0
    0.0000    1.6559   -0.4509 Cl  0  0  0  0  0  0
    0.0000   -0.6703    0.9615 C   0  0  0  0  0  0
    0.0000   -1.2543    1.8960 H   0  0  0  0  0  0
    0.0000   -1.6559   -0.4509 Cl  0  0  0  0  0  0
    0.0000    1.2543    1.8960 H   0  0  0  0  0  0
  1  3  2  0  0  0
  1  6  1  0  0  0
  1  2  1  0  0  0
  3  5  1  0  0  0
  3  4  1  0  0  0
M  END
</ModelData>
<ModelData id="C2" type="XYZVIB" baseModel="Cc2h2cl2" vibrationScale=".5">
6
Model[1]: Convg=0.2429D-08;-V/T=1.0002;Energy=NaN;E(RPM3)=0.919026666692E-02 A.U.;Range=M.O.s;PATH=Calculation 1;Input
C     0.00000    0.00000    0.00000
Cl    0.00000    0.00000    1.72231
C     1.09934    0.00000   -0.76714
H     1.04351    0.00000   -1.86773
Cl    2.71588    0.00000   -0.17287
H    -1.01374    0.00000   -0.43215
6
Model[2]: Convg=0.2429D-08;-V/T=1.0002;Energy=0.009190267;E(RPM3)=0.919026666692E-02 A.U.;Range=M.O.s;PATH=Calculation 1;Standard
C     0.00000    0.67027    0.96153
Cl    0.00000    1.65587   -0.45089
C     0.00000   -0.67027    0.96153
H     0.00000   -1.25431    1.89604
Cl    0.00000   -1.65587   -0.45089
H     0.00000    1.25431    1.89604
6
Model[3]: IRIntensity=0.1623 KM/Mole;ReducedMass=27.1796 AMU;ForceConstant=0.3452 mDyne/A;Frequency=146.8263 cm^-1;FrequencyLabel=A1;PATH=Calculation 1;FrequenciesFrequencies
C     0.00000    0.67027    0.96153    0.00000    0.00000   -0.28000
Cl    0.00000    1.65587   -0.45089    0.00000    0.59000    0.10000
C     0.00000   -0.67027    0.96153    0.00000    0.00000   -0.28000
H     0.00000   -1.25431    1.89604    0.00000    0.20000   -0.14000
Cl    0.00000   -1.65587   -0.45089    0.00000   -0.59000    0.10000
H     0.00000    1.25431    1.89604    0.00000   -0.20000   -0.14000
6
Model[4]: IRIntensity=0.0000 KM/Mole;ReducedMass=2.7386 AMU;ForceConstant=0.2504 mDyne/A;Frequency=393.9051 cm^-1;FrequencyLabel=A2;PATH=Calculation 1;FrequenciesFrequencies
C     0.00000    0.67027    0.96153    0.27000    0.00000    0.00000
Cl    0.00000    1.65587   -0.45089   -0.05000    0.00000    0.00000
C     0.00000   -0.67027    0.96153   -0.27000    0.00000    0.00000
H     0.00000   -1.25431    1.89604   -0.65000    0.00000    0.00000
Cl    0.00000   -1.65587   -0.45089    0.05000    0.00000    0.00000
H     0.00000    1.25431    1.89604    0.65000    0.00000    0.00000
6
Model[5]: IRIntensity=9.3488 KM/Mole;ReducedMass=9.5299 AMU;ForceConstant=1.3839 mDyne/A;Frequency=496.4658 cm^-1;FrequencyLabel=B2;PATH=Calculation 1;FrequenciesFrequencies
C     0.00000    0.67027    0.96153    0.00000    0.47000    0.13000
Cl    0.00000    1.65587   -0.45089    0.00000   -0.17000    0.13000
C     0.00000   -0.67027    0.96153    0.00000    0.47000   -0.13000
H     0.00000   -1.25431    1.89604    0.00000    0.43000   -0.17000
Cl    0.00000   -1.65587   -0.45089    0.00000   -0.17000   -0.13000
H     0.00000    1.25431    1.89604    0.00000    0.43000    0.17000
6
Model[6]: IRIntensity=24.2180 KM/Mole;ReducedMass=9.9009 AMU;ForceConstant=1.9484 mDyne/A;Frequency=577.9285 cm^-1;FrequencyLabel=A1;PATH=Calculation 1;FrequenciesFrequencies
C     0.00000    0.67027    0.96153    0.00000    0.00000    0.51000
Cl    0.00000    1.65587   -0.45089    0.00000    0.12000   -0.18000
C     0.00000   -0.67027    0.96153    0.00000    0.00000    0.51000
H     0.00000   -1.25431    1.89604    0.00000   -0.35000    0.27000
Cl    0.00000   -1.65587   -0.45089    0.00000   -0.12000   -0.18000
H     0.00000    1.25431    1.89604    0.00000    0.35000    0.27000
6
Model[7]: IRIntensity=45.6105 KM/Mole;ReducedMass=5.6061 AMU;ForceConstant=1.9169 mDyne/A;Frequency=761.7979 cm^-1;FrequencyLabel=B2;PATH=Calculation 1;FrequenciesFrequencies
C     0.00000    0.67027    0.96153    0.00000   -0.03000    0.43000
Cl    0.00000    1.65587   -0.45089    0.00000    0.01000   -0.09000
C     0.00000   -0.67027    0.96153    0.00000   -0.03000   -0.43000
H     0.00000   -1.25431    1.89604    0.00000   -0.21000   -0.51000
Cl    0.00000   -1.65587   -0.45089    0.00000    0.01000    0.09000
H     0.00000    1.25431    1.89604    0.00000   -0.21000    0.51000
6
Model[8]: IRIntensity=50.3660 KM/Mole;ReducedMass=1.2298 AMU;ForceConstant=0.4404 mDyne/A;Frequency=779.5981 cm^-1;FrequencyLabel=B1;PATH=Calculation 1;FrequenciesFrequencies
C     0.00000    0.67027    0.96153    0.10000    0.00000    0.00000
Cl    0.00000    1.65587   -0.45089   -0.01000    0.00000    0.00000
C     0.00000   -0.67027    0.96153    0.10000    0.00000    0.00000
H     0.00000   -1.25431    1.89604   -0.70000    0.00000    0.00000
Cl    0.00000   -1.65587   -0.45089   -0.01000    0.00000    0.00000
H     0.00000    1.25431    1.89604   -0.70000    0.00000    0.00000
6
Model[9]: IRIntensity=0.0000 KM/Mole;ReducedMass=1.4436 AMU;ForceConstant=0.7836 mDyne/A;Frequency=959.8055 cm^-1;FrequencyLabel=A2;PATH=Calculation 1;FrequenciesFrequencies
C     0.00000    0.67027    0.96153    0.14000    0.00000    0.00000
Cl    0.00000    1.65587   -0.45089    0.00000    0.00000    0.00000
C     0.00000   -0.67027    0.96153   -0.14000    0.00000    0.00000
H     0.00000   -1.25431    1.89604    0.69000    0.00000    0.00000
Cl    0.00000   -1.65587   -0.45089    0.00000    0.00000    0.00000
H     0.00000    1.25431    1.89604   -0.69000    0.00000    0.00000
6
Model[10]: IRIntensity=3.0206 KM/Mole;ReducedMass=1.0231 AMU;ForceConstant=0.8402 mDyne/A;Frequency=1180.6516 cm^-1;FrequencyLabel=A1;PATH=Calculation 1;FrequenciesFrequencies
C     0.00000    0.67027    0.96153    0.00000   -0.01000    0.01000
Cl    0.00000    1.65587   -0.45089    0.00000    0.00000   -0.01000
C     0.00000   -0.67027    0.96153    0.00000    0.01000    0.01000
H     0.00000   -1.25431    1.89604    0.00000    0.61000    0.36000
Cl    0.00000   -1.65587   -0.45089    0.00000    0.00000   -0.01000
H     0.00000    1.25431    1.89604    0.00000   -0.61000    0.36000
6
Model[11]: IRIntensity=39.6557 KM/Mole;ReducedMass=1.1647 AMU;ForceConstant=1.0093 mDyne/A;Frequency=1212.7624 cm^-1;FrequencyLabel=B2;PATH=Calculation 1;FrequenciesFrequencies
C     0.00000    0.67027    0.96153    0.00000    0.06000   -0.06000
Cl    0.00000    1.65587   -0.45089    0.00000    0.00000   -0.01000
C     0.00000   -0.67027    0.96153    0.00000    0.06000    0.06000
H     0.00000   -1.25431    1.89604    0.00000   -0.61000   -0.34000
Cl    0.00000   -1.65587   -0.45089    0.00000    0.00000    0.01000
H     0.00000    1.25431    1.89604    0.00000   -0.61000    0.34000
6
Model[12]: IRIntensity=20.1196 KM/Mole;ReducedMass=8.4412 AMU;ForceConstant=15.0914 mDyne/A;Frequency=1741.9642 cm^-1;FrequencyLabel=A1;PATH=Calculation 1;FrequenciesFrequencies
C     0.00000    0.67027    0.96153    0.00000    0.58000   -0.03000
Cl    0.00000    1.65587   -0.45089    0.00000    0.00000    0.00000
C     0.00000   -0.67027    0.96153    0.00000   -0.58000   -0.03000
H     0.00000   -1.25431    1.89604    0.00000   -0.08000    0.39000
Cl    0.00000   -1.65587   -0.45089    0.00000    0.00000    0.00000
H     0.00000    1.25431    1.89604    0.00000    0.08000    0.39000
6
Model[13]: IRIntensity=41.8464 KM/Mole;ReducedMass=1.0801 AMU;ForceConstant=5.7403 mDyne/A;Frequency=3003.3938 cm^-1;FrequencyLabel=B2;PATH=Calculation 1;FrequenciesFrequencies
C     0.00000    0.67027    0.96153    0.00000    0.03000    0.05000
Cl    0.00000    1.65587   -0.45089    0.00000    0.00000    0.00000
C     0.00000   -0.67027    0.96153    0.00000    0.03000   -0.05000
H     0.00000   -1.25431    1.89604    0.00000   -0.36000    0.60000
Cl    0.00000   -1.65587   -0.45089    0.00000    0.00000    0.00000
H     0.00000    1.25431    1.89604    0.00000   -0.36000   -0.60000
6
Model[14]: IRIntensity=36.4698 KM/Mole;ReducedMass=1.0964 AMU;ForceConstant=5.9009 mDyne/A;Frequency=3022.3735 cm^-1;FrequencyLabel=A1;PATH=Calculation 1;FrequenciesFrequencies
C     0.00000    0.67027    0.96153    0.00000    0.04000    0.05000
Cl    0.00000    1.65587   -0.45089    0.00000    0.00000    0.00000
C     0.00000   -0.67027    0.96153    0.00000   -0.04000    0.05000
H     0.00000   -1.25431    1.89604    0.00000    0.37000   -0.60000
Cl    0.00000   -1.65587   -0.45089    0.00000    0.00000    0.00000
H     0.00000    1.25431    1.89604    0.00000   -0.37000   -0.60000
</ModelData>
</Models>
##$PEAKS=
<Peaks type="RAMAN" xUnitsExpected="1/cm"  >
<PeakData id="1" title="1 (~3160 cm-1)" peakShape="broad" model="C2.14" xMax="3195" xMin="3165"    />
<PeakData id="2" title="2 (~3160 cm-1)" peakShape="broad" model="C2.13" xMax="3125" xMin="3085"    />
<PeakData id="3" title="3 (~1740 cm-1)" peakShape="broad" model="C2.12" xMax="1785" xMin="1750"    />
<PeakData id="4" title="4 (~1510 cm-1)" peakShape="broad" model="C2.11" xMax="1560" xMin="1530"    />
<PeakData id="5" title="5 (~1510 cm-1)" peakShape="broad" model="C2.10" xMax="1290" xMin="1260"    />
<PeakData id="6" title="6 (~1360 cm-1)" peakShape="broad" model="C2.10" xMax="1180" xMin="1150"    />
<PeakData id="7" title="7 (~960 cm-1)" peakShape="broad" model="C2.9" xMax="955" xMin="925"    />
<PeakData id="8" title="8 (~960 cm-1)" peakShape="broad" model="C2.6" xMax="915" xMin="885"    />
<PeakData id="9" title="9 (~765 cm-1)" peakShape="broad" model="C2.7" xMax="675" xMin="645"    />
<PeakData id="10" title="10 (~615 cm-1)" peakShape="broad" model="C2.4" xMax="570" xMin="540"    />
<PeakData id="11" title="11 (~510 cm-1)" peakShape="broad" model="C2.5" xMax="470" xMin="440"    />
<PeakData id="12" title="12 (~173 cm-1)" peakShape="broad" model="C2.3" xMax="340" xMin="310"    />
</Peaks>
##XUNITS=1/CM
##YUNITS=RAMAN INTENSITY
##XFACTOR=1.0000000000
##YFACTOR=0.0000356563
##FIRSTX=68.91406250
##LASTX=3365.01416016
##MAXX=3365.01416016
##MINX=68.91406250
##FIRSTY=0.85500002
##NPOINTS=515
##XYDATA=(X++(Y..Y))
$$ plain form
68.9 23979 21315 18650 16351 14051 11989 9928 8708 7488 7236 6983 18819 30654 21932 13209 9157 5104
171.5 5104 4095 3085 2636 2188 2047 1907 1809 1711 1711 1711 1669 1627 1486 1346 1234 1122 1080 1038 1094 1150 1416 1683 2734 3786 3646
331.8 3646 3506 3085 2664 2174 1683 2300 2917 5343 7769 5385 3001 2258 1514 1388 1262 1220 1178 1080 982 883 785 785 785 813 841 1150 1458 1528 1599
517.8 1599 1486 1374 2300 3225 3295 3365 2524 1683 1388 1094 1038 982 1024 1066 1108 1150 1248 1346 1543 1739 1949 2160 2174 2188 17094 32000 23488 14976 9101
703.8 9101 3225 2482 1739 1528 1318 1276 1234 1178 1122 1080 1038 1094 1150 1402 1655 1599 1543 1444 1346 1346 1346 1388 1430 1472 1514 1290 1066 940 813 869 926 954 982 982
921.8 982 982 954 926 869 813 799 785 785 785 785 785 785 785 785 785 785 785 771 757 715 673 659 645 743 841 897 954 911 869 841 813 911 1010 1248 1486 3127 4768 5455 6142 4179 2216 1753
1191.1 1753 1290 1136 982 982 982 1038 1094 1262 1430 1935 2440 1865 1290 1094 897 841 785 785 785 785 785 785 785 757 729 673 617 631 645 701 757 743 729 687 645 617 589 589 589 631
1447.6 631 673 715 757 729 701 659 617 645 673 715 757 841 926 1038 1150 1318 1486 10713 19940 11835 3730 2510 1290 1080 869 799 729 673 617 645 673 715 757 1010
$$ packed form
68.9B3979k664k665k299k300k062k061j220Tk52k53J1836J1835q722q723m052m053
171.5E104j009j010m49m48j41j40r8T%Tm2Tj41j40j12Tm2TN6TK66K67J051J052j40
331.8C646j40m21Tm90m91O17TK426Tk384Tp43p44j26Tm2Tr8Tr9r8%TK8TL09L08P0P1
517.8A599j13j12R26R25P0Tq41Tk95k94n6TM2VR8TJ97J96K10K11J4TJ4906Tq512Tn875
703.8I101n876p43Tk11k10m2Tn6Tm2TN6TK52K53n6Tr9r8%TM2Vk24Tj26j27N6N7K8T%
921.8I82%k8Tn7n6j4T%S0j4Tm2Tj4TR8TN6N7m3m2k8TR8R9K38TJ641TO87Tj963Tm63
1191.1A753m63j54T%TN6TJ68TN05Tn75Tj96j97n6T%Xk8Tn6TJ4TN6Tj4Tm2Tk8T%TM2
1447.6F31M2Uk8Tm2TK8TM2TQ4Q5J12TJ68TR227Tq105Tj220Tk10k11p0Tn6TK8TM2TK53
1665.7A010K52N19Tl93Tl22l23q4Tn6T%U6K8TM2TJ4Tn6Tk8T%S34J4TM2Vn6Tk8TM2V%
$$ plain form
2986.7 785 785 799 813 855 897 1010 1122 1318 1514 2286 3057 10966 18875 12480 6086 4277 2468 1893 1318 1276 1234 1234 1234 1402 1571 1879 2188
3159.8 2188 1795 1402 1136 869 757 645 687 729 729 729 687 645 617 589 589 589 631 673 715 757 813 869 911 954 926 897 855 813 883 954 1052 1150
3365 1150
$$ packed form
2986.7G85%J4TM2TJ13J12J96TP72P71P909To395o394j809Tn75Tm2T%TJ68J69L08L09
3159.8B188l93Tk66k67j12TM2T%Tm2Tk8T%TM2VN6TM2M3k8k9m2TP0P1R8T
3365A150
##END=$$ End of the RAMAN for cis-DCE
##TITLE= trans-1,2-dichloroethene (E)
##JCAMP-DX= 5.01
##DATA TYPE= INFRARED SPECTRUM
##DATA CLASS= XYDATA
##BLOCK ID=3
##ORIGIN= Department of Chemistry, UWI, JAMAICA
##OWNER= public domain
##LONGDATE= 2012/02/18 12:32:26.0301 -0500 $$ export date from JSpecView
##SPECTROMETER/DATA SYSTEM= from scan
##$MODELS=
<Models>
<ModelData id="Tc2h2cl2" type="MOL">
trans-1,2-dichloroethylene (E)

  created with ArgusLab version 4.0.1
  6  5  0  0  0  0  0  0  0  0  0 V2000
   -0.3642    0.5617    0.0000 C   0  0  0  0  0  0  0  0  0  0  0  0
   -1.4662    0.5830    0.0000 H   0  0  0  0  0  0  0  0  0  0  0  0
    0.3642    2.1208    0.0000 Cl  0  0  0  0  0  0  0  0  0  0  0  0
    0.3642   -0.5617    0.0000 C   0  0  0  0  0  0  0  0  0  0  0  0
    1.4662   -0.5830    0.0000 H   0  0  0  0  0  0  0  0  0  0  0  0
   -0.3642   -2.1208    0.0000 Cl  0  0  0  0  0  0  0  0  0  0  0  0
  1  2  1  0  0  0  0
  1  3  1  0  0  0  0
  1  4  2  0  0  0  0
  4  5  1  0  0  0  0
  4  6  1  0  0  0  0
M  END
</ModelData>
<ModelData id="T1" type="XYZVIB" baseModel="Tc2h2cl2" vibrationScale=".5">
6
Model[1]: E(RAM1)=-0.434016412453E-02 A.U.;Convg=0.4972D-08;-V/T=0.9999;Energy=NaN;Range=M.O.s;PATH=Calculation 1;Input
C     0.00000    0.00000    0.00000
H     0.00000    0.00000    1.10217
Cl    1.57296    0.00000   -0.69806
C    -1.10899    0.00000   -0.75009
H    -1.10899    0.00000   -1.85226
Cl   -2.68195    0.00000   -0.05203
6
Model[2]: E(RAM1)=-0.434016412453E-02 A.U.;Convg=0.4972D-08;-V/T=0.9999;Energy=-0.004340164;Range=M.O.s;PATH=Calculation 1;Standard
C    -0.36422    0.56166    0.00000
H    -1.46618    0.58304    0.00000
Cl    0.36422    2.12079    0.00000
C     0.36422   -0.56166    0.00000
H     1.46618   -0.58304    0.00000
Cl   -0.36422   -2.12079    0.00000
6
Model[3]: IRIntensity=1.0809 KM/Mole;ReducedMass=6.8502 AMU;ForceConstant=0.2257 mDyne/A;Frequency=236.4958 cm^-1;FrequencyLabel=AU;PATH=Calculation 1;FrequenciesFrequencies
C    -0.36422    0.56166    0.00000    0.00000    0.00000    0.43000
H    -1.46618    0.58304    0.00000    0.00000    0.00000    0.54000
Cl    0.36422    2.12079    0.00000    0.00000    0.00000   -0.16000
C     0.36422   -0.56166    0.00000    0.00000    0.00000    0.43000
H     1.46618   -0.58304    0.00000    0.00000    0.00000    0.54000
Cl   -0.36422   -2.12079    0.00000    0.00000    0.00000   -0.16000
6
Model[4]: IRIntensity=2.4048 KM/Mole;ReducedMass=6.8794 AMU;ForceConstant=0.2853 mDyne/A;Frequency=265.3070 cm^-1;FrequencyLabel=BU;PATH=Calculation 1;FrequenciesFrequencies
C    -0.36422    0.56166    0.00000   -0.40000    0.15000    0.00000
H    -1.46618    0.58304    0.00000   -0.38000    0.38000    0.00000
Cl    0.36422    2.12079    0.00000    0.15000   -0.06000    0.00000
C     0.36422   -0.56166    0.00000   -0.40000    0.15000    0.00000
H     1.46618   -0.58304    0.00000   -0.38000    0.38000    0.00000
Cl   -0.36422   -2.12079    0.00000    0.15000   -0.06000    0.00000
6
Model[5]: IRIntensity=0.0000 KM/Mole;ReducedMass=18.4278 AMU;ForceConstant=1.4783 mDyne/A;Frequency=368.9947 cm^-1;FrequencyLabel=AG;PATH=Calculation 1;FrequenciesFrequencies
C    -0.36422    0.56166    0.00000    0.21000    0.15000    0.00000
H    -1.46618    0.58304    0.00000    0.21000    0.39000    0.00000
Cl    0.36422    2.12079    0.00000    0.05000    0.48000    0.00000
C     0.36422   -0.56166    0.00000   -0.21000   -0.15000    0.00000
H     1.46618   -0.58304    0.00000   -0.21000   -0.39000    0.00000
Cl   -0.36422   -2.12079    0.00000   -0.05000   -0.48000    0.00000
6
Model[6]: IRIntensity=0.0000 KM/Mole;ReducedMass=4.8520 AMU;ForceConstant=2.0603 mDyne/A;Frequency=848.9532 cm^-1;FrequencyLabel=AG;PATH=Calculation 1;FrequenciesFrequencies
C    -0.36422    0.56166    0.00000    0.32000    0.19000    0.00000
H    -1.46618    0.58304    0.00000    0.31000    0.50000    0.00000
Cl    0.36422    2.12079    0.00000   -0.07000   -0.08000    0.00000
C     0.36422   -0.56166    0.00000   -0.32000   -0.19000    0.00000
H     1.46618   -0.58304    0.00000   -0.31000   -0.50000    0.00000
Cl   -0.36422   -2.12079    0.00000    0.07000    0.08000    0.00000
6
Model[7]: IRIntensity=0.0000 KM/Mole;ReducedMass=1.8465 AMU;ForceConstant=0.8421 mDyne/A;Frequency=879.8182 cm^-1;FrequencyLabel=BG;PATH=Calculation 1;FrequenciesFrequencies
C    -0.36422    0.56166    0.00000    0.00000    0.00000    0.19000
H    -1.46618    0.58304    0.00000    0.00000    0.00000   -0.68000
Cl    0.36422    2.12079    0.00000    0.00000    0.00000   -0.01000
C     0.36422   -0.56166    0.00000    0.00000    0.00000   -0.19000
H     1.46618   -0.58304    0.00000    0.00000    0.00000    0.68000
Cl   -0.36422   -2.12079    0.00000    0.00000    0.00000    0.01000
6
Model[8]: IRIntensity=156.1848 KM/Mole;ReducedMass=10.4115 AMU;ForceConstant=4.7511 mDyne/A;Frequency=880.0642 cm^-1;FrequencyLabel=BU;PATH=Calculation 1;FrequenciesFrequencies
C    -0.36422    0.56166    0.00000    0.21000    0.51000    0.00000
H    -1.46618    0.58304    0.00000    0.18000    0.35000    0.00000
Cl    0.36422    2.12079    0.00000   -0.08000   -0.19000    0.00000
C     0.36422   -0.56166    0.00000    0.21000    0.51000    0.00000
H     1.46618   -0.58304    0.00000    0.18000    0.35000    0.00000
Cl   -0.36422   -2.12079    0.00000   -0.08000   -0.19000    0.00000
6
Model[9]: IRIntensity=85.4112 KM/Mole;ReducedMass=1.1165 AMU;ForceConstant=0.6016 mDyne/A;Frequency=956.3369 cm^-1;FrequencyLabel=AU;PATH=Calculation 1;FrequenciesFrequencies
C    -0.36422    0.56166    0.00000    0.00000    0.00000   -0.07000
H    -1.46618    0.58304    0.00000    0.00000    0.00000    0.70000
Cl    0.36422    2.12079    0.00000    0.00000    0.00000    0.00000
C     0.36422   -0.56166    0.00000    0.00000    0.00000   -0.07000
H     1.46618   -0.58304    0.00000    0.00000    0.00000    0.70000
Cl   -0.36422   -2.12079    0.00000    0.00000    0.00000    0.00000
6
Model[10]: IRIntensity=16.6654 KM/Mole;ReducedMass=1.0902 AMU;ForceConstant=0.9190 mDyne/A;Frequency=1196.1292 cm^-1;FrequencyLabel=BU;PATH=Calculation 1;FrequenciesFrequencies
C    -0.36422    0.56166    0.00000    0.02000   -0.06000    0.00000
H    -1.46618    0.58304    0.00000    0.06000    0.70000    0.00000
Cl    0.36422    2.12079    0.00000   -0.01000    0.00000    0.00000
C     0.36422   -0.56166    0.00000    0.02000   -0.06000    0.00000
H     1.46618   -0.58304    0.00000    0.06000    0.70000    0.00000
Cl   -0.36422   -2.12079    0.00000   -0.01000    0.00000    0.00000
6
Model[11]: IRIntensity=0.0000 KM/Mole;ReducedMass=1.1490 AMU;ForceConstant=1.0669 mDyne/A;Frequency=1255.3385 cm^-1;FrequencyLabel=AG;PATH=Calculation 1;FrequenciesFrequencies
C    -0.36422    0.56166    0.00000   -0.07000   -0.04000    0.00000
H    -1.46618    0.58304    0.00000   -0.04000    0.70000    0.00000
Cl    0.36422    2.12079    0.00000   -0.01000    0.00000    0.00000
C     0.36422   -0.56166    0.00000    0.07000    0.04000    0.00000
H     1.46618   -0.58304    0.00000    0.04000   -0.70000    0.00000
Cl   -0.36422   -2.12079    0.00000    0.01000    0.00000    0.00000
6
Model[12]: IRIntensity=0.0000 KM/Mole;ReducedMass=9.1626 AMU;ForceConstant=17.0165 mDyne/A;Frequency=1775.4231 cm^-1;FrequencyLabel=AG;PATH=Calculation 1;FrequenciesFrequencies
C    -0.36422    0.56166    0.00000   -0.29000    0.53000    0.00000
H    -1.46618    0.58304    0.00000   -0.36000   -0.03000    0.00000
Cl    0.36422    2.12079    0.00000    0.00000   -0.01000    0.00000
C     0.36422   -0.56166    0.00000    0.29000   -0.53000    0.00000
H     1.46618   -0.58304    0.00000    0.36000    0.03000    0.00000
Cl   -0.36422   -2.12079    0.00000    0.00000    0.01000    0.00000
6
Model[13]: IRIntensity=0.0000 KM/Mole;ReducedMass=1.0823 AMU;ForceConstant=6.2456 mDyne/A;Frequency=3129.6222 cm^-1;FrequencyLabel=AG;PATH=Calculation 1;FrequenciesFrequencies
C    -0.36422    0.56166    0.00000   -0.06000    0.01000    0.00000
H    -1.46618    0.58304    0.00000    0.70000   -0.03000    0.00000
Cl    0.36422    2.12079    0.00000    0.00000    0.00000    0.00000
C     0.36422   -0.56166    0.00000    0.06000   -0.01000    0.00000
H     1.46618   -0.58304    0.00000   -0.70000    0.03000    0.00000
Cl   -0.36422   -2.12079    0.00000    0.00000    0.00000    0.00000
6
Model[14]: IRIntensity=124.2254 KM/Mole;ReducedMass=1.0815 AMU;ForceConstant=6.2982 mDyne/A;Frequency=3143.8929 cm^-1;FrequencyLabel=BU;PATH=Calculation 1;FrequenciesFrequencies
C    -0.36422    0.56166    0.00000   -0.06000    0.00000    0.00000
H    -1.46618    0.58304    0.00000    0.70000   -0.03000    0.00000
Cl    0.36422    2.12079    0.00000    0.00000    0.00000    0.00000
C     0.36422   -0.56166    0.00000   -0.06000    0.00000    0.00000
H     1.46618   -0.58304    0.00000    0.70000   -0.03000    0.00000
Cl   -0.36422   -2.12079    0.00000    0.00000    0.00000    0.00000
</ModelData>
</Models>
##$PEAKS=
<Peaks type="IR" xUnitsExpected="1/cm"  >
<PeakData id="1" title="Bu- asymm stretch of CH group (~3096 cm-1)" peakShape="broad" model="T1.14" xMax="3130" xMin="3080"    />
<PeakData id="2" title="Inactive Ag-symm stretch of CH group (~3071 cm-1)" peakShape="broad" model="T1.13" xMax="3090" xMin="3050"    />
<PeakData id="3" title="Inactive Ag- C=C stretch (~1576 cm-1)" peakShape="broad" model="T1.12" xMax="1680" xMin="1620"    />
<PeakData id="4" title="Inactive Ag- H-C-H scissors (~1272 cm-1)" peakShape="broad" model="T1.11" xMax="1300" xMin="1230"    />
<PeakData id="5" title="Bu- C-H scissors (~1205 cm-1)" peakShape="broad" model="T1.10" xMax="1230" xMin="1175"    />
<PeakData id="6" title="Au- C-H wagging (~900 cm-1)" peakShape="broad" model="T1.9" xMax="920" xMin="880"    />
<PeakData id="7" title="Inactive Ag-symm stretch of CCl group (~845 cm-1)" peakShape="broad" model="T1.6" xMax="870" xMin="830"    />
<PeakData id="8" title="Bu- asymm stretch of CCl group (~830 cm-1)" peakShape="broad" model="T1.8" xMax="850" xMin="790"    />
<PeakData id="9" title="Bg- wag of CH group (~750 cm-1)" peakShape="broad" model="T1.7" xMax="770" xMin="730"    />
<PeakData id="10" title="Inactive Ag-symm bend of CCl group (~350 cm-1)" peakShape="broad" model="T1.5" xMax="370" xMin="330"    />
<PeakData id="11" title="Bu-asymm bend of CCl group (~265 cm-1)" peakShape="broad" model="T1.4" xMax="285" xMin="245"    />
<PeakData id="12" title="Au-Cl-C=C-Cl torsion  (~192 cm-1)" peakShape="broad" model="T1.3" xMax="220" xMin="170"    />
</Peaks>
##XUNITS= 1/CM
##YUNITS= TRANSMITTANCE
##XFACTOR= 1E0
##YFACTOR= 9.83769E-7
##FIRSTX= 450
##FIRSTY= 0.995466
##LASTX= 3966
##NPOINTS= 880
##XYDATA= (X++(Y..Y))
$$ plain form
450.0 1011890 1006072 1001296 999336 999557 999778 998577 996648 996205 998735 1003225 1006641 1006356 1003605 1002308
510.0 1004205 1007242 1009107 1009582 1008981 1007177 1004395 1001455 998893 997248 996427 995542 994561 994782
566.0 996047 996838 997122 998545 1000854 1001612 999841 997913 998451 1001233 1003541 1003763 1002782 1001834 1001392
626.0 1001834 1003067 1004111 1004237 1003763 1002941 1002181 1002340 1002941 1002371 1000538 998830 997818 997344 996996
686.0 995605 993518 993359 996047 998735 999588 999494 998767 997629 997755 999557 1000980 1000475 996205 985548 970181
750.0 956583 949722 949911 954117 958291 961801 967272 972584 971446 960663 930527 851758 690583
802.0 452821 223691 89205 36586 19099 13028 11890 18530 56793 231818 632810
846.0 865293 790349 699374 658803 629743 610739 605869 595750 576809 565014 550373
$$ packed form
450.0A011890n818m776j960K21Tj201j929m43K530M490L416k85k751A002308
510.0A004205L037J865M75o01j804k782k940k562j645q21q85r81I94782
566.0I96047P91K84J423K309P58j771j928N38K782K308K22r81r48A001392
626.0A001834J233J044J26m74q22p60J59O01n70j833j708j012m74I96996
686.0I95605k087j59K688TQ53r4p27j138J26J802J423n05m270j0657I70181
750.0I56583o861J89M206M174L510N471N312j138j0783l0136p8769F90583
802.0D52821k29130j34486n2619j7487o071j138O640L8263J75025F32810
846.0H65293p4944r0975m0571k9060j9004m870j0119j8941j1795E50373
$$ plain form
890.0 505849 448046 425057 454845 507115 532444 527321 525961 541582 564729 591639 625917
938.0 664084 701081 738870 777701 811409 837592 859600 879743 898431 913262 919713
982.0 921104 929705 949943 971446 984347 989818 991936 991747 990513 989659 988711 987352 986561
1034.0 986814 988047 990039 991494 991588 991146 990513 988742 986498 985454 985454 985580 986182 987003 986561 984948
1098.0 983652 983019 983177 984727 986498 986529 985485 984442 982103 978465 975556 972141 965912 958829
1154.0 952347 944409 937041 933974 932140 930084 928345 899032 802808 672179 582975 552144
1202.0 538420 520396 538357 634581 785795 900361 935081 936314 938717 941405 944915
1246.0 952979 961643 967778 973532 978656 981565 983746 986182 987952 989407 991209 992032 991620 991209
$$ packed form
890.0E05849n7803k2989K9788N2270K5329n123j360J5621K3147K6910F25917
938.0F64084L6997L7789L8831L3708K6183K2008K0143J8688J4831I19713
982.0I21104Q601K0238K1503J2901N471K118j89j234q54r48j359I86561
1034.0I86814J233J992J455R4m42o33j771k244j044%J26O02Q21m42I84948
1098.0I83652o33J58J550J771L1j044j043k339l638k909l415o229I58829
1154.0I52347p938p368l067j834k056j739k9313r6224j30629q9204E52144
1202.0E38420j8024J7961R6224J51214J14566L4720J233K403K688I44915
1246.0I52979Q664O135N754N124K909K181K436J770J455J802Q23m12I91209
$$ plain form
1302.0 991051 990640 990703 991588 992252 992252 991968 991905 992568 993802 994182 993328 992821 993581 994656 995161 995352 995636
1374.0 995699 995289 994688 994845 996111 997438 997501 996111 994339 993675 994782 996395 996427 994972 994056
1434.0 994339 994023 992189 990956 992664 996237 997913 996174 993897 993960 994624 993202 991114 991241
1490.0 992632 992790 992758 994751 997786 999178 999178 999621 999747 997597 994592 994529 997438 998514 995289 991936
1554.0 992853 995826 995826 992601 989692 988522 987415 985328 983272 982419 982355 981785 980584 979572 978845
1614.0 977833 976505 973944 967745 957469 941753 912124 864659 817353 794017 794935 801480
1662.0 809764 836801 886573 935270 961516 970560 974545 976695 979698 986466 992379 992664
1710.0 991936 994845 997565 996585 995542 997565 999715 999209 997533 996869 996743 995762 994213 993707 995067
$$ packed form
1302.0I91051m11O3Q85O64%k84o3O63J234L80q54n07P60J075N05J91I95636
1374.0I95699m10o01J57J266J327O3j390j772o64J107J613L2j455I94056
1434.0I94339l16j834j233J708L573J676j739k277O3O64j422k088I91241
1490.0I92632J58l2J993L035J392%M43J26k150l005o3K909J076l225I91936
1554.0I92853K973%l225k909j170j107k087k056q53o4n70j201j012I78845
1614.0I77833j328k561o199j0276j5716k9629m7465m7306k3336R18H01480
1662.0H09764K7037M9772M8697K6246R044L985K150L003O768N913I92664
1710.0I91936K909K720r80j043K023K150n06j676o64j26r81j549n06I95067
$$ plain form
1770.0 996901 997059 995067 992442 990988 990798 990513 989312 988142 988110 988711 988742 988585 989375 990577 990672
1834.0 990165 991082 993771 995921 995889 994814 994877 996459 998418 999241 998577 997565 997629 998735 999525 999399
1898.0 998956 998862 999115 999621 1000285 1000758 1000664 1000063 999399 999336 1000063 1000948 1001138 1000791 1000538 1000758 1001138 1001360
1970.0 1001296 1000885 1000348 999968 1000063 1000475 1000695 1000316 999684 999399 999557 1000000 1000475 1000664 1000379 999905 999684
2038.0 999715 999652 999304 998893 998703 998830 999178 999462 999431 998545 996142 992442 988742 986182 984695 984031 985169
2106.0 989154 994908 999462 1001233 1001233 1001107 1001202 1001392 1001708 1002087 1002245 1002118 1001961 1001834 1001739 1001708 1001771 1001865
2178.0 1001992 1002118 1002150 1002213 1002435 1002719 1002941 1002972 1002878 1002719 1002656 1002782 1003004 1003131 1003035 1002751 1002593 1002751 1003035
2254.0 1003225 1003067 1002688 1002245 1002024 1001992 1001802 1001138 999841 998008 995921 993771 991462 988964 986845
$$ packed form
1770.0I96901J58j992k625j454j90k85j201j170l2O01L1j57P90J202I90672
1834.0I90165R17K689K150l2j075O3J582J959Q23o64j012O4J106P90I99399
1898.0I98956r4K53N06O64M73r4o01o64o3P27Q85J90l47k53K20L80A001360
1970.0A001296m11n37l80R5M12K20l79o32k85J58M43M75J89k85m74I99684
2038.0I99715o3l48m11j90J27L48K84l1q86k403l700Tk560j487o64I85169
2106.0I89154N754M554J771%j26R5J90L16L79J58j27j57j27r5l1O3A001865
2178.0A001992J26L2O3K22K84K22L1r4j59o3J26K22J27r6k84j58J58A003035
2254.0A003225j58l79m43k21l2j90o64j297j833k087k150k309k498I86845
$$ plain form
2314.0 985548 984916 984506 984189 984189 984252 984062 983936 983999 983240 980521 976916 975556 978244 983525 988774 993012
2382.0 996743 1000316 1003098 1004585 1005059 1005059 1005028 1005059 1005091 1004965 1004553 1003858 1003194 1002719 1002403 1002308 1002371 1002213
2454.0 1001549 1000854 1000664 1000885 1001011 1000948 1001138 1001739 1002530 1003131 1003447 1003636 1003952 1004427 1004965 1005407 1005755
2522.0 1006135 1006609 1007114 1007558 1007747 1007684 1007652 1007968 1008475 1008949 1009265 1009328 1009075 1008759 1008665 1008917 1009265 1009550
2594.0 1009708 1009739 1009771 1009929 1010087 1010024 1009898 1009898 1009992 1010182 1010498 1010783 1010846 1010656 1010371 1010182 1010277 1010371 1010182 1009835
2674.0 1009550 1009454 1009486 1009613 1009645 1009360 1008885 1008412 1008095 1007874 1007715 1007431 1006957 1006356 1005787 1005186 1004711 1004332
2746.0 1003826 1003004 1001676 999588 996996 995067 994688 995130 995858 997501 1000695 1004111 1005818 1005818
2802.0 1005407 1005375 1005471 1005502 1005597 1005534 1005218 1004870 1004774 1004774 1004711 1004774 1004902 1004870 1004680 1004521 1004427 1004364 1004301 1004205 1004111 1004048
$$ packed form
2314.0I85548o32m10l17%O3j90j26O3p59k719l605j360K688N281N249I93012
2382.0I96743L573K782J487M74%l1L1L2j26m12o95o64m75l16r5O3A002213
2454.0A001549o95j90K21J26o3J90O01P91O01L16J89L16M75N38M42A005755
2522.0A006135M74N05M44J89o3l2L16N07M74L16O3k53l16r4K52L48A009550
2594.0A009708L1L2J58To3j26%R4J90L16K85O3j90k85j89R5R4j89A009835
2674.0A009550r6L2J27L2k85m75m73l17k21j59k84m74o01n69o01m75A004332
2746.0A003826q22j328k088k592j929l79M42P28J643L194L416J707A005818
2802.0A005407l2R6L1R5o3l16l48r6%o3O3J28l2j90j59r4o3Tr6r4A004048
$$ plain form
2890.0 1003858 1003541 1003478 1003668 1003700 1003320 1003004 1003035 1003257 1003288 1003004 1002751 1002815 1002941 1002656 1002181 1001961 1001928
2962.0 1001865 1001739 1001708 1001581 1001455 1001360 1001138 1000885 1000854 1000822 1000632 1000569 1000506 999968 999209 998671 997913 997028 996585
3038.0 995699 993928 992505 991272 988806 986624 986055 983240 974102 952347 898526 803156 701904
3090.0 641349 626834 631704 646977 698741 801701 915981 980933 993549 991272 990672
3134.0 989912 990355 993454 995984 996743 997407 997755 997375 997344 997882 998198 998577 999209 999368 999020 998767 998418
3202.0 997882 997818 998229 998418 998229 997945 997723 997660 997755 997723 997692 997913 998229 998166 997850 997786 997818 997818 998008 998451
3282.0 998671 998545 998292 998071 997818 997375 996996 997091 997565 997850 997786 997723 997692 997501 997154 996648 996047 995731
3354.0 996015 996553 996616 996174 995699 995510 995542 995573 995320 994908 994719 994877 994972 994751 994498 994624 995226 995636
$$ packed form
2890.0A003858l17o3J90L2l80l16L1K22L1k84k53O4J26k85m75k20A001928
2962.0A001865j26l1j27j26r5k22k53l1l2j90o3Tn38p59n38p58q85I96585
3038.0I95699j771j423j233k466k182n69k815r138k1755n3821r5370G01904
3090.0F41349j4515M870J5273N1764J02960J14280O4952J2616k277I90672
3134.0I89912M43L099K530P59O64L48l80l1N38L16L79O32J59l48k53I98418
3202.0I97882o4M11J89j89k84k22o3R5l2l1K21L16o3l16o4L2%J90I98451
3282.0I98671j26k53k21k53m43l79R5M74K85o4o3l1j91l47n06o01I95731
3354.0I96015N38O3m42m75j89L2L1k53m12j89J58R5k21k53J26O02I95636
$$ plain form
3426.0 995226 994339 993897 994150 994529 994592 994276 993771 993422 993675 994308 994688 994529 994087 993771 993612 993549
3494.0 993422 993296 993202 993043 992790 992758 993106 993707 994087 993991 993549 993138 993043 993012 992632 991905 991304 991304 991747
3570.0 991968 991462 990672 990545 991335 992095 991779 990577 989565 989628 990577 991241 990893 990640 991588 992442 991114
3638.0 988679 988363 990513 992158 991178 988553 986592 987003 989439 991716 991651 990071 989217 989565 989439
3698.0 988237 987256 987509 988269 988237 987319 986655 987162 988774 990672 992189 993454 994529 994656 992917 990292
3762.0 988742 988522 988332 987888 988047 988395 987921 987383 988553 991146 992664 991842 990450 990862 992568 992758
3826.0 990988 990228 991747 992790 991398 990071 991178 993106 993359 992727 992917 993518 993486 993233 993106
3886.0 992126 990324 989565 990988 992853 992886 991462 990577 990956 991651 991747 991019 989470 987478 986213 986466
$$ packed form
3426.0I95226q87m42K53L79O3l16n05l49K53O33L80j59m42l16j59I93549
3494.0I93422j26r4j59k53l2L48O01L80r6m42m11r5l1l80p27o01%I91747
3570.0I91968n06p90j27P90P60l16j202j012O3R49O64l48k53R48Q54I91114
3638.0I88679l16K150J645r80k625j961M11K436K277o5j580q54L48I89439
3698.0I88237r81K53P60l2r18o64N07J612J898J517J265J075J27j739I90292
3762.0I88742k20j90m44J59L48m74n38J170K593J518q22j392M12J706I92758
3826.0I90988p60J519J043j392j327J107J928K53o32J90O01l2k53I93106
3886.0I92126j802p59J423J865L3j424q85L79O95R6p28j549j992j265I86466
$$ plain form
3950.0 987130 986655 986529 990609
$$ packed form
3950.0I87130m75j26I90609
3966.0A000032  $$checkpoint
##END= $$ end of trans-DCE IR
##TITLE=Raman of trans-1,2-dichloroethylene (E) $$ Begin of the data block
##JCAMP-DX=5.00 $$ ACD/DocManager Library v 5.00
##DATA TYPE=RAMAN SPECTRUM
##DATA CLASS=XYDATA
##BLOCK ID=4
##DATE=19 Feb 2012 10:30:00
##ORIGIN= Department of Chemistry, UWI, Jamaica
##OWNER= public domain
##SPECTROMETER/DATA SYSTEM=from scan
##$MODELS=
<Models>
<ModelData id="Tc2h2cl2" type="MOL">
trans-1,2-dichloroethylene (E)

  created with ArgusLab version 4.0.1
  6  5  0  0  0  0  0  0  0  0  0 V2000
   -0.3642    0.5617    0.0000 C   0  0  0  0  0  0  0  0  0  0  0  0
   -1.4662    0.5830    0.0000 H   0  0  0  0  0  0  0  0  0  0  0  0
    0.3642    2.1208    0.0000 Cl  0  0  0  0  0  0  0  0  0  0  0  0
    0.3642   -0.5617    0.0000 C   0  0  0  0  0  0  0  0  0  0  0  0
    1.4662   -0.5830    0.0000 H   0  0  0  0  0  0  0  0  0  0  0  0
   -0.3642   -2.1208    0.0000 Cl  0  0  0  0  0  0  0  0  0  0  0  0
  1  2  1  0  0  0  0
  1  3  1  0  0  0  0
  1  4  2  0  0  0  0
  4  5  1  0  0  0  0
  4  6  1  0  0  0  0
M  END
</ModelData>
<ModelData id="T2" type="XYZVIB" baseModel="Tc2h2cl2" vibrationScale=".5">
6
Model[1]: E(RAM1)=-0.434016412453E-02 A.U.;Convg=0.4972D-08;-V/T=0.9999;Energy=NaN;Range=M.O.s;PATH=Calculation 1;Input
C     0.00000    0.00000    0.00000
H     0.00000    0.00000    1.10217
Cl    1.57296    0.00000   -0.69806
C    -1.10899    0.00000   -0.75009
H    -1.10899    0.00000   -1.85226
Cl   -2.68195    0.00000   -0.05203
6
Model[2]: E(RAM1)=-0.434016412453E-02 A.U.;Convg=0.4972D-08;-V/T=0.9999;Energy=-0.004340164;Range=M.O.s;PATH=Calculation 1;Standard
C    -0.36422    0.56166    0.00000
H    -1.46618    0.58304    0.00000
Cl    0.36422    2.12079    0.00000
C     0.36422   -0.56166    0.00000
H     1.46618   -0.58304    0.00000
Cl   -0.36422   -2.12079    0.00000
6
Model[3]: IRIntensity=1.0809 KM/Mole;ReducedMass=6.8502 AMU;ForceConstant=0.2257 mDyne/A;Frequency=236.4958 cm^-1;FrequencyLabel=AU;PATH=Calculation 1;FrequenciesFrequencies
C    -0.36422    0.56166    0.00000    0.00000    0.00000    0.43000
H    -1.46618    0.58304    0.00000    0.00000    0.00000    0.54000
Cl    0.36422    2.12079    0.00000    0.00000    0.00000   -0.16000
C     0.36422   -0.56166    0.00000    0.00000    0.00000    0.43000
H     1.46618   -0.58304    0.00000    0.00000    0.00000    0.54000
Cl   -0.36422   -2.12079    0.00000    0.00000    0.00000   -0.16000
6
Model[4]: IRIntensity=2.4048 KM/Mole;ReducedMass=6.8794 AMU;ForceConstant=0.2853 mDyne/A;Frequency=265.3070 cm^-1;FrequencyLabel=BU;PATH=Calculation 1;FrequenciesFrequencies
C    -0.36422    0.56166    0.00000   -0.40000    0.15000    0.00000
H    -1.46618    0.58304    0.00000   -0.38000    0.38000    0.00000
Cl    0.36422    2.12079    0.00000    0.15000   -0.06000    0.00000
C     0.36422   -0.56166    0.00000   -0.40000    0.15000    0.00000
H     1.46618   -0.58304    0.00000   -0.38000    0.38000    0.00000
Cl   -0.36422   -2.12079    0.00000    0.15000   -0.06000    0.00000
6
Model[5]: IRIntensity=0.0000 KM/Mole;ReducedMass=18.4278 AMU;ForceConstant=1.4783 mDyne/A;Frequency=368.9947 cm^-1;FrequencyLabel=AG;PATH=Calculation 1;FrequenciesFrequencies
C    -0.36422    0.56166    0.00000    0.21000    0.15000    0.00000
H    -1.46618    0.58304    0.00000    0.21000    0.39000    0.00000
Cl    0.36422    2.12079    0.00000    0.05000    0.48000    0.00000
C     0.36422   -0.56166    0.00000   -0.21000   -0.15000    0.00000
H     1.46618   -0.58304    0.00000   -0.21000   -0.39000    0.00000
Cl   -0.36422   -2.12079    0.00000   -0.05000   -0.48000    0.00000
6
Model[6]: IRIntensity=0.0000 KM/Mole;ReducedMass=4.8520 AMU;ForceConstant=2.0603 mDyne/A;Frequency=848.9532 cm^-1;FrequencyLabel=AG;PATH=Calculation 1;FrequenciesFrequencies
C    -0.36422    0.56166    0.00000    0.32000    0.19000    0.00000
H    -1.46618    0.58304    0.00000    0.31000    0.50000    0.00000
Cl    0.36422    2.12079    0.00000   -0.07000   -0.08000    0.00000
C     0.36422   -0.56166    0.00000   -0.32000   -0.19000    0.00000
H     1.46618   -0.58304    0.00000   -0.31000   -0.50000    0.00000
Cl   -0.36422   -2.12079    0.00000    0.07000    0.08000    0.00000
6
Model[7]: IRIntensity=0.0000 KM/Mole;ReducedMass=1.8465 AMU;ForceConstant=0.8421 mDyne/A;Frequency=879.8182 cm^-1;FrequencyLabel=BG;PATH=Calculation 1;FrequenciesFrequencies
C    -0.36422    0.56166    0.00000    0.00000    0.00000    0.19000
H    -1.46618    0.58304    0.00000    0.00000    0.00000   -0.68000
Cl    0.36422    2.12079    0.00000    0.00000    0.00000   -0.01000
C     0.36422   -0.56166    0.00000    0.00000    0.00000   -0.19000
H     1.46618   -0.58304    0.00000    0.00000    0.00000    0.68000
Cl   -0.36422   -2.12079    0.00000    0.00000    0.00000    0.01000
6
Model[8]: IRIntensity=156.1848 KM/Mole;ReducedMass=10.4115 AMU;ForceConstant=4.7511 mDyne/A;Frequency=880.0642 cm^-1;FrequencyLabel=BU;PATH=Calculation 1;FrequenciesFrequencies
C    -0.36422    0.56166    0.00000    0.21000    0.51000    0.00000
H    -1.46618    0.58304    0.00000    0.18000    0.35000    0.00000
Cl    0.36422    2.12079    0.00000   -0.08000   -0.19000    0.00000
C     0.36422   -0.56166    0.00000    0.21000    0.51000    0.00000
H     1.46618   -0.58304    0.00000    0.18000    0.35000    0.00000
Cl   -0.36422   -2.12079    0.00000   -0.08000   -0.19000    0.00000
6
Model[9]: IRIntensity=85.4112 KM/Mole;ReducedMass=1.1165 AMU;ForceConstant=0.6016 mDyne/A;Frequency=956.3369 cm^-1;FrequencyLabel=AU;PATH=Calculation 1;FrequenciesFrequencies
C    -0.36422    0.56166    0.00000    0.00000    0.00000   -0.07000
H    -1.46618    0.58304    0.00000    0.00000    0.00000    0.70000
Cl    0.36422    2.12079    0.00000    0.00000    0.00000    0.00000
C     0.36422   -0.56166    0.00000    0.00000    0.00000   -0.07000
H     1.46618   -0.58304    0.00000    0.00000    0.00000    0.70000
Cl   -0.36422   -2.12079    0.00000    0.00000    0.00000    0.00000
6
Model[10]: IRIntensity=16.6654 KM/Mole;ReducedMass=1.0902 AMU;ForceConstant=0.9190 mDyne/A;Frequency=1196.1292 cm^-1;FrequencyLabel=BU;PATH=Calculation 1;FrequenciesFrequencies
C    -0.36422    0.56166    0.00000    0.02000   -0.06000    0.00000
H    -1.46618    0.58304    0.00000    0.06000    0.70000    0.00000
Cl    0.36422    2.12079    0.00000   -0.01000    0.00000    0.00000
C     0.36422   -0.56166    0.00000    0.02000   -0.06000    0.00000
H     1.46618   -0.58304    0.00000    0.06000    0.70000    0.00000
Cl   -0.36422   -2.12079    0.00000   -0.01000    0.00000    0.00000
6
Model[11]: IRIntensity=0.0000 KM/Mole;ReducedMass=1.1490 AMU;ForceConstant=1.0669 mDyne/A;Frequency=1255.3385 cm^-1;FrequencyLabel=AG;PATH=Calculation 1;FrequenciesFrequencies
C    -0.36422    0.56166    0.00000   -0.07000   -0.04000    0.00000
H    -1.46618    0.58304    0.00000   -0.04000    0.70000    0.00000
Cl    0.36422    2.12079    0.00000   -0.01000    0.00000    0.00000
C     0.36422   -0.56166    0.00000    0.07000    0.04000    0.00000
H     1.46618   -0.58304    0.00000    0.04000   -0.70000    0.00000
Cl   -0.36422   -2.12079    0.00000    0.01000    0.00000    0.00000
6
Model[12]: IRIntensity=0.0000 KM/Mole;ReducedMass=9.1626 AMU;ForceConstant=17.0165 mDyne/A;Frequency=1775.4231 cm^-1;FrequencyLabel=AG;PATH=Calculation 1;FrequenciesFrequencies
C    -0.36422    0.56166    0.00000   -0.29000    0.53000    0.00000
H    -1.46618    0.58304    0.00000   -0.36000   -0.03000    0.00000
Cl    0.36422    2.12079    0.00000    0.00000   -0.01000    0.00000
C     0.36422   -0.56166    0.00000    0.29000   -0.53000    0.00000
H     1.46618   -0.58304    0.00000    0.36000    0.03000    0.00000
Cl   -0.36422   -2.12079    0.00000    0.00000    0.01000    0.00000
6
Model[13]: IRIntensity=0.0000 KM/Mole;ReducedMass=1.0823 AMU;ForceConstant=6.2456 mDyne/A;Frequency=3129.6222 cm^-1;FrequencyLabel=AG;PATH=Calculation 1;FrequenciesFrequencies
C    -0.36422    0.56166    0.00000   -0.06000    0.01000    0.00000
H    -1.46618    0.58304    0.00000    0.70000   -0.03000    0.00000
Cl    0.36422    2.12079    0.00000    0.00000    0.00000    0.00000
C     0.36422   -0.56166    0.00000    0.06000   -0.01000    0.00000
H     1.46618   -0.58304    0.00000   -0.70000    0.03000    0.00000
Cl   -0.36422   -2.12079    0.00000    0.00000    0.00000    0.00000
6
Model[14]: IRIntensity=124.2254 KM/Mole;ReducedMass=1.0815 AMU;ForceConstant=6.2982 mDyne/A;Frequency=3143.8929 cm^-1;FrequencyLabel=BU;PATH=Calculation 1;FrequenciesFrequencies
C    -0.36422    0.56166    0.00000   -0.06000    0.00000    0.00000
H    -1.46618    0.58304    0.00000    0.70000   -0.03000    0.00000
Cl    0.36422    2.12079    0.00000    0.00000    0.00000    0.00000
C     0.36422   -0.56166    0.00000   -0.06000    0.00000    0.00000
H     1.46618   -0.58304    0.00000    0.70000   -0.03000    0.00000
Cl   -0.36422   -2.12079    0.00000    0.00000    0.00000    0.00000
</ModelData>
</Models>
##$PEAKS=
<Peaks type="RAMAN" xUnitsExpected="1/cm"  >
<PeakData id="1" title="Inactive Bu- asymm stretch of CH group (~3096 cm-1)" peakShape="broad" model="T2.14" xMax="3130" xMin="3080"    />
<PeakData id="2" title="Ag-symm stretch of CH group (~3071 cm-1)" peakShape="broad" model="T2.13" xMax="3090" xMin="3050"    />
<PeakData id="3" title="Ag- C=C stretch (~1576 cm-1)" peakShape="broad" model="T2.12" xMax="1600" xMin="1545"    />
<PeakData id="4" title="Ag- H-C-H scissors (~1272 cm-1)" peakShape="broad" model="T2.11" xMax="1300" xMin="1230"    />
<PeakData id="5" title="Inactive Bu- C-H scissors (~1205 cm-1)" peakShape="broad" model="T2.10" xMax="1230" xMin="1175"    />
<PeakData id="6" title="Inactive Au- C-H wagging (~900 cm-1)" peakShape="broad" model="T2.9" xMax="920" xMin="880"    />
<PeakData id="7" title="Ag-symm stretch of CCl group (~845 cm-1)" peakShape="broad" model="T2.6" xMax="870" xMin="830"    />
<PeakData id="8" title="Inactive Bu- asymm stretch of CCl group (~830 cm-1)" peakShape="broad" model="T2.8" xMax="850" xMin="790"    />
<PeakData id="9" title="Bg- wag of CH group (~750 cm-1)" peakShape="broad" model="T2.7" xMax="770" xMin="730"    />
<PeakData id="10" title="Ag-symm bend of CCl group (~350 cm-1)" peakShape="broad" model="T2.5" xMax="370" xMin="330"    />
<PeakData id="11" title="Inactive Bu-asymm bend of CCl group (~265 cm-1)" peakShape="broad" model="T2.4" xMax="285" xMin="245"    />
<PeakData id="12" title="Inactive Au-Cl-C=C-Cl torsion  (~192 cm-1)" peakShape="broad" model="T2.3" xMax="220" xMin="170"    />
</Peaks>
##XUNITS=1/CM
##YUNITS=RAMAN INTENSITY
##XFACTOR=1.0000000000
##YFACTOR=0.0000418750
##FIRSTX=77.97705078
##LASTX=3387.97705078
##FIRSTY=1.34000003
##NPOINTS=593
##XYDATA=(X++(Y..Y))
$$ plain form
78 32000 30591 29182 26304 23427 21254 19081 16693 14304 12299 10293 8884 7475 6782 6090 5325 4561 4107 3654 3379 3104 2913
195.4 2913 2722 2639 2555 2519 2484 2316 2149 1958 1767 1648 1528 1445 1361 1361 1361 1373 1385 1504 1624 1863 2101 8346 14591 17875 21158
335.2 21158 17194 13230 8131 3033 2484 1934 1743 1552 1433 1313 1290 1266 1337 1409 1445 1481 1397 1313 1230 1146 1075 1003 943 884 884 884 884 884 860 836 800
508.5 800 764 800 836 907 979 979 979 896 812 788 764 800 836 860 884 848 812 776 740 704 669 633 597 657 716 812 907 967 1027 991 955 931 907 955 1003 1063 1122 1194 1266 1552
732.1 1552 1839 2507 3176 2699 2221 1899 1576 1385 1194 1194 1194 1266 1337 1660 1982 7976 13970 13815 13660 8203 2746 1982 1218 1015 812 776
877.5 776 740 740 740 728 716 681 645 609 573 573 573 573 573 573 573 573 573 573 573 573 573 585 597 633 669 704 740 740 740 740 740 740 740 740 740 764 788 824 860 860 860 824 788 764 740 740 740 740 740 740 740 740 740 740 740 752 764 788 812 848 884 955 1027 1110 1194 7451
1246.5 7451 13707 13863 14018 8597 3176 2400 1624 1433 1242 1087 931 812 693 657 621 645 669 704 740 740 740 728 716 693 669 633 597 609 621 657
1414.3 657 693 693 693 669 645 609 573 573 573 573 573 573 573 573 573 609 645 681 716 788 860 967 1075 1349 1624 9755 17887 11427 4967 2949 931 1003 1075 1146 1218 1254 1290 1266
$$ packed form
78C2000j409Tk878k877k173Tk388k389k005k006j409To93o92p65p64m54m53k75Tj91
195.4B913j91q3q4l6l5j68j67j91Tj19j20q3q4%TJ2TJ19J20K39K38O245TL284L283
335.2B1158l964Tn099n098n49n50j91Tj19j20k3k4P1P2L6Tq4Tq3q4p1p2o0n9%Vk4Tl6
508.5H00l6L6TP1P2%Tq3q4k4TL6TK4Tl6Wl5l6TO0N9R6R5O0Tl6Tk4TM8TO0N9P2TK86
732.1A552K87O68O69m77m78l22l23j91T%TP2P1L23L22N994Tj55Tn457Tp64Tk03Tl6
877.5G76l6%Tj2Tl5l6U%S2J2TL6TL5L6%ZK4TL6T%Tl6Tk4T%S0J2TK4TL6TP1P2Q3Q4O257
1246.5G451O256J56J55n421Tp76Tj91Tj55j56j19Tl6TK4TL5L6%Tj2Tk3k4l6TJ2TL6
1414.3F57L6%Tk4Tl6T%ZL6UL5P2TJ07J08K74K75Q131Q132o460Tk018TP2TP1P2L6Tk4
$$ plain form
1626.7 1266 1242 1063 884 812 740 740 740 931 1122 1481 1839 1397 955 860 764 693 621 597 573 573 573 573 573 573 573 573 573 573 573 585 597 633 669 693 716 669 621 549 478 501 525
1856 525 597 669 669 669 597 525 478 430 466 501 537 573 573 573 573 573 549 525 490 454 454 454 490 525 549 573 573 573 573 573 537 501 466 430 454 478 513 549 549 549 513 478 454 430 430
2107.6 430 430 430 430 454 478 513 549 561 573 573 573 573 573 537 501 466 430 454 478 513 549 561 573 573 573 561 549 513 478 454 430 430 430 430 430 454 478 513 549 549 549 513 478 454 430 430
2364.8 430 430 430 430 430 430 430 430 454 478 501 525 549 573 573 573 573 573 549 525 490 454 442 430 430 430 430 430 430 430 430 430 430 430 430 430 430 430 430 430 430 430 430 430 430 430 430 430 430 430 430 430 430 430 430 430 430 430 430 430 454 478 513 549 549 549 513 478 454 430 430 430 430 430 430 430 430 430 442 454 478 501 537 573 537 501 466 430 466
2856.8 466 501 525 549 585 621 657 693 704 716 681 645 609 573 609 645 681 716 704 693 657 621 621 621 657 693 740 788 860 931 1027 1122 1349 1576 2209 2842 11093 19343
3063.7 19343 13779 8215 5087 1958 1684 1409 1337 1266 1301 1337 1457 1576 1696 1815 1779 1743 1433 1122 1003 884 884 884 860 836 800
3203.5 800 764 752 740 740 740 740 740 740 740 740 740 800 860 943 1027 979 931 860 788 764 740 740 740 752 764 800 836 860 884 967 1051 1122 1194
3388 1194
$$ packed form
1626.7A266k4j79Tp2T%TJ91TL59L58m42Tr5r6p1p2k4T%S0J2TL6TK4K3m7m8p2p1K3K4
1856E25P2T%Tp2Tm7m8L6L5L6T%Vk4Tl5l6%TL6L5K4T%Vl6Tl5l6K4TL5L6%Tl6l5k4T%
2107.6D30%UK4TL5L6J2T%Vl6Tl5l6K4TL5L6J2T%Tj2Tl6l5k4T%VK4TL5L6%Tl6l5k4T%
2364.8D30%YK4TK3K4U%Vk4Tl5l6j2T%U6K4TL5L6%Tl6l5k4T%ZJ2TK4K3L6Tl6Tl5l6L6
2856.8D66L5K4TL6VJ1J2l5l6UL6UL5j2j1l6T%TL6TM7M8P2P1R6R5K27TO33TQ251Q250
3063.7A9343n564Tl128l129k74k75p2p1L5L6J20J19J20J19l6Tl10l11j19T%Tk4Tl6
3203.5H00l6j2T%ZO0TQ3Q4m8Tp1p2k4T%TJ2TL6TK4TQ3Q4P1P2
3388A194
##END=$$ End of RAMAN of trans-DCE
##TITLE= 1,1-dichloroethene
##JCAMP-DX= 5.01
##DATA TYPE= INFRARED SPECTRUM
##DATA CLASS= XYDATA
##BLOCK ID=5
##ORIGIN= Department of Chemistry, UWI, JAMAICA
##OWNER= public domain
##LONGDATE= 2012/02/18 12:32:26.0301 -0500 $$ export date from JSpecView
##SPECTROMETER/DATA SYSTEM= from scan
##$MODELS=
<Models>
<ModelData id="1DCE" type="MOL">
1,1-dichloroethylene
__Jmol-14_02171520543D 1   1.00000     0.00000     0
Jmol version 14.3.12_2015.02.11  2015-02-11 19:15 EXTRACT: ({0:5})
  6  5  0  0  0  0              1 V2000
   0.00000   0.00000   0.41101 C   0  0  0  0  0  0
   0.00000   0.00000   1.74967 C   0  0  0  0  0  0
   0.00000   0.93996   2.32528 H   0  0  0  0  0  0
   0.00000  -0.93996   2.32528 H   0  0  0  0  0  0
   0.00000   1.44639  -0.51808 Cl  0  0  0  0  0  0
   0.00000  -1.44639  -0.51808 Cl  0  0  0  0  0  0
  1  6  1  0  0  0
  1  5  1  0  0  0
  1  2  2  0  0  0
  2  3  1  0  0  0
  2  4  1  0  0  0
M  END
</ModelData>
<ModelData id="i1" type="XYZVIB" baseModel="1DCE" vibrationScale=".5">
6
Model[1]: PATH=Calculation 1;Input;Convg=0.4887D-08;-V/T=2.0006;Energy=NaN;Range=M.O.s;E(RHF)=-995.823662291 A.U.;PATH=Calculation 1;Input
C       0.00000      0.00000      0.00000
C       0.00000      0.00000      1.33866
H       0.93996      0.00000      1.91427
H      -0.93996      0.00000      1.91427
Cl      1.44639      0.00000     -0.92909
Cl     -1.44639      0.00000     -0.92909
6
Model[2]: PATH=Calculation 1;Standard;Convg=0.4887D-08;-V/T=2.0006;Energy=-995.82367;Range=M.O.s;E(RHF)=-995.823662291 A.U.;PATH=Calculation 1;Standard
C       0.00000      0.00000      0.41101
C       0.00000      0.00000      1.74967
H       0.00000      0.93996      2.32528
H       0.00000     -0.93996      2.32528
Cl      0.00000      1.44639     -0.51808
Cl      0.00000     -1.44639     -0.51808
6
Model[3]: IRIntensity=0.1106 KM/Mole;PATH=Calculation 1;FrequenciesFrequencies;ReducedMass=18.4273 AMU;ForceConstant=1.1552 mDyne/A;FreqValue=326.1875;Frequency=326.1875 cm^-1;FrequencyLabel=A1;PATH=Calculation 1;FrequenciesFrequencies
C       0.00000      0.00000      0.41101      0.00000      0.00000     -0.37000
C       0.00000      0.00000      1.74967      0.00000      0.00000     -0.39000
H       0.00000      0.93996      2.32528      0.00000      0.00000     -0.38000
H       0.00000     -0.93996      2.32528      0.00000      0.00000     -0.38000
Cl      0.00000      1.44639     -0.51808      0.00000      0.44000      0.14000
Cl      0.00000     -1.44639     -0.51808      0.00000     -0.44000      0.14000
6
Model[4]: IRIntensity=0.0003 KM/Mole;PATH=Calculation 1;FrequenciesFrequencies;ReducedMass=3.6118 AMU;ForceConstant=0.4422 mDyne/A;FreqValue=455.8292;Frequency=455.8292 cm^-1;FrequencyLabel=B2;PATH=Calculation 1;FrequenciesFrequencies
C       0.00000      0.00000      0.41101      0.00000     -0.07000      0.00000
C       0.00000      0.00000      1.74967      0.00000      0.34000      0.00000
H       0.00000      0.93996      2.32528      0.00000      0.55000     -0.34000
H       0.00000     -0.93996      2.32528      0.00000      0.55000      0.34000
Cl      0.00000      1.44639     -0.51808      0.00000     -0.06000      0.12000
Cl      0.00000     -1.44639     -0.51808      0.00000     -0.06000     -0.12000
6
Model[5]: IRIntensity=2.8951 KM/Mole;PATH=Calculation 1;FrequenciesFrequencies;ReducedMass=7.2233 AMU;ForceConstant=1.3108 mDyne/A;FreqValue=554.9693;Frequency=554.9693 cm^-1;FrequencyLabel=B1;PATH=Calculation 1;FrequenciesFrequencies
C       0.00000      0.00000      0.41101      0.70000      0.00000      0.00000
C       0.00000      0.00000      1.74967     -0.19000      0.00000      0.00000
H       0.00000      0.93996      2.32528     -0.48000      0.00000      0.00000
H       0.00000     -0.93996      2.32528     -0.48000      0.00000      0.00000
Cl      0.00000      1.44639     -0.51808     -0.07000      0.00000      0.00000
Cl      0.00000     -1.44639     -0.51808     -0.07000      0.00000      0.00000
6
Model[6]: IRIntensity=18.6624 KM/Mole;PATH=Calculation 1;FrequenciesFrequencies;ReducedMass=9.0383 AMU;ForceConstant=2.3129 mDyne/A;FreqValue=659.0407;Frequency=659.0407 cm^-1;FrequencyLabel=A1;PATH=Calculation 1;FrequenciesFrequencies
C       0.00000      0.00000      0.41101      0.00000      0.00000      0.36001
C       0.00000      0.00000      1.74967      0.00000      0.00000      0.48000
H       0.00000      0.93996      2.32528      0.00000     -0.01000      0.51000
H       0.00000     -0.93996      2.32528      0.00000      0.01000      0.51000
Cl      0.00000      1.44639     -0.51808      0.00000      0.19000     -0.16000
Cl      0.00000     -1.44639     -0.51808      0.00000     -0.19000     -0.16000
6
Model[7]: IRIntensity=0.0000 KM/Mole;PATH=Calculation 1;FrequenciesFrequencies;ReducedMass=1.0197 AMU;ForceConstant=0.4876 mDyne/A;FreqValue=900.8576;Frequency=900.8576 cm^-1;FrequencyLabel=A2;PATH=Calculation 1;FrequenciesFrequencies
C       0.00000      0.00000      0.41101      0.00000      0.00000      0.00000
C       0.00000      0.00000      1.74967      0.00000      0.00000      0.00000
H       0.00000      0.93996      2.32528      0.71000      0.00000      0.00000
H       0.00000     -0.93996      2.32528     -0.71000      0.00000      0.00000
Cl      0.00000      1.44639     -0.51808     -0.01000      0.00000      0.00000
Cl      0.00000     -1.44639     -0.51808      0.01000      0.00000      0.00000
6
Model[8]: IRIntensity=92.0040 KM/Mole;PATH=Calculation 1;FrequenciesFrequencies;ReducedMass=3.0785 AMU;ForceConstant=1.6024 mDyne/A;FreqValue=939.9244;Frequency=939.9244 cm^-1;FrequencyLabel=B2;PATH=Calculation 1;FrequenciesFrequencies
C       0.00000      0.00000      0.41101      0.00000      0.37000      0.00000
C       0.00000      0.00000      1.74967      0.00000      0.09000      0.00000
H       0.00000      0.93996      2.32528      0.00000     -0.27001      0.59000
H       0.00000     -0.93996      2.32528      0.00000     -0.27001     -0.59000
Cl      0.00000      1.44639     -0.51808      0.00000     -0.07000      0.04000
Cl      0.00000     -1.44639     -0.51808      0.00000     -0.07000     -0.04000
6
Model[9]: IRIntensity=52.9028 KM/Mole;PATH=Calculation 1;FrequenciesFrequencies;ReducedMass=1.3120 AMU;ForceConstant=1.0456 mDyne/A;FreqValue=1163.0605;Frequency=1163.0605 cm^-1;FrequencyLabel=B1;PATH=Calculation 1;FrequenciesFrequencies
C       0.00000      0.00000      0.41101     -0.04000      0.00000      0.00000
C       0.00000      0.00000      1.74967      0.16000      0.00000      0.00000
H       0.00000      0.93996      2.32528     -0.70000      0.00000      0.00000
H       0.00000     -0.93996      2.32528     -0.70000      0.00000      0.00000
Cl      0.00000      1.44639     -0.51808      0.00000      0.00000      0.00000
Cl      0.00000     -1.44639     -0.51808      0.00000      0.00000      0.00000
6
Model[10]: IRIntensity=85.0510 KM/Mole;PATH=Calculation 1;FrequenciesFrequencies;ReducedMass=1.8092 AMU;ForceConstant=1.7212 mDyne/A;FreqValue=1270.7289;Frequency=1270.7289 cm^-1;FrequencyLabel=B2;PATH=Calculation 1;FrequenciesFrequencies
C       0.00000      0.00000      0.41101      0.00000      0.21000      0.00000
C       0.00000      0.00000      1.74967      0.00000     -0.16000      0.00000
H       0.00000      0.93996      2.32528      0.00000      0.23001     -0.64000
H       0.00000     -0.93996      2.32528      0.00000      0.23001      0.64000
Cl      0.00000      1.44639     -0.51808      0.00000     -0.02000      0.01000
Cl      0.00000     -1.44639     -0.51808      0.00000     -0.02000     -0.01000
6
Model[11]: IRIntensity=6.8266 KM/Mole;PATH=Calculation 1;FrequenciesFrequencies;ReducedMass=1.4915 AMU;ForceConstant=2.1016 mDyne/A;FreqValue=1546.4604;Frequency=1546.4604 cm^-1;FrequencyLabel=A1;PATH=Calculation 1;FrequenciesFrequencies
C       0.00000      0.00000      0.41101      0.00000      0.00000      0.20001
C       0.00000      0.00000      1.74967      0.00000      0.00000     -0.06000
H       0.00000      0.93996      2.32528      0.00000      0.31000     -0.62000
H       0.00000     -0.93996      2.32528      0.00000     -0.31000     -0.62000
Cl      0.00000      1.44639     -0.51808      0.00000      0.01000     -0.01000
Cl      0.00000     -1.44639     -0.51808      0.00000     -0.01000     -0.01000
6
Model[12]: IRIntensity=47.1352 KM/Mole;PATH=Calculation 1;FrequenciesFrequencies;ReducedMass=2.6981 AMU;ForceConstant=4.9710 mDyne/A;FreqValue=1768.3251;Frequency=1768.3251 cm^-1;FrequencyLabel=A1;PATH=Calculation 1;FrequenciesFrequencies
C       0.00000      0.00000      0.41101      0.00000      0.00000     -0.26000
C       0.00000      0.00000      1.74967      0.00000      0.00000      0.29000
H       0.00000      0.93996      2.32528      0.00000      0.49001     -0.43000
H       0.00000     -0.93996      2.32528      0.00000     -0.49001     -0.43000
Cl      0.00000      1.44639     -0.51808      0.00000     -0.01000      0.01000
Cl      0.00000     -1.44639     -0.51808      0.00000      0.01000      0.01000
6
Model[13]: IRIntensity=0.0670 KM/Mole;PATH=Calculation 1;FrequenciesFrequencies;ReducedMass=1.0641 AMU;ForceConstant=6.0497 mDyne/A;FreqValue=3106.4325;Frequency=3106.4325 cm^-1;FrequencyLabel=A1;PATH=Calculation 1;FrequenciesFrequencies
C       0.00000      0.00000      0.41101      0.00000      0.00000      0.01000
C       0.00000      0.00000      1.74967      0.00000      0.00000     -0.07000
H       0.00000      0.93996      2.32528      0.00000      0.61000      0.36001
H       0.00000     -0.93996      2.32528      0.00000     -0.61000      0.36001
Cl      0.00000      1.44639     -0.51808      0.00000      0.00000      0.00000
Cl      0.00000     -1.44639     -0.51808      0.00000      0.00000      0.00000
6
Model[14]: IRIntensity=0.8160 KM/Mole;PATH=Calculation 1;FrequenciesFrequencies;ReducedMass=1.1196 AMU;ForceConstant=6.6677 mDyne/A;FreqValue=3179.2916;Frequency=3179.2916 cm^-1;FrequencyLabel=B2;PATH=Calculation 1;FrequenciesFrequencies
C       0.00000      0.00000      0.41101      0.00000      0.00000      0.00000
C       0.00000      0.00000      1.74967      0.00000     -0.10000      0.00000
H       0.00000      0.93996      2.32528      0.00000      0.60001      0.37000
H       0.00000     -0.93996      2.32528      0.00000      0.60001     -0.37000
Cl      0.00000      1.44639     -0.51808      0.00000      0.00000      0.00000
Cl      0.00000     -1.44639     -0.51808      0.00000      0.00000      0.00000
</ModelData>
</Models>
##$PEAKS=
<Peaks type="IR" xUnitsExpected="1/cm"  >
<PeakData id="1" title="B1-asymm stretch of C-H group (~3160 cm-1)" peakShape="broad" model="i1.14" xMax="3195" xMin="3165"    />
<PeakData id="2" title="A1-symm stretch of C-H group (~3160 cm-1)" peakShape="broad" model="i1.13" xMax="3125" xMin="3085"    />
<PeakData id="3" title="A1- C=C stretch (~1740 cm-1)" peakShape="broad" model="i1.12" xMax="1785" xMin="1750"    />
<PeakData id="4" title="B1-asymm C-H bend (~1510 cm-1)" peakShape="broad" model="i1.10" xMax="1560" xMin="1530"    />
<PeakData id="5" title="A1- C-H scissors (~1510 cm-1)" peakShape="broad" model="i1.11" xMax="1290" xMin="1260"    />
<PeakData id="6" title="A2-symm C-H rocking (~1360 cm-1)" peakShape="broad" model="i1.9" xMax="1180" xMin="1150"    />
<PeakData id="7" title="B2-asym C-H flap (~960 cm-1)" peakShape="broad" model="i1.7" xMax="955" xMin="925"    />
<PeakData id="8" title="A1-symm stretch of C-Cl group (~960 cm-1)" peakShape="broad" model="i1.6" xMax="915" xMin="885"    />
<PeakData id="9" title="B1-asymm stretch of C-Cl group (~765 cm-1)" peakShape="broad" model="i1.8" xMax="675" xMin="645"    />
<PeakData id="10" title="B2-asymm bend of C-Cl group (~615 cm-1)" peakShape="broad" model="i1.4" xMax="570" xMin="540"    />
<PeakData id="11" title="Inactive A2- Cl-C=C-Cl torsion (~510 cm-1)" peakShape="broad" model="i1.5" xMax="470" xMin="440"    />
<PeakData id="12" title="A1- C-Cl scissors (~173 cm-1)" peakShape="broad" model="i1.3" xMax="340" xMin="310"    />
</Peaks>
##XUNITS= 1/CM
##YUNITS= TRANSMITTANCE
##XFACTOR= 1
##YFACTOR= 9.999000E-07
##FIRSTX= 3.377665E+03
##FIRSTY= 9.991514E-01
##LASTX= 1.261875E+02
##NPOINTS= 2000
##MINY= 10.000000E-05
##MAXY= 1
##XYDATA= (X++(Y..Y))
$$ plain form
3377.665 999251 999238 999224 999209 999194 999179 999164 999148 999131 999114 999097 999079 999061 999043 999023 999004 998983 998963 998941 998919 998897 998873 998849 998825 998799 998773 998746 998718 998690 998660 998630 998598 998566 998532 998497
3320.7358 998461 998424 998386 998346 998305 998263 998219 998173 998126 998077 998026 997973 997918 997862 997802 997741 997677 997610 997540 997468 997393 997314 997232 997146
3281.6985 997056 996962 996864 996761 996653 996540 996421 996296 996165 996028 995882 995730 995568 995398 995218 995028 994827 994614
3252.4207 994388 994148 993893 993622 993333 993024 992695 992343 991966 991562 991128 990662 990160 989619 989035 988403 987719
3224.769 986977 986170 985293 984337 983294 982153 980905 979538 978038 976391 974583 972597 970417 968026
3201.9973 965409 962555 959455 956109 952530 948745 944802 940776 936771 932923 929395 926364 924009
3180.8523 922485 921899 922292 923635 925828 928724 932147 935915 939864 943853 947771 951540 955106 958440
3158.0806 961526 964363 966957 969318 971463 973405 975162 976747 978177 979464 980622 981659 982588
$$ packed form
3377.665I99251j3j4j5Vj6j7Uj8Uk0j9k1k0k2Uk4Uk6Tk7k8Tl0Tl2Tl4I98497
3320.7358I98461l7l8m0m1m2m4m6m7m9n1n3n5n6o0o1o4o7p0p2p5p9q2I97146
3281.6985I97056r4r8j03j08j13j19j25j31j37j46j52j62j70j80j90k01I94614
3252.4207I94388k40k55k71k89l09l29l52l77m04m34m66n02n41n84o32I87719
3224.769I86977q07q77r56j043j141j248j367j500j647j808j986k180I68026
3201.9973I65409k854l100l346l579l785l943m026m005l848l528l031I24009
3180.8523I22485n86L93J343K193K896L423L768L949L989L918L769L566I58440
3158.0806I61526K837K594K361K145J942J757J585J430J287J158J037I82588
$$ plain form
3136.9353 983415 984148 984795 985360 985848 986263 986610 986891 987112 987275 987386 987453 987484 987490 987485 987486 987509 987574 987695 987883
3104.4043 988143 988474 988868 989312 989791 990289 990794 991292 991776 992238 992676 993087 993470 993826 994156 994462 994745
3076.753 995006 995248 995472 995680 995873 996053 996220 996376 996522 996659 996787 996907 997020 997127 997227 997322 997412
3049.1016 997498 997578 997655 997728 997797 997864 997927 997987 998045 998099 998152 998203 998251 998297 998342 998385 998426 998466 998504 998541 998576 998610 998643 998675
3010.0642 998706 998735 998764 998792 998819 998845 998870 998894 998918 998941 998963 998985 999006 999026 999046 999065 999084 999102 999120 999137 999153 999170 999186 999201 999216 999231 999245 999259 999272 999286
2961.2678 999299 999311 999324 999336 999347 999359 999370 999381 999392 999402 999412 999422 999432 999442 999451 999460 999469 999478 999486 999495 999503 999511 999519 999527 999534 999542 999549 999556 999563 999570 999577 999583 999590 999596 999602 999609 999614 999620 999626 999632 999638 999643 999648 999654 999659 999664 999669 999674 999679 999683 999688 999693 999697 999702 999706
2871.8074 999710 999715 999719 999723 999727 999731 999735 999739 999742 999746 999750 999753 999757 999760 999764 999767 999771 999774 999777 999780 999783 999786 999789 999793 999795 999798 999801 999804 999807 999810 999812 999815 999818 999820 999823 999825 999828 999830 999833 999835 999837 999840 999842 999844 999847 999849 999851 999853 999855 999857 999860 999862 999864 999866 999868 999870 999871 999873 1000075 1000076 1000076
$$ packed form
3136.9353I83415P33O47N65M88M15L47K81K21J63J11O7L1OnJK3O5J21I87883
3104.4043I88143L31L94M44M79M98N05M98M84M62M38M11L83L56L30L06I94745
3076.753I95006K42K24K08J93J80J67J56J46J37J28J20J13J07J00R5I97412
3049.1016I97498Q0P7P3O9O7O3O0N8N4N3N1M8M6M5M3M1M0L8L7L5L4L3I98675
3010.0642I98706K9TK8K7K6K5K4TK3K2TK1K0TJ9TJ8TJ7J6J7J6J5UJ4TJ3I99286
2961.2678I99299J2J3J2J1J2J1UJ0WRVQRQVPQPWOPOTPNOVNTONWMNTMNI99706
2871.8074I99710NMXLMTLMLMLMLXMKLWKLTKLKLKLKTLKTLKWLKWJKK02JA000076
2772.5876A000076%J%VJ%VJ%VJ%VJ%WJ%XJ%XJ7%U29j1675r5r6r7r9j00I87837
$$ plain form
2156.1245 987735 987631 987526 987420 987312 987203 987093 986981 986868 986754 986637 986520 986400 986280 986157 986033 985908 985780
2126.8464 985651 985520 985388 985253 985117 984979 984839 984697 984553 984407 984259 984109 983956 983802 983645 983486 983325
2099.195 983161 982995 982827 982656 982483 982307 982128 981946 981762 981575 981386 981193 980997 980798 980597 980392 980183
2071.5437 979972 979757 979538 979317 979091 978862 978629 978392 978152 977907 977658 977406 977148 976887 976621 976350 976075
2043.8923 975795 975510 975220 974925 974625 974319 974008 973691 973368 973040 972705 972364 972017 971664 971303 970936 970562
2016.241 970181 969792 969396 968992 968580 968159 967731 967294 966848 966393 965928 965454 964970 964476 963972 963457 962931
1988.5896 962393 961844 961283 960710 960124 959525 958913 958287 957646 956991 956321 955635 954933 954215 953479 952726 951955
1960.9382 951165 950356 949527 948677 947805 946912 945996 945056 944093 943104 940488 939434 938353 937243 936102 934931
$$ packed form
2156.1245I87735j04j05j06j08j09j10j12j13j14j17Tj20Tj23j24j25I85780
2126.8464I85651j31j32j35j36j38j40j42j44j46j48j50j53j54j57j59I83325
2099.195I83161j66j68j71j73j76j79j82j84j87j89j93j96j99k01k05I80183
2071.5437I79972k15k19k21k26k29k33k37k40k45k49k52k58k61k66k71I76075
2043.8923I75795k85k90k95l00l06l11l17l23l28l35l41l47l53l61l67I70562
2016.241I70181l89l96m04m12m21m28m37m46m55m65m74m84m94n04n15I62931
1988.5896I62393n49n61n73n86n99o12o26o41o55o70o86p02p18p36p53I51955
1960.9382I51165q09q29q50q72q93r16r40r63r89k616j054j081j110j141I34931
$$ plain form
1934.9133 933728 932491 931219 929912 928567 927184 925761 924296 922789 921236 919636 917988 916290
1913.7682 914539 912733 910871 908949 906966 904918 902803 900619 898361 896028 893615 891118 888536
1892.623 885862 883093 880226 877254 874174 870980 867666 864228 860658 856951 853099 849095 844933
1871.4779 840602 836096 831405 826519 821428 816121 810587 804814 798789 792498 785926 779059 771879
1850.3326 764371 756516 748295 739687 730671 721225 711327 700950 690069 678659 666691 654138
1830.8141 640970 627158 612674 597487 581572 564900 547449 529197 510129 490235 469513
1812.922 447972 425631 402526 378711 354260 329272 303875 278224 252510 226952 201802
1795.0299 177337 153851 131643 110999 92175 75373 60726 48276 37977 29694 23225
$$ packed form
1934.9133I33728j237j272j307j345j383j423j465j507j553j600j648I16290
1913.7682I14539j806j862j922j983k048k115k184k258k333k413k497H88536
1892.623H85862k769k867k972l080l194l314l438l570l707l852m004H44933
1871.4779H40602m506m691m886n091n307n534n773o025o291o572o867G71879
1850.3326G64371p855q221q608r016r446r898j0377j0881j1410j1968F54138
1830.8141F40970j3812j4484j5187j5915j6672j7451j8252j9068j9894D69513
1812.922D47972k2341k3105k3815k4451k4988k5397k5651k5714k5558B01802
1795.0299A77337k3486k2208k0644j8824j6802j4647j2450j0299q283B3225
$$ plain form
1777.1378 18324 14733 12210 10550 9599 9262 9503 10348 11881 14249 17646 22310 28498 36457 46398
1752.7395 58467 72725 89141 107596 127898 149798 173013 197243 222195 247587 273165
1734.8475 298703 324007 348916 373299 397053 420100 442384 463867 484526 504353 523346
1716.9554 541516 558878 575450 591258 606326 620682 634356 647376 659771 671570 682802
1699.0634 693493 703669 713358 722582 731365 739729 747696 755286 762517 769406 775972 782230 788195
1677.9182 793880 799300 804466 809391 814084 801396 805428 809260 812898 816351 819626 822729 825667
1656.773 828444 831067 833540 835867 838052 840098 842010 843788 845437 846957 848350 849618 850761
1635.6278 851779 852673 853443 854087 854604 854992 855250 855374 855361 855207 854907 854457 853849 853078 852135 851012 849698
$$ packed form
1777.1378A8324l591k523j660r51l37K41Q45J533K368L397M664O188P959D6398
1752.7395E8467J4258J6416J8455K0302K1900K3215K4230K4952K5392B73165
1734.8475B98703K5304K4909K4383K3754K3047K2284K1483K0659J9827E23346
1716.9554E41516J7362J6572J5808J5068J4356J3674J3020J2395J1799F82802
1699.0634F93493J0176R689R224Q783Q364P967P590P231O889O566O258G88195
1677.9182G93880N420N166M925M693j2688M032L832L638L453L275L103H25667
1656.773H28444K623K473K327K185K046J912J778J649J520J393J268H50761
1635.6278H51779Q94P70O44N17L88K58J24j3j54l00m50o08p71r43j123H49698
$$ plain form
1607.9764 848183 846454 844497 842297 839836 837096 834055 830689 826972 822875 818366 813408 807964
1586.8313 801989 795438 788258 780396 771794 762390 752121 740926 728743 715521 701215 685804
1567.3126 669291 651717 633176 605790 586067 566108 546336 527265 509489 493651 480396
1549.4205 470320 463905 461473 463146 468835 478244 490913 506259 523641 542411 561966 581776
1529.902 601407 620518 638862 656272 672647 687938 702139 715269 727366 738483 748679
1512.0099 758015 766555 774358 781483 787986 793917 799323 804247 808731 812809 816514 819876 822922
1490.8646 825677 828161 830396 832398 834185 835770 837167 838388 839444 840344 841096 841710 842192 842548
1468.0929 842785 842906 842918 842825 842629 842334 841944 841460 840886 840223 839472 838636 837715 836710 835623 834453 833201
$$ packed form
1607.9764H48183j729j957k200k461k740l041l366l717m097m509m958H07964
1586.8313H01989o551p180p862q602r404j0269j1195j2183j3222j4306F85804
1567.3126F69291j7574j8541k7386j9723j9959j9772j9071j7776j5838D80396
1549.4205D70320o415k432J673N689R409J2669J5346J7382J8770J9555E81776
1529.902F01407J9111J8344J7410J6375J5291J4201J3130J2097J1117G48679
1512.0099G58015Q540P803P125O503N931N406M924M484M078L705L362H22922
1490.8646H25677K484K235K002J787J585J397J221J056R00P52O14M82H42548
1468.0929H42785J21J2r3j96k95l90m84n74o63p51q36r21j005j087j170H33201
$$ plain form
1440.4415 831868 830452 828955 827374 825711 823965 822133 820217 818213 816122 813941 811668 809304
1419.2964 806844 804287 801632 798874 796013 793045 789967 786776 783469 780042 776492 772815 769007
1398.1512 765063 760979 756750 752372 747838 743144 738283 733250 728038 722640 717050 711261 705264
1377.006 699052 692616 685949 679040 671881 664462 664414 656290 647874 639154 630119 620757 611056 601004
1354.2343 590589 579798 568618 557038 545045 532627 519775 506477 492724 478509 453316
1336.3423 438422 423070 407263 391008 374314 357199 339683 321798 303579 285073 266338
1318.4502 247440 228459 209489 190635 172016 153762 136015 118926 102648 87334 73130
1300.5581 60164 48543 38339 29584 22263 16314 11629 8061 5439 3583 2315 1479 946
$$ packed form
1440.4415H31868j416j497j581j663j746j832j916k004k091k181k273H09304
1419.2964H06844k557k655k758k861k968l078l191l307l427l550l677G69007
1398.1512G65063m084m229m378m534m694m861n033n212n398n590n789G05264
1377.006F99052o436o667o909p159p419m8q124q416q720r035r362r701F01004
1354.2343E90589j0791j1180j1580j1993j2418j2852j3298j3753j4215D53316
1336.3423D38422j5352j5807j6255j6694j7115j7516j7885j8219j8506B66338
1318.4502B47440j8981j8970j8854j8619j8254j7747j7089j6278j5314G3130
1300.5581F0164j1621j0204q755p321n949m685l568k622j856j268q36I46
$$ plain form
1279.413 614 412 293 224 188 175 182 211 270 372 544 825 1274 1972 3023 4551 6689 9571 13314
1248.5084 18007 23698 30395 38055 46598 55907 65837 76225 86900 97686 108412 118912 129034
1227.3633 138636 147590 155782 163112 169494 174853 179126 182261 184219 184970 184494 182785 179846 175696
1204.5916 170365 163903 156374 147864 138481 128354 117638 106509 95164 83819 72695 62018 51997
1183.4463 42820 34632 27526 21538 16644 12767 9791 7578 5988 4893 4188 3797 3675 3810
1160.6746 4221 4962 6122 7828 10242 13552 17956 23649 30794 39507 49930 61905 75429 90374
1137.9028 106573 123832 141942 160692 179879 199312 218821 238254 257481 276395 294905
1120.0107 312940 330443 347374 363701 379405 394474 408904 422695 435852 448385 460304
$$ packed form
1279.413F14k02j19o9l6j3PK9N9J02J72K81M49O98J051J528K138K882A3314
1248.5084A8007N691O697P660Q543R309R930J0388J0675J0786J0726J0500A29034
1227.3633A38636Q954Q192P330O382N359M273L135J958P51m76j709k939A75696
1204.5916A70365o462p529q510r383j0127j0716j1129j1345Tj1124j0677E1997
1183.4463D2820q188p106n988m894l877k976k213j590j095p05l91j22C810
1160.6746D221P41J160J706K414L310M404N693P145Q713J0423J1975J3524I0374
1137.9028A06573J7259J8110J8750J9187J9433J9509J9433J9227J8914B94905
1120.0107C12940J7503J6931J6327J5704J5069J4430J3791J3157J2533D60304
$$ plain form
1102.1188 471623 482357 492521 502131 511205 519758 527806 535366 542452 549080 555264 561017 566352
1080.9735 571280 575813 579961 583734 587140 590187 592884 595235 597248 598927 600276 601299 601999
1059.8284 602378 599644 599364 598768 597855 596624 595073 593202 591005 588481 585625 582433 578900 575019
1037.0566 570785 566191 561228 555890 550168 544053 537536 530606 523255 515471 507245 498565 489423
1015.9115 479806 469705 459112 448018 436416 424299 411665 398511 384840 370655 355966
998.0194 340787 325136 309041 292535 275660 258469 241024 223399 205681 187970 170378
980.1273 153030 136062 119620 103856 88921 74964 62120 50507 40212 31287 23740
962.2352 17533 12583 8765 5925 3890 2487 1559 965 598 377 247 171 129 107 100 105 124 163
$$ packed form
1102.1188D71623J0734J0164R610R074Q553Q048P560P086O628O184N753E66352
1080.9735E71280M533M148L773L406L047K697K351K013J679J349J023F01999
1059.8284F02378k734k80n96r13j231j551j871k197k524k856l192l533E75019
1037.0566E70785m594m963n338n722o115o517o930p351p784q226q680D89423
1015.9115D79806j0101j0593j1094j1602j2117j2634j3154j3671j4185C55966
998.0194C40787j5651j6095j6506j6875j7191j7445j7625j7718j7711A70378
980.1273A53030j6968j6442j5764j4935j3957j2844j1613j0295q925B3740
962.2352A7533m950l818k840k035j403r28n94l67k21j30p6m2k2pNJ9A63
$$ plain form
932.95734 233 354 559 903 1461 2341 3679 5637 8393 12127 17007 23170 30717 39702 50131
908.559 61964 75126 89507 104976 121387 138589 156428 174757 193435 212333 231334
890.667 250332 269236 287967 306458 324652 342503 359974 377035 393665 409847 425571
872.7749 440829 455620 479857 493927 507526 520661 533341 545577 557380 568761 579732
854.8828 590306 600495 610312 619769 628878 637652 646101 654239 662075 669621 676888 683884 690621
833.7377 697108 703353 709365 715152 720723 726084 731244 736208 740984 745578 749995 754241 758322
812.59247 762242 766006 769619 773085 776408 779591 782638 785553 788337 790995 793528 795939 798230
791.44727 800403 802460 804402 806230 807945 809549 811041 812423 813694 814855 815905 816844 817671 818385
$$ packed form
932.95734B33J21K05L44N58Q80J338J958K756L734M880O163P547Q985E0131
908.559F1964J3162J4381J5469J6411J7202J7839J8329J8678J8898B31334
890.667B50332J8904J8731J8491J8194J7851J7471J7061J6630J6182D25571
872.7749D40829J4791K4237J4070J3599J3135J2680J2236J1803J1381E79732
854.8828E90306J0189R817R457R109Q774Q449Q138P836P546P267O996F90621
833.7377F97108O245O012N787N571N361N160M964M776M594M417M246G58322
812.59247G62242L764L613L466L323L183L047K915K784K658K533K411G98230
791.44727H00403K057J942J828J715J604J492J382J271J161J050R39Q27H18385
$$ plain form
768.67554 818984 819468 819834 820080 830924 830836 830620 830272 829788 829163 828393 827472 826394 825154 823744 822156
742.65076 820382 818413 816238 813847 811228 808367 805251 801864 798190 794209 789903 785228 780203
721.50555 774782 768937 762638 755852 748545 740677 732209 723097 713293 702748 691410 679223 666130
700.36035 652072 636992 620831 603536 585058 565360 544415 522220 498795 474194 448513
682.4683 421899 394557 366756 338836 311200 284307 258652 234742 213065 194052 178060
664.57623 165353 156107 150422 148348 149903 155077 163834 176085 191673 210351 231781 255542
645.0576 281154 308110 335908 364078 392203 419931 446974 473113 498188 522088 544750
627.1655 566141 586260 605122 622758 639209 654524 668752 681946 694157 705433 715823
$$ packed form
768.67554H18984M84L66K46J0844q8k16l48m84o25p70r21j078j240j410H22156
742.65076H20382j969k175k391k619k861l116l387l674l981m306m675G80203
721.50555G74782n845o299o786p307p868q468r112r804j0545j1338j2187F66130
700.36035F52072j5080j6161j7295j8478j9698k0945k2195k3425k4601D48513
682.4683D21899k7342k7801k7920k7636k6893k5655k3910k1677j9013A78060
664.57623A65353r246n685k074J555N174Q757J2251J5588J8678K1430B55542
645.0576B81154K6956K7798K8170K8125K7728K7043K6139K5075K3900E44750
627.1655E66141K0119J8862J7636J6451J5315J4228J3194J2211J1276G15823
$$ plain form
609.27344 725369 734112 742086 749323 755850 761689 766858 771370 775232 778448 781017 782931 784180
588.1283 784748 784614 783754 782142 779749 776548 772517 767640 761920 755380 748076 740109 731636 722883
565.35657 714147 705801 698277 692038 687539 685172 685211 687778 692820 700121 709335 720039 731783 744137
542.58484 756724 769233 781429 811256 822483 833041 842903 852072 860567 868420 875670 882358
523.0662 888528 894222 899480 904340 908838 913005 916872 920466 923810 926927 929837 932557 935104
501.92102 937492 939736 941845 943832 945705 947474 949146 950730 952230 953654 955006 956292 957516
480.77585 958682 959794 960856 961870 962840 963768 964657 965509 966326 967111 967864 968589 969286 969957 970604 971227
454.751 971828 972409 972969 973510 974033 974539 975028 975501 975959 976401 976830 977245 977647 978036 978413 978779 979133
$$ packed form
609.27344G25369Q743P974P237O527N839N169M512L862L216K569J914G84180
588.1283G84748j34q60j612k393l201m031m877n720o540p304p967q473G22883
565.35657G14147q346p524o239m499k367L9K567N042P301R214J0704J1744G44137
542.58484G56724J2509J2196K9827J1227J0558R862R169Q495P853P250H82358
523.0662H88528N694N258M860M498M167L867L594L344L117K910K720I35104
501.92102I37492K244K109J987J873J769J672J584J500J424J352J286I57516
480.77585I58682J112J062J014R70R28Q89Q52Q17P85P53P25O97O71O47I71227
454.751I71828N81N60N41N23N06M89M73M58M42M29M15M02L89L77L66I79133
$$ plain form
427.09964 979477 979810 980133 980446 980750 981044 981330 981607 981875 982136 982388 982632 982869 983098 983320 983534 983741
399.44824 983941 984133 984319 984497 984668 984832 984988 985137 985278 985412 985537 985655 985763 985863 985953 986034 986104 986162
370.17032 986209 986243 986263 986269 986258 986229 986181 986113 986021 985905 985761 985588 985383 985143 984868 984555 984205 983818 983399 982954
337.63925 982493 982031 981588 981186 980853 980615 980493 980505 980657 980944 981352 981859 982439 983066 983715 984367 985006
309.98788 985621 986205 986754 987267 987744 988185 988593 988970 989318 989640 989938 990214 990471 990710 990932 991141 991336
282.3365 991519 991692 991854 992008 992154 992292 992424 992549 992669 992783 992893 992998 993099 993196 993290 997940 997991
254.68512 998040 998086 998130 998172 998212 998250 998287 998322 998356 998389 998420 998450 998479 998507 998534 998560 998586 998610 998633 998656 998679 998700 998721 998741 998761 998780 998798
210.7682 998817 998834 998851 998868 998884 998900 998915 998930 998945 998960 998973 998987 999001 999014 999027 999039 999051 999063 999075 999087 999098 999109 999120 999131 999141 999151 999161 999171 999181 999190 999200 999209 999218 999226 999235 999954 999957 999959 999962 999964 999967 999969 999971 999974 999976
$$ packed form
427.09964I79477L33L23L13L04K94K86K77K68K61K52K44K37K29K22K14I83741
399.44824I83941J92J86J78J71J64J56J49J41J34J25J18J08J00R0Q1P0I86162
370.17032I86209L4K0Oj1k9m8o8r2j16j44j73k05k40k75l13l50l87m19I82954
337.63925I82493m62m43m02l33k38j22J2J52K87M08N07N80O27O49O52I85006
309.98788I85621N84N49N13M77M41M08L77L48L22K98K76K57K39K22K09I91336
282.3365I91519J73J62J54J46J38J32J25J20J14J10J05J01R7R4M650I97991
254.68512I98040M6M4M2M0L8L7L5L4L3L1L0K9K8K7K6TK4K3UK1TK0TJ9I98798
210.7682I98817J7UJ6TJ5VJ3J4TJ3TJ2WJ1VJ0WRJ0RTQRP19LKLKLKTLI99976
$$ plain form
137.57336 999978 999980 999982 999984 999986 999988 999989
$$ packed form
137.57336I99978KWI99989
126.1875I99991  $$checkpoint
##END= $$ end of 1,1-DCE IR
##TITLE=Raman of 1,1-dichloroethylene $$ Begin of the data block
##JCAMP-DX=5.00 $$ ACD/DocManager Library v 5.00
##DATA TYPE=RAMAN SPECTRUM
##DATA CLASS=XYDATA
##BLOCK ID=6
##DATE=19 Feb 2012 10:30:00
##ORIGIN= Department of Chemistry, UWI, Jamaica
##OWNER= public domain
##SPECTROMETER/DATA SYSTEM=from scan
##$MODELS=
<Models>
<ModelData id="1DCE" type="MOL">
1,1-dichloroethylene
__Jmol-14_02171520543D 1   1.00000     0.00000     0
Jmol version 14.3.12_2015.02.11  2015-02-11 19:15 EXTRACT: ({0:5})
  6  5  0  0  0  0              1 V2000
   0.00000   0.00000   0.41101 C   0  0  0  0  0  0
   0.00000   0.00000   1.74967 C   0  0  0  0  0  0
   0.00000   0.93996   2.32528 H   0  0  0  0  0  0
   0.00000  -0.93996   2.32528 H   0  0  0  0  0  0
   0.00000   1.44639  -0.51808 Cl  0  0  0  0  0  0
   0.00000  -1.44639  -0.51808 Cl  0  0  0  0  0  0
  1  6  1  0  0  0
  1  5  1  0  0  0
  1  2  2  0  0  0
  2  3  1  0  0  0
  2  4  1  0  0  0
M  END
</ModelData>
<ModelData id="i2" type="XYZVIB" baseModel="1DCE" vibrationScale=".5">
6
Model[1]: PATH=Calculation 1;Input;Convg=0.4887D-08;-V/T=2.0006;Energy=NaN;Range=M.O.s;E(RHF)=-995.823662291 A.U.;PATH=Calculation 1;Input
C       0.00000      0.00000      0.00000
C       0.00000      0.00000      1.33866
H       0.93996      0.00000      1.91427
H      -0.93996      0.00000      1.91427
Cl      1.44639      0.00000     -0.92909
Cl     -1.44639      0.00000     -0.92909
6
Model[2]: PATH=Calculation 1;Standard;Convg=0.4887D-08;-V/T=2.0006;Energy=-995.82367;Range=M.O.s;E(RHF)=-995.823662291 A.U.;PATH=Calculation 1;Standard
C       0.00000      0.00000      0.41101
C       0.00000      0.00000      1.74967
H       0.00000      0.93996      2.32528
H       0.00000     -0.93996      2.32528
Cl      0.00000      1.44639     -0.51808
Cl      0.00000     -1.44639     -0.51808
6
Model[3]: IRIntensity=0.1106 KM/Mole;PATH=Calculation 1;FrequenciesFrequencies;ReducedMass=18.4273 AMU;ForceConstant=1.1552 mDyne/A;FreqValue=326.1875;Frequency=326.1875 cm^-1;FrequencyLabel=A1;PATH=Calculation 1;FrequenciesFrequencies
C       0.00000      0.00000      0.41101      0.00000      0.00000     -0.37000
C       0.00000      0.00000      1.74967      0.00000      0.00000     -0.39000
H       0.00000      0.93996      2.32528      0.00000      0.00000     -0.38000
H       0.00000     -0.93996      2.32528      0.00000      0.00000     -0.38000
Cl      0.00000      1.44639     -0.51808      0.00000      0.44000      0.14000
Cl      0.00000     -1.44639     -0.51808      0.00000     -0.44000      0.14000
6
Model[4]: IRIntensity=0.0003 KM/Mole;PATH=Calculation 1;FrequenciesFrequencies;ReducedMass=3.6118 AMU;ForceConstant=0.4422 mDyne/A;FreqValue=455.8292;Frequency=455.8292 cm^-1;FrequencyLabel=B2;PATH=Calculation 1;FrequenciesFrequencies
C       0.00000      0.00000      0.41101      0.00000     -0.07000      0.00000
C       0.00000      0.00000      1.74967      0.00000      0.34000      0.00000
H       0.00000      0.93996      2.32528      0.00000      0.55000     -0.34000
H       0.00000     -0.93996      2.32528      0.00000      0.55000      0.34000
Cl      0.00000      1.44639     -0.51808      0.00000     -0.06000      0.12000
Cl      0.00000     -1.44639     -0.51808      0.00000     -0.06000     -0.12000
6
Model[5]: IRIntensity=2.8951 KM/Mole;PATH=Calculation 1;FrequenciesFrequencies;ReducedMass=7.2233 AMU;ForceConstant=1.3108 mDyne/A;FreqValue=554.9693;Frequency=554.9693 cm^-1;FrequencyLabel=B1;PATH=Calculation 1;FrequenciesFrequencies
C       0.00000      0.00000      0.41101      0.70000      0.00000      0.00000
C       0.00000      0.00000      1.74967     -0.19000      0.00000      0.00000
H       0.00000      0.93996      2.32528     -0.48000      0.00000      0.00000
H       0.00000     -0.93996      2.32528     -0.48000      0.00000      0.00000
Cl      0.00000      1.44639     -0.51808     -0.07000      0.00000      0.00000
Cl      0.00000     -1.44639     -0.51808     -0.07000      0.00000      0.00000
6
Model[6]: IRIntensity=18.6624 KM/Mole;PATH=Calculation 1;FrequenciesFrequencies;ReducedMass=9.0383 AMU;ForceConstant=2.3129 mDyne/A;FreqValue=659.0407;Frequency=659.0407 cm^-1;FrequencyLabel=A1;PATH=Calculation 1;FrequenciesFrequencies
C       0.00000      0.00000      0.41101      0.00000      0.00000      0.36001
C       0.00000      0.00000      1.74967      0.00000      0.00000      0.48000
H       0.00000      0.93996      2.32528      0.00000     -0.01000      0.51000
H       0.00000     -0.93996      2.32528      0.00000      0.01000      0.51000
Cl      0.00000      1.44639     -0.51808      0.00000      0.19000     -0.16000
Cl      0.00000     -1.44639     -0.51808      0.00000     -0.19000     -0.16000
6
Model[7]: IRIntensity=0.0000 KM/Mole;PATH=Calculation 1;FrequenciesFrequencies;ReducedMass=1.0197 AMU;ForceConstant=0.4876 mDyne/A;FreqValue=900.8576;Frequency=900.8576 cm^-1;FrequencyLabel=A2;PATH=Calculation 1;FrequenciesFrequencies
C       0.00000      0.00000      0.41101      0.00000      0.00000      0.00000
C       0.00000      0.00000      1.74967      0.00000      0.00000      0.00000
H       0.00000      0.93996      2.32528      0.71000      0.00000      0.00000
H       0.00000     -0.93996      2.32528     -0.71000      0.00000      0.00000
Cl      0.00000      1.44639     -0.51808     -0.01000      0.00000      0.00000
Cl      0.00000     -1.44639     -0.51808      0.01000      0.00000      0.00000
6
Model[8]: IRIntensity=92.0040 KM/Mole;PATH=Calculation 1;FrequenciesFrequencies;ReducedMass=3.0785 AMU;ForceConstant=1.6024 mDyne/A;FreqValue=939.9244;Frequency=939.9244 cm^-1;FrequencyLabel=B2;PATH=Calculation 1;FrequenciesFrequencies
C       0.00000      0.00000      0.41101      0.00000      0.37000      0.00000
C       0.00000      0.00000      1.74967      0.00000      0.09000      0.00000
H       0.00000      0.93996      2.32528      0.00000     -0.27001      0.59000
H       0.00000     -0.93996      2.32528      0.00000     -0.27001     -0.59000
Cl      0.00000      1.44639     -0.51808      0.00000     -0.07000      0.04000
Cl      0.00000     -1.44639     -0.51808      0.00000     -0.07000     -0.04000
6
Model[9]: IRIntensity=52.9028 KM/Mole;PATH=Calculation 1;FrequenciesFrequencies;ReducedMass=1.3120 AMU;ForceConstant=1.0456 mDyne/A;FreqValue=1163.0605;Frequency=1163.0605 cm^-1;FrequencyLabel=B1;PATH=Calculation 1;FrequenciesFrequencies
C       0.00000      0.00000      0.41101     -0.04000      0.00000      0.00000
C       0.00000      0.00000      1.74967      0.16000      0.00000      0.00000
H       0.00000      0.93996      2.32528     -0.70000      0.00000      0.00000
H       0.00000     -0.93996      2.32528     -0.70000      0.00000      0.00000
Cl      0.00000      1.44639     -0.51808      0.00000      0.00000      0.00000
Cl      0.00000     -1.44639     -0.51808      0.00000      0.00000      0.00000
6
Model[10]: IRIntensity=85.0510 KM/Mole;PATH=Calculation 1;FrequenciesFrequencies;ReducedMass=1.8092 AMU;ForceConstant=1.7212 mDyne/A;FreqValue=1270.7289;Frequency=1270.7289 cm^-1;FrequencyLabel=B2;PATH=Calculation 1;FrequenciesFrequencies
C       0.00000      0.00000      0.41101      0.00000      0.21000      0.00000
C       0.00000      0.00000      1.74967      0.00000     -0.16000      0.00000
H       0.00000      0.93996      2.32528      0.00000      0.23001     -0.64000
H       0.00000     -0.93996      2.32528      0.00000      0.23001      0.64000
Cl      0.00000      1.44639     -0.51808      0.00000     -0.02000      0.01000
Cl      0.00000     -1.44639     -0.51808      0.00000     -0.02000     -0.01000
6
Model[11]: IRIntensity=6.8266 KM/Mole;PATH=Calculation 1;FrequenciesFrequencies;ReducedMass=1.4915 AMU;ForceConstant=2.1016 mDyne/A;FreqValue=1546.4604;Frequency=1546.4604 cm^-1;FrequencyLabel=A1;PATH=Calculation 1;FrequenciesFrequencies
C       0.00000      0.00000      0.41101      0.00000      0.00000      0.20001
C       0.00000      0.00000      1.74967      0.00000      0.00000     -0.06000
H       0.00000      0.93996      2.32528      0.00000      0.31000     -0.62000
H       0.00000     -0.93996      2.32528      0.00000     -0.31000     -0.62000
Cl      0.00000      1.44639     -0.51808      0.00000      0.01000     -0.01000
Cl      0.00000     -1.44639     -0.51808      0.00000     -0.01000     -0.01000
6
Model[12]: IRIntensity=47.1352 KM/Mole;PATH=Calculation 1;FrequenciesFrequencies;ReducedMass=2.6981 AMU;ForceConstant=4.9710 mDyne/A;FreqValue=1768.3251;Frequency=1768.3251 cm^-1;FrequencyLabel=A1;PATH=Calculation 1;FrequenciesFrequencies
C       0.00000      0.00000      0.41101      0.00000      0.00000     -0.26000
C       0.00000      0.00000      1.74967      0.00000      0.00000      0.29000
H       0.00000      0.93996      2.32528      0.00000      0.49001     -0.43000
H       0.00000     -0.93996      2.32528      0.00000     -0.49001     -0.43000
Cl      0.00000      1.44639     -0.51808      0.00000     -0.01000      0.01000
Cl      0.00000     -1.44639     -0.51808      0.00000      0.01000      0.01000
6
Model[13]: IRIntensity=0.0670 KM/Mole;PATH=Calculation 1;FrequenciesFrequencies;ReducedMass=1.0641 AMU;ForceConstant=6.0497 mDyne/A;FreqValue=3106.4325;Frequency=3106.4325 cm^-1;FrequencyLabel=A1;PATH=Calculation 1;FrequenciesFrequencies
C       0.00000      0.00000      0.41101      0.00000      0.00000      0.01000
C       0.00000      0.00000      1.74967      0.00000      0.00000     -0.07000
H       0.00000      0.93996      2.32528      0.00000      0.61000      0.36001
H       0.00000     -0.93996      2.32528      0.00000     -0.61000      0.36001
Cl      0.00000      1.44639     -0.51808      0.00000      0.00000      0.00000
Cl      0.00000     -1.44639     -0.51808      0.00000      0.00000      0.00000
6
Model[14]: IRIntensity=0.8160 KM/Mole;PATH=Calculation 1;FrequenciesFrequencies;ReducedMass=1.1196 AMU;ForceConstant=6.6677 mDyne/A;FreqValue=3179.2916;Frequency=3179.2916 cm^-1;FrequencyLabel=B2;PATH=Calculation 1;FrequenciesFrequencies
C       0.00000      0.00000      0.41101      0.00000      0.00000      0.00000
C       0.00000      0.00000      1.74967      0.00000     -0.10000      0.00000
H       0.00000      0.93996      2.32528      0.00000      0.60001      0.37000
H       0.00000     -0.93996      2.32528      0.00000      0.60001     -0.37000
Cl      0.00000      1.44639     -0.51808      0.00000      0.00000      0.00000
Cl      0.00000     -1.44639     -0.51808      0.00000      0.00000      0.00000
</ModelData>
</Models>
##$PEAKS=
<Peaks type="RAMAN" xUnitsExpected="1/cm"  >
<PeakData id="1" title="B1-asymm stretch of C-H group (~3160 cm-1)" peakShape="broad" model="i2.14" xMax="3195" xMin="3165"    />
<PeakData id="2" title="A1-symm stretch of C-H group (~3160 cm-1)" peakShape="broad" model="i2.13" xMax="3125" xMin="3085"    />
<PeakData id="3" title="A1- C=C stretch (~1740 cm-1)" peakShape="broad" model="i2.12" xMax="1785" xMin="1750"    />
<PeakData id="4" title="B1-asymm C-H bend (~1510 cm-1)" peakShape="broad" model="i2.11" xMax="1560" xMin="1530"    />
<PeakData id="5" title="A1- C-H scissors (~1510 cm-1)" peakShape="broad" model="i2.10" xMax="1290" xMin="1260"    />
<PeakData id="6" title="A2-symm C-H rocking (~1360 cm-1)" peakShape="broad" model="i2.10" xMax="1180" xMin="1150"    />
<PeakData id="7" title="B2-asym C-H flap (~960 cm-1)" peakShape="broad" model="i2.9" xMax="955" xMin="925"    />
<PeakData id="8" title="A1-symm stretch of C-Cl group (~960 cm-1)" peakShape="broad" model="i2.6" xMax="915" xMin="885"    />
<PeakData id="9" title="B1-asymm stretch of C-Cl group (~765 cm-1)" peakShape="broad" model="i2.7" xMax="675" xMin="645"    />
<PeakData id="10" title="B2-asymm bend of C-Cl group (~615 cm-1)" peakShape="broad" model="i2.4" xMax="570" xMin="540"    />
<PeakData id="11" title="Inactive A2- Cl-C=C-Cl torsion (~510 cm-1)" peakShape="broad" model="i2.5" xMax="470" xMin="440"    />
<PeakData id="12" title="A1-symm bend of C-Cl group (~173 cm-1)" peakShape="broad" model="i2.3" xMax="340" xMin="310"    />
</Peaks>
##XUNITS=1/CM
##YUNITS=RAMAN INTENSITY
##XFACTOR= 1
##YFACTOR= 1.084966E-06
##FIRSTX= 3.377665E+03
##FIRSTY= 1.382219E-02
##LASTX= 1.261875E+02
##NPOINTS= 2000
##MINY= 0
##MAXY= 1.084966
##XYDATA= (X++(Y..Y))
$$ plain form
3377.665 12740 12926 13117 13313 13512 13717 13926 14140 14359 14583 14813 15048 15289 15536 15789 16049 16315
3350.0137 16588 16868 17155 17450 17753 18064 18384 18712 19049 19395 19752 20118 20496 20884 21283 21695 22118
3322.3623 22555 23005 23469 23948 24442 24951 25478 26021 26583 27163 27764 28385 29028 29693 30383 31097 31838
3294.711 32607 33404 34232 35093 35987 36917 37885 38892 39942 41036 42177 43368 44612 45913 47272
3270.3125 48696 50187 51749 53389 55110 56918 58820 60823 62932 65157 67506 69988 72614 75395
3247.5408 78344 81474 84800 88339 92110 96134 100432 105030 109957 115243 120923 127037 133628 140744
3224.769 148441 156780 165830 175666 186377 198057 210814 224768 240050 256803 275185 295361
3205.2505 317504 341789 368379 397417 429003 463162 499811 538709 579404 621178 662999
$$ packed form
3377.665A2740J86J91J96J99K05K09K14K19K24K30K35K41K47K53K60A6315
3350.0137A6588K80K87K95L03L11L20L28L37L46L57L66L78L88L99M12B2118
3322.3623B2555M50M64M79M94N09N27N43N62N80O01O21O43O65O90P14C1838
3294.711C2607P97Q28Q61Q94R30R68J007J050J094J141J191J244J301D7272
3270.3125D8696J491J562J640J721J808J902K003K109K225K349K482K626G5395
3247.5408G8344L130L326L539L771M024M298M598M927N286N680O114O591A40744
3224.769A48441Q339R050R836J0711J1680J2757J3954J5282J6753J8382B95361
3205.2505C17504K4285K6590K9038L1586L4159L6649L8898M0695M1774F62999
$$ plain form
3187.3584 703510 741059 773803 799894 817717 826146 824746 813854 794523 768330 737132 702815
3167.8398 667101 631431 596922 564379 534332 507095 482820 461549 443249 427845 415246
3149.9478 405355 398087 393370 391154 391413 394147 399383 407175 417602 430770 446805 465852 488060
3128.8025 513577 542527 574985 610939 650245 692567 737306 783536 829943 874807 916043
3110.9104 951331 978343 995042 1000000 992649 973384 943485 904889 859878 810768 759669 708339
3091.3918 658131 610001 564565 522163 482927 446846 413811 383652 356169 331148 308374
3073.4998 287640 268750 251524 235796 221416 208249 196174 185083 174878 165473 156791
3055.6077 148763 141327 134430 128022 122059 116503 111317 106471 101935 97685 93696 89950 86425
$$ packed form
3187.3584G03510L7549L2744K6091J7823Q429j400j0892j9331k6193l1198G02815
3167.8398F67101l5670l4509l2543l0047k7237k4275k1271j8300j5404D15246
3149.9478D05355p268m717k216K59K734N236P792J0427J3168J6035J9047D88060
3128.8025E13577K8950L2458L5954L9306M2322M4739M6230M6407M4864I16043
3110.9104I51331K7012J6699M958p351j9265k9899l8596m5011m9110n1099G08339
3091.3918F58131m8130m5436m2402l9236l6081l3035l0159k7483k5021C08374
3073.4998B87640j8890j7226j5728j4380j3167j2075j1091j0205r405A56791
3055.6077A48763p436o897o408n963n556n186m846m536m250l989l746H6425
$$ plain form
3034.4626 83106 79977 77023 74232 71593 69093 66725 64478 62344 60317 58388 56552 54804 53136
3011.691 51545 50025 48574 47185 45857 44585 43366 42197 41076 40000 38967 37974 37019 36100
2988.9192 35216 34365 33544 32754 31991 31256 30546 29860 29198 28557 27938 27340 26761 26200 25657 25131 24622
2961.2678 24128 23649 23184 22733 22296 21871 21459 21058 20668 20290 19922 19564 19216 18877 18547 18226 17913
2933.6165 17608 17312 17022 16740 16466 16198 15936 15681 15432 15189 14952 14720 14494 14273 14058 13847 13641
2905.9648 13439 13242 13050 12861 12677 12497 12320 12147 11978 11813 11651 11492 11337 11185 11035 10889 10746
2878.3135 10606 10468 10333 10201 10071 9944 9819 9696 9576 9458 9343 9229 9117 9008 8900 8795 8691
2850.662 8589 8489 8391 8294 8200 8106 8015 7925 7836 7749 7663 7579 7496 7415 7335 7256 7178 7102 7027 6953 6880 6809 6738 6669 6601 6533
$$ packed form
3034.4626H3106l129k954k791k639k500k368k247k134k027j929j836j748E3136
3011.691E1545j520j451j389j328j272j219j169j121j076j033r93r55C6100
2988.9192C5216q51q21p90p63p35p10o86o62o41o19n98n79n61n43n26B4622
2961.2678B4128m79m65m51m37m25m12m01l90l78l68l58l48l39l30l21A7913
2933.6165A7608k96k90k82k74k68k62k55k49k43k37k32k26k21k15k11A3641
2905.9648A3439j97j92j89j84j80j77j73j69j65j62j59j55j52j50j46A0746
2878.3135A0606j38j35j32j30j27j25j23j20j18j15j14j12j09j08j05H691
2850.662H589j00r8r7r4Tr1r0q9q7q6q4q3q1q0p9p8p6p5p4p3p1To9o8F533
$$ plain form
2808.3718 6467 6402 6338 6275 6212 6151 6091 6031 5972 5915 5858 5802 5746 5692 5638 5585 5533 5481 5430 3499 3465 3431 3397 3365 3332 3300 3269 3238 3208 3177
2759.5752 3148 3119 3090 3061 3033 3005 2978 2951 2925 2898 2873 2847 2822 2797 2772 2748 2724 2701 2678 2655 2632 2609 2587 2566 2544 2523 2502 2481 2460 2440 2420 2400 2381 2362 0 0 0
$$ packed form
2808.3718F467o5o4o3To1o0Tn9n7Tn6Tn4Tn3n2Tn1j931l4Ul2l3l2l1Tl0C177
2759.5752C148k9Uk8Tk7Tk6k7k5k6k5Uk4Tk3Wk2k1k2k1Vk0Uj9Tk362%@
2699.3928@%U26N72NTMNWONUONOTNOXPOPOPTOPUQPTQTPQURQTRYJ0XJ1A001
$$ plain form
2068.2905 1012 1023 1035 1046 1058 1069 1081 1094 1106 1119 1131 1144 1158 1171 1185 1199 1213 1228 1242 1257 1273 1288 1304 1320 1337 1353 1370
2024.3738 1388 1406 1424 1442 1461 1480 1500 1519 1540 1561 1582 1603 1625 1648 1671 1694 1718 1742 1767 1793 1819 1846 1873 1901 1929 1958 1988 2018 2049 2081 2114 2147 2181 2216
1969.0709 2252 2289 2326 2365 2404 2445 2486 2529 2572 2617 2663 2710 2759 2808 2859 4207 4271 4337 4405 4475 4546 4619 4695 4772 4852 4933 5017
1925.154 5103 5192 5283 5377 5474 5573 5676 5782 5890 6003 6119 6238 6362 6489 6621 6757 6898 7044 7195
1894.2496 7351 7512 7680 7854 8034 8221 8416 8618 8827 9046 9273 9510 9756 10014 10282 10562 10855 11161
1864.9717 11481 11816 12167 12536 12922 13328 13755 14203 14676 15174 15700 16255 16842 17463 18121 18818 19559
1837.3203 20346 21184 22077 23029 24047 25136 26302 27553 28897 30344 31903 33585 35404 37373
1814.5486 39510 41831 44357 47110 50116 53403 57003 60951 65285 70048 75286 81048 87386 94349
$$ packed form
2068.2905A012J1J2J1J2J1J2J3J2J3J2J3J4J3J4UJ5J4J5J6J5J6TJ7J6A370
2024.3738A388J8UJ9TK0J9K1VK2K3UK4TK5K6TK7TK8TK9L0TL1L2L3TL4B216
1969.0709B252L7TL9TM1TM3TM5M6M7M9TN1J348O4O6O8P0P1P3P6P7Q0Q1E017
1925.154E103Q9R1R4R7R9J03J06J08J13J16J19J24J27J32J36J41J46G195
1894.2496G351J61J68J74J80J87J95K02K09K19K27K37K46K58K68K80K93A1161
1864.9717A1481L35L51L69L86M06M27M48M73M98N26N55N87O21O58O97A9559
1837.3203B0346Q38Q93R52J018J089J166J251J344J447J559J682J819C7373
1814.5486C9510K321K526K753L006L287L600L948M334M763N238N762O338I4349
$$ plain form
1791.7769 101987 110341 119440 129289 139864 151089 162829 174865 186888 198487 209167 218372
1772.2582 225546 230202 231999 230803 226712 220035 211242 200883 189517 177654 165718 154035
1752.7395 142837 132275 122429 113333 104986 97362 90421 84116 78395 73208 68505 64240 60370
1731.5944 56855 53661 50755 48108 45695 43492 41480 39640 37956 36414 35000 33704 32515 31424
1708.8226 30422 29504 28662 27890 27183 26536 25946 25408 24920 24477 24077 23719 23399 23116 22868 22653 22470
1681.1713 22318 22196 22103 22038 22000 21989 22005 22047 22114 22208 22328 22473 22644 22842 23067 23319 23598 23907 24244 24612
1648.6403 25011 25442 25907 26408 26945 27520 28136 28794 29498 30249 31050 31904 32816 33787 34824 35929 37108
1620.9889 38367 39711 41147 42681 44323 46081 47964 49984 52152 54481 56987 59686 62596 65738
$$ packed form
1791.7769A01987Q354R099R849J0575J1225J1740J2036J2023J1599J0680B18372
1772.2582B25546M656J797j196m091o677q793j0359j1366j1863j1936A54035
1752.7395A42837j0562r846r096q347p624o941o305n721n187m703m265F0370
1731.5944E6855l194k906k647k413k203k012j840j684j542j414j296j189C1424
1708.8226C0422r18q42p72p07o47n90n38m88m43m00l58l20k83k48k15B2470
1681.1713B2318j22r3o5l8j1J6M2O7R4J20J45J71J98K25K52K79L09L37B4612
1648.6403B5011M31M65N01N37N75O16O58P04P51Q01Q54R12R71J037J105C7108
1620.9889C8367J344J436J534J642J758J883K020K168K329K506K699K910F5738
$$ plain form
1598.2172 69134 72811 76797 81124 85828 90950 96536 102635 109307 116614 124629 133430 143105 153750
1575.4454 165469 178373 192577 208197 225343 244107 264555 286701 310540 335797 362215
1557.5533 389304 416359 442456 466469 487144 503221 513598 517504 514637 505216 489943 469877
1538.0347 446266 420374 393352 366163 339545 314021 289929 267457 246678 227589 210131
1520.1426 194215 179733 166568 154607 143736 133851 124855 116658 109179 102346 96094 90364
1500.624 85105 80269 75815 71707 67912 64400 61146 58125 55316 52702 50266 47991 45865 43875
1477.8523 42010 40260 38616 37071 35616 34244 32950 31728 30573 29479 28444 27462 26530 25646
1455.0806 24805 24005 23244 22519 21828 21168 20538 19937 19362 18812 18285 17781 17298 16834 16390 15963 15553
$$ packed form
1598.2172F9134L677L986M327M704N122N586O099O672P307Q015Q801R675A53750
1575.4454A65469J2904J4204J5620J7146J8764K0448K2146K3839K5257C62215
1557.5533C89304K7055K6097K4013K0675J6077J0377L906k867r421j5273D69877
1538.0347D46266k5892k7022k7189k6618k5524k4092k2472k0779j9089B10131
1520.1426A94215j4482j3165j1961j0871r885q996q197p479o833o252I0364
1500.624H5105m836m454m108l795l512l254l021k809k614k436k275k126D3875
1477.8523D2010j750j644j545j455j372j294j222j155j094j035r82r32B5646
1455.0806B4805q00p61p25o91o60o30o01n75n50n27n04m83m64m44m27A5553
$$ plain form
1427.4292 15159 14781 14416 14066 13728 13403 13090 12788 12497 12216 11945 11683 11430 11186 10949 10721 10500
1399.7777 10286 10079 9878 9684 9496 9314 9137 8966 8799 8638 8481 8329 8182 8039 7899 7764 7633
1372.1263 7505 7381 7260 6579 6469 6363 6259 6158 6060 5965 5872 5781 5694 5608 5525 5444 5365 5288 5213 5141 5070 5030
1336.3423 4963 4898 4835 4773 4713 4655 4599 4543 4490 4438 4387 4338 4290 4244 4199 4155 4113 4072 4032 3994 3957 3921 3887 3990 3959
1295.6785 3929 3901 3874 3848 3823 3800 3778 3757 3737 3719 3702 3687 3672 3660 3648 3638 3630 3623 3618 3614 3612 3612 3614 3618 3623 3631 3641 3653 3667 3684 3704
1245.2552 3726 3752 3780 3812 3848 3887 3931 3979 4031 4089 4153 4222 4298 4380 4471 4569 4677 4795 4924 5064 5218 5386 5570
1207.8446 5772 5994 6237 6504 6799 7123 7480 7873 8308 8788 9317 9901 10544 11252 12027 12873 13790 14775
1178.5667 15822 16919 18043 19166 20249 21246 22103 22768 23196 23353 23228 22829 22185 21342 20351 19265
$$ packed form
1427.4292A5159l78l65l50l38l25l13l02k91k81k71k62k53k44k37k28A0500
1399.7777A0286k07k01j94j88j82j77j71j67j61j57j52j47j43j40j35G633
1372.1263G505j24j21o81j10j06j04j01r8r5r3r1q7q6q3q1p9p7p5p2p1E030
1336.3423D963o5o3o2o0n8n6Tn3n2n1m9m8m6m5m4m2m1m0l8l7l6l4J03C959
1295.6785C929k8k7k6k5k3k2k1k0j8j7j5Tj2Tj0qpnmk%KMNQJ0J2J4J7C704
1245.2552C726K6K8L2L6L9M4M8N2N8O4O9P6Q2R1R8J08J18J29J40J54J68E570
1207.8446E772K22K43K67K95L24L57L93M35M80N29N84O43P08P75Q46R17A4775
1178.5667A5822J097J124J123J083R97Q57O65M28J57j25l99o44q43r91A9265
$$ plain form
1152.5419 18131 16992 15876 14806 13796 11579 10718 9928 9206 8549 7952 7410 6918 6473 6068 5701
1126.517 5367 5064 4788 4536 4306 4096 3904 3728 3567 3419 3283 3158 3044 2938 2841 2751 2668 2592 2522
1095.6125 2458 2398 2344 2294 2248 2206 2167 2132 2101 2072 2046 2023 2002 1985 1969 1956 1945 1936 1929 1924 1921 1920 1921 2264 2272 2281 2292 2305 2320
1048.4425 2337 2355 2376 2398 2422 2449 2477 2508 2540 2575 2612 2652 2694 2738 2785 2835 2888 2944 3003 3066 3132 3202 3276 3354 3437
1007.7787 3525 3617 3715 3819 3930 4047 4171 4303 4443 4593 4753 4923 5105 5299 5507 5731 5971 6229
978.5008 6507 6807 7131 7481 7861 8272 8719 9204 9732 10305 10928 11605 12337 13128 13978 15050 16011
950.84937 17017 18055 19107 20153 21169 22130 23019 23824 24545 25195 25797 26384 26995 27669 28442 29350
924.8246 30420 31676 33135 34808 36699 38801 41095 43547 46101 48682 51188 53499 55479 56993
$$ packed form
1152.5419A8131j139j116j070j010k217q61p90p22o57n97n42m92m45m05E701
1126.517E367l03k76k52k30k10j92j76j61j48j36j25j14j06r7r0q3p6B522
1095.6125B458o0n4n0m6m2l9l5l1k9k6k3k1j7j6j3j1rpnljJL43QRJ1J3B320
1048.4425B337J8K1K2K4K7K8L1L2L5L7M0M2M4M7N0N3N6N9O3O6P0P4P8C437
1007.7787C525R2R8J04J11J17J24J32J40J50J60J70J82J94K08K24K40F229
978.5008F507L00L24L50L80M11M47M85N28N73O23O77P32P91Q50J072A6011
950.84937A7017J038J052J046J016R61Q89Q05P21O50O02N87O11O74P73B9350
924.8246C0420J256J459J673J891K102K294K452K554K581K506K311J980E6993
$$ plain form
902.05286 57923 58185 57745 56626 54901 52679 50093 47274 44343 41403 38529 35777 33182 30763
879.2811 28529 26476 24601 22892 21338 19927 18645 17482 16426 15466 14593 13798 13074 12413 11809
854.8828 11384 10879 10417 9993 9603 9246 8916 8614 8335 8078 7841 7623 7423 7238 7068 6911 6768
827.23145 6636 6515 6405 6304 6213 6130 6056 5989 5930 5878 5833 5794 5762 5735 5715 5700 5691 5688 5689 5696 5709 5726 5749 5777 5810 5848
784.9411 5891 5940 5994 6054 6119 6189 6266 6349 6437 6532 6634 6742 6858 6981 7058 7197 7345 7502 7668 7844 8030
750.7835 8227 8436 8657 8892 9140 9404 9683 9980 10294 10628 10984 11362 11764 12192 12649 13137 13774 14332
721.50555 14930 15570 16258 16997 17792 18648 19573 20571 21652 22823 24094 25476 26980 28621 30414
697.1073 32374 34522 36878 39465 42309 45436 48877 52661 56820 61381 66371 71805 77688 84004
$$ packed form
902.05286E7923K62m40j119j725k222k586k819k931k940k874k752k595C0763
879.2811B8529k053j875j709j554j411j282j163j056r60q73p95p24o61A1809
854.8828A1384n05m62m24l90l57l30l02k79k57k37k18k00j85j70j57F768
827.23145F636j21j10j01r1q3p4o7n9n2m5l9l2k7k0j5rlJPJ3J7K3K8L3E848
784.9411E891M9N4O0O5P0P7Q3Q8R5J02J08J16J23P7J39J48J57J66J76H030
750.7835H227K09K21K35K48K64K79K97L14L34L56L78M02M28M57M88O37A4332
721.50555A4930O40O88P39P95Q56R25R98J081J171J271J382J504J641C0414
697.1073C2374K148K356K587K844L127L441L784M159M561M990N434N883H4004
$$ plain form
674.3356 90709 97722 104914 112100 119035 125424 130937 135243 138050 139158 138485 136091 132160 126971
651.5638 120852 114138 107131 100086 93195 86599 80386 74606 69278 64403 59966 55943 52307
630.41864 49028 46076 43423 41043 38910 37002 35300 33785 32442 31258 30220 29318 28545 27892
607.6469 27354 26927 26608 26394 26285 26280 26382 26593 26916 27357 27922 28618 29454 30441 31590 32912 34422
579.99554 36132 38055 40203 42581 45192 48026 51062 54259 57554 60857 64049 66987 69509 71456
557.2238 72687 73102 72663 71398 69397 66793 63747 60419 56955 53480 50086 46841 43760 40923
534.4521 38313 35928 33762 31803 30039 28455 27037 25772 24647 23652 22774 22006 21340 20768 20286
510.05377 19888 19571 19331 19168 19079 19066 19127 19130 19349 19649 20036 20514 21089 21769 22562 23476 24520 25706 27044
$$ packed form
674.3356I0709P013P192P186O935O389N513M306K807J108o73k394l931A26971
651.5638A20852o714p007p045o891o596o213n780n328m875m437m023E2307
630.41864D9028k952k653k380k133j908j702j515j343j184j038r02p73B7892
607.6469B7354m27l19k14j09nJ02K11L23M41N65O96Q36R87J149J322C4422
579.99554C6132J923K148K378K611K834L036L197L295L303L192K938K522G1456
557.2238G2687M15m39j265k001k604l046l328l464l475l394l245l081D0923
534.4521C8313k385k166j959j764j584j418j265j125r95q78p68o66n72B0286
510.05377A9888l17k40j63q9j3O1LK19L00L87M78N75O80P93R14J044J186B7044
$$ plain form
479.1493 28544 30213 32058 34080 36271 38615 41082 43622 46166 48622 50881 52817 54309 55246
456.37756 55553 55201 54210 52649 50623 48253 45663 42967 40258 37610 35073 32681 30452 28393
433.60583 26504 24779 23209 21784 20492 19323 18265 17308 16443 15661 14954 14315 13739 13219 12751
409.20755 12330 11953 11616 11316 11052 10821 10620 10450 10308 10193 10105 10043 10008 9998 10014 10057 10127 10226 10353 10511
376.6765 10702 10927 11188 11489 11833 12224 12665 13162 13719 14344 15042 15821 16690 17658 18734 19929 21253
349.02512 22714 24322 26082 27995 30056 32250 34548 36909 39268 41543 43635 45431 46819 47702
326.2534 48011 47718 46844 45451 43632 41499 39164 36730 34282 31885 29586 27416 25390 23516
303.48166 21792 20215 18775 17463 16269 15183 14194 13294 12473 11723 11038 10411 9836 9308 8822 8375
$$ packed form
479.1493B8544J669J845K022K191K344K467K540K544K456K259J936J492E5246
456.37756E5553l52r91j561k026k370k590k696k709k648k537k392k229B8393
433.60583B6504j725j570j425j292j169j058r57q65p82p07o39n76n20A2751
409.20755A2330l77l37l00k64k31k01j70j42j15q8o2l5j0J6M3P0R9J27A0511
376.6765A0702K25K61L01L44L91M41M97N57O25O98P79Q69R68J076J195B1253
349.02512B2714J608J760J913K061K194K298K361K359K275K092J796J388D7702
326.2534D8011k93q74j393j819k133k335k434k448k397k299k170k026B3516
303.48166B1792j577j440j312j194j086r89r00q21p50o85o27n75n28m86H375
$$ plain form
277.45685 7961 7579 7225 6897 6591 6307 6042 5795 5564 5347 5144 4954 4438 4272 4116 3969 3830 3698
248.17891 3574 3456 3344 3238 3137 3042 2951 2864 2781 2702 2627 2555 2486 2420 2357 2297 2239 2184 2130 2079 2030 1982 1937
210.7682 1893 1850 1810 1770 1732 1696 1660 1626 1593 1561 1530 1500 1471 1443 1416 1389 1364 1339 1315 1291 1269 1246 1225 1204 1184 1164 1145 1126 1108 1090
161.97165 1073 1056 1040 1024 1008 830 817 804 791 778 766 754 742 731 720 709 698 688 678 668 658 649
$$ packed form
277.45685G961l82l54l28l06k84k65k47k31k17k03j90n16j66j56j47j39C698
248.17891C574j18j12j06j01r5r1q7q3p9p5p2o9o6o3o0n8n5n4n1m9m8A937
210.7682A893m3m0Tl8l6Tl4l3l2l1l0k9k8k7Tk5Tk4Tk2k3k1Tk0Tj9Tj8A090
161.97165A073j7j6Uj78j3Vj2Uj1Vj0VF49
126.1875F40  $$checkpoint
##END=$$ End of RAMAN of 1,1-DCE
##END= $$ end of file