##TITLE= Compound file, contains several data records
##JCAMP-DX= 5.0
##DATA TYPE= LINK
##BLOCKS=3
##ORIGIN= Department of Chemistry, UWI, JAMAICA
##OWNER= public domain
##TITLE=2-chlorobenaldehyde $$ Begin of the data block
##JCAMP-DX=5.00 $$ ACD/DocManager Library v 8.20
##DATA TYPE=INFRARED SPECTRUM
##DATA CLASS=XYDATA
##BLOCK ID=1
##LONGDATE= 2005/03/17 13:14:14.00000 -0500
##ORIGIN=JSpecView Converted
##OWNER= public domain
##$MODELS=
<Models>
<ModelData id="2Clbenzaldehyde" type="MOL">
  Clbenzald

  created with ArgusLab version 4.0.1
 14 14  0  0  0  0              1 V2000
  -0.73480  -2.36880  -0.00650 C   0  0  0  0  0  0
   0.66150  -2.36880  -0.00650 C   0  0  0  0  0  0
  -1.43330  -1.16380  -0.00650 C   0  0  0  0  0  0
   1.35330  -1.16130  -0.01470 C   0  0  0  0  0  0
   1.44230   1.31750  -0.01351 C   0  0  0  0  0  0
  -0.73650   0.04970  -0.00750 C   0  0  0  0  0  0
   0.66640   0.06290  -0.01200 C   0  0  0  0  0  0
   2.67310   1.34120   0.06000 O   0  0  0  0  0  0
  -1.63910   1.49330  -0.00080 Cl  0  0  0  0  0  0
  -1.28760  -3.32060  -0.00440 H   0  0  0  0  0  0
   1.21330  -3.32050  -0.00300 H   0  0  0  0  0  0
  -2.53450  -1.16610  -0.00520 H   0  0  0  0  0  0
   2.45660  -1.14520  -0.01770 H   0  0  0  0  0  0
   0.85010   2.25680  -0.08980 H   0  0  0  0  0  0
  1  2  4  0  0  0
  2 11  1  0  0  0
  2  4  4  0  0  0
  3  1  4  0  0  0
  3  6  4  0  0  0
  4 13  1  0  0  0
  5  8  2  0  0  0
  6  7  4  0  0  0
  7  4  4  0  0  0
  7  5  1  0  0  0
  9  6  1  0  0  0
 10  1  1  0  0  0
 12  3  1  0  0  0
 14  5  1  0  0  0
M  END
</ModelData>
<ModelData id="1" type="XYZVIB" baseModel="2Clbenzaldehyde" vibrationScale=".1">
14
1  Energy: -1658.62158  Freq: 3194.97809
C    -0.734800   -2.368800   -0.006500    0.035940    0.065060   -0.000140
C     0.661500   -2.368800   -0.006500   -0.055920    0.098180   -0.000360
C    -1.433300   -1.163800   -0.006500    0.040980   -0.000160   -0.000060
C     1.353300   -1.161300   -0.014700   -0.024740    0.001120    0.000080
C     1.442300    1.317500   -0.013500    0.000620    0.000540    0.000020
C    -0.736500    0.049700   -0.007500    0.001500   -0.001600    0.000000
C     0.666400    0.062900   -0.012000   -0.001280   -0.002800    0.000000
O     2.673100    1.341200    0.060000   -0.000300   -0.000020   -0.000020
Cl   -1.639100    1.493300   -0.000800    0.000040    0.000040    0.000000
H    -1.287600   -3.320600   -0.004400   -0.435400   -0.746720    0.001580
H     1.213300   -3.320500   -0.003000    0.679360   -1.169900    0.004460
H    -2.534500   -1.166100   -0.005200   -0.462900   -0.000300    0.000560
H     2.456600   -1.145200   -0.017700    0.257900    0.004420   -0.000840
H     0.850100    2.256800   -0.089800   -0.000420    0.000640   -0.000080
14
2  Energy: -1658.62158  Freq: 3184.54147
C    -0.734800   -2.368800   -0.006500   -0.043960   -0.068520    0.000140
C     0.661500   -2.368800   -0.006500   -0.038080    0.064140   -0.000240
$$ [...]
C     1.442300    1.317500   -0.013500   -0.004420   -0.004580   -0.230880
C    -0.736500    0.049700   -0.007500    0.001740   -0.004480   -0.087560
C     0.666400    0.062900   -0.012000    0.002180   -0.008460   -0.031420
O     2.673100    1.341200    0.060000   -0.019800    0.027940    0.006880
Cl   -1.639100    1.493300   -0.000800    0.014660    0.002120    0.125780
H    -1.287600   -3.320600   -0.004400   -0.008940   -0.001880   -0.191140
H     1.213300   -3.320500   -0.003000   -0.009040   -0.008340    0.348100
H    -2.534500   -1.166100   -0.005200   -0.002960    0.002100   -0.370440
H     2.456600   -1.145200   -0.017700   -0.000240   -0.013040    0.310540
H     0.850100    2.256800   -0.089800    0.004060   -0.031880   -0.642300
14
36  Energy: -1658.62158  Freq: 82.74335
C    -0.734800   -2.368800   -0.006500   -0.002540   -0.002000    0.112480
C     0.661500   -2.368800   -0.006500   -0.002320   -0.005180   -0.056260
C    -1.433300   -1.163800   -0.006500   -0.000160   -0.000800    0.134480
C     1.353300   -1.161300   -0.014700    0.000320   -0.007380   -0.177260
C     1.442300    1.317500   -0.013500    0.000760   -0.005500   -0.213180
C    -0.736500    0.049700   -0.007500    0.003080   -0.002760   -0.015360
C     0.666400    0.062900   -0.012000    0.002120   -0.006760   -0.151040
O     2.673100    1.341200    0.060000   -0.032020    0.018380    0.319120
Cl   -1.639100    1.493300   -0.000800    0.013420    0.003300   -0.002220
H    -1.287600   -3.320600   -0.004400   -0.004540   -0.000600    0.225220
H     1.213300   -3.320500   -0.003000   -0.004620   -0.006640   -0.082460
H    -2.534500   -1.166100   -0.005200    0.000060    0.002220    0.267700
H     2.456600   -1.145200   -0.017700   -0.000280   -0.010100   -0.275320
H     0.850100    2.256800   -0.089800    0.030460   -0.030800   -0.759200
</ModelData>
</Models>
##$PEAKS=
<Peaks type="IR" xUnits="1/cm" yUnits="TRANSMITTANCE" >
<PeakData id="1" title="peak 1 (~3100 cm-1)" peakShape="broad" model="1.1" xMax="3398" xMin="3358"  yMax="1" yMin="0" />
<PeakData id="2" title="peak 2 (~3100 cm-1)" peakShape="broad" model="1.2" xMax="3369" xMin="3329"  yMax="1" yMin="0" />
<PeakData id="3" title="peak 3 (~3100 cm-1)" peakShape="broad" model="1.3" xMax="3093" xMin="3053"  yMax="1" yMin="0" />
<PeakData id="4" title="peak 4 (~3100 cm-1)" peakShape="broad" model="1.4" xMax="2893" xMin="2853"  yMax="1" yMin="0" />
<PeakData id="5" title="peak 5 (~3100 cm-1)" peakShape="broad" model="1.5" xMax="2774" xMin="2734"  yMax="1" yMin="0" />
<PeakData id="6" title="C=O stretch (~1750 cm-1)" peakShape="broad" model="1.6" xMax="1740" xMin="1700"  yMax="1" yMin="0" />
</Peaks>
##NPOINTS=1816
##FIRSTX=499.49755859
##LASTX=3999.83740234
##MAXX=3999.83740234
##MINX=499.49755859
##MAXY=0.94920212
##MINY=0.04921576
##XFACTOR=1.0000000000
##YFACTOR=1.000000000000000e-9
##FIRSTY=0.04921576
##DELTAX=1.92856193
##XUNITS=1/CM
##YUNITS=TRANSMITTANCE
##XYDATA=(X++(Y..Y))
499.5D9215764N352218O581604M788835O012797N724817P662483P605776P888384P116206
$$ 49215764 54567982 61149586 65938421 71951218 77676035 85338518 92944294 100832678 107948884
516.9A07948884Q618251Q098088R097956Q826167J0686472Q793756R744138R966433
$$ 107948884 116567135 124665223 133763179 142589346 153275818 162069574 171813712 181780145
532.3A81780145J0947436J0442540J1514485J0870888J1778146J1470333J3206363
$$ 181780145 192727581 203170121 214684606 225555494 237333640 248803973 262010336
545.8B62010336J2152553J2654691J1800617J2422502J1910379J2634069J1733085
$$ 262010336 274162889 286817580 298618197 311040699 322951078 335585147 347318232
559.3C47318232J2467563J1536867J2276709J1338025J2236267J0980696J1194020
$$ 347318232 359785795 371322662 383599371 394937396 407173663 418154359 429348379
572.8D29348379J0253549J1711508J0679245J1692673J0582924J1462211J1050910
$$ 429348379 439601928 451313436 461992681 473685354 484268278 495730489 506781399
586.3E06781399J1158109J0105014J1036575R249985R461582Q466124Q544505P111728
$$ 506781399 517939508 528044522 539081097 548331082 557792664 566258788 574803293 581915021
601.7E81915021P109880N650998N408048L401935L079772J062811M7803k858401n388200
$$ 581915021 589024901 594675899 600083947 603485882 606565654 607628465 607676268 604817867 599429667
619.1E99429667j0537028j6100765k7025759l9917946n5192619n9011162l7511438
$$ 599429667 588892639 572791874 545766115 505848169 450655550 391644388 354132950
632.6C54132950J4586985O7754567R0286613P8227758N6153774L5600722K1030903
$$ 354132950 368719935 436474502 526761115 604988873 661142647 696743369 717774272
646.1G17774272N600572n614996Q10027K4849534L0829847K1431446J2228071Q320392
$$ 717774272 723374844 717759848 718569875 743419409 774249256 795680702 807908773 816229165
661.5H16229165N050718L389359L842950k04385o768703p090092j1333465j4410734
$$ 816229165 821279883 824669242 828512192 828307807 821539104 814449012 803115547 788704813
676.9G88704813j0941983k00748Q081972R852112O999194M059792l7730l747582q794606
$$ 788704813 777762830 777562082 785644054 795496166 802495360 806555152 806517422 802769840 793975234
694.3G93975234j3168633j5922546j2278557o407917p348299k1265864m3389142o7936480
$$ 793975234 780806601 764884055 752605498 746197581 738849282 717583418 674194276 606257796
709.7F06257796q2373023p0540040k8381974L1744331Q4146053R9940777P5017452
$$ 606257796 523884773 453344733 424962759 456707090 540853143 640793920 715811372
723.2G15811372M4913888K4131298J0800719J682103o348491j3026416j9379437k5224805
$$ 715811372 760725260 784856558 795657277 797339380 790990889 777964473 758585036 733360231
738.6G33360231l4515381m7716439o1533808o9574356o7992211n8631390m4678867
$$ 733360231 698844850 651128411 589594603 520020247 452028036 393396646 348717779
752.1C48717779k9175818j3008356k9713Q273572J2498945J5423149J8118500K1866054
$$ 348717779 319541961 306533605 306503892 314777464 327276409 342699558 360818058 382684112
767.6C82684112K7634084L6135346M6481609N6817025O3124180O0930848N1552236
$$ 382684112 410318196 446453542 492935151 549752176 612876356 673807204 725359440
781.1G25359440L8715482K7428090J8070817J2264013Q572400P696748P190049P766783
$$ 725359440 764074922 791503012 809573829 821837842 830410242 838106990 845297039 853063822
796.5H53063822O589711M417955L75331l697097r217680j5056729k4012566l5764575
$$ 853063822 859653533 864071488 864446819 860749722 851532042 836475313 812462747 776698172
811.9G76698172n0983369o4649582p7350259q5145891p6023668m7815382j1734903
$$ 776698172 725714803 661065221 583714962 498569071 422545403 374730021 362995118
825.4C62995118K4708211N8437050Q2384735Q4432244O6833914M4961452K6636064
$$ 362995118 387703329 446140379 528525114 612957358 679791272 724752724 751388788
838.9G51388788L317356k1905720k2248566J9738436N1655650M3027520K3526549J2765408
$$ 751388788 754706144 732800424 710551858 730290294 781945944 824973464 848500013 861265421
854.4H61265421P189095L924787j16050m298389r393990j2634993j3254046q801878
$$ 861265421 868454516 872379303 872263253 867964864 858570874 845935881 832681835 823879957
869.8H23879957j881897O058752J1676371J5320480J5869499J5068531J2584328J0554254
$$ 823879957 821998060 828056812 839733183 855053663 870923162 885991693 898576021 909130275
885.2I09130275P969439O689489M938305M274904L174186K978981K160012K107799
$$ 909130275 917099714 923789203 928727508 933002412 936176598 939155579 941315591 943423390
900.6I43423390J452506J649678J024246J079082K20418L52800k61843j06215r96292
$$ 943423390 944875896 946525574 947549820 948628902 948849320 949202120 948940277 948834062 947837770
918I47837770j082718j945794j960039k192378r64821m77910N94855M51803N18322
$$ 947837770 946755052 944809258 942849219 940656841 939692020 939214110 939808965 940260768 940779090
935.4I40779090p12693j379669l211200m994035q495867j2545764j9171536k5021434
$$ 940779090 940066397 938686728 935475528 930481493 921985626 909439862 890268326 865246892
950.8H65246892k7203918j9852757o042540Q836031J8242001K2054136J9820333J5417695
$$ 865246892 838042974 818190217 812147677 820983708 839225709 861279845 881100178 896517873
966.2H96517873R622693N162239R00030j868427n366623q174479j1275947j2163341
$$ 896517873 906140566 911302805 912202835 910334408 904967785 896793306 885517359 873354018
981.6H73354018j1415363p128000k488434J822531K638698R17136n351364j3756335
$$ 873354018 861938655 854810655 852322221 854144752 856783450 857700586 852349222 838592887
997.1H38592887k0002186j2107551N629479J7718912J7008841J1820435N198300M54485
$$ 838592887 818590701 806483150 812112629 829831541 846840382 858660817 863859117 864313602
1012.5H64313602p67588K89738m074156j1222005k0494521k6753008l4802437l9424777
$$ 864313602 863546014 863835752 859761596 848539591 828045070 801292062 766489625 727064848
1027.9G27064848n8899701j04853809r7337097J6480566J05365842P3367834J2115658
$$ 727064848 668165147 563311338 465974241 482454807 587820649 661188483 673304141
1041.4F73304141k3417652o1253131r0267688q6831599n9052587k1533072K4200619
$$ 673304141 649886489 588633358 498365670 411534071 352481484 330948412 355149031
1054.9C55149031P5327992J08679652R3891025M5988381K958298j976371L3039450
$$ 355149031 430477023 539156675 633047700 679036081 681994379 680018008 713057458
1068.4G13057458N9309960M7071993K5442660J2476504P142246L913998L025830J799941
$$ 713057458 772367418 819439411 844882071 857358575 864500821 868414819 871440649 873240590
1083.9H73240590P11978k629877n363881o199062j334667K519905K081693j681984
$$ 873240590 873952568 871322691 865958810 859759748 858425081 860944986 863026679 861344695
1099.3H61344695m289508q900761j4785946k4231195l5933793m8834145n2803039l9887488
$$ 861344695 857055187 848154426 833368480 809137285 773203492 724369347 671566308 631678820
1114.7F31678820j1572898J4172137K4727046J9560338R055733O6519j711845J423001
$$ 631678820 620105922 634278059 659005105 678565443 687621176 687687695 685975850 687398851
1130.1F87398851N059719N580723P845283J2817561K1113694K6375890K4692893J5730917
$$ 687398851 692458570 698039293 705884576 718702137 739815831 766191721 790884614 806615531
1145.6H06615531O581545k726018j1997700k5490343m4548393o5690934o0383678j3096630
$$ 806615531 813197076 810471058 798473358 772983015 728434622 662743688 602360010 589263380
1161E89263380L9282620N4743468M2473078K3024380Q225858l113091j2518763k3028851
$$ 589263380 628546000 683289468 725762546 748786926 757012784 753899693 741380930 718352079
1176.4G18352079l0043363l4951031m1510940n2087605n7914972n4582447m1944772
$$ 718352079 688308716 653357685 611846745 559759140 501844168 447261721 405316949
1189.9D05316949k7087808j4215231p468074n514264l588230N670816K3090035M5417815
$$ 405316949 378229141 364013910 356545836 351031572 347443342 353114158 376204193 421622008
1205.4D21622008O4603716P2916031O6140890N2360356L7796676K7603448J8954634
$$ 421622008 486225724 559141755 625282645 677643001 715439677 743043125 761997759
1218.9G61997759J3093055P967531N408049K705336J611948k10643r08077k939343
$$ 761997759 775090814 783058345 788466394 791171730 792783678 792573035 791664958 788725615
1234.3G88725615m103959o721139q555293j1887848j4550090j8684745k2041440k7039170
$$ 788725615 784621656 777900517 769345224 757457376 742907286 724222541 702181101 675141931
1249.7F75141931l1475246l7312568m2132914m4901192m2420834m3092251m8144728
$$ 675141931 643666685 606354117 564221203 519320011 476899177 433806926 385662198
1263.2C85662198n0312847l1318605R826899N1969737Q0487549R1231644Q1008673
$$ 385662198 335349351 304030746 313857645 365827382 446314931 537546575 618555248
1276.7F18555248N9490859L6743880J7477691M59909j4734566l3876479l6866128p177353
$$ 618555248 678046107 714789987 732267678 732727587 717993021 684116542 647250414 640073061
1292.1F40073061J7528951J4492572K2159397L2437325K7118444J3965964R052039
$$ 640073061 657602012 672094584 694253981 726691306 753809750 767775714 776827753
1305.6G76827753J0262608J5384317J7329275J8393934J4064014J1226416Q135914
$$ 776827753 787090361 802474678 819803953 838197887 852261901 863488317 871624231
1319.1H71624231O441176L897846M016638K758443L369510J942218J809001J15156
$$ 871624231 878065407 881963253 885979891 888738334 892107844 894050062 895859063 895974219
1334.6H95974219N67913o73235o06536k840341j476883k084375j137614k537012k527237
$$ 895974219 896542132 895868897 895262361 892422020 890945137 888860762 887723148 885186136 882658899
1351.9H82658899m804075n857050q962095q652508r667576q309662p388890l458619
$$ 882658899 877854824 871997774 863035679 854383171 844715595 836405933 829017043 825558424
1367.4H25558424l489196j957536l962636n729258j2219191j7854869l1912506m8029661
$$ 825558424 822069228 820111692 816149056 810419798 798200607 780345738 748433232 700403571
1382.8G00403571o3798129p8909994p8121483l9067477j6114294K670258K0930976
$$ 700403571 636605442 557695448 479573965 440506488 424392194 427062452 447993428
1396.3D47993428L3935785M9424559L9685785M2798818M7485172L7206293L0478894
$$ 447993428 481929213 531353772 571039557 613838375 661323547 698529840 729008734
1409.8G29008734K3900032J2184084L687203l857315j5925288j9794285k2248507l2164693
$$ 729008734 752908766 765092850 768780053 764922738 748997450 729203165 706954658 674789965
1425.2F74789965l0596793l9154768m8846781m4481873l5633177m0359825l0432164
$$ 674789965 644193172 605038404 556191623 511709750 476076573 435716748 405284584
1438.7D05284584k4124146k1227956k532571K5188833N5770338N3061396M4291049
$$ 405284584 381160438 359932482 357399911 382588744 438359082 491420478 535711527
1452.2E35711527K6886105Q366406l4218490m5808404l7813783j5040577K9968620
$$ 535711527 562597632 570964038 536745548 490937144 453123361 438082784 468051404
1465.7D68051404L4625202K4831474K6254416N8987796L9574206K9731095J7001628
$$ 468051404 502676606 527508080 553762496 612750292 652324498 682055593 699057221
1479.2F99057221J7504692K0451308J9298434J9804120K1065176J9551217R351909
$$ 699057221 716561913 737013221 756311655 776115775 797180951 816732168 826084077
1492.7H26084077P062137J1938334J0551333P160426M705071K736867O722867L451586
$$ 826084077 833146214 845084548 855635881 862796307 867501378 870238245 876961112 880412698
1508.1H80412698l215730k421022j280606o30974N4121k446175J712620l610730j460731
$$ 880412698 877196968 874775946 873495340 872864366 872918487 870472312 872184932 868574202 867113471
1525.5H67113471l017604k663076l487468m15802m337966k225578j205147M043639
$$ 867113471 864095867 861432791 857945323 857529521 853191555 850965977 849760830 853804469
1540.9H53804469m862606q95501o272018n490839j4577925j2010277j8259882j4082969
$$ 853804469 848941863 848046362 841774344 836283505 821705580 809695303 791435421 777352452
1556.4G77352452l5834729q5859597m5380950o3407660p8882962k6568443L7353933
$$ 777352452 741517723 655658126 610277176 546869516 467986554 441418111 478772044
1569.9D78772044N9591711L9159298J1745691l4895122m7062993n8322758m8008799
$$ 478772044 538363755 577523053 589268744 554373622 507310629 448987871 400979072
1583.4D00979072l5807789k9766172l1805485k1680683O18339M2316377P1076482Q6629063
$$ 400979072 365171283 335405111 303599626 281918943 282537282 324853659 395930141 482559204
1598.8D82559204Q4889412P0669651M7115207K9102862J8563985R633482K755761o91175
$$ 482559204 567448616 638118267 685233474 714336336 732900321 742533803 745289564 744598389
1614.2G44598389k950192o744504p356465o659031q903563p231474o265640o147802
$$ 744598389 741648197 734903693 727547228 720888197 711984634 704753160 698487520 692339718
1629.7F92339718p059514o980241j6621887k7339816k7933777l3062756l3616245k3325920
$$ 692339718 685280204 678299963 661678076 634338260 606404483 573341727 539725482 516399562
1645.1E16399562k1586150l203928J538962J7124951J7421007P003725J0409236J2796878
$$ 516399562 494813412 491609484 493148446 510273397 527694404 534698129 545107365 557904243
1660.5E57904243P955909j713574j0757565j5964806l3060134k6791721k6078850l4708917
$$ 557904243 565860152 564146578 553389013 537424207 504364073 477572352 451493502 416784585
1675.9D16784585k5545240k0272165j9747556j5951246k7791619j1145443k1151423
$$ 416784585 391239345 370967180 351219624 335268378 307476759 296331316 275179893
1689.4B75179893k2301704j9709676j5299783j3270303M344240J6989946J4066756
$$ 275179893 252878189 233168513 217868730 204598427 208942667 225932613 239999369
1702.9B39999369K0832911L5992265K8136253K6366919K0035416J3611466J1565685
$$ 239999369 260832280 296824545 324960798 351327717 371363133 384974599 396540284
1716.4C96540284K2541970K6887983L5007686M4626683L2225847K0229876J3282955
$$ 396540284 419082254 445970237 480977923 525604606 557830453 578060329 591343284
1729.9E91343284P585048J0063649J2888729P821679J8096090J7254531J5742600J3690531
$$ 591343284 598928332 608991981 621880710 629702389 647798479 665053010 680795610 694486141
1745.4F94486141J3949812J6382455K1650196J7168104J3164997J5038789J0639488
$$ 694486141 708435953 724818408 746468604 763636708 776801705 791840494 802479982
1758.9H02479982N972445P869423K277911L587305M360497M600763O752551N599737
$$ 802479982 808452427 816321850 818599761 822187066 826547563 831148326 837900877 843500614
1774.3H43500614K482057L832221L501832L741145J262725K539754j84477N43595N88596
$$ 843500614 845982671 849814892 853316724 857057869 858320594 860860348 860675871 861219466 861808062
1791.7H61808062J187920j289606L80695n25653M32908k749383k538026m076898l709733
$$ 861808062 862995982 861706376 862087071 861561418 861994326 859244943 856706917 852630019 848920286
1809H48920286n697847n938947p099152n743622n747378l445089k113283J090884J933158
$$ 848920286 843222439 837283492 830184340 824440718 818693340 815248251 813134968 814225852 816159010
1826.4H16159010L134608P000089N509734M724860O144285N349517L962636K204955
$$ 816159010 819293618 826293707 831803441 836528301 842672586 848022103 851984739 854189694
1841.8H54189694L374934J106024j106918k019525k020478k293169j796365j824260
$$ 854189694 857564628 858670652 857563734 855544209 853523731 851230562 849434197 847609937
1857.2H47609937n88596j25110Q25346L99530J310348J757741J002491j4425J667738
$$ 847609937 847021341 846896231 847721577 848121107 849431455 851189196 852191687 852177262 853845000
1874.6H53845000J992643L102183K967299L264129K520084J999736R56595J551747
$$ 853845000 855837643 858939826 861907125 865171254 867691338 869691074 870647669 872199416
1890H72199416q58605p20024j231193j693726k413809k055645k525270j980067j862049
$$ 872199416 871340811 870620787 869389594 867695868 865282059 863226414 860701144 858721077 856859028
1907.4H56859028p46071j093507n52654p05600L76403K4140q94427o33657j143932
$$ 856859028 856112957 855019450 854466796 853761196 854137599 854161739 853267312 852633655 851489723
1924.7H51489723k357006k848447m704296n740106o827355o109893n367577l107608
$$ 851489723 849132717 846284270 841579974 835839868 829012513 822902620 817535043 814427435
1940.2H14427435p00235J198769J375138K750338K448856K803564K186060K523542
$$ 814427435 813727200 814925969 816301107 819051445 821500301 824303865 826489925 829013467
1955.6H29013467J756787J804412Q75830N34475l30329j7106j051069o97493n20289
$$ 829013467 830770254 832574666 833450496 833984971 833654642 833637536 832586467 831888974 831368685
1972.9H31368685o1155m62591l26753q23378k33114N25594K289533L499985M224539
$$ 831368685 831307530 830844939 830518186 829694808 829461694 829987288 832276821 835776806 840001345
1990.3H40001345M243493J980841J567900M816592K942145J549661M88818N9366j168251
$$ 840001345 844244838 846225679 847793579 852610171 855552316 857101977 857590795 857650161 856481910
2007.7H56481910j968205l380418l692567l861845k740502k286077o39677Q44121K915919
$$ 856481910 854513705 851133287 847440720 843578875 840838373 838552296 837912619 838756740 841672659
2025H41672659M217386N629420N466462N191207M018306L366947K253533K165317J530111
$$ 841672659 845890045 851519465 856985927 862177134 866195440 869562387 871815920 873981237 875511348
2042.4H75511348J391351R98974J081765N63324O74128K02537K48313k16783j6272
$$ 875511348 876902699 877901673 878983438 879546762 880220890 880423427 880671740 880454957 880438685
2059.7H80438685m58061l20435j082599j121521m76837j51277n43594l34799p44284
$$ 880438685 879980624 879660189 878577590 877456069 876979232 876827955 876284361 875949562 875205278
2077.1H75205278p68542j402199j652479k312899j944780j512945j71959P40707K129435
$$ 875205278 874436736 873034537 871382058 869069159 867124379 865611434 865439475 866180182 868309617
2094.4H68309617K307534K288640J450836J204968N94020O08444K03431K26795k05159
$$ 868309617 870617151 872905791 874356627 875561595 876155615 876764059 876967490 877194285 876989126
2111.8H76989126k1636j72735K34843K38478N19276K76208M84287J25945K99752J6153
$$ 876989126 876967490 876794755 877029598 877268076 877787352 878063560 878547847 878673792 878973544 878989697
2131.1H78989697J76489j43111R835k54750o318k65420r1732l82602k62797n07533
$$ 878989697 879166186 879023075 879032910 878778160 878771842 878506422 878414690 878032088 877769291 877261758
2150.4H77261758l82543o24478l87132o38902l24070l84212k16067o35385o98388j250029
$$ 877261758 876879215 876254737 875867605 875228703 874904633 874520421 874304354 873668969 872970581 871720552
2169.6H71720552j347303j879215j783729j663148n49078N33759J667679J653194J573205
$$ 871720552 870373249 868494034 866710305 865047157 864498079 865031838 866699517 868352711 869925916
2187H69925916R51290P88451L56435N21005L81648N34594K21312K86162j5139J728
$$ 869925916 870877206 871665657 872022092 872543097 872924745 873459339 873680651 873966813 873951674 873953402
2206.3H73953402m38213m91441p22825l34740l10480m9472l44694l92377p89285o91235
$$ 873953402 873515189 873023748 872300923 871966183 871655703 871606231 871261537 870869160 870079875 869388640
2225.6H69388640q73864o23703q00073n74171o64175l39329m71592m49062r18805r65834
$$ 869388640 868514776 867891073 867091000 866516829 865852654 865513325 865041733 864592671 863673866 862708032
2244.9H62708032j305878j103401j081705l05176M67122J409411J437306J382292O66976
$$ 862708032 861402154 860298753 859217048 858911872 859378994 860788405 862225711 863608003 864274979
2262.2H64274979J95264n57065p63237j186192j140237j141250n26428k56479J44899
$$ 864274979 864470243 863913178 863149941 861963749 860823512 859682262 859155834 858899355 859044254
2279.6H59044254j74642l34739p21813p27176r34244o36279p72238q72910j474202
$$ 859044254 858869612 858534873 857813060 857085884 856151640 855515361 854743123 853870213 852396011
2296.9H52396011j492262j265287N1320R02652J414776J016915O50823o37233j899958
$$ 852396011 850903749 849638462 849689782 850592434 852007210 853024125 853674948 853037715 851137757
2314.3H51137757l193021l000676j898945P85769K800822M215479M294812M248739
$$ 851137757 847944736 844944060 843045115 843830884 846631706 850847185 855141997 859390736
2329.7H59390736K592802J282513L91543M58002J31488Q79287R59278J213252q59439
$$ 859390736 861983538 863266051 863657594 864115596 864247084 865126371 866085649 867298901 866439462
2347.1H66439462q63135J311242K599180J631737J611829O97493L17693n38170l24846
$$ 866439462 865576327 866887569 869486749 871118486 872730315 873427808 873745501 873207331 872882485
2364.4H72882485j212358j291454k121329k316475k980769k963662l495574l499091
$$ 872882485 871670127 870378673 868257344 865940869 862960100 859996438 856500864 853001773
2379.9H53001773l405571k632498k108634j259923q58664k70963m2200K91586K08735
$$ 853001773 849596202 846963704 844855070 843595147 842736483 842465520 842423320 842714906 842923641
2397.2H42923641J80900n7578K88904M65274P71284M00483L3319n87761m58956j43051
$$ 842923641 843104541 843046963 843335867 843801141 844572425 844972908 845006227 844418466 843959510 843816459
2416.5H43816459M32909L30329K682n00441j22428M85123J293301J445353J430154
$$ 843816459 844249368 844579697 844582379 844081938 843959510 844444633 845737934 847183287 848613441
2433.8H48613441Q35121N69701L6895j86205o51657q64923j292348j522839j997888
$$ 848613441 849448562 850018263 850055158 849868953 849217296 848352373 847060025 845537186 843539298
2451.2H43539298k054751k149046j740694j423776p92027l83377K15173M90487J079082
$$ 843539298 841484547 839335501 837594807 836171031 835379004 834995627 835210800 835701287 836780369
2468.6H36780369J229346J189828O35386K73644k14338l15904o29902p05541r08136
$$ 836780369 838009715 839199543 839834929 840108573 839894235 839578331 838948429 838242888 837334752
2485.9H37334752o92010n22137l1411K11477O96540Q82030J064717P22647N59747K60174
$$ 837334752 836642742 836120605 836089194 836300671 836997211 837879241 838943958 839666605 840226352 840486526
2505.2H40486526J85490r6559n9307k06113j43111k78949k10464l41177k38538l37482
$$ 840486526 840672016 840575457 840516150 840310037 840166926 839887977 839677513 839336336 839097798 838760316
2524.5H38760316k00748l62575k40326j99795Q5354L7015J2576k75314l85225p55071
$$ 838760316 838559568 838196993 837956667 837756872 837842226 837879241 837891817 837616503 837231278 836476207
2543.8H36476207q85606j385152j648665j988172j809836j288771k10584M23909P38918
$$ 836476207 835590601 834205449 832556784 830568612 828758776 827470005 827259421 827683330 828422248
2561.1H28422248L67046J9014o55294j146555j807093k379597l179729l576397l774643
$$ 828422248 828789294 828808308 828153014 827006459 825199366 822819769 819640040 816063643 812289000
2578.5H12289000k891660j306653P14481J860201K146602J611769J018822K65539P1108
$$ 812289000 809397340 808090687 808805168 810665369 812811971 814423740 815442562 815708101 815779209
2595.8H15779209L22163J304090J853943J725316R88186M71532j34945n38230j094401
$$ 815779209 816101372 817405462 819259405 820984721 821972907 822444439 822309494 821771264 820676863
2613.2H20676863j510978k142965k565801k749503j835048n80490K99692L6001o93977
$$ 820676863 819165885 817022920 814457119 811707616 809872568 809292078 809591770 809627771 808933794
2630.6H08933794j726150k456069l394663m076004m255236k607226N40972L583669
$$ 808933794 807207644 804751575 801356912 797280908 793025672 790418446 790959418 794543087
2646G94543087M218281L014922J177192K10583j69218M1426K34007O23584R06408J283348
$$ 794543087 798761368 801776290 802953482 803164065 802994847 803036273 803270280 803893864 804800272 806083620
2665.3H06083620J181602J002669L84212k22206j007974j361728j696467j480520j120448
$$ 806083620 807265222 808267891 808652103 808429897 807421923 806060195 804363728 802883208 801762760
2682.6H01762760n53429m12226m04954q01087r21547q49605l68952l1531K84433N1320
$$ 801762760 801209331 800797105 800392151 799591064 798669517 797819912 797450960 797419429 797703862 797755182
2701.9G97755182l54648j186192j737893k074420k109587k455175l130972m426122
$$ 797755182 797400534 796214342 794476449 792402029 790292442 787837267 784706295 780280173
2717.3G80280173n594433o613969o856025o459295n630315n026340m271388m058898
$$ 780280173 774685740 768071771 761215746 754756451 749126136 744099796 739828408 735769510
2732.8G35769510m373014n750000p802010j0536134j3569117j7014324j9062579j8190503
$$ 735769510 731396496 725646496 717844486 707308352 693739235 676724911 657662332 639471829
2748.2F39471829j3624907p758736k178848K942920Q412182J3171256J6692996J8376827
$$ 639471829 625846922 618088186 615909338 618852258 627264440 640435696 657128692 675505519
2763.6F75505519J8438876J6923368J4775097J2012064R471476P306993N644739M031062
$$ 675505519 693944395 710867763 725642860 737654924 747126400 754433393 760078132 764109194
2779G64109194L133714K522648K235651J700044J626253J594782J603782J125872N74171
$$ 764109194 767242908 769765556 772001207 773701251 775327504 776922286 778526068 779651940 780226111
2796.4G80226111J0789m81486j465142k274275l330886m172326m913032n530476o376326
$$ 780226111 780236900 779755414 778290272 776015997 772685111 768512785 763599753 758069277 751692951
2813.8G51692951o877721p508576q029699q849501r794653j1223674j2625813j3636709
$$ 751692951 744815230 737306654 729276955 720427454 710632801 699409127 686783314 673146605
2829.2F73146605j3007521j0976195q711815q323133j0351599j4301776j7677486j8861056
$$ 673146605 660139084 649162889 640451074 632127941 621776342 607474566 589797080 570936024
2844.6E70936024j6183495j0876358n385518k330959j953900l937363p410586j1811376
$$ 570936024 554752529 543876171 538490653 536159694 534205794 530268431 522857845 511046469
2860E11046469j4982968j5097291j1529743o071300k86162M509837Q550763J1453182
$$ 511046469 496063501 480966210 469436467 463365167 463079005 467588842 476139605 487592787
2875.5D87592787J3741046J5523851J7228484J8311977J9083321J9140899J8813313
$$ 487592787 501333833 516857684 534086168 552398145 571481466 590622365 609435678
2889F09435678J7823338J6586781J5042305J3927280J2721360J1368573R899974Q905291
$$ 609435678 627259016 643845797 658888102 672815382 685536742 696905315 706805289 715710580
2904.4G15710580P847906O774127N761683M968941M006624L277839K518177J947522
$$ 715710580 723558486 730332613 736094296 741063237 745069861 748347700 750865877 752813399
2919.8G52813399J382410J216770J026928Q75711Q56758J169085R17971O83069M49956
$$ 752813399 754195809 755412579 756439507 757315218 758171976 759341061 760259032 760942101 761392057
2937.2G61392057L53694P272n5850r6321q8155k51115m43637o17385n63502p17283
$$ 761392057 761745751 761753023 761697173 761600852 761512697 761261582 760817945 760200560 759637058 758919775
2956.5G58919775q67545j065552j043976j062929r92656j222193j412094j749516j944005
$$ 758919775 758052230 756986678 755942702 754879773 753887117 752664924 751252830 749503314 747559309
2973.8G47559309k368808k671122l005922l179670l284990k963662k625168k229273
$$ 747559309 745190501 742519379 739513457 736333787 733048797 730085135 727459967 725230694
2989.2G25230694j755059r98080j81794P82073R25183N76973j28746j001716j961052
$$ 725230694 723475635 722477555 722295761 723077834 724003017 724579990 724451244 723449528 721488476
3006.6G21488476k528966l299236m186809n352259o233275o653666n535841k843022
$$ 721488476 718959510 715660274 711473465 706121206 699887931 693234265 687698424 684855402
3022F84855402J71065J145720Q53122L68118J58369K52009N40018N11169N44489q7261
$$ 684855402 685026467 686172187 687025309 687393427 687551796 687803805 688343823 688854992 689399481 689312220
3041.3F89312220r29714k025008l095031m366755o128013q303225j0022283j1960804
$$ 689312220 688382506 686357498 683262467 678895712 672767699 664464474 654442191 642481387
3056.7F42481387j3001204j2693405j0672987q232116o196439n468250l858268l09646
$$ 642481387 629480183 616786778 606113791 597881675 591685236 586216986 582358718 582049072
3072.2E82049072M922926R531796J1426211R875536O443023K788186J25051q57651
$$ 582049072 586971998 596503794 607930005 617805541 624248564 627036750 627161801 626304150
3087.6F26304150M62591L320039O628394R042144R770274R210467Q316696O895780
$$ 626304150 626766741 630086780 636715174 645757318 655527592 664738059 673054755 679950535
3103F79950535N826414N032837M264057L403842K816022K345383J956523J449883J199662
$$ 679950535 685776949 690809786 695073843 698477685 701293707 703639090 705595613 707045496 708245158
3120.4G08245158R29713O40810K83480j7166q9944L17752J25051l16799n04791n8592
$$ 708245158 709174871 709815681 710099161 710081995 709992051 710309803 710434854 710118055 709613264 709554672
3139.7G09554672L09587P14659J378715K045692K132892J886368J493096J176298R11772
$$ 709554672 709864259 710578918 711957633 714003325 716136217 718022585 719515681 720691979 721603751
3157G21603751Q86321Q21769P35343M46379J01686m71652j091599j669526j897216
$$ 721603751 722490072 723311841 724047184 724493563 724595249 724123597 723031998 721362472 719465256
3174.4G19465256j912356j175403K52902K392113M055322M265904L066361K200365
$$ 719465256 717552900 716377497 716630399 719022512 723077834 727343738 730410099 732610464
3189.8G32610464J501262J014233P08342O59704J83522Q6487J49369J58429J31309
$$ 732610464 734111726 735125959 735834301 736494005 736677527 736764014 736913383 737071812 737203121
3207.2G37203121K83599Q2731J49370L06904J10745K36690L29376Q106Q9109J81734
$$ 737203121 737486720 737569451 737718821 738025725 738136470 738373160 738702536 738710642 738799751 738981485
3226.4G38981485K18809P5519J40369J67489J89841J05321K5213j20580L5107J75416
$$ 738981485 739200294 739275813 739416182 739583671 739773512 739878833 739904046 739783466 739818573 739993989
3245.7G39993989Q166j5378o0260q9109p1943j20640j73628l69012l59118k11477j82748
$$ 739993989 740002155 739986777 739926517 739837408 739765465 739644825 739471197 739102185 738743067 738531590 738348842
3266.9G38348842k43903j03533J4425m530j41263j77324k12312j40369q6546P1168
$$ 738348842 738104939 738001406 738015831 738011301 737870038 737692714 737480402 737340033 737253487 737324655
3286.2G37324655P2897Q046K39432L27528L26752M35651P7366k16901l86059k06113
$$ 737324655 737397552 737405598 737645030 737972558 738299310 738734961 738812327 738595426 738209367 738003254
3305.5G38003254r835J81794o4850j27792l77059n44488p16448q98183j227557j391411
$$ 738003254 737993419 738175213 738110363 737982571 737605512 737061024 736344576 735446393 734218836 732827425
3324.8G32827425j449883j791000k383113k901614l659368m359483m741967m704297
$$ 732827425 731377542 729586542 727203429 724301815 720642447 716282964 711540997 706836700
3340.2G06836700m520654l653050k640485j416624Q4579J624525K092421J806378N48005
$$ 706836700 702316046 698662996 696022511 694605887 694690466 696314991 698407412 700213790 700761795
3357.6G00761795n70595j395881k783657m068851m455805m268706l398299k404749
$$ 700761795 700191200 698795319 696011662 691942811 687487006 683218300 679820001 677415252
3373F77415252j405835j04368J316726K377749L544151M215539M535019M319072M384696
$$ 677415252 676009417 675905049 677221775 679599524 683143675 687359214 691894233 696213305 700598001
3390.4G00598001N009294M786134M142642L842056L348887L825783L689170K857387
$$ 700598001 705607295 710393429 714536071 718378127 721727014 725552797 729241967 732099354
3405.8G32099354K244532K125740J710892J662314J448929Q53181Q15392J062870M69804
$$ 732099354 734343886 736469626 738180518 739842832 741291761 742144942 742960334 744023204 744493008
3423.2G44493008M2379n2214K32160M37379K14279M7564M60029O32584M14014L09646
$$ 744493008 744535387 744483173 744715333 745152712 745366991 745414555 745874584 746507168 746921182 747230828
3442.4G47230828l06905K89739K69174o66022j72854q8155j17004l67164q9944K18630
$$ 747230828 746923923 747213662 747482836 746816814 746643960 746555805 746438801 746071637 745981693 746200323
3461.7G46200323k55585m83214r001j12653p6413j39534q1897o76811m73380L81589
$$ 746200323 745944738 745461524 745452523 745339870 745263457 745123923 745042026 744365215 743891835 744273424
3481G44273424k9743j016914l39330k02477o36339o54220l51906k24948o78718n48899
$$ 744273424 744243681 743226767 742887437 742684960 742048621 741394401 741042495 740817547 740138829 739589930
3500.3G39589930N45322J67430j188815l97801L24845o53446n11109n64278k55584
$$ 739589930 740135252 740302682 739113867 738716066 739040911 738387465 737876356 737312078 737056494
3517.6G37056494m50909k06113N58853l92377j16051j53899q35180r90927p3851L92378
$$ 737056494 736605585 736399472 736958325 736565948 736449897 736295998 735460818 734469891 734396040 734788418
3536.9G34788418q04484p15494j79172Q74818L92377j064599m93228J372516k4319
$$ 734788418 733983934 733268440 733089268 733964086 734356463 733291864 732798636 734171152 734146833
3554.3G34146833l78072J60217Q36134J85371k14219K336442L471256j574159j312077
$$ 734146833 733768761 733928978 734765112 734950483 734736264 737072706 740543962 738969803 737657726
3571.6G37657726K24948Q44121K32339l11435j783847j882792J693726P730126L715992
$$ 737657726 737882674 738726795 738959134 738647699 736863852 734981060 736674786 744404912 748120904
3589G48120904j034141O46234J992583M02272J46627Q14617l96013j517415j788J808941
$$ 748120904 747086763 747732997 749725580 750127852 750274479 751089096 750693083 749175668 749173880 750982821
3608.3G50982821q72970m45544P74920k131105M80533J990855j847685k176165j579524
$$ 750982821 750109851 749664307 750439227 748308122 748788655 750779510 748931825 746755660 745176136
3625.6G45176136J165510N450248m011213j180709j74641n48125j86264n4896k16901
$$ 745176136 746341646 751791894 747780681 746599972 746425331 745877206 745690942 745636046 745419145
3643G45419145j628995J715362N425215K306580m667282j835108L690779j91629j12533
$$ 745419145 743790150 745505512 750930727 753237307 748570025 746734917 750425696 750234067 750121534
3660.4G50121534M50909N25653l32117J341045O926239r79305p73012J0667503j153767
$$ 750121534 750572443 751098096 750765979 752107024 759033263 758053958 757280946 767948449 766794682
3677.7G66794682O12020P52389J236558N05805K688289O335914J625419j763165o48975
$$ 766794682 767406702 768159091 769395649 769901454 772589743 778925657 780551076 778787911 778138936
3695.1G78138936L21388r18806J583934J655877j655877j172721j4425L106773J429141
$$ 778138936 778460324 777541518 779125452 780781329 779125452 777952731 777938306 781045079 782474220
3712.4G82474220l150821k740443j42216Q94J630902Q72016J882791L6896j962960
$$ 782474220 779323399 776582956 776440740 776441634 778072536 778944552 780827343 780864239 778901279
3729.8G78901279J493156K070844M307330o84858k663076k188801J377940O138801
$$ 778901279 780394435 782465279 786772609 786087751 783424675 781235874 782613814 788752615
3745.2G88752615m697918N82277N007506j28746m045368p64071J443505N32806l072500
$$ 788752615 784054697 784636974 789644480 789515734 785470366 784706295 786149800 786682606 783610106
3762.6G83610106K72631J52171r25243J626253k204955k315640j608312j3471J817048
$$ 783610106 783882737 784034908 783109665 784735918 782530963 780215323 778607011 778593540 780410588
3779.9G80410588k334476j33276Q33392o65962j78218L6001r14454J107931J287877
$$ 780410588 778076112 777942836 778776228 778110266 777932048 777968049 777053595 778161526 779449403
3797.3G79449403k193212M915774K2411l590941L985166p40707j967370j482249J107872
$$ 779449403 777256191 782171965 782194376 778603435 782588601 781847894 779880524 778398275 779506147
3814.6G79506147L527939l586471L492832K143681m305482O62446p12692j274526R88245
$$ 779506147 783034086 779447615 782940447 785084128 780778646 781441092 780728400 779453874 780442119
3832G80442119p18236R5427K541542J237452j887202j07170r95338k038478j255453
$$ 780442119 779723883 779819310 782360852 783598304 781711102 781603932 780608594 778570116 777314663
3849.3G77314663j67430R702743q54969l783524k885402m38273J587510K265394l329933
$$ 777314663 777147233 786849976 785995007 782211483 779326081 778887808 780475318 782740712 779410779
3866.7G79410779l02433L322780l128350O68704l764689k986192J785576k042055k460599
$$ 779410779 779108346 782431126 779302776 779971480 776206791 773220599 775006175 772964120 770503521
3884.1G70503521J525521m595339j593888L024042j109719k180696K35796K583861
$$ 770503521 772029042 767433703 765839815 768863857 767754138 765573442 765809238 768393099
3899.5G68393099J376927K872825J761198j510143o83964P78497J03473M15862K366841
$$ 768393099 769770026 772642851 774404049 772893906 772209942 772988439 773091912 773507774 775874615
3916.8G75874615P98344l50117m60804J667738n94914r00030P24494J377881l69847
$$ 775874615 776672959 776322842 775862038 777529776 776934862 776034832 776759326 778137207 777767360
3934.2G77767360j222253l01361r00030J014292O00279j244724M45485N28336o01173
$$ 777767360 776545107 776243746 775343716 776358008 776958287 775713563 776159048 776687384 776086211
3951.6G76086211n21183j60157K03430K6107L69847K37644j89066Q3744J76370o5624
$$ 776086211 775565028 775404871 775608301 775634408 776004255 776241899 776052833 776136577 776312947 776247323
3970.8G76247323J4245J23382q8156l37481r0957J69218k9743j25945r894L77119k5213
$$ 776247323 776261568 776384950 776296794 775959313 775868356 776037574 776007831 775881886 775871992 776249111 776223898
3992G76223898j80960j29521l58283j92523
$$ 776223898 776042938 775913417 775555134 775362611
3999.8G75362611
$$ 775362611
##END=$$ End of the data block
##TITLE= 2-chlorobenzaldehyde
##JCAMP-DX= 4.24 $$ converted from ppm file from PSLC to Hz
##DATA TYPE= NMR SPECTRUM
##BLOCK ID=2
##ORIGIN= PSLC
##OWNER= public domain
##.OBSERVE FREQUENCY= 199.582950
##.OBSERVE NUCLEUS= ^1H
##SPECTROMETER/DATA SYSTEM= TECMAG APOLLO NTNMR
##$MODELS=
<Models>
<ModelData id="2ClbenzaldehydeH" type="MOL">
  Clbenzald

  created with ArgusLab version 4.0.1
 14 14  0  0  0  0  0  0  0  0  0 V2000
   -4.3317    3.6222    0.0616 C   0  0  0  0  0  0  0  0  0  0  0  0
   -5.3595    4.5938    0.1664 C   0  0  0  0  0  0  0  0  0  0  0  0
   -2.8972    3.9924    0.1637 C   0  0  0  0  0  0  0  0  0  0  0  0
   -4.6801    2.2668   -0.1454 C   0  0  0  0  0  0  0  0  0  0  0  0
   -6.7091    4.1998    0.0637 C   0  0  0  0  0  0  0  0  0  0  0  0
   -6.0308    1.8811   -0.2468 C   0  0  0  0  0  0  0  0  0  0  0  0
   -7.0464    2.8488   -0.1421 C   0  0  0  0  0  0  0  0  0  0  0  0
   -5.0190    6.2718    0.4195 Cl  0  0  0  0  0  0  0  0  0  0  0  0
   -1.9712    3.1850    0.0789 O   0  0  0  0  0  0  0  0  0  0  0  0
   -2.7002    5.0517    0.3228 H   0  0  0  0  0  0  0  0  0  0  0  0
   -3.9074    1.5143   -0.2273 H   0  0  0  0  0  0  0  0  0  0  0  0
   -7.4904    4.9417    0.1439 H   0  0  0  0  0  0  0  0  0  0  0  0
   -6.2860    0.8426   -0.4050 H   0  0  0  0  0  0  0  0  0  0  0  0
   -8.0834    2.5559   -0.2196 H   0  0  0  0  0  0  0  0  0  0  0  0
  1  2  4  0  0  0  0
  1  3  1  0  0  0  0
  1  4  4  0  0  0  0
  2  5  4  0  0  0  0
  2  8  1  0  0  0  0
  3 10  1  0  0  0  0
  3  9  2  0  0  0  0
  4 11  1  0  0  0  0
  4  6  4  0  0  0  0
  5 12  1  0  0  0  0
  5  7  4  0  0  0  0
  6 13  1  0  0  0  0
  6  7  4  0  0  0  0
  7 14  1  0  0  0  0
M  END
</ModelData>
</Models>
##$PEAKS=
<Peaks type="HNMR" xUnits="ppm" yUnits="arbitrary units" >
<PeakData id="1" title="H 13" peakShape="singlet" model="2ClbenzaldehydeH" atoms="13"  xMax="7.43" xMin="7.33"  yMax="10000" yMin="0" />
<PeakData id="2" title="H 13" peakShape="singlet" model="2ClbenzaldehydeH" atoms="12"  xMax="7.49" xMin="7.39"  yMax="10000" yMin="0" />
<PeakData id="3" title="H 13" peakShape="singlet" model="2ClbenzaldehydeH" atoms="14"  xMax="7.58" xMin="7.48"  yMax="10000" yMin="0" />
<PeakData id="4" title="H 13" peakShape="singlet" model="2ClbenzaldehydeH" atoms="11"  xMax="7.93" xMin="7.88"  yMax="10000" yMin="0" />
<PeakData id="5" title="H 13" peakShape="singlet" model="2ClbenzaldehydeH" atoms="10"  xMax="10.52" xMin="10.32"  yMax="10000" yMin="0" />
</Peaks>
##XUNITS= HZ
##YUNITS= ARBITRARY UNITS
##NPOINTS= 20607
##FIRSTX= 2394.86559125
##LASTX= -100.468180950270003991659
##FIRSTY= 9.9076199910786596e-003
##MAXY= 100.
##MINY= -0.3244203452383792
##XFACTOR= 0.038075771670525969960027
##YFACTOR= 1.52587890625e-003
##XYDATA= (X++(Y..Y))
62897Fk2M1k2k8j5N3l0OK0m8O1k5J8M2p6j1J1m9P5l2l4K9pM1m4prM9M8Jp7N9j1lj4j6N0n8
$$ 6 -16 25 3 -25 -40 13 -17 -11 9 -39 22 -3 15 57 -19 -30 -19 -68 7 -25 -59 -30 -37 4 -40 -47 -56 -7 41 42 -35 24 13 10 -4 -20 30 -28
62777b8PJ9k3K0L6o4Nj6Q5j7K3p2L1k3NOJ4j1M6n7j3J4J7j8L0o7L3mL7nn1J7O1n7K4k0M1
$$ -28 -21 -2 -25 -5 31 -33 -28 -44 41 24 47 -25 6 -17 -12 -6 8 -3 43 -14 -27 -13 4 -14 16 -51 -18 -22 15 10 -41 -24 37 -20 4 -16 25
62659B5n7j5R5p6N0l3N1mj2lo4PO0m3J4Ml2L1j2N1k4l5N4l2j0K1n6mN8k2j4K0l1L0j4L9l
$$ 25 -32 -47 48 -28 22 -11 40 36 24 21 -43 -36 24 -19 -5 -1 -33 -2 -14 37 13 -22 32 0 -10 11 -45 -49 9 -13 -27 -7 -38 -8 -22 17 14
62541A4n6N1j7k6M4K4k1Tl5OM8m0k0j6M3K3K7n0M1m8J2L0Rn6QTN4Mk9J5n2n3Q6l0K6qk9M
$$ 14 -42 9 -8 -34 10 34 13 -8 -43 -37 11 -29 -49 -65 -22 1 28 -22 19 -29 -17 13 22 -34 -26 -18 36 40 11 26 -26 -79 7 -23 3 -5 -34 -30
62420c0N9qk1k8OKj3QM2n0qMO4l3k6P6p1j5LOJ1M5N4p7k7J6j2N1j4ln0J02j29N3J3M8q0L7
$$ -30 29 21 0 -28 -22 -20 -33 -25 17 -33 -41 -37 27 -6 -32 44 -27 -42 -39 -33 -22 23 77 0 -27 -11 -23 28 14 11 -39 63 -66 -13 0 48 -32 5
62299En1P5l0o4O0j1L8k5k7j2LM2J8jm9J4K2l2M6nk3nm5P0j7kJ7k7m8K6R2m1j8m1Q0o6L0
$$ 5 -46 29 -1 -65 -5 -16 22 -3 -30 -42 -39 3 21 20 -29 -15 7 -25 21 16 -7 -12 -57 13 -4 -6 11 -16 -64 -38 54 13 -5 -46 34 -32 -2
62182bK2On2O1p1R2o0M0k9Kl3N1l0J7o9k7J18n4j2kk8O7K5l4O0j05L7NK4j6J9j9j6K3Kk4
$$ -2 20 26 -26 35 -36 56 -4 36 7 9 -24 27 -3 14 -55 -82 36 -18 -30 -32 -60 7 32 -2 58 -47 -10 -5 19 3 22 3 -13 10 12 -12
62067a2k1K0K5k4J4Om6N7Qn8j2O3m6K5J7k0j0J0j1qj6N1k9j0j3K4j7pQjk8P7j8j7J4l5rP3
$$ -12 -33 -13 12 -12 2 8 -38 19 27 -31 -43 20 -26 -1 16 -4 -14 -4 -15 -23 -39 12 -17 -27 -40 -16 -33 -40 -32 -33 -61 16 -2 -19 -5 -40 -49 24
61946B4l9M0p7N4M5n7j0m0P5m7K8l9M7l2K7j4J0n0P3j7k3kL5J2l3m2K0L1m5J7J6j5l7K9N5
$$ 24 -15 25 -52 2 47 -10 -20 -60 15 -32 -4 -43 4 -28 -1 -15 -5 -55 18 1 -22 -24 11 23 -10 -52 -32 -1 -46 -29 -13 -28 -65 -36 19
61835A9J4m7P2j3o8pJ3K9l9K2k6RM2l7NPK1J1l1L4l4K7m4RlL3k6n7L5OJ8NmJ7l7K1J8pK0
$$ 19 33 -14 58 45 -23 -30 -17 12 -27 -5 -31 -22 20 -17 -12 -5 16 27 -4 30 -4 23 -21 -12 -15 18 -8 -65 -30 -24 -6 -1 -5 12 -25 -4 14 7 27
61711B7k1J5j3m3Qm0K0M9qj3L0o3%P6l3qK9To9K1k7K7o1O3k1L8qj0m2RJ5L6rl2K3K8o7PO6
$$ 27 6 21 8 -35 -27 -67 -47 2 -6 -19 11 -52 -52 24 -9 -17 12 41 -28 -7 -34 -7 -68 -5 -26 12 4 -6 -48 -39 -24 12 3 -29 -6 22 -45 -38 28
61587B8l2J2l6K0ol7O8o5K7k8K5j8Noj9K9Tlj7k7R2Mm8l1j7N6m2K2l6M9j4kK0j8Rk4K6k7
$$ 28 -4 8 -28 -8 -14 -51 17 -48 -21 -49 -24 -42 -37 -43 -62 -33 -4 -7 -24 -51 41 45 -3 -34 -51 5 -37 -15 -51 -2 -16 -18 2 -16 -7 -31 -5 -32
61466c2L0N9p6O1o5Qj7L6o9M0oQO2n2j2L0l1MlO3k5l5n8O8l6JK1%j9K9KK0ll3K0j8K0n9M6
$$ -32 -2 57 -19 42 -23 -15 -32 4 -65 -25 -31 -23 39 -13 -25 5 -26 -22 -25 38 13 -22 -80 -12 -48 -47 -26 -26 -45 -16 -14 6 3 -30 -10 -28 -8 -67 -21
61342b1k2L9M8p7P9l3l0l5M7L9j2%Lo3l7O3RO4r9J3j8N6j07Q9J2oj6O4q7k7N7K9K2n3j0M6
$$ -21 -43 -4 44 -33 46 13 -17 -52 -5 34 22 22 25 -38 -75 -12 -3 61 -38 -25 -43 13 -94 -5 7 1 -15 49 -38 -65 -8 21 43 -10 -20 26
61228B6m9OJK6J8pn4L0%mn6K6M7o2K9MJ9KK8l7qK3n5PN1n9L4J7j4M2o9K2M2m7Q1r4j0qK8q
$$ 26 -23 -17 -16 10 28 21 -33 -3 -3 -7 -63 -37 10 -52 -23 -19 0 2 30 -7 -15 8 -47 -40 11 -48 -14 3 -11 31 -38 -16 26 -21 60 -34 -44 -52 -24 -32
61100c2J9M7m1mJ2j7Mk2J3nK5K8p4K3J5k2K1J5%p7M8K3l2MnO4j20P4j3kQJ4qj2rJ2QNJ2K2
$$ -32 -13 34 -7 -11 1 -16 -12 -34 -21 -26 -1 27 -47 -24 -9 -31 -10 5 5 -72 -24 -1 -33 -29 -34 30 -90 -16 -29 -31 -23 -9 -17 -29 -38 -26 -18 -13 -1 21
60973B1k8k3M1n7M7j6k2M1Om1J5jNm5P5l6j9K4jrj9L8l1Nqk3K6NM3ok6%P0o6l6L2lML6l8
$$ 21 -7 -30 11 -46 1 -15 -37 4 10 -31 -16 -17 -12 -57 18 -18 -37 -13 -14 -23 -42 -4 -35 -30 -38 -61 -35 -30 13 7 -19 -19 51 -15 -51 -19 -22 -18 18 -20
60846b0J4N0j2n9N3l0k8j3M8j2j0j5oK3K0OJ6j7on3J9OJ5J0k2Ol5O3q1J14j02J5K3J2L2o7
$$ -20 -6 44 32 -27 26 -4 -32 -45 3 -9 -19 -34 -40 -17 3 9 25 8 2 -51 -32 -26 -11 -1 -23 -17 -52 11 -70 44 -58 -43 -20 -8 24 -43
60731d3P1j8m8TJ19q4L6nJ7%qKN8j08R0j6n1Q3Rp8RK3n5kN5J5r7J21l7M0o0j3n8P5l2O9l7
$$ -43 28 10 -38 -86 33 -51 -15 -20 -3 -3 -11 -9 49 -59 31 15 -36 47 56 -22 -13 10 -45 -47 8 23 -74 47 10 50 -10 -23 -81 -6 -38 31 -6
60614fn1Q1j7J5j25N8Q0o1K3j4K1n2L5J7k5J2o4L2Q0o2J3Kj8L4l6l5O2J0k3l6KJ01o5J2j5
$$ -6 -57 24 7 22 -103 -45 35 -26 -3 -17 4 -48 -13 4 -21 -9 -73 -41 39 -23 -10 -8 -26 8 -28 -63 -1 9 -14 -50 -48 53 -12 0 -15
60502a5k8J9M2q5P9ln1j9K5JL6l6M6j3k8lJ2QmJ8p8O8k4K1l8O6o1j1O0J8n4L6K4l7lK5k2n
$$ -15 -43 -24 18 -67 12 9 -42 -61 -36 -35 1 -35 11 -2 -30 -33 -21 -13 -17 1 -77 -9 -33 -12 -50 16 -45 -56 4 22 -32 4 28 -9 -12 13 -9 -14
60382a4k7mLK3k9J1K3J5m5N4mrl0J2L3J7n1M1%r2P3%J3n6O6p9M8j4%L8m4L7k3jl7L1LL9q
$$ -14 -41 -45 -42 -19 -48 -37 -14 1 -44 10 6 -3 -33 -21 12 29 -22 19 19 -73 0 0 13 -43 23 -56 -8 -22 -22 16 -28 9 -14 -15 -52 -21 -18 21 13
60258A3j4J1m8N3j4kjL4m9KJ7q2J17j09J05m5k9K4K7J8l6rK8m1N3j2m5O5k2n0J4nK4l8N4
$$ 13 -1 10 -38 15 1 -1 -2 32 -17 -15 2 -80 37 -72 33 -12 -41 -17 10 28 -8 -17 11 -30 23 11 -34 31 9 -41 -27 -32 -8 -46 8
60146Hl3rO5l9K4r7J1M6L7m2L2l0Q2p2LL5r1J7N1j9K8m0rP0k2J8l4J6n5K2J3M0mo1MM7Mk4
$$ 8 -25 -34 31 -8 16 -81 -70 -24 13 -29 3 -27 55 -17 -14 21 -70 -53 -2 -21 7 -33 -42 28 6 24 -10 6 -49 -27 -14 26 22 -39 -35 12 16 -8
60025hok3L5k7O9qj6m3K0n6R0q2K1TM3m7j0%L8K1r5Q2j6o8K5kKK6k9Pj6M5J5j9Ql6M0J8n9
$$ -8 -14 -37 -2 -29 40 32 16 -27 -7 -63 27 -55 -34 -13 30 -17 -27 -27 11 32 -63 19 3 -65 -40 -42 -40 -14 -43 -36 -52 -7 8 -11 -3 -39 1 19 -40
59901d0K5Pj4N0m9k2J9J5L0m2LL0k3M2n7K2RN7l7o6P1qo1L4p0J10l9l7k4PnQ8m1l0L4qPL4
$$ -40 -15 -8 -22 28 -21 -43 -24 -9 21 -21 -18 12 -11 31 -26 -4 5 62 25 -41 30 22 -39 -5 -75 35 -4 -41 -65 -58 -63 25 -16 -46 -12 -20 -13 21
59781B1j18N5N6m5l9P4m2K7K0M2q1m4P2k0P0j10J10j4m3k3J1J7m1Q6n0j2j0QJ7QO0n3J1k4
$$ 21 -97 -42 14 -31 -70 4 -38 -11 9 51 -30 -74 -2 -22 48 -62 48 34 -9 -32 -21 -4 -45 41 -9 -21 -31 -23 -6 2 62 9 20 -4
59672dRr5P0l3J06j08Q0j44M9N3k5k7P9n8R8q1J4n1J1Q8j7k2n1M1N6q4L0j7j9L5M4j34Q2
$$ -4 5 -90 -20 -53 53 -55 25 -119 -70 -17 -42 -69 10 -48 50 -31 -17 -68 -57 31 14 -8 -59 -18 38 -46 -16 -33 -52 -17 27 -107 -25
59567b5L9o1J7L0m4mK2l2jJ01n1N5n8k2L9K6j01N2L8o4J15r2j2K8J3j0M0j00K6K8m6K9l4
$$ -25 14 -47 -30 0 -44 -48 -26 -58 -59 42 -9 46 -12 -34 5 31 -70 -18 20 -44 71 -21 -33 -5 8 -2 38 -62 -36 -8 -54 -25 -59
59462e9L8lL7m1N1q8K2k0NO2MJ9k1m8K7J5J8nm5J1J2%k0k9L6J2J0j2m8L7lj6K8l3O3n8L8
$$ -59 -21 -24 13 -28 23 -65 -43 -63 -58 4 8 27 6 -42 -15 0 18 13 -32 -21 -9 -9 -29 -58 -22 -10 0 -12 -60 -23 -26 -42 -14 -47 16 -42 -4
59345dk0LK8j7o9Q2J0j2M3m5j8J3Jr5N1L0M3OJ6p2O6o8K6k5K9JQTm4M0j7n7pL3N3k6m9L3
$$ -4 -24 -21 7 -10 -79 3 13 1 44 -1 -19 -6 -5 -100 -49 -19 24 30 46 -26 40 -28 -2 -27 2 3 11 19 -25 15 -2 -59 -66 -33 20 -6 -55 -22
59224b2m0M7J9k7lQL6L3l8l7l0M8j1Nj1rM0k6K7q9O1j6O8m4L7Pp4j2lO4k5pM9l0J0Mm7K3
$$ -22 -62 -15 4 -23 -26 -18 18 51 13 -24 -54 -6 -17 -12 -23 -32 8 -18 9 -80 -19 -35 33 -11 26 33 -41 -53 -56 8 -17 -24 25 -5 5 9 -38 -15
59103a5o0N8J1j7pK8k1O4m7j2J3L7n0m3L5J2j5K5k0%N4l9j2j7M5j9J6k3m0K5rLoK9J9M0q0
$$ -15 -75 -17 -6 -23 -30 -2 -23 41 -6 -18 -5 32 -18 -61 -26 -14 -29 -4 -24 -24 30 -9 -21 -38 7 -12 4 -19 -59 -34 -43 -40 -46 -17 2 42 -38
58985c8rK5K0m6K0l5Qo4R4m7N5M0l7jN9m0j2Ko8J22k6m6k0L7j3N9m0j7mj8M7k0k8M4J4j6
$$ -38 -47 -22 -2 -48 -28 -63 -55 -119 -25 -72 -17 23 -14 -15 44 4 -8 -6 -74 48 22 -24 -44 -7 -20 39 -1 -18 -22 -40 7 -13 -41 3 17 1
58871Am8M8L8j09J04k6l4J7J5k4qL8j5m5O6j03L6J05n5n6K2L6J4p2P7j5q8L9J9qK7q1P1k4
$$ 1 -47 1 39 -70 34 8 -26 -9 6 -18 -26 12 -3 -48 18 -85 -49 56 1 -55 -33 3 17 -55 22 7 -81 -42 -23 -31 -4 -85 -14 -38
58763c8o7J34n5j8rO2n3K0N1l1l5K7j5k0KjL5J6l7L7k5K0k1m4O1p6M5j2L6Kj0j1l6M5k0m
$$ -38 -105 29 -26 -44 -53 9 -44 -24 27 -4 -39 -12 -27 -47 -45 -46 -11 5 -32 5 -20 0 -21 -65 -4 -80 -35 -47 -11 -9 -19 -30 -66 -21 -41 -45
58648d5P2n1M1n9L9J6j8k6k5J1O6J0l4Pkn8L7L5m4pO9mp2J6M2Kq9RNnL7j9j1K9KJ5L9n2j5
$$ -45 27 -24 17 -42 -3 13 -5 -31 -56 -45 21 31 -3 4 2 -56 -19 16 -28 -35 34 30 -42 -26 16 18 -71 -62 -57 -62 -25 -44 -55 -26 -24 -9 30 -22 -37
58524c7L7k2pRTl2k8R4n1K2m5mK2l2oL6K2J8l4k1O7o4J4J8M6n2j7kK2k0KM1K6p0j6M7l1T
$$ -37 0 -22 -29 -20 -11 -43 -71 23 -28 -6 -51 -55 -33 -65 -71 -35 -13 5 -29 -50 17 -47 -33 -15 31 -21 -38 -40 -18 -38 -36 5 31 -39 -55 -8 -39 -70
58403g0M7Q3j00M8Jl6j2L5K1m1L4r6L9P0l6n1j8M9M1o0j6M2K2j5J8j7k2j0j7k1M3M7p4N1
$$ -70 -23 60 -40 8 9 -27 -39 -4 17 -24 10 -86 -47 23 -13 -64 -82 -33 8 -52 -68 -26 -4 -19 -1 -18 -40 -50 -67 -88 -45 2 -72 -21
58295b1J8n3OP0l7j9K4M1q7N3o8R0k8l3RK2k7K1Ml2L3j9M0p7P7n3J7oJ1k5L5ok0l0N6kl2
$$ -21 -3 -56 -50 20 -17 -36 -12 29 -58 -5 -73 17 -11 -44 -35 -13 -40 -19 -15 -47 -14 -33 7 -70 7 -46 -29 -35 -24 -49 -14 -20 -40 -70 -14 -16 -48
58178d8L9N6j06L5M5oj01M1L8K8Mn7m0P2n0P2k4r2N3qO6n6k0KJ1pK6J8l7n1J07jro5J5oN2
$$ -48 -9 47 -59 -24 21 15 -86 -45 -7 21 25 -32 -72 0 -50 22 -2 -94 -41 -49 17 -39 -59 -57 -46 -53 -27 -9 -46 -97 10 9 0 -65 -50 -56 -4
58060dJjl5Pk4N4J6k9J8l4Mn8J02m4J0Jm4N3q7Q4k8kj2K8j6J0j7m5Q3j9J6L9j4o4L9jkl0
$$ -4 -3 -4 -39 -32 -56 -2 14 -15 3 -31 -27 -85 17 -27 -17 -16 -60 -7 -94 -10 -38 -40 -52 -24 -40 -30 -47 -92 -9 -28 -12 27 13 -51 -12 -13 -15 -45
57939d5L8l7J2J1M4o1oK2j9N8p6N7Jj2J9n2K3k7K5j4L1qnpL9n0N9o3K4j3K6%qjK5J5j1k7
$$ -45 -7 -44 -32 -21 23 -38 -44 -22 -41 17 -59 -2 -1 -13 6 -46 -23 -50 -25 -39 -8 -16 -21 -28 11 -39 20 -43 -19 -32 -6 -6 -14 -15 10 25 14 -13
57818a3j3p7R4k6O5n6N7p8RL3J8j6LJ8k8l4l9O7Nk3q1M9M2Jk5L1kk7R4j33Q5jqLKm9Omk7
$$ -13 -26 -103 -9 -35 30 -26 31 -47 -38 -5 13 -3 0 18 -10 -44 -83 -16 -11 -34 -115 -66 -24 -23 -48 -17 -19 -46 48 -85 0 -1 -9 -6 -4 -53 -47 -51 -78
57694g8P5o5Q1l7kJ3ol9Q2l8j0j7K9Jj3nRm5L2J6Lj4k8N7K9l8k1LN1k9km9j3Q5K0k5rj8L6
$$ -78 -3 -68 13 -24 -26 -13 -19 -58 24 -14 -24 -41 -12 -11 -24 -29 -20 -65 -33 -17 -14 -28 -56 1 30 -8 -29 -26 25 -4 -6 -55 -68 17 37 12 3 -15 21
57570B1o5k5L7k2j6P4n4KK7q2R3m5K5Tn2J2k5O8L2Mq5qJ0m3L3R5p8J1K5L4o0K1K0m0K7j2
$$ 21 -44 -69 -32 -54 -70 4 -50 -48 -21 -103 -10 -55 -30 -5 -57 -45 -70 -2 30 34 -51 -59 -49 -92 -59 36 -42 -31 -6 28 -32 -11 9 -31 -4 -16
57456a6k4l5L1oJ0M4k2J8k4lM6m1k1Q4o5j6L4l5K5TOnK2l4n2j5J09o2j0m7j0R7m2N2o1K3r
$$ -16 -40 -75 -44 -50 -40 4 -18 0 -24 -27 19 -22 -43 41 -24 -40 -6 -41 -16 9 15 10 32 -2 -54 -69 40 -22 -32 -79 -89 8 -34 18 -43 -20 -29
57338b9J5l9K3K2qj2L5n1J7mN0n1M0J4jl8r7J24j02O3jl0QM4K0j6p3Q0j01O8M3j5k7L8K0
$$ -29 -14 -53 -30 -8 -16 -28 7 -44 -27 -31 19 -32 8 22 21 -17 -114 10 -92 -29 -30 -60 -52 -8 12 -4 -77 3 -98 -30 13 -2 -29 9 29
57227B9L0J5J17M0j7j04j1O8K2N2p0L3j46J1ko5K4K1l6JJ7m0K3Qj4l1M8l9J2l2N8j5o0NM6
$$ 29 59 74 191 231 214 110 99 167 189 241 171 204 58 69 67 2 26 47 11 12 29 -11 12 20 6 -25 23 -16 -4 -36 22 7 -53 -48 -2
57115bm5Q4m0j4Lj8NL5k9plpJ7L8o5P8q2N6m8k8K7O0m3k6k1M0PRk1K9n9N9Oj01R2k2Rnn2
$$ -2 -47 37 -3 -17 -14 -32 -27 8 -21 -28 -31 -38 -21 17 -48 30 -52 4 -44 -72 -45 15 -28 -54 -75 -35 -28 -19 -40 -11 -70 -11 -5 -106 -14 -36 -27 -32 -84
56991h4P0p2NM3R3o6k1k8J3M6%Pp7R0k6%n5P1k1n0J9M0L8k8K9m4L2k0J3Mj7j3j2O9L6j20
$$ -84 -14 -86 -81 -38 55 -11 -32 -60 -47 -1 -1 6 -71 19 -7 -7 -62 9 -12 -62 -43 -3 35 7 36 -8 24 4 17 21 4 -9 -21 48 84 -36
56877c6j8J6J5j8Rl7N3k0O4n8K7Nm5K8J0kk0o%L7j1k3j4P6k2l7L5m7m3N8kRlj4O6o2M4Ll4
$$ -36 -54 -38 -23 -41 -32 -69 -16 -36 28 -30 -3 2 -43 -15 -5 -7 -27 -33 -33 4 -7 -30 -44 32 10 -27 8 -39 -82 -24 -26 -17 -20 -34 32 -30 14 17 -17
56753a7Qm6JL8j0K4n9O0km8L3k4j6O7k8k2%Kk3M9noLj2PJ4l0K0j8J5L4j2Ll9%m5R7n8L5o2
$$ -17 -9 -55 -54 -16 -26 -2 -61 -1 -3 -51 -18 -42 -58 9 -19 -41 -41 -39 -62 -13 -18 -24 -21 -33 -26 -12 -42 -22 -40 -25 9 -3 0 -39 -39 -84 13 -45 -10 -72
56626g2l5J21r4P3l9N0r0J22n1o0L0M9Pj0K2j4j3q1P6m9L2pj6OJ9n1J7N4k6L6r2P9J0k4m3
$$ -72 -107 14 -80 -7 -46 4 -86 36 -15 -75 -45 4 11 1 23 9 -4 -85 -9 -58 -26 -33 -49 -43 -24 -75 -58 -4 -30 6 -86 -7 3 -21 -64
56514f4K3L6MJ4j9l8n8N1J5NM2K0K8o1K2j12L2K0m7oN0l0j0L4L8k8l7L6l4L7K4Oo6n5J26
$$ -64 -41 -5 -1 13 -6 -44 -102 -51 -36 -31 11 31 59 -2 20 -92 -60 -40 -87 -93 -43 -73 -83 -49 -11 -39 -76 -40 -74 -37 -13 -7 -73 -128 -2
56403bm2pJ1K6m1L4J9k5J3q2J07k9j7N6m2J4j3pk8L2j4j2qj4P2k0o0L8MjP8l0r9Q9l1j3%
$$ -2 -44 -51 -40 -14 -55 -21 -2 -27 -14 -96 11 -18 -35 21 -21 -7 -20 -27 -55 -23 -37 -49 -57 -71 1 -19 -79 -41 -37 -38 40 10 -89 0 -31 -44 -44
56285d4J9L1o2M0j7L2m6P0o9M9k6M0r2J09m8j1mqL8L5k7p1pK8pL3r6N7K8M4m6OJ0lKm5O9
$$ -44 -25 6 -56 -16 -33 -1 -47 23 -46 3 -23 17 -75 34 -14 -25 -29 -37 1 36 9 -62 -69 -41 -48 -15 -111 -54 -26 18 -28 -22 -12 -15 -13 -58 11
56168A1m3O5m2lkm5Pj2J2mML1m2NJ0j4K2n4Q5Mno5Q1J4m3L2j6jn2JM9Pm3RK5j9o1P1J8q2
$$ 11 -32 33 -9 -12 -14 -59 -52 -64 -52 -56 -52 -21 -63 -58 -48 -62 -40 -94 -9 -5 -10 -75 6 20 -23 9 -7 -8 -60 -59 -10 -3 -46 -37 -12 -31 -92 -21 -3 -85
56040h5N2k1O8q5QL5K4jm2j1M3n5O6L3q2M0rk3R5o1rK4m4J4Kj4m7k5k9J61j00P6%l3K5l0
$$ -85 -33 -54 14 -71 -63 -28 -4 -5 -47 -58 -15 -70 -4 29 -53 -13 -22 -45 50 -11 -20 4 -40 -26 -24 -38 -85 -110 -139 22 -78 -2 -2 -35 -10 -40
55926d0N4l5p3R1p4N6J4Lj03Q2J7J4J0L0k7k3Qn8M8m7Q9p3LM9r3L2N6rM1l2j0m5jO7o4oM6
$$ -40 14 -21 -94 -3 -77 -21 -7 -4 -107 -25 -8 6 16 46 19 -4 4 -54 -6 -53 36 -37 -34 15 -78 -46 10 1 42 10 0 -45 -46 21 -43 -49 -3
55808cn7L8l3kJ0nL3j2k2J08j32pJ10m4m1OK4l2L1j0K7k0M1j8l6R8o2j0Jk8o7R8K7%k3J2
$$ -3 -60 -22 -55 -57 -47 -52 -19 -31 -53 55 -77 -84 26 -18 -59 -53 -29 -61 -30 -40 -13 -33 8 -10 -46 52 -10 -20 -19 -47 -114 -16 11 11 -12 0
55694@k1K6n4Qm0N5l4P1m0j4J4n1R6q5mL9l7N6RM4n6j8M7j3kn0N8k4l3N5l9K1k3n8Q9L5r4
$$ 0 -21 5 -49 -41 -81 -26 -60 11 -29 -43 -29 -80 16 -69 -73 -34 -71 -15 -6 38 -18 -36 11 -2 -4 -54 4 -20 -53 2 -37 -16 -39 -97 -8 27 -67
55576f7R5j27M8J9n4O1k0LM9k9k6N7q6N6pK9n1MJ3M5q6N0l7mR1k8ol8j8R9q1n5N6km4P2P
$$ -67 28 -99 -51 -32 -86 -25 -45 -42 7 -22 -48 9 -77 -21 -28 1 -50 -46 -33 12 -74 -24 -61 -65 26 -2 -8 -46 -64 35 -46 -101 -45 -47 -91 -19 -12
55458a2m3J9kK5K8o1l9OM9j7N4r1J12j03Q8k1Kj3mQj7rmm2RL4QK0Q3q4nk6k2K7J3pj8J03
$$ -12 -55 -36 -38 -13 15 -46 -85 -79 -30 -47 7 -84 28 -75 13 -8 -6 -19 -23 -15 -32 -41 -45 -87 -78 -44 -36 -16 67 -17 -22 -48 -70 -43 -30 -37 -55 48
55337D8l1Ml6m7nK7L4jp7O5Rn1M6n7J09j5mQo5pJ9l5L6K0o8Q8k6k3l1O3Rrj0k6J6%L6Ln7
$$ 48 17 21 -15 -62 -67 -40 -6 -7 -84 -19 -10 -61 -15 -72 37 22 18 26 -39 -46 -27 -62 -26 -6 -74 14 -12 -35 -66 -3 6 -3 -13 -39 -23 -23 13 16 -41
55213d1J8rPj3n5M4K5K3o4M0J3J0J2J9j4o3P7J0O3q6N5qO3O4N9m5J4l8J1nrJ15l8k4j04o3
$$ -41 -23 -32 -25 -38 -93 -49 -24 -1 -65 -25 -12 -2 10 29 15 -48 29 39 102 16 71 63 126 190 249 204 218 180 191 186 177 292 254 230 126 63
55099F3OQmm6nN9p0nN1n3k7Q5q3O9k4j9K9JP0q1O0K8l4k8pM6L9%m3%oM7L6p5P6j0R0q9K2
$$ 63 69 77 73 27 22 81 11 6 57 4 -23 62 -21 48 24 5 34 35 105 24 84 112 78 50 43 89 128 128 85 85 79 126 162 87 163 153 243 154 176
54975A76J1Q3qO1kk8M2m9k4O2n7M8L7o0P9M6JL4J14j0L7K4Q4o3J24n0KJ34K91J1J80Q8Q3
$$ 176 187 270 262 323 321 293 335 286 262 324 267 315 352 292 371 417 418 452 566 556 593 617 701 638 762 712 714 848 1139 1150 1330 1418 1501
54870A501L39M00L20L44J48M23R50K010M089O983R938J1287L231l046r143l569N386P805
$$ 1501 1840 2240 2560 2904 3052 3475 4425 6435 10524 17507 27445 38732 41963 38917 29774 26205 31591 39396
54813C9396P120l724n738j3751o454k954l090k702j611j195q97o06l11l51k83k07j08r6JT
$$ 39396 46516 42792 37054 23303 16849 13895 10805 8103 6492 5297 4400 3794 3483 3132 2849 2642 2534 2438 2439 2440
54749B440L8j2k9lj26k3l8j1J22l6n9j21r2q5r0mj52j29nr5n0j10n9k6j54L7ko2j0k3p9O3
$$ 2440 2478 2466 2437 2434 2308 2285 2247 2236 2358 2322 2263 2142 2050 1965 1875 1871 1719 1590 1585 1490 1440 1330 1271 1245 1091 1128 1126 1064 1054 1031 952 1015
54647A015j19L6O8n5l2k3j71J07j03J5o5J8k5k3oPJ9k2j6K9j29J2ll5P1n6J6l2K2k4j60O3
$$ 1015 896 932 1000 945 913 890 719 826 723 738 673 691 666 643 637 644 663 641 625 654 525 537 534 499 570 514 530 498 520 496 336 399
54546C99jK3l8L5P0N0K1Rp8Lk4OK2J9k8k7j38J8Tq0L0j15j8J65p8o4J9j0K6kl5m4J04m1N2
$$ 399 398 421 383 418 488 538 559 568 490 493 469 475 497 516 488 461 323 341 359 279 309 194 176 341 263 199 218 208 234 232 197 153 257 216 268
54434B68q8KJ5j8O1r3R3n3Pj2K2m4M2K9m1j08M7O1l6J0j6K2m9Jk9O8m4l1NK8K7m6J3l5l3
$$ 268 180 182 197 179 240 147 240 187 194 182 204 160 202 231 190 82 129 190 154 164 148 170 121 122 93 161 117 86 91 119 146 100 113 78 45
54323D5Q2q2O9k4K0l8j2jk7J9k0MM9m2R8r2mPj9L3L2l3L1n7M8L3q3j7LR5q8M0l0J4J7m9L0
$$ 45 127 45 114 90 110 72 60 59 32 51 31 35 84 42 140 48 44 51 32 65 97 64 95 38 86 119 36 19 22 117 29 69 39 53 70 21 51
54205E1L5r5Q5l0o7Q0k5P0k8n3J2mJ7p5N4o3P3n7N2K2j6l9R3l6n1J9K4qn3P4l1J1n0k0L7
$$ 51 86 -9 76 46 -21 59 34 104 76 23 35 31 48 -27 27 -36 37 -20 32 54 38 -1 92 56 5 24 48 40 -13 61 30 41 -9 -29 8
54094Hl1P7l2rL1j6K1m4jM8k9J0J5J0q7J4N7k8R4j00J5l5Rl0P5j4kprKk0m2L6pJ0M5p6N1
$$ 8 -23 54 22 13 44 28 49 5 4 52 23 33 48 58 -29 -15 42 14 108 8 23 -12 -3 -33 42 28 26 19 10 12 -8 -50 -14 -21 -11 34 -42 9
53973Ik7N2l9j0M6j2j8K0J4l9K2o4Pl2P6Oq4N0o1J11j1l4k0J4L0l1mJJ8J9rm8L2j9N3M1o2
$$ 9 -18 34 -5 -15 31 19 1 21 35 -4 18 -46 -39 -71 5 11 -73 -23 -84 27 16 -18 -38 -24 6 -25 -29 -28 -10 9 0 -48 -16 -35 18 59 -3
53855cM1l5k7L9m9rk0R5Mo7k0pR4o4rN3k3Jp0O0l6J6K1pL3m2N9q1%L6j3O0j4o6L1K1K0r4
$$ -3 38 3 -24 15 -34 -43 -63 32 36 -31 -51 -58 36 -28 -37 16 -7 -6 -76 -16 -52 -36 -15 -22 11 -31 28 -53 -53 -17 -30 30 16 -50 -19 2 22 -72
53735g2R3qk6m7L0k1l0L9K0l2Q2j14R2Nm4J3LL0mk9Pl4N9ro7L7j3K3J3k9J6J0M6o3k3K7j5
$$ -72 21 13 -13 -60 -30 -51 -81 -42 -22 -54 28 -86 6 11 -33 -20 -17 13 9 -20 -13 -47 12 3 -64 -27 -40 -17 -4 -33 -17 -7 39 -24 -47 -20 -35
53617c5Kn9M6k2N2j0j5RM6k8jk7K4n4R6j6J3nMn9l4P6l6K2Oj1l2k0M5J3k1k5TkL7J02j03
$$ -35 -33 -92 -46 -68 -16 -26 -41 -32 14 -14 -15 -42 -18 -72 24 8 21 16 20 -39 -73 3 -33 -11 -5 -16 -48 -68 -23 -10 -31 -56 -81 -83 -46 56 -47
53499d7L0nL0J2oj01P3K3L5j32N1m9O1q3J27q8L4N5q1K4OJ4j1L7m3L8l3l2Q8n1nP0n8%m4
$$ -47 -17 -22 8 20 14 -87 -14 9 44 -88 -37 -86 -25 -108 19 -69 -35 20 -61 -37 -31 -17 -28 9 -34 4 -29 -61 27 -24 -29 41 -17 -17 -61
53388f1N4pK5k7Jmjj4Mk2Q1n8q9R4l8K4m9O0M0m0l6P3p7J07p8Q2q1J3k0N9Kj12N8m9P6k5
$$ -61 -7 -14 11 -16 -15 -19 -20 -34 -30 -52 29 -29 -118 -24 -62 -38 -87 -27 13 -27 -63 10 -67 40 -38 44 -37 -24 -44 15 17 -95 -37 -86 -10 -35
53273c5m3M3K9J1Op8P6l7n2O8k0k9K1OK6oJ0j8j2rn6K8mJ06J1p7Lkk7j6L2Tk4OK7nM8p4l7
$$ -35 -78 -35 -6 5 11 -67 9 -28 -80 -12 -32 -61 -40 -34 -8 -14 -4 -22 -34 -43 -99 -71 -75 31 42 -35 -32 -34 -61 -77 -45 -13 -37 -31 -4 -9 39 -35 -72
53149g2J10q3P7o5K8ql2o6J09J4N0p2k9l7N5p7Q1j7J8o4O0JJ3q1O4OnM7m7j8P8o1K8o7j2p
$$ -72 38 -45 32 -33 -5 -13 -45 -111 -2 12 62 -10 -39 -76 -21 -98 -17 -34 -16 -80 -20 -19 -6 -87 -23 -17 -22 25 -22 -40 38 -23 5 -62 -74 -81
53035h1M4J9m2J4nK2m7Q5m5J0M1k1mJ1m3l0L1K7m0J9Tl%J3J4p3L2m7N5j7j4J5M2j8M3K7o7
$$ -81 -37 -18 -60 -46 -51 -29 -76 9 -36 -26 15 -6 -10 1 -42 -72 -41 -14 -54 -35 -16 -19 -19 -6 8 -65 -33 -80 -25 -42 -56 -41 1 -17 26 53 -14
52917a4n2P2Jl1k9K4j4Lj5JM4J1Lo2J3j4J24q0k6J1M9J2o7L4k5l0k1K8J3m1N1J7k5L2j4n6
$$ -14 -66 6 7 -24 -53 -29 -43 -40 -55 -54 -10 1 4 -58 -45 -59 65 -15 -41 -30 19 31 -36 -2 -27 -57 -78 -50 -37 -78 -27 -10 -35 -3 -17 -73
52803g3R1L0j05N3L0J6q8N9l1J10j20K5%n7nO3p1j0P3n8oNk4m1J11l5J1n9P7M8n2j9Q9ln6
$$ -73 18 48 -57 -4 26 42 -46 13 -18 92 -28 -3 -3 -60 -65 -2 -73 -83 -10 -68 -74 -69 -93 -134 -23 -58 -47 -106 -29 19 -33 -52 37 34 -22
52691b2m9R8o9l5M7M4Jl3j9PQk5M6J7j23J07l8l6N0K3j42J15nl0K8L1K3%J0m0p8J16p1N7
$$ -22 -71 27 -42 -77 -30 14 15 -18 -37 -30 -22 -47 -1 16 -107 0 -38 -74 -24 -1 -143 -28 -33 -63 -35 -4 19 19 29 -11 -89 27 -44 13
52583A3l8l7M0kJ6O1l3l8N9q4l6O7n4j2%M7MpK5l1kpqJ40r5k0RNJ4%rJ7k3J1J5J0j4L8j48
$$ 13 -25 -62 -22 -24 -8 53 20 -18 41 -43 -79 -12 -66 -78 -78 -31 -27 -34 -9 -40 -42 -49 -57 83 -12 -32 -23 -18 -4 -4 -13 4 -19 -8 7 17 3 41 -107
52459a07P7O8n9lJ9j0K7nJ1R1j8rJ09Q0j12M9j01NK5L8O9n9Kq0n2Pj9l8L5J4r7K1O6n8Km4
$$ -107 -30 38 -21 -24 -5 -15 12 7 18 109 91 82 191 271 159 208 107 112 137 175 244 185 187 107 55 62 43 5 40 54 -43 -22 44 -14 -12 -56
52345e6Q7k5j8k5L5k4kJ3K1rk2O4qTM5qK3M5O5J4n4J6J00n2n3o3k6k9k5K6m5Koq2L4L3k0q
$$ -56 31 6 -12 -37 -2 -26 -28 -15 6 -3 -25 39 31 23 68 60 83 128 193 207 153 169 269 217 164 101 75 46 21 47 2 4 -2 -84 -50 -17 -37 -45
52224d5J54j18O2n0J0l4m6l0P7l0Q%M7o4J01q6Q5nr9j1L0l4R8p2N8k4m8P7m4l8J6M7j3l6p
$$ -45 109 -9 53 3 13 -21 -67 -97 -20 -50 -42 -42 5 -59 42 -44 41 36 -63 -74 -44 -78 20 -52 6 -18 -66 11 -33 -71 -55 -8 -21 -57 -64
52113f4NR0m3l1M7p0J07j27O1J5q5R1m8K5K4L1m1k8l7O4q7N4m3J36n7M4m3K2kl0pL0%J1mr
$$ -64 -59 31 -12 -43 4 -66 41 -86 -25 -10 -95 -4 -52 -27 -3 28 -13 -41 -78 -14 -101 -47 -90 46 -11 33 -10 12 10 -20 -27 3 3 14 10 1
51998AJ2pl8MJ4j6m4Q0n9N5r5R0j6l9Q3p2L3Kn0N8n7j3K2K8J9J7L8r5O3p7K6Kk2K7qJ2M1
$$ 1 13 6 -32 -28 -14 -30 -74 6 -53 2 -93 -3 -19 -58 25 -47 -14 -12 -62 -4 -61 -74 -52 -24 -5 12 50 -45 18 -59 -33 -31 -53 -26 -34 -22 19
51880A9j3o8O1k5n2j2M3N9p4K5k6K1OK6P2o0n4l6Q2J45j74N6Lk2o0P4m9o1J2Q0K7p8L5l4k
$$ 19 6 -62 -1 -26 -78 -90 -47 12 -62 -37 -63 -42 -36 -10 62 2 -52 -88 -6 139 -35 21 24 2 -58 16 -33 -94 -82 -2 25 -53 -18 -52 -54
51769e4J2L5k9l7N9J3L4m0rK4l5J8j4J0kpKm2Qj3N4%q0R5m1Jn8N2m3P3j5kQl1M0J8o2k8
$$ -54 -42 -7 -36 -73 -14 -1 33 -7 -16 8 -27 -9 -23 -13 -15 -22 -20 -62 -54 -67 -13 -13 -93 2 -39 -38 -96 -44 -87 -14 -29 -31 -23 -54 -14 4 -58 -86
51648h6J11n5qpN8j1l4jOj1J5L9o6J9Ml0j8K3k2KL1Rm3K8%J2k4L0M1oj02J39p4J7mJJ0p0
$$ -86 25 -30 -38 -45 13 2 -32 -33 -27 -38 -23 16 -50 -31 -27 -57 -75 -52 -74 -72 -41 -32 -75 -47 -47 -35 -59 -29 12 6 -96 43 -31 -14 -18 -17 -7 -77
51527g7K9RJ0k3Ok8O7p3O9k0O8q7J7N8o2j6P5l1M5o5J2p8Q2q0Q8KnM7Kj60R8l1P3q8O7k2
$$ -77 -48 -39 -29 -52 -46 -74 -7 -80 -11 -31 37 -50 -33 25 -37 -53 22 -9 36 -29 -17 -95 -13 -93 -5 -3 -8 39 41 -119 -21 -52 21 -67 0 -22
51413b2l8j9N9o7N2k1N1n9M2l4K6jN8l3l1K6j01K2J18l4l9L9k2n4P1k1LO7j54Q6Po0J1J10
$$ -22 -60 -79 -20 -87 -35 -56 -5 -64 -22 -56 -30 -31 27 -6 -37 -11 -112 -90 28 -6 -45 -6 -28 -82 -11 -32 -29 38 -116 -30 -23 -83 -72 38
51305C8j0n1n2R1n4K0L0l8K8o6j1P0n9K7qK0J9jpq4P5j3M7n4K4O2m3l5m4J9O3p4M1RrQj3
$$ 38 28 -23 -75 16 -38 -18 12 -26 2 -64 -75 -5 -64 -37 -45 -25 -6 -7 -14 -98 -23 -36 11 -43 -19 43 0 -35 -79 -60 3 -71 -30 -21 -30 -22 -35
51187c5j9J07j21J4rl0J00n7K5M4n4J7K5pn7O5K4j26M5P5n4k6m3J01n1J9nolLQ9q4K6K0k5
$$ -35 -54 53 -68 -54 -63 -93 7 -50 -25 19 -35 -18 7 0 -57 8 32 -94 -49 26 -28 -54 -97 4 -47 -28 -33 -39 -42 -39 50 -34 -8 12 -13
51076a3lJ7rN3m1k1j5TL1j3qJ11j33J5j9P8p0N0m9M2Mk8QnO6j01j6K0J5K0k1O8q6O6K2kr2
$$ -13 -16 1 -8 45 4 -17 -32 -47 -16 -29 -37 74 -59 -44 -63 15 -55 -5 -54 -12 -8 -36 -28 -33 33 -68 -84 -64 -49 -29 -50 18 -68 -2 20 18 -74
50958g4J14l9n9K7J5j9K8m8K5K2q5O7K7lj19J41ml5L1o3O6%o6M9n6O1j6J0k1m9P7n1L9J5R
$$ -74 40 1 -58 -31 -16 -35 -7 -55 -30 -8 -93 -26 1 -2 -121 20 16 -19 12 -51 15 15 -51 -2 -58 3 -13 -3 -24 -73 4 -47 -8 7 16
50847A6n0j6M0l3L7N0j20N1M5m8k7k1K1QK9L5j04J13l4J2n3j8J6P3l0k3j2N6j3m3On2Q4K
$$ 16 -34 -50 -10 -43 -6 44 -76 -25 20 -28 -55 -76 -55 -47 -18 17 -87 26 -8 4 -49 -67 -51 22 -8 -31 -43 13 0 -43 -37 -89 -5 -3
50739ck8l9J3M0k0k3J05r5RJ5R2j44K5M8k6K7p3N3Lj02R2Lj9J7q2LP6MQjk2K6M0o8P4m3j3
$$ -3 -31 -70 -57 -17 -37 -60 45 -50 -41 -26 66 -78 -53 -5 -31 -4 -77 -24 -21 -123 -31 -28 -47 -30 -112 -109 -33 -29 -21 -22 -44 -18 22 -46 28 -15 -28
50621b8m3j5N8n1MP1Nm5L3K8j16J35j04j0J1JJ13r7j5R7n2k9P1p9j6O6l0k0TP2m5j7J2m6
$$ -28 -71 -86 -28 -79 -75 -4 1 -44 -11 17 -99 36 -68 -78 -67 -66 47 -50 -65 32 -20 -49 22 -57 -73 -7 -37 -57 -77 -5 -50 -67 -55 -101
50513a01M9RP3Pn2n4M2l3j6O4l6k9O6J8l3ok8J6L6p3J0N0J9m1J10q4N4j12K6jJ5Npk9R4j1
$$ -101 -52 -43 30 37 -15 -69 -27 -60 -76 -12 -48 -77 -11 7 -26 -32 -60 -44 -8 -81 -71 -21 -2 -43 67 -17 37 -75 -49 -50 -35 -30 -37 -66 28 17
50398A7l1k0Q7p1K6Kl4q%m5Q0l1J5j9k4K4Lk9Ok1j8M4o4M4LmrK3mK4n5L7lm2Q3k6l3MM0j2
$$ 17 -14 -34 53 -18 8 10 -24 -32 -32 -77 3 -28 -13 -32 -56 -32 -29 -58 -52 -73 -91 -47 -111 -67 -64 -68 -77 -54 -58 -34 -89 -52 -55 -97 -14 -40 -73 -69 -29 -41
50271d1o8J28j09K1L7n9J9R0o5k4J7k8R0n1Jl4L1m7M6K5M5k1L2j07M5l2J2K1j3M0m8P9r9
$$ -41 -109 19 -90 -69 -32 -91 -72 18 -47 -71 -54 -82 8 -43 -42 -76 -45 -92 -46 -21 24 3 35 -72 -27 -59 -47 -26 -39 1 -47 32 -67
50166f7n1J06N0n7k3j4K8qL6m5o4R0j1LNm6NrJ6N6RQo4N8r6K3ON9K2j34j0J22l5N8p6K7l6
$$ -67 -118 -12 38 -19 -42 -56 -28 -36 0 -45 -109 -19 -30 -27 -22 -68 -63 -72 -56 0 9 17 -47 11 -85 -62 -56 3 25 -109 -119 3 -32 26 -50 -23 -59
50048e9L3P2l9r1J05k0m0L6J2n7Q3m2po5j9M3J1nPL0k4N1J5m3m5M4j7mK7K8J3n3L2o1Kk9
$$ -59 -26 46 7 -84 21 1 -39 -3 9 -48 35 -7 -14 -79 -98 -55 -44 -49 -42 -12 -36 15 30 -13 -58 -14 -31 -35 -8 20 33 -20 12 -49 -47 -76
49934g6J6J9Kj3oN9m4pr0J20l8%o6J28l2k2O6q9P0p5L4J5j0k0M2J1J6n2M1Mj8m2M2Jo2J0T
$$ -76 -60 -41 -39 -52 -58 1 -43 -50 -140 -20 -58 -58 -124 4 -28 -50 16 -73 -3 -78 -44 -29 -39 -59 -17 -6 10 -42 -1 3 -15 -57 -15 -14 -76 -66 -56
49816e6lJ4j7N6l6O5jn1lo7N5J0l4qL1K7oj9j3Mo3O7K0K2j5m5K5l0M7l3L8L1o5n2N8jO3m
$$ -56 -59 -45 -62 -6 -42 23 22 -29 -32 -99 -44 -34 -68 -76 -45 -18 -24 -43 -56 -52 -115 -48 -28 -6 -21 -66 -41 -71 -24 -57 -19 12 -53 -105 -47 -48 15 11
49695A1k5n1J7l5R3p9K1N6j57O8R1n8L1L5n5qN0lk2rM0qn4M3mK2k4n8L0K0Q1j07R2r3J2K
$$ 11 -14 -65 -48 -83 10 -69 -48 8 -149 -81 10 -48 -17 18 -37 -45 5 2 -20 -29 11 3 -51 -8 -12 10 -14 -72 -42 -22 59 -48 44 -49 -37 -35
49581c5m1Q0J6q5J1j6M2L5l9K6k9J4L0m7j2N4j3L5r8N1k4ol0J05m3o5N7p5J06j9J4l3l7Q0
$$ -35 -76 4 20 -65 -54 -70 -28 7 -32 -6 -35 -21 9 -38 -50 4 -9 26 -72 -21 -45 -51 -81 24 -19 -84 -27 -102 4 -15 -1 -34 -71 9
49473IJ4p4j4K2O0j00O8l9OO7Kj09K4Q4J3l5n3m4Q9mJ8l9j3MK0L2n3J10j18N0Mk0j04R2J4
$$ 9 23 -51 -65 -43 17 -83 -15 -54 -48 19 21 -88 -64 20 33 -2 -55 -99 -10 -14 4 -35 -48 -44 -24 8 -45 65 -53 -3 1 -19 -123 -31 -17
49361a7l3Nl7N2o0L1O2n3K3qQj0k1N9k8M4p9M5k2M1o1j6l2R5n2l2J38r1J00j26M3n2rP3k9
$$ -17 -50 -45 -82 -30 -90 -59 3 -50 -27 -35 -27 -37 -58 1 -27 17 -62 -17 -39 2 -59 -75 -107 -12 -64 -96 42 -49 51 -75 -32 -84 -93 -20 -49
49250d9Mk3NK7oK5Lpk7k5J02k9j13O6MM9k3M9j10M1OM0m7m5P0L0p4K7N4j06M5M6n1J1l2k6
$$ -49 -45 -68 -63 -36 -42 -17 -14 -21 -48 -73 29 0 -113 -47 -43 6 -17 32 -78 -37 -31 9 -38 -83 -13 17 -57 -30 24 -82 -37 9 -42 -31 -63 -89
49136h9P9j6L9o8l4J00n6L8j6K4p2N9L6k8Rq9J06n7L0r0O4nl3O3ml5pJ7oLm4N8m9K1rRK8
$$ -89 -10 -26 13 -55 -89 11 -45 -7 -23 1 -71 -12 24 -4 5 -84 22 -35 -5 -95 -31 -36 -69 -6 -10 -45 -52 -35 -41 -38 -82 -24 -73 -52 -61 -52 -24
49018b4p3M3K0J3Rk3K7J5l3O0q7PK7J9l5K5k3k4p6J19rRp4M4K0r6J8K7J18p9lJ0K0l4K7Lm
$$ -24 -97 -54 -34 -21 -12 -35 -8 7 -26 34 -53 -46 -19 0 -35 -10 -33 -57 -133 -14 -23 -14 -88 -44 -24 -120 -102 -75 43 -36 -39 -29 -9 -43 -16 -13 -17
48900a7j5M5m0TJ9k5O4Rj00J44k5j1k8q2P7K2j8mn4R9o0Rk5l3O1l8P8l8Rn7N0k0J8Lk6Q8
$$ -17 -32 13 -27 -67 -48 -73 -9 0 -100 44 19 8 -20 -102 -25 -3 -21 -25 -79 20 -40 -31 -56 -89 -28 -66 12 -26 -17 -74 -24 -44 -26 -23 -49 39
48786C9j19L8j0l1k0M8Q4l5q4O7p4N8L4p6N9m7O9K7l3TJ1M8n1l1O4L4m9Qp2O5K0m2pOk8K5
$$ 39 -80 -42 -52 -83 -103 -55 29 -6 -90 -23 -97 -39 -5 -81 -22 -69 0 27 -6 -39 -28 20 -31 -62 2 36 -13 -5 -77 -12 8 -34 -41 -35 -63 -38
48671c8m6O3N4q9L3jLn4M2K1J4k4L1j2n0k1O4m4N4n5j8j2N8j1m4R7q3qN4lK6k2K6j8pQOm8
$$ -38 -84 -21 33 -56 -23 -24 -21 -75 -33 -12 2 -22 9 -3 -53 -74 -10 -54 0 -55 -73 -85 -27 -38 -82 15 -68 -76 -22 -25 1 -21 5 -13 -20 -12 -6 -54
48550e4qj0N5J8m6Q%L6k4kK3p0P0j3q1O1K1nq0MO2j7OKJ3J2J3j5rqML8k7j9P3o3ml4nJ9R3
$$ -54 -62 -72 -17 1 -45 -37 -37 -1 -25 -27 -4 -74 -4 -17 -98 -37 -16 -21 -101 -97 -35 -52 -46 -44 -31 -19 -6 -21 -30 -38 -34 4 -23 -42 31 -32 -36 -70 -75 -56 37
48420C7r9pN3p5N4J4m9pK9p1N1MnP7l6n8P2J05j19k0n9M0RqP8r4J05k6kl8TpK0J9j9M2j9M
$$ 37 -62 -69 -16 -91 -37 -23 -72 -79 -50 -121 -70 -66 -71 6 -30 -88 -16 89 -30 -50 -109 -69 -60 -68 10 -84 21 -5 -7 -45 -83 -90 -70 -51 -70 -28 -47 -43
48299d3oJ4j5M1k3k5R7j44P7J4l6n0M2J6j0J9jM0k2m4Q4r4Q9Kj21J4M5PJ5K0m4J1n3N3n8
$$ -43 -49 -35 -50 -9 -32 -57 40 -104 -27 -13 -49 -99 -57 -41 -51 -32 -33 7 -15 -59 25 -69 20 22 -99 -85 -40 -33 -18 2 -42 -31 -84 -31 -89
48188h9N7j0K1K5j00Qj0J8O1L0k3n3Q8p0R4j03J8RL2k0k8J0oK6l2TO8k1k8N6m2r0M3O2m9
$$ -89 -32 -42 -21 4 -96 -88 -98 -80 -19 11 -12 -65 23 -47 47 -56 -38 -29 3 -17 -45 -35 -41 -15 -47 -79 -11 -32 -60 -4 -46 -136 -93 -31 -80
48077h0O8p0N5K9j40R1o9MO6M0n1L0p2R9m0j4L0K1l3L1n2K0l6O7m9jj8M5j1M1J1m6J2kj2
$$ -80 -12 -82 -27 2 -138 -47 -116 -112 -46 -6 -57 -27 -99 0 -40 -54 -24 -3 -36 -5 -57 -37 -73 -6 -55 -56 -74 -29 -40 1 12 -34 -22 -24 -36
47965c6p2R2k5k2K3k3O1j07O7m2Q8l4J7m7OK9m2J5O2J0k3l6K6m0K7L4l0n1M3K3q0L6O6j17
$$ -36 -108 -16 -41 -63 -40 -63 -2 -109 -42 -84 4 -30 -13 -60 -54 -25 -67 -52 10 20 -3 -39 -13 -53 -26 8 -22 -73 -30 -7 -87 -51 15 -102
47857a02Q1L4k0j27J64o4J2l0L9r1R7p6J5R0q1L3p7M0J1L3n5k2j1O1p5R7l0M3k1rM7p2J6
$$ -102 -21 13 -7 -134 30 -34 -22 -52 -13 -104 -7 -83 -68 22 -59 -26 -103 -63 -52 -19 -74 -96 -107 -46 -121 -24 -54 -11 -32 -41 6 -66 -50
47752e0k6L0n3O0K3J0l2n8L4LJ6K6o3K6L0m1K3K5m1L1k9K3l3M7m6n0O2K3l4kJ1k5N9J2Q
$$ -50 -76 -46 -99 -39 -16 -6 -38 -96 -62 -59 -43 -17 -80 -54 -24 -65 -42 -17 -58 -27 -56 -33 -66 -19 -65 -115 -53 -30 -64 -66 -55 -80 -21 -9 -1
47641aj00M9J2N8n5j8jM8m9O1J4%j3lK6n8M4L2r1j9k9M8L5Mk6M2o1J2m6O5L0l3L8j17O0l6
$$ -1 -101 -52 -40 18 -37 -55 -56 -8 -57 4 18 18 5 2 28 -30 14 46 -45 -64 -93 -45 -10 -6 -32 10 -51 -39 -85 -20 10 -23 15 -102 -42 -78
47526g8J01%j6p5j4N7L2k9m9J0N4q4Q8K4q1R8n0k4Oj0k0O8j00P8oN6k6m3k7N7k8o5P6j3j1
$$ -78 23 23 7 -68 -82 -25 7 -22 -71 -61 -7 -91 -3 21 -60 38 -12 -36 -30 -40 -60 8 -92 -14 -20 36 10 -33 -60 -3 -31 -96 -20 -33 -44
47415d4Ok5L8kj3l0P2j8J9l7%qN1o1m1L1J0rK6K7o4K5J4K7K4rn2J7Jo6P2J8M7j07L9l7K5
$$ -44 -38 -63 -25 -27 -40 -70 2 -16 3 -34 -34 -42 9 -52 -93 -62 -52 -61 -35 -8 -72 -47 -33 -6 18 9 -43 -26 -25 -91 -19 -1 46 -61 -22 -59 -34
47297c4j8J3K7J3n7K6q6R0n6Q6o8O6j4J6k6m1JL3k1Q0m4k7K3o1M7m6pL8m2mJ1P1n1N1n4m0
$$ -34 -52 -39 -12 1 -56 -30 -116 -26 -82 4 -64 2 -12 4 -22 -63 -62 -29 -50 30 -14 -41 -18 -79 -32 -78 -85 -47 -89 -93 -82 -11 -62 -11 -65 -105
47183a05M2O1q6N7j5j0N8L8r6k2j1J5N9p1j4P1lo0J1M2L6m9L4n3rN8q5K6J6PJ6J5l7%L0k6
$$ -105 -63 -2 -88 -31 -46 -56 2 40 -56 -78 -89 -74 -15 -86 -100 -29 -32 -92 -81 -39 -3 -52 -18 -71 -80 -22 -107 -81 -65 -58 -42 -27 -64 -64 -34 -60
47068f0K7NJ7k5K0K4kn4oj6L3k2qO9K5j1j2r2L6m4k3J00J0n1M6j34J16J2o0J6pM7j0J5m7
$$ -60 -33 -28 -11 -36 -16 8 6 -48 -54 -70 -37 -59 -67 2 27 16 4 -88 -52 -96 -119 -19 -9 -60 -14 -148 -32 -20 -80 -64 -71 -24 -34 -19 -66
46957f6O6o2R3J5l0j06O5npK0o8N0m2L5pM1K7qop0NL7KN6l6kl2%l0O4q5K4L7m3R9j4j22M0
$$ -66 0 -62 31 46 16 -90 -25 -30 -37 -17 -85 -35 -77 -42 -49 -8 19 11 5 -65 -60 -23 -21 35 -1 -3 -35 -35 -65 -1 -86 -62 -25 -68 31 17 -105 -65
46836f5L6l4j3N1l3n7L7j6M4l4JJ13o0Jjk5N2k8L3q7L4m0J06o1JLL1m6K3l8Q2j02O7P7l8
$$ -65 -29 -63 -76 -25 -58 -115 -78 -94 -50 -84 -83 30 -30 -29 -30 -55 -3 -31 2 -85 -51 -91 15 -46 -45 -42 -11 -57 -34 -72 10 -92 -25 52 14
46725A4r2J1TOK5m9o2Q1L8%q3M8K1l1k5J9j1M1n7Q2m4j3J2N7p8O2j0k5M6M3j09L7o9J6PJ6
$$ 14 -78 -67 -56 -50 -25 -74 -136 -55 -17 -17 -100 -52 -31 -62 -87 -68 -79 -38 -95 -13 -57 -70 -58 -1 -79 -17 -27 -52 -6 37 -72 -35 -104 -88 -81 -65
46610f5KJ6J1l3Rn1J05p6pO2j1k5LL5L8n8pL8o3N1P3q7jK3p7n1K8L5L9n4O0PkK1o9N5L0l7
$$ -65 -63 -47 -36 -69 -60 -111 -6 -82 -89 -27 -38 -63 -60 -25 13 -45 -52 -14 -77 -26 47 -40 -41 -18 -95 -146 -118 -83 -44 -98 -38 -31 -33 -12 -81 -26 4 -33
46490c3J5p9O4l3TRM8l4Q1m8j0N2K9o5n4kR8jm4o2O3M8q0N1m8k3N1m0Q0l3p3J0M1LK8o5N2
$$ -33 -18 -97 -33 -66 -99 -90 -42 -76 5 -43 -53 -1 28 -37 -91 -93 5 4 -40 -102 -39 9 -71 -20 -68 -91 -40 -80 0 -33 -106 -96 -55 -52 -24 -89 -37
46372c7Nl9j5L3KL3j1j11P0K2J3jnkk7Q7j07N2n9N2N5j04N3J8l4Tk1Q5lk8l9P9k2kl8J2J8
$$ -37 -32 -71 -86 -53 -51 -18 -29 -140 -70 -48 -35 -36 -41 -43 -70 17 -90 -38 -97 -45 10 -94 -41 -23 -57 -91 -112 -27 -30 -58 -97 -18 -40 -42 -80 -68 -50
46254e0K0K1l2P6j67J05j7N0o0q0N1L6L1n7R2r6J7m7P8J7n4O7l6kk8O1q1Q5l8n9K9M6n8L1
$$ -50 -30 -9 -41 35 -132 -27 -44 6 -54 -134 -83 -47 -16 -73 19 -77 -60 -107 -29 -12 -66 1 -35 -37 -65 -4 -85 0 -38 -97 -68 -22 -80 -49
46146d9j0L9j5RK6l6L3j1Pl5j0K8m3N5JK7Pj04NlL3L5q6M3onN0l8k4j9J1L7qL0n2O4LMj8
$$ -49 -59 -20 -35 -26 0 -36 -3 -14 -7 -42 -52 -24 -67 -12 -11 16 23 -81 -76 -79 -46 -11 -97 -54 -60 -65 -15 -53 -77 -96 -85 -48 -56 -26 -78 -14 -11 -7 -25
46022b5J1m6N2k0j3jM2q2O7on1R2o3M1p6L4J1m8k4R5Ok8J3L7p9jJ5M0k0M7k3loo3m4J34J5
$$ -25 -14 -60 -8 -28 -41 -42 0 -82 -15 -21 -72 20 -43 -2 -78 -44 -33 -81 -105 -10 -4 -32 -19 18 -61 -62 -47 -7 -27 20 -3 -6 -12 -75 -119 15 30
45904C0j35N8Q0q7K4r4J28n1R7r2n8P8j8j4J6K1K5j09J03l7J5M0j15nL7QKK2nPk8J19j31
$$ 30 -105 -47 33 -54 -30 -124 4 -47 50 -42 -100 -22 -40 -54 -38 -17 8 -101 2 -35 -20 20 -95 -100 -63 -55 -53 -31 -36 -29 -57 62 -69
45799f9k4J01qk2QL5j3n0J07m4j06M0K8l1M9j26J31l3M9q7L7q4O5QJ0Tl1TN5q1J10j7l2m9
$$ -69 -93 8 0 -22 -14 21 8 -42 65 21 -85 -45 -17 -48 1 -125 6 -27 22 -65 -28 -112 -47 -39 -29 -19 -50 -81 -26 -107 3 -14 -46 -95
45691i5K9QK8n1R3j02K2J05r1K2lj4QM9m0j2M9n2K6m2K8k5L0n3M6PJ9n7R9r6j9N7J9m9N4
$$ -95 -66 -58 -30 -81 12 -90 -68 37 -54 -32 -35 -49 -41 8 -32 -44 5 -47 -21 -63 -35 -60 -30 -83 -37 -30 -11 -68 31 -65 -84 -27 -8 -57 -3
45580cJ0o7j1mN7m8J7k5J7P2p9K4J6j2J7L4K8j04O0l4L3l3J1j5k8O2l8m5RP6o6K9M7q3J00
$$ -3 7 -60 -71 -75 -18 -66 -49 -74 -57 15 -64 -40 -24 -36 -19 15 43 -61 -1 -35 -2 -35 -24 -39 -67 -5 -43 -88 -79 -3 -69 -40 7 -76 24
45469B4q6N4p3K2J9J1o1J21m5j7k7Jk3J26n2pk2k4n4R3n2P9o5O5j3r1O7n5k7N1j9N1l7N7
$$ 24 -62 -8 -81 -59 -40 -29 -90 31 -14 -31 -58 -57 -80 46 -6 -13 -35 -59 -113 -20 -72 7 -58 7 -6 -97 -30 -85 -112 -61 -80 -29 -66 -9
45360in2L4L0K9p2m7O5K1j32K4J2L9KJ6n6J7O0l8ML3pL9K7m8TJ5J0M7j6lm8qj2NK8l8Q5m3
$$ -9 -61 -27 3 32 -40 -87 -22 -1 -133 -109 -97 -58 -56 -40 -96 -79 -19 -57 -53 -20 -27 12 39 -9 -57 -42 -32 15 -1 -4 -52 -60 -72 -67 -39 -77 8 -35
45240c5pnj5Pk8N6J2K1nJ9n8l3M6m0P3o9j9N3rj6L8l4J11j61N0J7L0l8oj5J8J6J5j8k6k5
$$ -35 -42 -47 -62 -55 -83 -27 -15 6 1 20 -38 -71 -25 -65 8 -61 -80 -27 -36 -52 -14 -48 63 -98 -48 -31 -1 -39 -45 -60 -42 -26 -11 -29 -55 -80
45125h0N9l6rR2j4j2r6Q1k2o1R6%q6J2j1J30j06O1m0M2lp7RJ3k8N5l2rNL4K8k4J4j8p3O9M
$$ -80 -21 -57 -66 26 12 0 -96 -15 -37 -98 -2 -2 -88 -76 -87 43 -63 -2 -42 0 -3 -80 -71 -58 -86 -31 -63 -72 -67 -33 -5 -29 -15 -33 -106 -37 -33
45007c3j0N9m6j9K4K0l2K3Kk4L5p6Q9j27R7L3r5N6l5k1L6M5l2Jl6L2M3m6m3N7n2J4N2K0j2
$$ -33 -43 16 -30 -49 -25 -5 -37 -14 -12 -36 -1 -77 12 -115 -18 15 -80 -24 -59 -80 -44 1 -31 -30 -66 -34 9 -37 -80 -23 -75 -61 -9 11 -1
44896aMJ0l3n2O7p5K3jj19Q8J02r3M2m5L2l1J9pK9L2m8L6Qol6Q2p0K2j6k7O1mM3o2qTj7L3
$$ -1 3 13 -20 -72 -5 -80 -57 -58 -177 -89 13 -80 -38 -83 -51 -82 -63 -70 -41 -9 -57 -21 -13 -19 -55 27 -43 -21 -37 -64 -3 -7 36 -26 -34 -42 -59 -26
44775b6k8N1p2M2m5L3K0l6lN0l8rk9N2n9pQ1lj9l2j5P0j2M7l7n2J14j20M4K6J8l7K1j4J1p
$$ -26 -54 -3 -75 -33 -78 -45 -25 -61 -64 -14 -52 -61 -90 -38 -97 -104 -23 -26 -45 -77 -92 -22 -34 13 -24 -76 38 -82 -38 -12 6 -31 -10 -24 -13 -20
44661b0l6l8N6k9nN1m4K5M9m1rk6k0l0M0R7m2k5K2m6J8L8k3%J1m8N6m0P4p3Q4k2ll7k1MK0
$$ -20 -56 -94 -38 -67 -72 -21 -65 -40 9 -32 -41 -67 -87 -117 -77 20 -22 -47 -25 -71 -53 -15 -38 -38 -27 -75 -19 -59 15 -58 26 4 1 -36 -57 -53 -33
44543c3j3j2N4j6K6k8K2p3pqK5J5J7j4LJ4k5n3Q8l2k6ML1L6l4k0O0m3K6j7mOMjKl3P1m6K
$$ -33 -46 -58 -4 -20 6 -22 0 -73 -80 -88 -63 -48 -31 -45 -42 -28 -53 -106 -18 -50 -76 -72 -41 -5 -39 -59 1 -42 -16 -33 -37 -31 -27 -28 -26 -59 12 -34 -32
44419c2l0j3K1O4m3l2k3M6K9k9j5TR3p7L1k3k2l7K5K6L6lm3J05j07K7m9N5L4nK4p9N1p1J9
$$ -32 -62 -75 -54 10 -33 -65 -88 -42 -13 -42 -57 -72 21 -56 -25 -48 -70 -107 -82 -56 -20 -23 -66 39 -68 -41 -90 -35 -1 -6 18 -61 -10 -81 -62
44308f2J4K7l3J2J15q5J7j1n9K2m5l%J5L0Lok8K9L4j2%L1p0N8l8M3k6RJ8j17N9m3RP4m3M0
$$ -62 -48 -21 -54 -42 73 -12 5 -6 -65 -43 -88 -91 -91 -76 -46 -43 -49 -77 -48 -14 -26 -26 5 -65 -7 -45 -2 -28 -19 -1 -118 -59 -102 -93 -19 -62 -22
44190b2k3L1j8m4o2J23l3J5q2J01L3l6j9MkNM5r0n1J12K7r0O4n5k3J04j22R2J9r7J48j00
$$ -22 -45 -14 -32 -76 -138 -15 -48 -33 -115 -14 19 -17 -36 -32 -34 -29 16 -74 -125 -13 14 -76 -12 -67 -90 14 -108 -16 3 -94 54 -46
44088d6M3J6p5J08o2Ol2n8m3R4Rj5J2O8n7k9Nk5N8r5O1K9N2n4RJ7j9l4N0p6J43j51M0k4L1
$$ -46 -3 13 -62 46 -16 -10 -42 -100 -143 -49 -40 -55 -43 25 -32 -61 -56 -81 -23 -118 -57 -28 24 -30 -21 -4 -23 -57 -7 -83 60 -91 -51 -75 -44
43977d4M0p6lQ9l0n8N3kJ1J8p8jM1k8O4k9j6J5k0j6J2K1NL0q0k0J30j14P4L8m8kk3O6n4l2
$$ -44 -4 -80 -83 6 -24 -82 -29 -31 -20 -2 -80 -81 -40 -68 -4 -33 -49 -34 -54 -70 -58 -37 -32 -2 -82 -102 28 -86 -12 26 -22 -24 -47 19 -35 -67
43862f7O4Rq2Q2r1M5L8n8Kn7L5lJ7K7TK6p6M4m8nl4R7k1k4L7j7o8J28j14M6l4Q8n0m0Q8
$$ -67 -3 6 -76 6 -85 -40 -2 -60 -58 -115 -80 -83 -66 -39 -12 14 -62 -18 -66 -71 -105 -8 -29 -53 -16 -33 -101 27 -87 -41 -75 13 -37 -77 11
43751A1j24Q7l3J5K7K0o7O6mm2P8p4k0L4k5k1O3J5jo0R1mo6R4n6O6o7M4Kr6KP1m1MOk9Q6
$$ 11 -113 -26 -59 -44 -17 3 -64 2 -2 -44 34 -40 -60 -26 -51 -72 -9 6 5 -55 36 32 -34 60 4 70 3 47 49 -47 -45 26 -15 -11 -5 -34 52
43633E2L9o9jNo3Q8o2NL1lK6q3k2K3J4m1N9K2n3l0L0Qo4L3K0l3Q6K3q1rL1n3J54j16k9k8
$$ 52 91 22 21 26 -37 51 -11 -6 25 22 48 -35 -57 -34 -20 -61 -2 20 -33 -63 -33 -25 -89 -56 -36 -69 17 40 -41 -50 -19 -72 82 -34 -63 -91
43519i1R0J1r5N7N2r1L5K0lK4J8J5J2k1jrj1o5N7j8m0P8j2N7k3J1l0L1N4p6N0J8q8k4N7l2
$$ -91 -1 10 -85 -28 24 -67 -32 -12 -15 9 27 42 54 33 32 23 12 -53 4 -14 -54 24 12 69 46 57 27 58 112 36 86 104 16 -8 49 17
43404A7l1k0J0P3p7K1pn6MN7l4L9p0R4m8L5j02J16q4J4L8k9m5J24r3k0N9p3R8kl6K0n7j0
$$ 17 -14 -34 -24 49 -28 -7 -14 -70 -66 -9 -43 -4 -74 20 -28 7 -95 21 -63 -49 -11 -40 -85 39 -54 -74 -15 -88 10 8 -28 -8 -65 -75
43296g5K3M3j0Qll0K1k0Ork4J11l1n0L2o1j5Q6Mq2nj9P3n6M8mM5J1q2l7L1O6m6K6l5N1k6
$$ -75 -52 -9 -19 -11 -14 -44 -23 -43 -37 -46 -70 41 10 -40 -8 -69 -84 2 6 -76 -81 -100 -27 -83 -35 -39 6 17 -65 -102 -71 -5 -51 -25 -60 -9 -35
43179c5j7M0L0k5Tk7j4O9j5r9O0K0N1j6kK9%m7pL2m0j7J1L2K7r4R2k9okk0k9P9p0mM2kL0
$$ -35 -52 -12 18 -7 -32 -59 -73 -4 -19 -118 -58 -38 13 -3 -5 24 24 -23 -30 2 -38 -55 -44 -12 15 -79 13 -16 -22 -24 -44 -73 6 -64 -68 -26 -28 2
43058Bj11Q0MO1o7K0l1qK7N1o3Qp5J12j09R6n7o5J15j3N9Mp4k7M8J3k6pRol3K9Kk4K2N6l2
$$ 2 -109 -29 -25 36 -31 -11 -42 -50 -23 28 -35 -27 -102 10 -99 -3 -60 -125 -10 -23 36 40 -34 -61 -13 0 -26 -33 -24 -30 -63 -34 -32 -56 -34 22 -10
42940a0J5j00M8%lM5p7M2J7n2K6J20r9L4rl5k3J5JM8j9k0p9M3O2j04J3N6k0K6L1Om7lL0j7
$$ -10 5 -95 -47 -47 -50 -5 -82 -40 -23 -75 -49 71 -28 6 -3 -38 -61 -46 -45 3 -16 -36 -115 -72 -10 -114 -101 -45 -65 -39 -8 -2 -49 -52 -22 -39
42826c9p5O7l7l4P9nM7m0M2m8nk6N5j7Rn6J10kl1K3mm6rL2k3K6m7k3N7j7Oj1J38j82M3O7
$$ -39 -114 -47 -84 -118 -39 -44 3 -37 5 -43 -48 -74 -19 -36 -27 -83 27 25 -6 17 13 -33 -42 -10 -33 -7 -54 -77 -20 -37 -31 -42 96 -86 -43 24
42711B4o1L7k2r4N6L5o9J17k2m0J3m1J1nN1k1J2l0O2k8j6J9l6K3M3Jn5LmoK9j03J13l9%m7
$$ 24 -37 0 -22 -116 -60 -25 -94 23 1 -39 -26 -67 -56 -61 -10 -31 -19 -49 13 -15 -31 -12 -48 -25 18 19 -36 -33 -37 -43 -14 -117 -4 -43 -43 -90
42597i0ML1j3J6j2R1l1m9N3oJ1p4P2pl2k7R7q1j2k7N0l6N8J8Rq1N8M0qn6m8J36r3j3M1J5%
$$ -90 -86 -55 -68 -52 -64 27 -4 -53 0 -6 5 -69 3 -4 -36 -63 34 -47 -59 -86 -36 -72 -14 4 13 -68 -10 30 22 -34 -82 54 -39 -52 -11 4 4
42479DJ3j20J32j7k2l0k2N9p3nJ7J9N9J5K4K7n3nK0n6J7N8k5n4J4l6pJ3J10r4l5m8L2j9J8
$$ 4 17 -103 29 12 -10 -40 -62 -3 -76 -81 -64 -45 14 29 53 80 27 22 42 -14 3 61 36 -18 -4 -40 -47 -34 76 -18 -53 -101 -69 -88 -70
42368g0M7Ql6j0K9Q9j05pR5r5N2K2p9nO9k7l9LM6l8oK1Mk2M6k5n2O3k3%k1m6J11o3N8q6N4
$$ -70 -23 -15 -51 -61 -32 57 -48 -55 40 -55 -3 19 -60 -65 4 -23 -62 -59 -13 -51 -57 -36 -32 -54 -8 -33 -85 -22 -45 -45 -66 -112 -1 -64 -6 -92 -38
42250c8Nj5m0O9q5M9J4k2M5LjK2n1Q1j0k4m7Q2n5o1K4J34j29j7nN4Pr5M7P4l9J2p4R6m1P1
$$ -38 -33 -48 -88 -19 -104 -55 -41 -63 -18 -15 -16 6 -45 36 26 2 -45 37 -18 -79 -55 79 -50 -67 -72 -18 -11 -106 -59 15 -24 -12 -86 10 -31 40
42135D0n0rL9m8j1J1L6lo3M7M6k8o7K7Qpm0L1m3J00l4l6M5N6n3l6l1J25k1n7M0P2j36M9l5
$$ 40 -10 -19 20 -28 -39 -28 8 5 -58 -11 35 7 -60 -33 -25 -32 -72 -41 -84 16 -18 -54 -9 47 -6 -42 -73 52 31 -26 14 86 -50 -1 -36
42024c6J6J3J6jo1M7n8J10m9L1Rn5J34K3M3k1r4k6J31n6k6K2J10R4nj10n3k2r7J24l1k0r
$$ -36 -20 -7 9 8 -53 -6 -64 46 -3 28 37 -18 116 139 182 161 67 41 172 116 90 112 222 316 311 201 148 126 29 153 122 102 93
41919I3K0M2O6j42pm2MJ4rk8J02q4M2L6j56P3K6p6J00n0Kn5P4j9QjNkK1j32R9lL4l3%k7N
$$ 93 113 155 221 79 72 30 34 48 39 11 113 29 71 107 -49 24 50 -26 74 24 26 -29 45 26 34 33 38 36 57 -75 24 21 55 22 22 -5 0
41802@K9K5kj8N6O1J1M7NO4o2L7R1n1q4m7LM7M8O7m9Q2j07j8k4L4J24n0%j26pJ0o7Q9q1j8
$$ 0 29 54 52 34 90 151 162 209 214 278 216 253 344 293 209 162 165 212 260 327 278 360 253 235 211 245 369 319 319 193 186 196 129 218 137 119
41687A19P2pPl4L3K1l3M6N6j4NL7qL8n9n4k0J22l1J2OJ15pN5M1OJ8Qm5P1K6%M5M8O9P4J48
$$ 119 191 184 191 157 190 211 178 224 280 266 271 308 300 338 279 225 205 327 296 308 314 429 422 477 518 524 542 550 505 576 602 602 647 695 764 838 986
41569I86L4J11J49J64K85N11J052J778K578L028J312K99m36N30J377q82k060l281j522n71
$$ 986 1020 1131 1280 1444 1729 2240 3292 5070 7648 10676 11988 12287 11851 12381 13758 12876 10816 7535 6013 5442
41506E442l62K24J476K347K932J269M74m10L45R22j511k454l418j552j059q17o93m47k91
$$ 5442 5080 5304 6780 9127 12059 13328 13802 13392 13737 14659 13148 10694 7276 5724 4665 3848 3155 2708 2417
41445B417k98j17j76o1Qo2m8Q4n1M0l7L6K0q6L2N1j4o6m4J5O6Q6RJ80J00lJ69K39L18O07
$$ 2417 2119 2002 1826 1765 1773 1711 1663 1747 1696 1736 1699 1735 1755 1669 1701 1752 1738 1672 1628 1643 1709 1795 1804 1984 2084 2081 2250 2489 2807 3414
41350C414J305J990L018L257J413N31p45R11J334j585k860l371j351p56m74L80J366K672
$$ 3414 4719 6709 9727 12984 14397 14928 14183 15094 16428 14843 11983 8612 7261 6505 6031 6411 7777 10449
41293A0449L504K149K00p66J22J416j394k729m242j908j113j038r71m69m68k78j78k15m0
$$ 10449 13953 16102 16302 15536 15658 17074 15680 12951 8709 6801 5688 4650 3679 3210 2742 2464 2286 2071 2031
41232B031j39pn9k5j9l9j4r8Mq4j4j08K8r9n4Ll0J0K7p3m3o1Pq5mRl4r1k5k1q0k5K3j48j
$$ 2031 1892 1885 1826 1801 1782 1743 1729 1631 1635 1551 1537 1429 1457 1358 1304 1307 1277 1287 1314 1241 1198 1137 1144 1059 1055 1064 1030 939 914 893 813 788 811 663 662
41121F62L9J4n2j8Kl4P8n0l2n1l7M5k5J2K5K8O4rK8Mr3%n5Ml1n3M9j9q3L8n6J7n3k2N8j9
$$ 662 701 715 663 645 647 613 691 641 609 558 521 566 541 553 578 606 670 661 689 693 600 600 545 549 518 465 514 495 412 450 394 411 358 336 394 375
41006C75L0o5n1J8n9P1j26J22q5R3o4k2j5O7j35M3N3M6o6J1M9Nj4l4m5rm1J4N6k5m7J3j5
$$ 375 405 340 289 307 248 319 193 315 230 323 259 237 222 289 154 197 250 296 230 241 290 295 281 247 202 193 152 166 222 197 150 163 148
40901A48P1n9L7O3m1l5mJ6n3M4Kk1j5K5N6n0KL0J09mM4Pn7m2j9pk0p3qKJ3n1mM3L8q4J01
$$ 148 219 160 197 260 219 184 180 196 143 187 189 168 153 178 234 184 186 216 325 321 365 372 315 273 254 247 227 154 146 148 161 110 106 149 187 103 204
40784B04p2M9o1M5Q2m7k6l1TK9n0K7n8P1J5n5LoKM6n6K7n3L1nn8O2l0NJL2j8K0n8J10j49
$$ 204 132 181 120 165 247 200 174 143 112 141 91 118 60 131 146 91 94 88 90 136 80 107 54 85 80 22 84 54 59 60 92 74 94 36 146 -3
40669cP1l2j2K6J4j8NN0o6J2j0k1Q2n8L1K1L1n0m6l9J12n9k7qj7J6j8L6RNTK5k9kk5Q7l0
$$ -3 68 36 24 50 64 46 51 101 35 47 37 16 98 40 71 92 123 73 27 -12 100 41 14 6 -11 5 -13 23 32 37 42 67 38 36 11 98 68
40552F8j2k0Kj5k2L1QK2m6L2l1j8lM0L5n4K2q6O9M6o3K5n1K1kl8L2O4r1P5o6M9j4j1J6l7
$$ 68 56 36 38 23 1 32 40 62 16 48 17 -1 -4 36 71 17 39 -47 22 68 5 30 -21 0 -2 -40 -8 56 -35 40 -26 23 9 -2 14 -23
40437b3O2q1J7Tn3M8m8N3j8MN7n0mm5R5o7oL1K3q8J3J8KOj3M5K6o6P6p2K5l7R2p5M5r3R9
$$ -23 39 -42 -25 -8 -61 -13 -61 -8 -26 -22 35 -15 -19 -64 31 -36 -42 -11 12 -76 -63 -45 -43 -37 -50 -5 21 -45 31 -41 -16 -53 39 -36 9 -84 15
40319A5l0J7j3L6N5m2o4M3m1K9Q%p0pP8nj4m3J1nN4m6Q6j28O5m8L9j9K4n4Q3j2j0k7K7o2
$$ 15 -15 2 -11 25 80 38 -26 17 -24 5 13 13 -57 -64 14 9 -5 -48 -37 -42 12 -34 52 -76 -11 -59 -20 -39 -15 -69 14 2 -8 -35 -8 -70
40205g0N2m8M9rn7M1jL0l0pN5J9k9p4N6j0L9J6l0m1L8N8j1n0j0J0K8m6K6j6M1p5LJ6nL6n3
$$ -70 -18 -66 -17 -26 -83 -42 -43 -13 -43 -50 5 24 -5 -79 -23 -33 6 22 -8 -49 -11 47 36 -14 -24 -14 14 -32 -6 -22 19 -56 -53 -37 -42 -6 -59
40087e9K6J8k5K3k0l2M4L4r1K0qJ9j8P3n6L1m1M8o5P0q1M2K5m3K5NN3L1j23K6kM4j2J9l5
$$ -59 -33 -15 -40 -17 -37 -69 -25 9 -82 -62 -70 -51 -69 4 -52 -21 -62 -14 -79 -9 -90 -48 -23 -66 -41 -36 17 48 -75 -49 -51 -7 -19 0 -35
39976c5k8J09r5M1j1QQ4n4q9Q1j6n7J66q4n1QO5j15QQ7l8J9M4q6K2m1O9J8j22Q9M8o0N0K3
$$ -35 -63 46 -49 -8 -19 -11 73 19 -70 11 -5 -62 104 20 -31 -23 42 -73 -65 22 -16 3 47 -39 -17 -58 11 29 -93 -4 44 -16 34 57
39868E7j10P8q8J09j2l5TJ8N9k7l1p2J04p3Q7N2p0J4TJ0L0j8m2K7j4J6Pq4P7K2joO1no7
$$ 57 -53 25 -63 46 34 -1 -36 -18 41 14 -17 -89 15 -58 29 81 11 25 39 49 79 61 19 46 32 48 55 -29 48 70 69 63 124 119 52
39757E2J25k5k4l1L7q4Q2j9NO1l2lK7l6J10M4r1mO0R7L8P0LM7Q5K06L34R33J356J592O45
$$ 52 177 152 128 97 134 50 132 113 118 179 147 144 171 135 245 289 198 194 254 351 389 459 462 509 594 800 1134 2067 3423 5015 5660
39658E660o98j009j319l91l92l50j88k33kQ0L71Q42J184J457Q41p30j044j440l38l93l60
$$ 5660 4962 3953 2634 2243 1851 1501 1313 1080 1078 1158 1529 2371 3555 5012 5853 5123 4079 2639 2301 1908 1548
39591A548k01j69j94k05ol5K9k3m9L0lN9p0J7J8j3o3Q4L3pM8l6J2N5O2P6m7J85R8J26K61
$$ 1548 1347 1178 984 779 773 738 767 744 695 725 722 781 711 728 746 733 670 754 787 780 828 792 804 859 921 997 950 1135 1233 1359 1620
39493A620N73J122J662K323J631o72j502k090k64M7O01J376K529L158R86j023k722q76
$$ 1620 2193 3315 4977 7300 8931 8259 6757 4667 4403 4450 5051 6427 8956 12114 13100 12077 9355 8479
39435H479J263J138j129j563k159o99nO21J645K793K990K6j414l949k100o11p89p92n07
$$ 8479 9742 10880 9751 8188 6029 5330 5325 5946 7591 10384 13374 13400 11986 8037 5937 5326 4537 3745 3238
39375C238m00j86l60j45m0j33m7q6l6l0K4n5m6o4J19j07J65N8J49J5l0N6J2R9O7Q2J61K07
$$ 3238 2838 2652 2292 2147 2107 1974 1927 1841 1805 1775 1799 1744 1698 1634 1753 1646 1811 1869 2018 2033 2003 2059 2071 2170 2237 2319 2480 2687
39286B687L27R26J896L470M940N632J960j508n056m862j405j365j340p91n58j26L52J350
$$ 2687 3014 3940 5836 9306 14246 19878 21838 20330 15274 10412 9007 7642 6302 5511 4953 4827 5179 6529
39229F529K687M260N143K094k023l899m870j778j317j337r85o89n59m55j88q9j10n2n7N8
$$ 6529 9216 13476 18619 20713 18690 14791 9921 8143 6826 5489 4504 3815 3256 2801 2613 2524 2414 2362 2305 2363
39165B363M2O4M0L0o8O2M3K5J82lq3m4q0j1q2P5P8K22K36J09N6l5R1K22M01Q97J667K538
$$ 2363 2405 2469 2509 2539 2471 2533 2576 2601 2783 2780 2697 2653 2573 2562 2480 2555 2633 2855 3091 3200 3256 3221 3312 3534 3935 4832 6499 9037
39076I037L186K289O57P87N43K208m8j731l276k081K57K030L873N387L927j33r77j173
$$ 9037 12223 14512 15169 15956 16499 18707 18659 16928 13652 11571 11828 13858 17731 23118 27045 26912 25935 24762
39019B4762K605j594l860o494l846j834j590j470r73q10o09n41l05r3j44m5j16L2Q3R8rj7
$$ 24762 27367 25773 21913 15419 11573 9739 8149 6679 5706 4896 4287 3746 3441 3348 3204 3159 3043 3075 3158 3256 3247 3230
38949C230j35n1j26mr5Q4m4j03j8r8m3n5n9J7K6jK6M3P3R5K35J84L25M49Q81J740K799
$$ 3230 3095 3044 2918 2914 2819 2903 2859 2756 2738 2640 2597 2542 2483 2500 2526 2525 2551 2594 2667 2762 2997 3181 3506 3955 4836 6576 9375
38863I375M010L502K578O16k21j39k448r02p63R92p89q61j153L00P95O81K21n82r22j967
$$ 9375 13385 16887 19465 20081 19860 19721 17273 16371 15608 16600 15811 14950 13797 14097 14892 15573 15794 15212 14290 12323
38799A2323n38o53K01j030j408k080j186p34n93m55l41k30j08l7m7q1j56n1Qq0p2m0j6o0
$$ 12323 11785 11132 11333 10303 8895 6815 5629 4895 4302 3847 3506 3276 3168 3131 3084 3003 2847 2796 2804 2724 2652 2612 2596 2536
38723B536L4j12p0L2j3M1N1o9j8J10P7J84L97P75J089J194J010J95%L42J969K774J887J5
$$ 2536 2570 2458 2388 2420 2407 2448 2499 2430 2412 2522 2599 2783 3180 3955 5044 6238 7248 7443 7443 7785 9754 12528 14415 14430
38647A4430k059j762N03J951J923Q7j184k297j344R20J741R26r83k377j764l19O80M94q92
$$ 14430 12371 10609 11112 13063 14986 15073 13889 11592 10248 11168 12909 13835 12852 10475 8711 8392 9072 9566 8674
38586H674j333j856r91m82m98m55k97j33j72q5k8%n7p3k09R0n9M1m3j06n6P2r3%J9m2j2O
$$ 8674 7341 5485 4494 4012 3514 3059 2762 2629 2457 2372 2344 2344 2287 2214 2005 2095 2036 2077 2034 1928 1872 1944 1851 1851 1870 1828 1816 1822
38497A822J4K4P2J0L22N86P52J231Q85k05n80r97L03P66R95N54p13p76n20N45O53L52m65
$$ 1822 1836 1860 1932 1942 2264 2850 3602 4833 5718 5513 4933 3936 4239 5005 6000 6554 5841 5065 4545 5090 5743 6095 5630
38424E630p99r33K38O83O45O8o95j091r90l48l53k32k24k22j15l8r2P6q5N2l4j0j00kl7m9
$$ 5630 4831 3898 4136 4819 5464 5532 4837 3746 2756 2408 2055 1823 1599 1377 1262 1224 1132 1208 1123 1175 1141 1131 1031 1029 992 943
38341I43j1j3M0p3k4m2K2o2M6nk6R6J12J75M35N23Lk82n62j44j41j09j75pj54qp7O4o5n7
$$ 943 932 919 959 886 862 820 842 780 826 821 795 891 1003 1178 1613 2136 2139 1857 1295 1151 1010 901 726 719 565 557 480 544 479 422
38246D22N8l2Rl1m5L9Rn1LpJ15m7K9k3j03N1j25Q7m9N3o9m8k3J9l6O0m1P6l6j2K4J7l2m0
$$ 422 480 448 457 426 381 420 429 378 381 374 489 442 471 448 345 396 271 358 309 362 293 245 222 241 205 265 224 300 264 252 276 293 261 221
38138B21O1j6N5j05M5p4OM2Nk5M3j06Q3q5J5%j1M9M6j10L4noL3M4k4m7Qm1M1r8NJ23j04J4
$$ 221 282 266 321 216 261 187 193 235 240 215 258 152 235 150 165 165 154 203 249 139 173 168 162 195 239 215 168 176 135 176 78 83 206 102 116
38026A16jJ2l7n1L0l1Q6Q8q0p3J03n4O1q4l8R4m3j03M4K9N0m9qop0P5pM2o0K6J10j33J3PR
$$ 116 115 127 90 39 69 38 124 212 132 59 162 108 169 85 47 141 98 -5 39 68 118 69 61 55 -15 60 53 95 35 61 171 38 51 58 67
37915F7p2P4j3JP7n4N4k6o0k0RK9n0K9k9M2Nk3p6L6M0l7L1m9M9K3m1P0m0o2M7K7nK3j08j
$$ 67 -5 69 56 57 134 80 134 108 48 28 37 66 16 45 16 58 63 40 -36 0 40 3 34 -15 34 57 16 86 46 -16 31 58 53 76 -32 -33
37801c3K2Kn0L9J5N5k0r5N4k4P2lTkq0RN4k7o0Q3l1k4P0J6m1K2j5nMm7N1J0j3Qm3L8J3o2
$$ -33 -11 -9 -59 -20 -5 50 30 -65 -11 -35 37 34 31 29 -51 -42 12 -15 -75 8 -23 -47 23 39 -2 20 5 0 4 -43 8 18 5 13 -30 8 21 -41
37680d1O6n4P2j37O0Q2j27P3l3J0j3P4p4K1O9k9l0K1r7K6M9K6r2P4K8Kp8L7j0Tk4k8K9r8
$$ -41 25 -29 43 -94 -34 48 -79 -6 -39 -29 -42 32 -42 -21 48 19 -11 10 -87 -61 -12 14 -78 -4 24 26 -52 -15 -25 -35 -59 -87 -58 -156
37572a56J05J9m0N1k1K5L1n5j4Q9r2M1j7L9J4M3j0om6NKK1l6j5pL0j2lO1q6J11n5Q9r3m3
$$ -156 -51 -32 -72 -21 -42 -17 14 -41 -55 34 -58 -17 -34 5 19 62 52 46 0 5 7 28 -8 -23 -30 0 -12 -15 46 -40 71 16 105 12 -31
37460c1R6k6K7j07N2K8K0l5l9M0l5L9Q8n3n5M2p5M4l2j1K7j6kl4TN5P3j08m7O2o0J9O3LM8
$$ -31 65 39 66 -41 11 39 59 24 -15 25 -10 29 117 64 9 51 -24 20 -12 -23 4 -12 -14 -48 -82 -27 46 -62 -109 -47 -107 -88 -25 -22 26
37349B6p1J4rM4n5j0N6j9J1pn2L1J0j7j0OQ0mq5N8J2N0p1O1O0Jq1j1Q4r8O0p1j1O1m8L5l9
$$ 26 -45 -31 -40 4 -51 -61 -5 -24 -13 -20 -72 -41 -31 -48 -58 -52 28 24 -61 -3 9 59 -12 49 109 110 29 18 102 4 64 -7 -18 43 -5 30 -9
37231iLM0J9p6J02q0qL3ok6L7k2k5j02M5j5P3M2j6l7N0j1K0l0qm4j5O9o7l5Q5l7oP0j4k1
$$ -9 -6 34 53 -23 79 -1 -9 24 18 -8 29 7 -18 -120 -75 -90 -17 25 9 -28 22 11 31 1 -7 -51 -66 3 -64 -99 -14 -51 -57 13 -1 -22
37117b2J5J8k6J00j12K3j3TK4K1Qj04R6k8J2Q0r1P1l3N5j02K0P0j31P5k0K0P4n8N3p9L8p1
$$ -22 -7 11 -15 85 -27 -4 -17 -30 -6 15 23 -81 15 -13 -1 79 -12 59 26 81 -21 -1 69 -62 13 -7 13 87 29 82 3 41 -30
37012c0M4K3l2o9Q1pk5Pj8L9m1m9Q0k7j9J5m2L7m6R0o8q5K1J09rjJ1j5n0N8M6l8m6N1K6k0
$$ -30 14 37 5 -64 17 10 -15 -8 -26 13 -28 -77 3 -24 -43 -28 -70 -33 -79 11 -57 -142 -121 -12 -21 -22 -11 -26 -76 -18 28 -10 -56 -5 21 1
36897Anj8K7nL9K0j4J1m4N6K0jj6o0J54p3P5n8K4l3r9J2l0N2K2k4l1PL3n5Rj9OJ19p1k8m1
$$ 1 -4 -22 5 0 39 59 45 56 12 68 88 87 71 11 165 92 167 109 133 100 1 13 -17 35 57 33 2 9 42 -13 -4 -23 -17 102 31 3 -38
36780c8L0j3p8J13r6J17q9n3P4j2L5m5O1MJ2l5k2J6NL2p8R4l8N0k5J2jK5nl0M6m2O3j5M9l
$$ -38 -8 -21 -99 14 -82 35 -54 -107 -33 -45 -10 -55 6 10 22 -13 -35 -19 -14 18 -60 34 -4 46 21 33 32 57 52 22 68 26 89 74 123 120
36665A20J0n5j4K7m4P7KMp1P0q3qL7K9j30Q8m4lJ0lo5O7L6k8m9M3l8PM1o7l9L3J0j5J00J8
$$ 120 130 75 61 88 44 121 123 127 56 126 43 35 72 101 -29 59 15 12 22 19 -46 21 57 29 -20 23 -15 -8 33 -34 -73 -40 -30 -45 55 73
36551G3n4m0m5N6m5nK8n3O9J5nl5R3K8l9J7q4P7J1l0N3N1r9K9jRPLl4L0o6L9kq5L2l2L4K5
$$ 73 19 -21 -66 -10 -55 -60 -32 -85 -16 -1 -6 -41 52 80 41 58 -26 51 62 32 85 136 37 66 65 74 81 84 50 80 14 53 51 -34 -2 -34 0 25
36430B5K3m7j03J36k0Tn8N5J3n9J8K2l3Q2nj01O7J0nm6PLM2J5l1k9k7k1M2K7qM0l9qK3k6
$$ 25 48 1 -102 34 14 -6 -64 -9 4 -55 -37 -15 -48 34 29 -72 -5 5 0 -46 -39 -36 6 21 -10 -39 -66 -87 -45 -18 -26 14 -25 -33 -10 -36
36315c6O2J4m8K4pKm4K6R9n2j08O9q2J42m4l8O4n5P2m3k4Lo0M3K3m3J02o0jk0m9L6JR2j11
$$ -36 26 40 -8 16 9 11 -33 -7 92 40 -68 1 -81 61 17 -21 43 -12 60 17 -7 -4 -64 -21 2 -41 61 1 0 -20 -69 -33 -32 60 -51
36204e1K3m0k8N8K0k8N7k4pN0q4k4K9P4oJ4j09N2l6P7n8M6%n2N4O9q9J9k3TJ9KL1p6N0Q3
$$ -51 -28 -68 -96 -38 -18 -46 11 -13 -20 30 -54 -78 -49 25 19 33 -76 -24 -60 17 -41 5 5 -47 7 76 -13 6 -17 -40 -21 -19 12 -64 -14 69
36089F9r4OJ3J7k8j9N5On7L4M5r3L9l9J2Rm7LJ6J8K3N2O3j02l5m5O9k7L8n3M2q0R0p3R1m1
$$ 69 -25 -19 -6 11 -17 -36 19 25 -32 2 47 -46 -7 -46 -34 -25 -72 -69 -53 -35 -12 40 103 1 -34 -79 -10 -37 1 -52 -10 -90 0 -73 18 -23
35975b3J3%K9j1kK4o0k2M0q2J22k6k8m2J2KJ2JOL7n1j3N0N6rq7K4L3l4Jk8O7l6m0L5N1q7
$$ -23 -10 -10 19 8 6 30 -30 -52 -12 -94 28 2 -26 -68 -56 -54 -42 -41 -35 2 -49 -62 -12 44 35 -52 -28 5 -29 -28 -56 11 -25 -65 -30 21 -66
35857f6P6PRj0J2j06J9j4M8O3l1o2O2k2j1j4m4O0j4M5k5L2m5L9j8L7K9j18PL6nO4m4l5n6
$$ -66 10 17 26 16 28 -78 -59 -73 -25 38 7 -55 7 -15 -26 -40 -84 -24 -38 7 -18 14 -31 8 -10 27 56 -62 -55 -19 -24 40 -4 -39 -95
35746i5J24k2m7M1m3L7J5n0rJ0L1lL7o2K3km2N9n3J2P4l7q9M1J06o1l7mOL2K9l6j4k7J6J
$$ -95 29 7 -40 1 -42 -5 10 -40 -49 -39 -8 -11 26 -36 -13 -15 -57 2 -51 -39 35 -2 -91 -50 56 -5 -42 -46 -40 -8 21 -15 -29 -56 -40 -39
35632c9K8L4ol5L8Qk8J0p6J07n1k7K7k8Q5q1K2J8l0K8Kk9L2n1j8M0n4L0O3L8o5j2r%Jk5K1
$$ -39 -11 23 17 -18 20 28 0 10 -66 41 -10 -37 -10 -38 47 -34 -12 6 -24 4 6 -23 9 -42 -60 -20 -74 -44 19 57 -8 -20 -29 -29 -28 -53 -32
35514c2J0k8%N8m3j7k6K3N8j4p6k2P3m4J15p8j4Qj2l6LlO4nJ2n5Q2n4K2J1o1M9K7k5J9pK1
$$ -32 -22 -50 -50 8 -35 -52 -78 -55 3 -11 -87 -109 -36 -80 35 -43 -57 -49 -61 -97 -94 -97 -33 -38 -26 -81 1 -53 -31 -20 -81 -32 -5 -30 -11 -18 3
35396Cmp9K4N7p4Q9n2J4n2L4j5J4K2M3o3J8j2nm2K0RO7p0L1NqJ8O5r8PN5n4p0N0K0k1O7k1
$$ 3 -1 -80 -56 1 -73 16 -36 -22 -74 -40 -55 -41 -19 24 -39 -21 -33 -38 -80 -60 -51 16 -54 -23 -18 -26 -8 57 -41 -34 21 -33 -103 -53 -33 -54 13 -8
35275hj3r9Q5K4q7Q2l5JR8kn5j5qj4P5p5j2M5p7J9O0j3L6m1K0N6j05L6qJ4p4k5N3%j6P9j8
$$ -8 -21 -120 -35 -11 -98 -16 -51 -50 48 46 -9 -24 -32 -46 29 -46 -58 -13 -90 -71 -11 -24 12 -29 -9 47 -58 -22 -30 -16 -90 -115 -62 -62 -78 1 -17
35158a7j1M%L0n8j4O6kJ9n8k5nlQ0k0qpm3J2J7OLO2j02JM0J9K1k1j8L2J2m8P8n0K8m8J7n1
$$ -17 -28 -24 -24 6 -52 -66 0 -2 17 -41 -66 -71 -74 6 -14 -22 -29 -72 -60 -43 -37 -34 28 -74 -73 -33 -14 7 -14 -32 0 12 -36 42 -8 20 -28 -11 -62
35034f2L0l5O3om0lK8p8N2oK1K9k0Pl3l5J29j21N6m2O0k1n6L8j4M5l4L1l7K7QpLJ5k3o6P8
$$ -62 -32 -67 -4 -10 -50 -53 -25 -103 -51 -57 -36 -7 -27 -20 -53 -88 41 -80 -24 -66 -6 -27 -83 -45 -59 -14 -48 -17 -54 -27 -19 -26 -23 -8 -31 -97 -19
34916a9M7l6n6m1Q1k8TO4o1NM9k3M5M8K1o2m3LqjN8k2Pj1K4J6m1N6K3j46Q3Lrk7K8m8K3r3
$$ -19 28 -8 -64 -105 -24 -52 -80 -16 -77 -72 -23 -46 -1 47 68 6 -37 -34 -42 -43 15 -7 0 -11 13 29 -12 44 67 -79 4 7 -2 -29 -1 -49 -26 -119
34795a19J30p3k3R0j16R3rm5P0l0l2m0R7Mk7n7K9L2m8M9j9%poQO8l1Pl8K9N5J3j03N8o0K6
$$ -119 11 -62 -85 5 -111 -18 -27 -72 -2 -32 -64 -104 -7 -3 -30 -87 -58 -26 -74 -25 -44 -44 -51 -57 -49 19 -12 -5 -43 -14 41 54 -49 9 -51 -25
34681b5K1J7JN1q7L5M1m5m1N0l8n5k8O9k0N2l1M4q8L3M3k7K2l5k6m3Q6mL8l0L1rTm3J0K5
$$ -25 -4 13 14 65 -22 13 54 9 -32 18 -20 -75 -103 -34 -54 -2 -33 11 -77 -44 -1 -28 -6 -41 -67 -110 -24 -28 10 -20 11 2 -7 -50 -40 -15
34566a5L2j9Kk9K4k0p4N5j6L0k5L1kO8q7O6o7NpM4o9K7R3j29M3Qo0M0J6pJ1l8R8n8k2KJ1
$$ -15 17 -2 0 -29 -5 -25 -99 -44 -60 -30 -55 -24 -26 42 -45 21 -46 -41 -48 -4 -73 -46 47 -82 -39 -31 -91 -51 -35 -42 -31 -69 29 -29 -51 -49 -38
34448c8l5R1o9jM8p1J3J1N1q4Q0kN2r9OK0qL8r5J23n8n2J3lR9m4j4n3N7m2TJM0O0k3l9Q8
$$ -38 -73 18 -51 -52 -4 -75 -62 -51 0 -84 -4 -6 46 -53 -47 -27 -35 3 -92 31 -27 -79 -66 -69 30 -14 -28 -81 -24 -66 -108 -107 -67 -7 -30 -69 19
34331A9k3J0k1M3m3l1j8oN3L6n8J6K8q6N4L1ql4N4n8K7Ql1J5nMTr2R6%m0O6m0L1l2K3m0
$$ 19 -4 6 -15 28 -15 -46 -64 -70 -17 19 -39 -23 5 -81 -27 4 -4 -38 16 -42 -15 -7 -38 -23 -28 -24 -20 -112 -16 -16 -56 10 -30 1 -31 -8 -48
34213d8J13l3j8k0J9m2RN1m3K7Kk3p6Q9n5m5L0L1K9j6r9P9j8N0l7K4l0J13q0l6rJ6rK5j0p
$$ -48 65 32 14 -6 13 -29 -20 31 -12 15 17 -6 -82 7 -48 -93 -63 -32 -3 -19 -118 -39 -57 -7 -44 -20 -50 63 -17 -53 -62 -46 -55 -30 -40 -47
34099d7O1o7O3o6J6O9q2N5k3j4%O3J6m5k0J6m0M0m4m3O9jO3po6Ql9M1l7N1o9Q9r5K0J4TM8
$$ -47 14 -53 10 -56 -40 29 -53 2 -21 -35 -35 28 44 -1 -21 -5 -45 -5 -49 -92 -23 -24 39 32 -34 -26 -65 -24 -61 -10 -79 10 -85 -65 -51 -37 11
33981A1o4J2o8M0l1Q3n6k2L8PKJ5M4n8K8L7l5l7K8QOM2n9j0L9m7Ll3M9n2R0j5l6m0P8k8K6
$$ 11 -53 -41 -109 -69 -100 -17 -73 -95 -57 -50 -48 -33 11 -47 -19 18 -17 -54 -26 -18 -12 30 -29 -39 0 -47 -44 -77 -28 -80 10 -5 -41 -81 -3 -31 -5
33863ej9rO1k7K5o3l0NN0pN2n8K0lkm0N8nm5nQ5j10K1J6j3k7MJ5j9J7M6k5J4L6K6o9M9n0
$$ -5 -24 -33 28 1 26 -37 -67 -62 -12 -19 33 -25 -5 -8 -10 -50 8 3 -42 -47 38 -72 -51 -35 -48 -75 -71 -56 -75 -58 -12 -37 -23 13 39 -30 19 -31
33742c1L1j6J6K6o3Nj9j1O3k5l1L2M0rk1TqM9RN1j20L0q1O7P0o5O8m7J0l6L9J5ol6o4N8kQ
$$ -31 0 -16 0 26 -37 -32 -51 -62 1 -24 -55 -23 17 8 -13 -34 -42 7 16 67 -53 -23 -104 -37 33 -32 36 -11 -1 -37 2 17 11 -25 -89 -31 -33 -25
33621b5J5k4l2jRL9Nk4P4n1o1J0N9n3J1k4N5n9Q2L6Mo6k7Mj8J04n5k5L5m8P8j7Kl4%J9oM
$$ -25 -10 -34 -66 -67 -58 -19 -14 -38 36 -15 -76 -66 -7 -60 -49 -73 -18 -77 5 41 45 -21 -48 -44 -62 42 -13 -38 -3 -51 27 10 12 -22 -22 -3 -9 -5
33501em0K4L0j15J62j03O0q1L2N5k2j4Rk5N8Nq7K7J9K2p4j3M9Rm2M2L5n7L4M0p7N5j3m2rP
$$ -5 -45 -21 9 -106 56 -47 13 -68 -36 19 -3 -17 -8 -33 25 30 -57 -30 -11 11 -63 -76 -27 -18 -60 -18 17 -40 -6 34 -43 12 -1 -43 -52 -45
33386d5O6r2k1O3TL1n1m0%j2J7K0l1J2n3M7QJ9Lr2N1J9k9m1R3q9P2o3N1qn3J16q2O2k2j0O
$$ -45 21 -71 -92 -29 34 65 14 -26 -26 -38 -21 -1 -32 -20 -73 -26 -18 1 4 -88 -37 -18 -47 -88 5 -84 -12 -75 -24 -32 -85 31 -51 11 -11 -21 -15
33268a5J2kj10O1j3P2NJK8o5k9L0Tl4ko5N6Rj8J8L7n8K9L1q2N8J9pk2J1m8J10L4j06N7o2
$$ -15 -3 -5 -115 -54 -67 5 10 11 39 -26 -55 -25 5 -29 -31 -96 -40 -31 -49 -31 6 -52 -23 8 -74 -16 3 -4 -26 -15 -63 47 81 -25 32 -30
33154c0L1p4oP1P0l5j03J2jK3K8Nmk3K9j6K5j5n0Q8j03M2n2J19n4l2O1J4L1q8L1j4p6O4j9
$$ -30 1 -73 -79 -8 62 27 -76 -64 -65 -42 -14 -9 -13 -36 -7 -23 2 -13 -63 25 -78 -36 -88 31 -23 -55 6 20 51 -37 -6 -20 -96 -32 -51
33043e1J8MJ5j4Tj8k6N0jm8J11j3m3l2K1pL9l8L6j4O6mj39R2k7j2oQJ0j6O4l0q3J03Lj46
$$ -51 -33 -29 -14 -28 -42 -60 -86 -36 -37 -85 26 13 -30 -62 -41 -48 -9 -47 -11 -25 41 37 -102 -10 -37 -49 -55 -47 -37 -53 11 -19 -102 1 4 -142
32928a42J27k9j9k7R1L3r7M4J5K2o4Jj9K0nK5m1k3Q6l4K8jn3Jj8L6PK6k9j1J7K0ro6J4O8
$$ -142 -15 -44 -63 -90 1 34 -63 -19 -4 18 -46 -45 -64 -44 -49 -24 -65 -88 -2 -36 -8 -9 -62 -61 -79 -43 -36 -10 -39 -50 -33 -13 -22 -88 -74 -6
32814fm2J3oK2ml1K3k9k0Q5l1L4j3J3ml8L5nj3r3Q3lj5KTK4j7j8K0m6M8o6J37r6O0o1OR8
$$ -6 -48 -35 -41 -19 -23 -54 -31 -60 -80 5 -26 8 -5 8 4 -34 1 -4 -17 -110 -27 -30 -45 -43 -41 -17 -34 -52 -32 -78 -30 -96 41 -55 5 -56 -50 48
32693D8j16L2nk6Q9mp6O9q4Q9m2ql8P5pn3L1K4Jr5J2J01Pl1J4l7L9p0P5q9Q3o3j0n5J52n
$$ 48 -68 -36 -41 -67 22 18 -58 11 -73 16 -26 -34 -72 3 -4 -57 -26 -2 -1 -96 -84 17 24 -7 7 -30 9 -61 14 -75 8 -55 -65 -120 32 27
32578B7k6j5L2qm1j8O6j1K1oj01L9K1lnK9m1j6M1K5J8l8nN2Ln3K5l6k7M9l6K7k9ML4p2L3
$$ 27 1 -14 18 10 -31 -49 17 6 27 21 -80 -41 -20 -23 -28 1 -40 -56 -15 10 28 -10 -15 37 40 -13 12 -24 -51 -2 -38 -11 -40 -36 -2 -74 -41
32461d1q9J03Pl1k5Q3q2Q7m6L9o0J2J0L7k9RM4o2L0o3N8k5K8m2N0n0l4M9n3J24o6qJ0N2o0
$$ -41 -130 -27 -20 -51 -76 7 -75 12 -34 5 -55 -43 -33 4 -25 -16 28 -34 -4 -67 -9 -34 -6 -48 2 -48 -82 -33 -86 38 -28 -36 -26 26 -34
32349c4J6j3m3J15Mj00O7o0j9J08qp8l8M4Kk4J5q2Q5j2O7J0p0N0Kj09J01j7l6J6P4o3J4r
$$ -34 -18 -31 -74 41 45 -55 12 -48 -67 41 33 -45 -83 -39 -37 -61 -46 -128 -43 -55 12 22 -48 2 4 -105 -4 -21 -57 -41 33 -30 -16 -25
32241b5o6M6j7K2K9K8m4j7LP6j14N6Nj5n6Q3L2r4O5o0M2j1k6J9K4L9j48R2rM3m2j0N7Jl5q
$$ -25 -91 -45 -62 -40 -11 17 -27 -44 -41 35 -79 -23 -18 -33 -89 -6 26 -68 -3 -63 -21 -32 -58 -39 -15 24 -124 -32 -41 2 -40 -50 7 8 -27 -35
32127c5L1k8j02J04jO6r0L0Jr5P4K7K0m3n9J16l3TjK8L9o3M6j8l3k1J4R0j6m1k7P8l5K6n9
$$ -35 -4 -32 -134 -30 -31 35 -55 -25 -24 -119 -45 -18 2 -41 -100 16 -17 -50 -51 -23 16 -47 -1 -19 -52 -73 -59 31 15 -26 -53 25 -10 16 -43
32015d3pK0N8rk7l1L1l1N1p9J34r5L1Jn2L0Pj6K9j6m8L9L4J1p5J9Tl8N8qj9j2L8l2L9m2m0
$$ -43 -50 -30 28 19 -8 -39 -8 -39 12 -67 67 -28 3 4 -48 -18 -11 -27 2 -14 -62 -23 11 22 -53 -34 -15 -53 5 -3 -22 -34 4 -28 11 -31 -71
31898g1K1K7K4k8m3pJ00L7r5L4n1P5m9kM5K1p9L8RMl7lJ1m0QK3n3O3j3j2J8j3l7N7l5J7J8
$$ -71 -50 -23 1 -27 -70 -77 23 60 -35 -1 -52 23 -26 -28 17 38 -41 -3 6 10 -27 -30 -19 -59 -51 -28 -81 -18 -31 -43 -25 -38 -75 -18 -53 -36 -18
31780a8Ko3L5L9K4p3N9m7M1o0K2jL3j1k3M0j1o0O8M2q8M1o1k2K9J7J4L6PM5n7l6j9j3j9K4
$$ -18 -16 -79 -44 -5 19 -54 5 -42 -1 -61 -39 -40 -7 -18 -41 -1 -12 -72 -4 38 -50 -9 -70 -92 -63 -46 -32 4 11 56 -1 -37 -56 -69 -88 -64
31666f4MQ8o5J9k1L0p1J00p4k4MqN7j0K2L2l9j8L4nOr0R3j1J8l0K6m6NjJ4j5N1k8j2O4lk2
$$ -64 -60 28 -37 -18 -39 -9 -80 20 -54 -78 -74 -82 -25 -35 -13 19 -20 -38 -4 -9 -3 -93 0 -11 7 -23 3 -43 -38 -39 -25 -40 11 -17 -29 35 32 10
31545A0o5Q3p1J5m4P7o2NO0k0J4o1J7N8p5J0N2n4K7j8L9p4J9M3MjMLk0K8m3k9L7J0J5m2o
$$ 10 -55 28 -43 -28 -72 5 -57 -52 8 -12 2 -59 -42 16 -59 -49 3 -51 -24 -42 -3 -77 -58 -15 -11 -12 -8 -5 -25 3 -40 -69 -32 -22 -7 -49 -55
31427e5L1m7J01j00L1M7QTqq0R6q8P7lJ5m8k4q4J05l2K3n1L1MM7j3M7l6m5J2M7j23O9O4l0
$$ -55 -24 -71 30 -70 -39 8 16 24 16 -64 32 -56 21 18 33 -15 -39 -123 -18 -50 -27 -78 -47 -43 4 -9 38 2 -43 -31 16 -107 -38 26 -4
31316dL7j22N7nj2J8J4m2n6P9o6J01J9j2m2j2k5J06p8kP9j0l9J1j2Ro6J3N3mq4J4R8j6j4
$$ -4 33 -89 -32 -37 -49 -31 -17 -59 -115 -36 -102 -1 18 6 -36 -48 -73 33 -45 -47 32 22 -17 -6 -18 -9 -75 -62 -9 -13 -97 -83 15 -1 -15
31204a5k4J0p2N5R2p8nR0r3K2Tj3N3q9J9j7k9kJ6o9Q7Ok5mJ4m6L9O9k9N9n5n2P0o3rP0j1
$$ -15 -39 -29 -101 -46 46 -32 -37 53 -40 -18 4 -9 44 -45 -26 -43 -72 -74 -58 -127 -40 -34 -59 -63 -49 -95 -56 13 -16 43 -12 -64 6 -57 -66 4 -7
31087gn8OL9L2r6K9K1L3j17O5M8j0n7K7P8q9KJ2J0N8p5J6l5K6ok4N1J0j4Nk0M5q2RJ12k6
$$ -7 -65 -59 -20 12 -84 -55 -34 -1 -118 -53 -5 -15 -72 -45 33 -56 -54 -42 -32 26 -49 -33 -68 -42 -48 -72 -21 -11 -25 -20 -40 5 -77 -68 44 18
30972A8l7k8M4k2o5N9jj7J8K7J0Jj15R9j7K7ok1m9P9Lm2j6L7p9j3J12n4LO4q2l0P2K4n1N
$$ 18 -19 -47 -3 -25 -90 -31 -32 -49 -31 -4 6 7 -108 -9 -26 1 -5 -26 -75 4 7 -35 -51 -14 -93 -106 6 -48 -45 19 -63 -93 -21 3 -48 -43
30858d3M5m3L0j0J9J7m1l4M5Tqj5r6M2k7Q1k1K9j0l7k9O0j6l9J8mm7K4Q8q6L1K3j7J0K2r
$$ -43 2 -41 -11 -21 -2 15 -26 -60 -15 30 22 7 -89 -47 -74 7 -14 15 5 -32 -61 -1 -17 -56 -38 -42 -89 -65 23 -63 -32 -9 -26 -16 6 -3
30743ck9j1K2k7R0j30N7qN5k8m9M6l3J3L0j5j8J04p1J6n5l9PR4q9n9J00l5J09j09rJ13j25
$$ -3 -32 -43 -21 -48 42 -88 -31 -39 16 -12 -61 -15 -48 -35 -5 -20 -38 66 -5 11 -44 -83 -76 18 -71 -130 -30 -65 44 -65 -74 39 -86
30638h6J7N8k6Nj3L3ol9Q1mp0L9n4J06j06K3J6j0j9P4o6M9R8j95J0R3j5K7o5N6o4j3P2m1
$$ -86 -69 -11 -37 -32 -45 -12 -18 -57 24 20 -50 -11 -65 41 -65 -42 -26 -36 -55 19 -47 2 100 -95 -85 8 -7 20 -45 11 -53 -66 6 -35
30530c5M1L4o5K7k3Mn8L3l7K1K5mP1l8k0m0N4kjj7lk9klJ23r3k6J2L4m9o7J73n1k0lO8o2
$$ -35 6 40 -25 2 -21 -17 -75 -42 -79 -58 -33 -37 34 -4 -24 -64 -10 -12 -13 -30 -33 -62 -64 -67 56 -37 -63 -51 -17 -66 -133 40 -11 -31 -34 34 -28
30412b8J13j13Nl3oj2P6%r2k2M0M2j7m9J36o0p6P0nm4R8n7j7M5k8%m0L2O6m3l4N6o1P7m7
$$ -28 85 -28 -23 -56 -62 -74 2 2 -90 -112 -72 -30 -47 -96 40 -20 -96 -26 -31 -75 23 -34 -51 -6 -34 -34 -74 -42 24 -19 -53 3 -58 19 -28
30301b8l0k6K3j3M8l1K0oK5j4p3J36l8km2J18q0j8K4k4Qm7K0QL6nk0k2j5J9l9K1O5j0p8
$$ -28 -58 -84 -61 -74 -26 -57 -37 -43 -18 -32 -105 31 -7 -9 -51 67 -13 -31 -7 -31 -23 -70 -50 -42 -6 -11 -31 -53 -68 -49 -88 -67 -2 -12 -90
30190i0J09o6TP2K7J3Ml2Jl4pM7j0pKL8l7K8k7m1O9n2k4QO2ql3L8k0L3Kk0p2M2M6j4Pm6O8
$$ -90 19 -47 -113 -41 -14 -1 3 -29 -28 -62 -69 -22 -32 -39 -37 1 -36 -8 -35 -76 -7 -59 -83 -75 -13 -21 -54 -16 -36 -3 -1 -21 -93 -51 -5 -19 -12 -58 10
30066A0k2on4O0q2O4k1M8M7r1j7N5L2q7M2K1m3LpJ03p7l7l9K4J6Rm1N2j6J9j9N8n1J21p6
$$ 10 -12 -18 -72 -12 -94 -30 -51 -3 44 -47 -64 -9 23 -64 -22 -1 -44 -41 -48 55 -22 -59 -98 -74 -58 -49 -90 -38 -54 -35 -54 4 -47 74 -2
29954bk4K7k7m5K3j1J7j7n6O5q%J8K3j0N1m6M1j3pL6p6L0n2J5l2N1L7m6K1K5p7J33j11j2
$$ -2 -26 1 -26 -71 -48 -59 -42 -59 -115 -50 -58 -58 -40 -17 -27 24 -22 19 6 -1 35 -41 -11 -63 -48 -80 -29 8 -38 -17 8 -69 64 -47 -59
29843e9M2PL3l8l3N3l0K9kk5o8O3pl4M6k3p8J63n6ML6o3K5l8M6M5r9J4N2l2K5o9N4Qm4O0
$$ -59 -17 -10 23 -15 -48 5 -25 4 2 -23 -91 -28 -35 -69 -23 -46 -124 39 -17 -13 23 -40 -15 -53 -7 38 -61 -47 5 -27 -2 -71 -17 -9 -53 7
29729Gn3m6lM8RJ3K8qp3M2K4J3j3%m4P6n9K4JK7j2J0J2m9k8L4o1N9Pn3R9j26J36r8%L9N8
$$ 7 -46 -92 -95 -47 -38 -25 3 -5 -78 -36 -12 1 -12 -12 -56 20 -39 -15 -14 13 1 11 23 -26 -54 -20 -81 -22 -15 -68 31 -95 41 -57 -57 -18 40
29611D0q0M8k3L6j00J25j23K2R0r0m8L4P2o6NL8j7J0j2j8Q1m4L7m6rP5m1kp7kP2n7K5l5
$$ 40 -40 8 -15 21 -79 46 -77 -55 35 -55 -103 -69 3 -63 -58 -20 -37 -27 -39 -57 24 -20 17 -29 -38 37 -4 -6 -83 -85 -13 -70 -45 -80
29503h0J01j1%m6k3jO4%k0pRM5p9QK1k8L0j5M7l7j8M5m4P0r4P7ro8L7O9o6rj7qL3PMqm5M7
$$ -80 21 10 10 -36 -59 -60 4 4 -16 -23 -14 31 -48 -40 -19 -47 -17 -32 15 -22 -40 5 -39 31 -63 14 5 -63 -26 43 -23 -32 -49 -57 -24 -17 -13 -21 -66 -19
29376a9qn7%Q2K1n1J3k0j7J08%j20jO9j3m8M0J3n7L2m3Q8j6j9j2q1J10p7J21o3nl0M7k2k1
$$ -19 -27 -84 -84 -2 19 -32 -19 -39 -56 52 52 -68 -69 0 -13 -61 -21 -8 -65 -33 -76 12 -4 -23 -35 -116 -6 -83 38 -25 -30 -60 -13 -35 -56
29264e6l3R9m2L8j5oO5j46J23j6m3m6L6PK6m7k3J3P4J5m9P4j17QJ7j11J43k5P8o3j3Q5p9
$$ -56 -89 10 -32 6 -9 -15 50 -96 27 11 -32 -78 -42 -35 -9 -56 -79 -66 8 23 -26 48 -69 -61 -44 -155 -12 -37 41 -22 -35 50 -29
29159b9K6k6OTRl5M7Pn5L1j0m2R0m1l3K6K7k8M5L0r4M7oj4o7M1j4N5l1J1j5N6np7%P5m6k8
$$ -29 -3 -29 -23 -17 -8 -43 4 11 -44 -13 -23 -65 25 -16 -49 -23 4 -24 21 51 -43 4 -2 -16 -83 -42 -56 -1 -32 -21 -36 20 15 -62 -62 13 -33 -61
29038f1J1n0R2n9K1qnNrM9lJ5n2J7k3J2P0l2L8n7M4p0O1m3K6r4N7R1q3K2j0M1m1q3M0K1m
$$ -61 -50 -100 -8 -67 -46 -54 -59 -54 -63 -14 -17 -2 -54 -37 -60 -48 22 -10 28 -29 15 -55 6 -37 -11 -105 -48 43 -40 -18 -28 13 -28 -111 -71 -50 -54
28921e4l4J00n7L0k9oqP9j6Jj2l1N3l5o8J8kP5k4j7n5J22Oq3o6P8m6O4m3j0M1j3j0P0NK9
$$ -54 -88 12 -45 -15 -44 -50 -58 21 5 6 -6 -37 16 -19 -87 -69 -71 4 -20 -37 -92 30 36 -47 -113 -35 -81 -17 -60 -70 -29 -42 -52 18 23 52
28806E2q0K2m7j2M3N3po2P1p6k3LK0K1%K3j0Ro0O9p3m9N4LM7K0j5k7R7j04J4q4M8N0oML9
$$ 52 -28 -6 -53 -65 -22 31 24 -38 33 -43 -66 -63 -43 -22 -22 1 -9 0 -60 9 -64 -113 -59 -56 -9 11 -4 -31 66 -38 -24 -108 -60 -10 -16 -12 27
28689B7p8K3M3n2j2P2l8L3n9N9ko6PkNk8M3l8M5Qoo6M0P7o1J6n3M3QJ3j2J5J6m5n2N0j%J1
$$ 27 -51 -28 15 -37 -49 23 -15 18 -41 18 16 -50 -43 -45 -40 -68 -25 -63 -18 -10 -16 -82 -42 35 -26 -10 -63 -20 -12 1 -11 4 20 -25 -77 -27 -28 -28 -17
28565a7o0J6M9nJ3L2n1j7K2l0o4N0N1m7K8M4k6L6r2J04r9N8m7PO8j1n3j2J6L1m7N4pOp9K9
$$ -17 -77 -61 -12 -17 -4 28 -23 -40 -18 -48 -112 -62 -11 -58 -30 14 -12 24 -68 36 -63 -5 -52 -45 23 12 -41 -53 -37 -6 -53 1 -6 0 -79 -50
28450e0O9l2l0L4k3o4M3P2J7j08M2L0M9j06oM4k7oP6n2J6q2O1mN7k1nk2j9j8K4qJ5L3n9N5
$$ -50 19 -13 -43 -9 -32 -96 -53 19 36 -72 -30 0 49 -57 -63 -19 -46 -52 24 -28 -12 -94 -33 -37 20 -1 -6 -28 -47 -65 -41 -49 -34 -1 -60 -5
28336eO5o5j6o6L3TM6m8j1l2L7j5Rl1O1o7P7o7P4j1J9l0J7n6M0o0O5l3M0Oq8P5k8n3N2n0
$$ -5 60 -5 -21 -87 -54 -21 25 -23 -34 -66 -29 -44 -35 -66 -5 -72 5 -62 12 1 20 -10 7 -49 -9 -69 -4 -37 3 9 -79 -4 -32 -85 -33 -83
28221h3P3mK6k5j6m6P4J3p3O4k5m5k7N3L2p0P9O0j07M0n4Q2m6j9P6o9Q5J0j06J8K3l9KL8
$$ -83 -10 -14 12 -13 -29 -75 -1 12 -61 3 -22 -67 -94 -41 -9 -79 0 60 -47 -7 -61 21 -25 -44 32 -37 48 58 -48 -30 -7 -46 -44 -6
28113fP1n5%j7n1rK0j6M5J8k0o9M7P3n8J9n5JQK9j3Rj8OM3n8M7l7l2L8L4k1L1l2P6p9kP1
$$ -6 65 10 10 -7 -58 -67 -47 -63 -18 0 -20 -89 -42 31 -27 -8 -63 -62 -54 -25 -38 -29 -47 -41 2 -56 -9 -46 -78 -40 -6 -27 4 -28 48 -31 -33 38
27992C8q7pj6M2k3Jl5j0L0RL0N0n1NL2Kl7m2lm9O8P1m6k0N1n5l8M3%O3o2O3j4Rjo9L0l3J5
$$ 38 -49 -56 -72 -30 -53 -52 -87 -97 -67 -58 -28 22 -29 -24 8 10 -27 -69 -72 -121 -53 18 -28 -48 3 -52 -90 -47 -47 16 -46 17 3 12 11 -58 -28 -61 -46
27868d6qL3Po0O1j6lN9l8n4N3o9Q7Rq2kM2l5J03l8l6K3n4O2l7K0Pk9K8k2M8n8KNl7L4k7O3
$$ -46 -54 -21 -14 -74 -13 -29 -32 27 -11 -65 -12 -81 6 15 -67 -69 -27 -62 41 3 -33 -10 -64 -2 -39 -19 -12 -41 -13 -35 13 -45 -43 -38 -75 -41 -68 -5
27747eJ8l9Np6Q2j7M4m9l2J5K8P1n9R6j48O9J0l1Rn4R0m2o3O6k0OR2o6K8j15j7L1N8j1Kl4
$$ -5 13 -26 -21 -97 -15 -32 12 -37 -69 -54 -26 45 -14 82 -66 3 13 -18 -9 -63 27 -15 -78 -12 -32 -26 66 0 28 -87 -104 -73 -15 -26 -24 -58
27633e8j7K4J9j4j5j8M1k7P3m3L1J7j23R2N9j12L0PN8q8L5nm7N3mm1RJ3J7QlJ7q5R0k1m7
$$ -58 -75 -51 -32 -46 -61 -79 -38 -65 8 -35 -4 13 -110 -18 41 -71 -41 -34 24 -64 -29 -34 -81 -28 -32 -73 -64 -51 -34 -26 -29 -12 -97 -7 -28 -75
27518g5J05n0O3k9r2M5L4m6Rl5M6p5N4K3k9j4P1p9M1kK8m9J2M2l1mK2J2j0m4j6O2M5m4n9
$$ -75 30 -20 43 14 -78 -33 1 -45 -36 -71 -25 -100 -46 -23 -52 -66 5 -74 -33 -35 -7 -56 -44 -2 -33 -37 -15 -3 -13 -57 -73 -11 34 -10 -69
27407f9P1J7m3k9O9J9p1k1O3p9JM6L0k8l2P4p3j1Tj6N5qK0L6o1P6j1j6k7MJ5N3p1O4p4K9P
$$ -69 2 19 -24 -53 16 35 -36 -57 6 -73 -72 -26 4 -24 -56 18 -55 -66 -77 -93 -38 -46 -26 10 -51 25 14 -2 -29 -25 -10 43 -28 36 -38 -9 -2
27289bTj40J51m9m3j3O4j3J8l1K2N2k3Pm4J13p9k6N3p2NK5qM7o2n6N9J8K6m9j1O6L0m8k9
$$ -2 -2 -142 9 -40 -83 -96 -32 -45 -27 -58 -36 16 -7 0 -44 69 -10 -36 17 -55 -50 -25 -33 14 -48 -104 -45 -27 -1 -50 -61 5 35 -13 -42
27178d2o6J09m7j7K3nk9K8J6k9O4o4R7j22J6OqQ5lpl8J5P0p8R0q5M2k8L2k5l1M0k2k9K3
$$ -42 -108 1 -46 -63 -40 -45 -74 -46 -30 -59 5 -59 38 -84 -68 -62 -70 15 12 5 -33 -18 52 -26 64 -21 21 -7 25 0 -31 9 -13 -42 -19
27067a9L4Tj40R4j8Tk2J02o5L4n3n7J11k2J0j4m0K3L4J7q8JPO8m6Oj2l1J4N6K5n6o1J20p8
$$ -19 15 49 -91 3 -15 -33 -55 47 -18 16 -37 -94 17 -5 5 -9 -49 -26 8 25 -63 -62 -55 13 -33 -27 -39 -70 -56 0 25 -31 -92 28 -50
26955e0RpN2k9p1j6Q6rPK7n2n4K7lL3L8km3M9l6O5r6O8j7M8k8k5kj1j6l2P8K0m2N2m5L7P
$$ -50 -41 -48 4 -25 -96 -112 -26 -35 -28 -1 -53 -107 -80 -83 -50 -12 -14 -57 -8 -44 21 -75 -7 -24 24 -4 -29 -31 -42 -58 -90 -12 8 -34 18 -27 10 17
26834A7k2k4K4Qj01O6N3J5l0Tn5M1J8jK0p5J1O4k1J6q5Q3qr1Q9j6j0J9K5k2k0n4N7Qk3j3
$$ 17 -5 -29 -5 3 -98 -32 21 36 6 -24 -79 -38 -20 -21 -1 -76 -65 -1 -22 -6 -91 -8 -16 -107 -18 -34 -44 -25 0 -22 -42 -96 -39 -31 -54 -67
26720f7L8nK5N4j13K2K5j7j8jR3m1l8m2P7l3N0l5Q%J7L7l8p0N3qn2J09j11L6Q2k0o8m2M1
$$ -67 -29 -34 -9 45 -68 -46 -21 -38 -56 -57 36 -5 -43 -85 -8 -41 9 -26 -18 -18 -1 36 -2 -72 -19 -27 -79 30 -81 -45 37 17 -51 -93 -52
26609e2J4jJ7jJ8j5p0K5l8Q2KrmJ7ONk0Q7j20N1M5l8k8L1n2Ql3L9rk6K2J3nk0M7l0LL3o7
$$ -52 -38 -39 -22 -23 -5 -20 -90 -65 -103 -21 -19 -28 -32 -15 -9 -4 -24 63 -57 -6 39 1 -27 4 -48 -40 -73 -34 -43 -69 -47 -34 -39 -59 -12 -42 -39 -6 -73
26485g3P1rm0j0L4M5p2Q1j45R1L1k7p4J23l2J0q2Q8j8k0o7nR5M3n3Rj5n0O2lQq2JQ2j0K1
$$ -73 -2 -11 -51 -61 -27 18 -54 27 -118 -27 4 -23 -97 26 -6 4 -78 10 -8 -28 -95 -100 -5 38 -15 -6 -21 -71 -9 -12 -4 -86 -85 -3 -13 8
26370Hr7R0m0j8L7j5N6q3k6QM7k1m2K6M2M1M4p8Op8K3M0K9n7J1L1j7j6L6L4o1M4L1l4N0
$$ 8 -89 1 -39 -57 -20 -35 21 -62 -88 -80 -33 -54 -96 -70 -28 13 57 -21 -15 -93 -70 -30 -1 -58 -47 -16 -33 -49 -13 21 -40 4 35 1 51
26259E1j01LO6m2TM3m6L0k6P3j04N9NM0m4J3k3J8J5q8K8M3l3K0j5J6j5K3nJ5L1m4K0O3oj4
$$ 51 -50 -47 19 -23 -65 -22 -68 -38 -64 9 -95 -36 -31 9 -35 -22 -45 -27 -12 -100 -72 -29 -62 -42 -57 -41 -56 -33 -38 -23 8 -36 -16 47 41 27
26144B7o5j3KQM8nn0M7ok0rml5Q7r1P5J6K5p0k9rK7N7Kl2n0O8l0qjTR0q7n2P5J2o8M8l5P1
$$ 27 -38 -51 -49 -41 7 2 -48 -1 -7 -27 -36 -40 -75 12 -79 -4 12 37 -33 -62 -71 -44 13 15 -17 -67 1 -29 -37 -38 -39 51 -36 -88 -13 -1 -69 -21 -56 15
26017A5lo2M8j6j8L1lj09P5J7m1Q5j80J12pL3K3J5k3n5O5j8J7n5L7M5p8K5k0nJ2J4j7KL8
$$ 15 12 -50 -2 -18 -36 -5 -8 -117 -42 -25 -66 19 -161 -49 -56 -23 0 15 -8 -63 2 -16 1 -54 -17 28 -50 -25 -45 -50 -38 -24 -41 -39 -1
25906an9M7o4J25pj02M2l1P5l6m4J7j7L9J7M5m7n3K2J0L0j5m4m7J34o2oJ7K0l9M8qm4J7l3
$$ -1 -60 -13 -77 48 41 -61 -19 -50 25 -11 -55 -38 -55 -16 1 46 -1 -54 -32 -22 8 -7 -51 -98 36 -26 -32 -15 5 -34 14 6 -38 -21 -54
25794e4M9l6R3j18N7j4qjkL3j8k2njK1k7L5J6n7J2K0Mpm9L4M4Np0L5M4k9NnO3j31L5O3j2
$$ -54 -5 -41 52 -66 -9 -23 -31 -32 -34 -1 -19 -41 -46 -47 -26 -53 -18 -2 -59 -47 -27 -23 -30 -79 -45 -1 4 -66 -31 13 -16 -11 -16 47 -84 -49 14 2
25674Bn5Q7o1L9p6J02j04L2M3n8NqN1j04Q2Q0l4J1p8k3K2NO7p3m1J27o1mJ7lm7J9OO1m7K6
$$ 2 -53 34 -27 12 -64 38 -66 -34 9 -49 -44 -52 -1 -105 -23 57 23 34 -44 -67 -45 -40 27 -46 -87 40 -21 -25 -8 -11 -58 -39 -33 28 -19 7
25559GK1l8pM3k4p5M1j9N5J6j5m9JN0n7M4qJ9n0%K1qK0m9P2j02R6j9pqj2L5L2n3P0r9K2P8
$$ 7 28 -10 -17 26 2 -73 -32 -51 4 20 5 -44 -43 7 -50 -6 -14 5 -45 -45 -24 -32 -12 -61 11 -91 5 -14 -21 -29 -41 -6 26 -27 43 -56 -34 44
25438D4k8p7J3OK5o5R0j03Q0k5N2r9P9J5l0k7K4JK6n0RO5m3KL0j16O3l8M0m8J22j9n7RN5
$$ 44 16 -61 -48 -42 -17 -82 8 -95 -15 -40 12 -87 -8 7 -23 -50 -26 -25 1 -49 -40 25 -18 -16 14 -102 -39 -77 -37 -85 37 18 -39 -30 25
25327B5l8j3K7M9q1Ll0L2K5j5OJ7k6k8M5kn0J5m3L7L3j1qK4qJ4l3pOM7p0J5K0m1OM0L9l6Q
$$ 25 -13 -26 1 50 -31 -28 -58 -26 -1 -16 -10 7 -19 -47 -2 -4 -54 -39 -82 -45 -12 -23 -31 -7 -15 -1 -34 -41 -35 12 -58 -43 -23 -64 -58 -18 21 -15 -7
25203gj4N7n3j5L2j8TJ6M7m3J3l1K3lL8k7m8M8k9QK2l0L1K7n7R1p6O5n1l1K1l9M0L3j1P
$$ -7 -21 36 -17 -32 0 -18 -36 -20 27 -16 -3 -34 -11 -14 24 -3 -51 -3 -32 -24 -2 -32 -1 26 -31 60 -16 49 -2 -33 -12 -51 -11 22 11 18
25088A8j06P3J4m0K8n8Q1o3nK4j5N6o2JLL6j9j3J1J6k4J0OL4J6JN1r4m3K9j5M6M4m9K3L3
$$ 18 -88 -15 -1 -41 -13 -71 10 -53 -58 -34 -49 7 -55 -54 -51 -15 -34 -47 -36 -20 -44 -34 -28 6 22 23 74 -20 -63 -34 -49 -3 41 -8 15 48
24974D8K6q1p5R7j5l8L4k3K9k3k0Kl1O9J1Pq6L8Lo9K3N4J01q6o8O6m5j6O4l4RK9L6p7J9l7
$$ 48 74 -7 -82 15 0 -38 -4 -27 2 -21 -41 -39 -70 -1 10 17 -69 -31 -28 -97 -74 -20 81 -5 -73 -7 -52 -68 -4 -38 -29 0 36 -41 -22 -59
24859e9J3kJ2Q2lo4K0j5Kj6R1m7K9j06Q2K3k3o8L4m6J1O6m2k7OM9K6r8K4j1M5L2j5N1m7l1
$$ -59 -46 -48 -36 46 43 -21 -1 -16 -14 -30 61 14 43 -63 19 42 19 -49 -15 -61 -50 16 -26 -53 -47 2 28 -70 -46 -57 -12 20 5 56 9 -22
24745b2nm7R8k1mm3O4j5K8j22Q8l8L1n5L0N1n6j5R4Nj35O9p5P8n4K6M8n7LTK9N2o6J0J4k
$$ -22 -27 -74 24 3 -1 -44 20 5 33 -89 -1 -39 -8 -63 -33 18 -38 -53 41 46 -89 -20 -95 -17 -71 -45 3 -54 -51 -48 -19 33 -33 -23 -9 -11
24630a1m6%Q7j1n3J1nL8l5jK3k5L3l8m6O0K6M6jJ3L5J3RP3Q4m1q1K4j27J5J4n0Lj5nP3n1
$$ -11 -57 -57 30 19 -34 -23 -28 10 -25 -26 -3 -28 5 -33 -79 -19 7 53 52 65 100 113 122 195 279 238 157 181 54 69 83 33 36 21 16 89 38
24513C8o5O5k7M5o2j1j3kQ0J4r2m0R2Mq8M4k2R1q9O4j04L8K8l8R4q4LN8l9jJ0l7RN9j07M0
$$ 38 -27 38 11 56 -6 -17 -30 -32 48 62 -30 -70 22 26 -62 -18 -40 51 -38 26 -78 -40 -12 -50 44 -40 -37 21 -18 -19 -9 -46 -37 22 -85 -45
24398d5L7j7P4n7l8L7m%K6j07M5L3K8q8R7r7L4%qRR5r4L2l7L4J0Nq2R8l9QP9r5K7l5L6k6m
$$ -45 -8 -25 49 -8 -46 -9 -13 -13 13 -94 -49 -16 12 -76 21 -76 -42 -42 -50 -41 54 -40 -8 -45 -11 -1 4 -78 20 -19 -11 68 -27 0 -35 1 -25 -29
24277b9k2TP2q3J00m9M7K0m6m5nM8j1m1K3%N4l3rj1L9J6o2NM1J3rKj6k1OLJ3LOK5l2J8j30
$$ -29 -51 -73 -1 -84 16 -33 14 34 -12 -57 -62 -14 -25 -66 -43 -43 11 -22 -31 -42 -3 13 -49 -44 -3 10 1 3 -13 -34 -28 -25 -12 -9 -3 22 -10 8 -122
24153a22N3K0N8M5j32Q4j8J0J7JM8j65O2j4J02j01j9J5N8m6oM0l1l6N6J2k2n3J45m8l0NL4
$$ -122 -69 -49 9 54 -78 6 -12 -2 15 16 64 -101 -39 -53 49 -52 -71 -56 2 -44 -50 -10 -41 -77 -21 -9 -31 -84 61 13 -17 -12 22
24048B2k8N1p8j9Qo0P7j4pO1K8r5Q1m6q0J17o1P0n3J4O9q4Q9p9O3j28J6R6j3j24Q3L8l4l3
$$ 22 -6 45 -33 -52 -44 -104 -27 -41 -48 13 41 -54 27 -19 -99 18 -43 27 -26 -12 57 -27 62 -17 46 -82 -66 30 17 -107 -24 14 -20 -53
23940e3K3rJN5l7O4n7J2j05M7jR0m0k4Rq1O4R6o0K5p1O3l4J7Jk2J00j42N6K8nj5l1L3j4K
$$ -53 -30 -39 -38 17 -20 44 -13 -1 -106 -59 -60 30 -10 -34 -25 -106 -42 54 -6 19 -52 11 -23 -6 -5 -27 73 -69 -13 15 10 -5 -36 -3 -17 -15
23826a5m7K4l1J0Tj0K6P8qJn0k9J1RL9p2J11k1j02N8q3O2K5P1r3Jm0J7N1m6rK9J8o2Q9n2
$$ -15 -62 -38 -69 -59 -49 -59 -33 45 37 38 -12 -41 -30 -21 18 -54 57 36 -66 -8 -91 -29 -4 67 -26 -25 -65 -48 3 -43 -52 -23 -5 -67 22 -30
23711c0j2k3L6qnP3m3J4J0Jrm5k3O8k1l8k4L4N0J6m8J2M7q5O3KK4q1jm1nO5k8Q5m6JM2m9
$$ -30 -42 -65 -29 -37 -42 31 -12 2 12 13 4 -41 -64 4 -17 -55 -79 -45 5 21 -27 -15 32 -53 10 12 36 -45 -46 -87 -92 -27 -55 30 -16 -15 27 -22
23590b2k7OJ02p6l1J7pO5k8j0j1L7L9k1l3n4TJ40ln0J6o1N6J7k1mj5M8j0j2n5N3k1j5K9%
$$ -22 -49 -43 59 -17 -48 -31 -38 27 -1 -11 -22 15 54 33 0 -54 -108 32 29 -21 -5 -66 -10 7 -14 -18 -33 15 5 -7 -62 -9 -30 -45 -16 -16
23476a6j7M3o3QoM1M3m7M1Jn3N9m4k9l3Q1k5k0K1M2m7m8P3qPk2l6Q7o6MM8n8J7o0Q2J0jm6
$$ -16 -33 10 -53 -45 -51 -10 33 -14 27 28 -25 34 -10 -39 -72 9 -16 -36 -15 27 -20 -68 5 -3 4 -18 -54 33 -33 -29 19 -39 -22 -82 0 10 9 -37
23355c7j9k2N8l3qN2lJj11P2P3K4o6Rj7kJ0JL7J8l8q1K1j4J67j12j3P7q4K0K6l6L3m3n9
$$ -37 -56 -78 -20 -53 -61 -9 -12 -11 -122 -50 23 47 -19 -10 -27 -29 -19 -18 19 37 -1 -82 -61 -75 92 -20 -33 44 -40 -20 6 -30 3 -40 -99
23244i9J12l8k9pN6l8OM9L0k7k9p5N2l5N0J7j9L8J0kn1M2q2k3P7l6M8m1P9m2K9o5K5o1N4
$$ -99 13 -25 -54 -61 -5 -43 -37 12 42 15 -14 -89 -37 -72 -22 -5 -24 14 24 22 -29 13 -69 -92 -15 -51 -3 -44 35 -7 22 -43 -18 -79 -25
23132b5L9n3Q3l1n5L6J1kk1k9O2n5O4o6OR9n8rq1L0L3rm1K5J6KQkTl1M7k1R5p0n7P2n0K4n
$$ -25 14 -39 44 13 -42 -6 5 3 -18 -47 15 -40 24 -42 -36 63 5 -4 -85 -55 -22 -31 -72 -47 -31 -29 -21 -23 -25 -56 -9 -30 65 -5 -62 10 -40 -16 -21
23008b1j6N6l3N2l4o5J26p2o3J12j7o2K2o0M6j9N8l2P9r5K2n1k0Q5k9M4o4J3kj3L7M4o9j2
$$ -21 -37 19 -14 38 4 -61 65 -7 -70 42 25 -37 -15 -75 -29 -48 10 -22 57 -38 -16 -67 -87 -2 -31 13 -51 -38 -40 -53 -16 28 -41 -53
22900e3J20j43P7p1O7jM7j33R0Nl6k1L6m0L0m5K8Mk9Q7m5M1oo3j6P6j5n9J14q8L8N1r0P0
$$ -53 67 -76 1 -70 -3 -4 43 -90 0 5 -31 -52 -16 -56 -26 -71 -43 -39 -68 19 -26 15 9 -54 -70 6 -9 -68 46 -42 -4 47 -43 27
22792B7K2r1L3M4o1l4J3J%J07p9J3rKnJoPo0M4P1o9M9l0N7nn7Q3j37Q7m6L6RM5q0L9rl6L2
$$ 27 49 -42 -9 35 -26 -60 -47 -46 -46 61 -18 -5 -14 -12 -17 -16 -22 -15 -75 -31 40 -29 20 -10 47 42 -15 68 -69 18 -28 8 17 62 -18 21 12 -24 8
22668Hp8O6j3l3J9M6K4j3m3M0j07M4L9K7l2TJ1J3k1j0n0N4L2K7k8q1P5p1L7K7QN1o7K5K0R
$$ 8 -70 -4 -17 -50 -31 15 39 26 -17 23 -84 -40 -1 26 -6 -38 -27 -14 -35 -45 -95 -41 -9 18 -10 -91 -16 -87 -50 -23 -15 36 -31 -6 14 23
22554B3p7l1R9j8J2kl7n3nK0N4lN7q2j0O4n1J6K5m7O0l3j5N1p3L9j5K7j4j0K6K0k0k1L8j
$$ 23 -54 -85 14 -4 8 6 -31 -84 -89 -69 -15 -18 39 -43 -53 11 -40 -24 1 -46 14 -19 -34 17 -56 -17 -32 -5 -19 -29 -3 17 -3 -24 14 13
22439A3q3N8L0Nq5J8%L5pj3RQ3j02m2Q9lm2pN7j04J25k8K9pm2k0l1M6M2o9j7l2K9N7k3P9
$$ 13 -70 -12 18 23 -62 -44 -44 -9 -16 -29 -20 63 -39 -81 8 5 -37 -44 13 -91 34 6 35 28 -14 -34 -65 -19 23 -46 -63 -95 -66 -9 -32 47
22325D7j09L7K9j8mk8L0p4Q2k3PJ7K5j0j7j6j5R8l6j34J69q1RKPj0j9R3j16O8k4j2j1J4r
$$ 47 -62 -25 4 -14 -18 -46 -16 -90 -8 -31 -24 -7 18 8 -9 -25 -40 58 22 -112 57 -24 -15 -13 -6 -16 -35 58 -58 10 -14 -26 -37 -23 -32
22213c2J5M6p9R8p9J7J2O0p3k2K0O6n1K6o7N5m4j6m0L5L9j3Pj8ro5O4j0P5m1QJ6Nm2k1JO8
$$ -32 -17 29 -50 48 -31 -14 -2 58 -15 -37 -17 49 -2 24 -43 12 -32 -48 -88 -53 -14 -27 -20 -38 -47 -112 -48 -58 17 -24 -16 0 5 -37 -58 -57 11
22096A1m1O2o3J1o4L5J7L3K7m8N3k6P2m5q3nN2q5Q0qTK4l5M8j5l4K1nn5K1L4o7L9M4J5LL5
$$ 11 -30 32 -31 -20 -84 -49 -32 1 28 -20 33 7 79 34 -49 -54 -2 -87 -7 -15 -23 1 -34 14 -1 -35 -14 -19 -74 -53 -19 -86 -47 -3 12 15 50
21978E0q6M2n3M0K0K9k3j5l6J3Q1j03L9J4l1k5M8K3p5K5RM0q5L5l2Q0q7J01Jl1p6P7j0l4
$$ 50 -36 6 -47 -7 13 42 19 4 -32 -19 62 -41 -2 12 -19 -44 4 27 -48 -23 -14 26 -59 -24 -56 24 -63 38 39 8 -68 9 -1 -35
21870c5j5L6RK1q2M7N7o8j6j5M1MRo5N2K4J0m7M0pm4PJ3J2m5N5l4K3p2Q8n6P9r4O6p1N9k3
$$ -35 -50 -14 -5 16 -66 -19 38 -30 -46 -61 -20 -16 -7 -72 -20 4 14 -33 7 0 -44 -37 -24 -12 -57 -2 -36 -13 -85 3 -53 26 -68 -2 -73 -14 -37
21752c7m3M6j3NQ1r9L5L8j9k1J9l0M9p2kL2M3p7P0o0M6n4J2L4L3p7J3O0m7K0n1N1k5M2m3
$$ -37 -80 -34 -47 -42 39 -60 -25 13 -6 -27 -8 -38 11 -61 -63 -31 12 -65 5 -55 -9 -63 -51 -17 16 -61 -48 12 -35 -15 -66 -15 -40 2 -41
21641d1L1%okJlj9n0P9l7P4r7L2J9K1J0k6p9O5O0j04Q9o7N7L3po4l3Q6n1N6Mm2l8N1PL3
$$ -41 -10 -10 -16 -18 -17 -20 -39 -89 -10 -47 27 -70 -38 -19 2 12 -14 -93 -28 32 -72 17 -50 7 40 33 -31 -64 22 -29 27 31 -11 -49 2 9 42
21523D2j25R0L4j5l4m8n2P4K3m1O2J3Mj17K2N6%p6R8J1nj0o1k4J02J0j36M0OO6l8rJ2N5n2
$$ 42 -83 7 41 26 -8 -56 -108 -34 -11 -52 10 23 27 -90 -68 -12 -12 -88 10 21 16 6 -55 -79 23 33 -103 -63 -57 9 -29 -38 -26 29 -23
21412b3Oj4L3k3K3lql7j0k3O9O7j21N7J5o4O4m8L8L5n7pk6Q7n3n2N5j1N3j2J5q1Q0n4L2J3
$$ -23 -17 -31 2 -21 2 -1 -9 -46 -56 -79 -10 57 -64 -7 8 -56 8 -40 -2 33 -24 -31 -57 30 -23 -75 -20 -31 22 10 25 -56 24 -30 2 15
21297A5p9Q4jk8pm1K3J5j7q3J12p2N6K5L7l3p5J5O5q6K0j1M9J0JJ3m3Qj7J26r4n5OM7J7l7
$$ 15 -64 20 19 -9 -16 -57 -34 -19 -36 -119 -7 -79 -23 2 39 6 -69 -54 11 -75 -55 -66 -17 -7 -6 7 -36 -28 -45 81 -13 -68 -62 -15 2 -35
21183c5Nk8l4P5m9M7l2P3o3l2Q1k1q7J28r5O3o7N7n4L4Q0n7l6K5k9L9j9k9O3k6rk9K0Oj9
$$ -35 -30 -58 -92 -17 -66 -19 -51 22 -41 -73 8 -13 -100 28 -67 -4 -71 -14 -68 -34 46 -11 -47 -22 -51 -12 -31 -60 3 -23 -32 -61 -41 -35 -54
21071e4K6NjK7m2Q0n1j3J9L2m4p7J28j01N9n6O8p4J9P8j0m7M5n8pm6l6J34R3j72J4j6j35
$$ -54 -28 -23 -24 3 -39 41 -10 -23 -4 28 -16 -93 35 -66 -7 -63 5 -69 -50 28 18 -29 16 -42 -49 -95 -131 3 96 -76 -62 -78 -213
20967b13K80j00J18pk07K80j30J0l7K9J11l10N6K7R4j30J08P3p8nK3j2k4N7n6N0m6P5mq5
$$ -213 67 -33 85 78 -129 151 21 31 -6 23 134 -176 -120 -93 1 -129 -21 52 -26 -31 -8 -20 -44 13 -43 7 -39 36 32 -53
20871e3J8l%K5o9M8l0N1qkN4q6JO2j7J1O7l9r7O9m3O3k4j6L1m5l9ON1jl2K2Kk0M1j5j3m6
$$ -53 -35 -38 -38 -13 -82 -34 -64 -13 -21 -23 31 -55 -54 8 -9 2 69 30 -67 2 -41 22 -2 -18 13 -32 -71 -65 -14 -15 -47 -25 -23 -43 -2 -17 -30 -76
20750g6L6Q1K7j67Q3L2k4N9l8o2mM5L2k8l8K9TOjKn3L8m1j9pK1JJ4M5p6j5K9J9J2q7N3N1M
$$ -76 -40 41 68 -99 -16 16 -8 51 13 -49 -53 -8 24 -4 -42 -13 16 22 21 23 -30 8 -33 -52 -59 -38 -37 -23 22 -54 -69 -40 -21 -9 -96 -43 8 12
20629A2j02L6K2Q1l5j10L7J8rk8Q1J8p6J08n4R5j48J1KP6n9j9K0Q4m3k9R5r1ml5L9K6Mq8
$$ 12 -90 -54 -32 49 14 -96 -59 -41 -50 -78 3 21 -55 53 -1 94 -54 -43 -41 35 -24 -43 -23 61 18 -11 84 -7 -11 -46 -7 19 23 -65
20521f5M1j2K0k3%m5L2O0j7l9J69j76J25o6k9O0M6j56O6L8l1l4m4K5M3J5k5j3L1k8l6j7K4
$$ -65 -24 -36 -16 -39 -39 -84 -52 8 -9 -48 121 -55 70 4 -25 35 81 -75 -9 29 -2 -36 -80 -55 -12 3 -22 -35 -4 -32 -68 -85 -61
20416f1M4k2N5k3K8q3J3O1k6K9pN0n6Pq1P5m7rK1J0rkj6M4k5M5m7l5pN4o7M4N6k3K4k4ql2
$$ -61 -17 -39 16 -7 21 -62 -49 12 -14 15 8 58 2 9 -72 3 -44 -53 -32 -22 -31 -33 -49 -5 -30 15 -32 -67 -74 -20 -87 -43 13 -10 14 -10 -18 -50
20295e0Q1l0j10Q1O9k0j5J7r8N4mnk2N7n4N1n4P6ln5n7O9m0rN9l0J2l9O0m3k2M2Qm7M3J3
$$ -50 31 1 -109 -28 41 21 6 23 -75 -21 -25 -30 -52 5 -49 2 -52 24 21 -34 -91 -22 -62 -71 -12 -42 -30 -69 -9 -52 -74 -32 -24 -71 -28 -15
20181a5j0L5m5M3n7R1l7m9J5j5mk9Q6j8k9%l8L9j03J01M1l3L2L4m3qm6M1NnN7j58Q1k8P5
$$ -15 -25 10 -35 8 -49 42 5 -44 -29 -44 -48 -77 9 -9 -38 -38 -76 -37 -140 -39 2 -31 1 35 -8 -16 -62 -21 -16 -21 36 -122 -41 -69 6
20070Fj0Mm3L1%J0O%J4p9K8Q1o0o4j1L4M3orn1L2Ol1Q6M0k5j03N1oK8n3M9J2L2m1l1L6n9P
$$ 6 -4 0 -43 -12 -12 -2 4 4 18 -61 -33 48 -12 -76 -87 -53 -10 -16 -25 -76 -44 -38 -69 17 57 32 -71 -20 -26 2 -51 -2 10 42 1 -30 6 -53 -46
19946d6L3l9O6m1j5O1Jj1l1K4j1J1LL3Mm8rL1n6M9n7L1n6Q1%p1P0m6k8M8N2m6J2nm5jM0j0
$$ -46 -13 -52 14 -27 -42 19 20 9 -22 2 -9 2 5 38 42 -6 -15 16 -40 9 -48 -17 -73 8 8 -63 7 -39 -67 -19 33 -13 -1 -6 -51 -52 -12 -22
19825b2O0p4K0k9M7l6L6P4p5J2j02Q9J3k7OK1lro1qML3N5m8Kj3nJ4k6Q4k0o2K6L4L9j06m2
$$ -22 38 -36 -16 -45 2 -34 2 76 1 13 -89 0 13 -14 -8 13 10 1 -60 -68 -64 -31 24 -24 -22 -35 -40 -26 -52 32 12 -50 -24 10 49 -57 -99
19707i9L1N6J4l3nj9n3R7o0L7j3K4J4ml8lO7m2pM9p5O0m7J3J8k6TJ8K5k5L0K4L3n1%Nk1j3
$$ -99 -68 -12 2 -31 -36 -55 -108 -11 -71 -34 -47 -23 -9 -13 -51 -54 13 -29 -36 13 -62 -2 -49 -36 -18 -44 -70 -52 -27 -52 -22 2 35 -16 -16 -11 -32 -45
19586d5R5p1j9O2m6O9n3%k4J4l8M0N6o8O9q1jp5O3n1M2J6qm8J02ql0LJ3ON3j8m5TK2nO1n5
$$ -45 50 -21 -40 22 -24 45 -8 -8 -32 -18 -56 -16 40 -28 41 -40 -41 -116 -53 -104 -62 -46 -54 -102 0 -8 -38 -35 -22 -16 37 19 -26 -71 -49 -54 7 -48
19465d8J2j1TN9Rp2N6Qn2L9N4j15M3M6o1l9M3QL1k9N0Pq1J7O0k2m0L5Qk1j1Rm5N7pp1Q7n4
$$ -48 -36 -47 -58 1 10 -62 -6 2 -50 -11 43 -72 -29 17 -44 -83 -40 -32 -1 -30 20 27 -54 -37 23 1 -39 -4 4 -17 -28 -19 -64 -7 -14 -85 2 -52
19345e2N0J3jk4m2pQrJ17Rp3m6K2L9l4L9J1l5J0l6P5m8n5Q6j3P7j32K1oP0j5l9Rm7M3jJo0
$$ -52 -2 11 10 -14 -56 -63 -55 -64 53 62 -11 -57 -35 4 -30 9 20 -15 -5 -41 34 -14 -69 17 4 81 -51 -30 -36 34 19 -20 -11 -58 -15 -16 -15 -75
19224g5j2P8n5j2k5J03Om7K1L8m0qm1K4O0j7p2L0m5L1O5K3n4J3K2o5N2lk1%K4m9Jj6J6N1
$$ -75 -87 -9 -64 -76 -101 2 8 -39 -18 20 -20 -28 -69 -45 15 -2 -74 -44 -89 -58 7 30 -24 -11 11 -54 -2 -5 -26 -26 -2 -51 -50 -66 -50 1
19109Aq1k3J04lk7k0L7m5J4j1M8M6q0O5n7O7n8K3q0M2J4Jnj9m4L8O1j04R2p1M1K4m3K5N3
$$ 1 -80 -103 1 -2 -29 -49 -12 -57 -43 -54 -6 40 -40 25 -32 35 -23 0 -80 -38 -24 -23 -28 -47 -91 -53 8 -96 -4 -75 -34 -10 -53 -28 25
18998B5r4J0kM1j0K5k8j5L1l6j1L2L9l2j8O5n5K6Mn0KK0l9m2J13l8K8n4L2j4k6P2l5K4k5
$$ 25 -69 -59 -61 -20 -30 -5 -33 -48 -17 -53 -64 -32 7 -25 -43 22 -33 -7 -3 -53 -51 -31 -70 -112 1 -37 -9 -63 -31 -45 -71 1 -34 -10 -35
18887c5N5o6L0j2J1O4q8kO6n4L5Oj4Pn0JM4l2l4N5OJ8o7KM8Lj5n7L7oJ7Tpk8L9n3K5oLkN2
$$ -35 20 -46 -16 -28 -17 47 -41 -43 23 -31 4 10 -4 3 -47 -46 -2 -34 -68 -13 -7 11 -56 -54 -6 -3 -18 -75 -38 -44 -27 -10 -17 -45 -6 -59 -34 -40 -37 -39 13
18756A3j8o8K7J1J6J7jj7N0K6r5KP4l2l1O4km2k4qL5p7l2J24K2q7QK5KJ4r9N1Q0j15J02q4
$$ 13 -5 -73 -46 -35 -19 -2 -3 -20 30 56 -39 -37 37 5 -26 38 36 -6 -30 -38 -3 -80 -112 12 34 -53 -45 -20 -18 -4 -103 -52 28 -87 15 -69
18642f9K9j4pL0M5no8Q6Ll9m9N3J1m2j9mNK3N3l4m7K4R4o7j2jm4Q5j4rm0K9Pk7rK2OjOk7K
$$ -69 -40 -54 -61 -31 14 9 -59 27 30 -9 -58 -5 6 -36 -55 -59 -54 -31 22 -12 -59 -35 59 -8 -20 -21 -65 20 6 -3 -43 -14 -7 -34 -43 -21 -15 -16 -10 -37 -35
18511c5r5R4J9M9k4o6J01o6L6q8J02K1n3k3J7o7j7J3Q4o3J3j3J21l0l3L5n0N1pk8l0L8l3
$$ -35 -130 -36 -17 32 8 -58 43 -23 13 -75 27 48 -5 -28 -11 -78 -95 -82 2 -61 -48 -61 60 30 -3 32 -18 33 26 -2 -32 6 -27
18406b7L5m0O5k6J4l1Om4n0J02j0l9K5p0J12K3o7nJ1PK6q5P1n1K6L5k1m7KTM6M9j3j22N4o
$$ -27 8 -32 33 7 21 -10 -4 -48 -98 4 -6 -45 -20 -90 22 45 -22 -27 -16 -9 17 -68 3 -48 -22 13 -8 -55 -53 -51 -5 44 31 -91 -37 -43
18292d3n0O1Kk4PR1j9k5o0J7j7L1L0p5JR3p3Q4j12M6M3n8R5q0m3j0l6J24q8N3L7l3J9k4L3
$$ -43 -93 -32 -30 -54 -47 44 25 0 -60 -43 -60 -29 1 -74 -73 20 -53 31 -81 -35 8 -50 45 -35 -78 -88 -124 0 -88 -35 2 -31 -12 -36 -3
18180cm4P9L4j85J04k0orL7j0J2K1j8rpl5L2TM3Jn0j4K0o4n9P6N7o5M2K7K5j06N4J8o3J1
$$ -3 -47 32 66 -119 -15 -35 -41 -50 -13 -23 -11 10 -8 -17 -24 -59 -27 5 48 49 -1 -15 5 -59 -118 -42 15 -50 -8 19 44 -62 -8 10 -53 -42
18066d2k5O4nm1l4M8l5N5K9m6L1p4R7J7n5p4J01K2m4j2L5o9l2N9j4O5j05N6k9J27r9J7K8
$$ -42 -67 -3 -8 -49 -83 -35 -70 -15 14 -32 -1 -75 22 39 -16 -90 11 33 -11 -23 12 -57 -89 -30 -44 21 -84 -28 -57 70 -29 -12 16
17961A6l3ok6K8n6M2L9J9m9l9N9m1j7K9M2j6n5N3J0j02R0J0o1N0O4q9K2q5P2M3o0M2J7o6
$$ 16 -17 -23 -49 -21 -77 -35 4 23 -26 -65 -6 -47 -64 -35 7 -9 -64 -11 -1 -103 -13 -3 -64 -14 50 -39 -17 -102 -30 13 -47 -5 12 -54
17853e4M8LL5J1J5n1M2o7L6r8P7oK2OKo3Oj2n2K6M1L4j0Qn1N4K8j08R6L8j09jL5O4o6j5K6
$$ -54 -6 -3 32 43 58 7 49 -18 18 -80 -3 -9 13 19 21 -42 -36 -48 -100 -74 -33 1 -9 -1 -52 2 30 -78 18 56 -53 -54 -19 45 -21 -36 -10
17735a0P6o9K9o0O1r4J3P3j4J1n5l9Q3j26R3k0l5J4MJ32j24K0m4P3M1j01J8QKLJ17j10Rp1
$$ -10 66 -3 26 -34 27 -67 -54 19 5 16 -39 -78 5 -121 -28 -48 -83 -69 -65 67 -57 -37 -81 -8 33 -68 -50 -42 -40 -37 80 -30 -21 -92
17627i2O2l9M4QM0j4k5qnmJ6Nk0qPm2Q8k0Nj6n1L8K6K9o4M9m3M5kK3n0m5JL4j9N3k4Kk2j
$$ -92 -30 -69 -25 -17 23 9 -16 -24 -29 -33 -17 -12 -32 -40 -33 -75 13 -7 -2 -18 -69 -31 -5 24 -40 9 -34 11 9 32 -18 -63 -62 -28 -47 6 -18 -16 -38 -39
17500c9n0O5qJ7n0o4P4K1M4k0o2J13p8J4l7J7R4k0o1Nj4k3L3l8K9k7N3k6j6O9o6J0P9p8P
$$ -39 -89 -24 -32 -15 -65 -129 -55 -34 10 -10 -72 41 -37 -23 -60 -43 51 31 -30 -25 -39 -62 -29 -67 -38 -65 -12 -38 -54 15 -51 -41 38 -40 -33
17389c3J9n9O9o5J31j09L6q8J63q2P5j50J33p4jj9O0l8L2Mr5N3j4Q8p9k3LL2K4m9J1K2O2
$$ -33 -14 -73 -4 -69 62 -47 -11 -99 64 -18 57 -93 40 -34 -35 -54 6 -32 0 4 -91 -38 -52 36 -43 -66 -63 -31 -7 -56 -45 -23 39
17284C9j8r2L4J1Pp0Q7k9j07J24P3o8QJ9m1QJ6j0TQK3l7J3nrj2m5J02ro3nQ1m5n3R7j06K8
$$ 39 21 -71 -37 -26 -19 -89 -2 -31 -138 -14 59 -9 -1 18 -23 -15 1 -9 -19 -11 12 -25 -12 -17 -26 -38 -83 19 10 -53 -58 23 -22 -75 22 -84 -56
17166e6N2J5Ol4KJ9q6L3L7n8M9Qk1L1nj7k6k2O1j7o1O9q3O4L2o9O3j0mk0M4l6r7J25No3R3
$$ -56 -4 11 17 -17 -15 4 -82 -49 -12 -70 -21 -13 -34 -3 -8 -25 -51 -73 -12 -29 -90 -21 -104 -40 -8 -77 -14 -24 -28 -48 -4 -40 -137 -12 -7 -70 23
17048B3j3j05N5L7L0l9k1j1M7m2J1LK1m9%M5K9l7J0j9j6lJ4K2P9j04lj5j6pJ20n5J2pK1r3
$$ 23 10 -95 -40 -3 27 -12 -33 -44 3 -39 -28 -25 -4 -53 -53 -8 21 -16 -6 -25 -41 -44 -30 -8 71 -33 -36 -51 -67 -74 46 -9 3 -4 17 -76
16934g6N4L2r9O9lk2j4m6N6%M8j5j2j5o4O4M8n5N9pl9J01o5l4NM6l3m5N7Jm9J3o3RK6J2k8
$$ -76 -22 10 -89 -20 -23 -45 -59 -105 -49 -49 -1 -16 -28 -43 -107 -43 5 -50 9 2 -37 64 -1 -35 -30 16 -17 -62 -5 -4 -53 -40 -103 -94 -68 -56 -84
16816h4R0o5L2k1J3L1n1k2R1Mj3l7L7m4J9m9j9O6mm6Pl4K3Pm2J38k3j3q9Q2K9m4J3O0j0p9
$$ -84 6 -59 -27 -48 -35 -4 -55 -77 14 18 5 -32 5 -39 -20 -69 -88 -22 -26 -72 -65 -99 -76 -69 -111 27 4 -9 -98 -16 13 -31 -18 42 32 -47
16702d7nK3NL4m1K6n3J9JKo8N8R5n0R0j38J22q4j5l0J6k2R3m0l9p6Q4l1J8n3J36m2j6m5L3
$$ -47 -52 -29 -24 10 -31 -5 -58 -39 -38 -36 -104 -46 49 -1 89 -49 73 -11 -26 -56 -40 -62 31 -9 -48 -124 -40 -71 -53 -106 30 -12 -28 -73 -40
16590d0TJNm4J02o4N4J4Kk7l0j1P7%o2N4pm6j0K0J5p5R0l8k5qJ1K4k8l6M7kJ7j2MJ2n8R8
$$ -40 -40 -39 -34 -78 24 -40 14 28 30 3 -27 -38 39 39 -23 31 24 -22 -32 -12 3 -72 18 -20 -45 -53 -42 -18 -46 -82 -35 -37 -20 -32 -28 -16 -74 24
16469B4m0J9oj2N0J8p7j3J6L3k7M2p1P0q8J00o1k3Q8o7Op7J22r3l6J02r6J42m0m4K3L1n3
$$ 24 -16 3 -3 -15 35 53 -24 -37 -21 12 -15 27 -44 26 -62 38 -23 -46 42 -25 -19 -96 26 -67 -103 -1 -97 45 5 -39 -16 15 -38
16364c8k2J06m5l5L4j3l5K4j2N6n8L3O0r1Jm8Q8n7mJ2K3L2p3R0p9RjJ2L7k7Nm1j2O1K0m1R
$$ -38 -60 46 1 -34 0 -13 -48 -24 -36 20 -38 -5 55 -36 -35 -83 5 -52 -56 -44 -21 11 -62 28 -51 -42 -43 -31 6 -21 -16 -57 -69 -8 12 -29 -20
16247b0L3p6N4m1P2q3M5NRp4N9rM6l0J5n7l6O4N2p8J5M6j6m1mo7O9O6k7l1L8j21J20k3q4
$$ -20 13 -63 -9 -50 22 -61 -16 -11 -2 -76 -17 -26 20 -10 5 -52 -88 -24 28 -50 -35 11 -5 -46 -50 -117 -48 18 -9 -40 -2 -123 -3 -26 -110
16135a10P0m7N6L6r5J17q5M8j6k4k0O4kn6JK9K0l8jmj5P8Mj0oK5J2Pq8L1%m7K4J1j7M5p9
$$ -110 -40 -87 -31 5 -90 27 -58 -10 -26 -50 -70 -6 -8 -64 -63 -34 -14 -52 -53 -57 -72 6 10 0 -6 19 31 38 -50 -19 -19 -66 -42 -31 -48 -3 -82
16018h2L8M4n9L7l4L3m0N5j00M6N7n7J9K4M8J8k8r2P2o7R5k5r2J13m4rJ3Ojl0M6j0j08Q1
$$ -82 -44 0 -59 -22 -56 -23 -63 -8 -108 -62 -5 -62 -43 -19 29 47 19 -73 -1 -68 27 2 -90 23 -21 -30 -17 -11 -12 -42 4 -6 -114 -33
15910c3P9p5K5m6MM0l7qm2Q7j3N6j24M4L7PJ8J4o2K2Pj0m3O2l8ml8O7n1O3n3j0L8j1%m8M9
$$ -33 46 -29 -4 -50 -46 -6 -43 -51 -93 -6 -19 37 -87 -43 -6 1 19 33 -29 -7 0 -10 -53 9 -29 -33 -71 -4 -55 8 -45 -55 -17 -28 -28 -76 -27
15792b7k4K3LN0j28Q2J1%M4j17Q8qr7L8N1j3k8J2Kk8K5M9qk3k1P9np0rPK0j5L4Pr3O3K5%
$$ -27 -51 -28 -25 25 -103 -21 -10 -10 34 -83 5 -3 -100 -62 -11 -24 -52 -40 -38 -66 -41 8 0 -23 -44 35 30 -40 -49 -42 -22 -37 -3 4 -89 -26 -1 -1
15671aj4j9qK3Mp0N5L7k0jJ9m6jj2J6n8M7N4m9j3J04o0pm1J08n9O4o8Rm2N5LJJ4j41N2Q2
$$ -1 -15 -34 -42 -19 -15 -85 -30 7 -13 -14 5 -41 -42 -54 -38 -96 -49 5 -44 -57 47 -13 -20 -61 47 -12 52 -16 -7 -49 6 9 10 24 -117 -65 17
15553A7n7jM9k7M5q7Q7q5%J7n2J7N5R1q1J8n7K0mM5j05J1J3Q5n3M4j5j52J70k9L7l2o9J30
$$ 17 -40 -41 8 -19 26 -61 26 -59 -59 -42 -94 -77 -22 69 -12 6 -51 -31 -35 10 -95 -84 -71 14 -39 5 -10 -162 8 -21 16 -16 -85 45
15445D5q4Pm2L5jN8o8K8J7M8q9K2j2l2J2J3L7o8N7K0K6j8o3Lj7J15q0J8OJj0kj26J18J1o5
$$ 45 -39 -32 -74 -39 -40 18 -50 -22 -5 43 -46 -24 -36 -68 -56 -43 -6 -74 -17 3 29 11 -52 -49 -66 49 -31 -13 -7 -6 -16 -18 -144 -26 -15 -80
15331h0O6j5K2kKJ9j28O9L9k2m7Q3j12J18l6m4K4M2J0o3M9n9L1j0%Q1k4o8L8j7l3R3p2oM4
$$ -80 -14 -29 -7 -9 -7 12 -116 -47 -8 -30 -77 6 -106 12 -24 -68 -44 -2 8 -55 -6 -65 -34 -44 -44 37 13 -55 -17 -34 -67 26 -46 -52 -8
15219hj7N3k0j5o0L0P5n1k4l8P5n5K3n0K7j6L4L1Om6m2%K2J2mP8n0p5Q6n3L2J6Tk4l7L9M9
$$ -8 -25 28 8 -7 -67 -37 38 -13 -37 -75 0 -55 -32 -82 -55 -71 -37 -6 0 -46 -88 -88 -66 -54 -58 20 -30 -105 -19 -72 -40 -24 -8 -32 -69 -30 19
15102A9lr3J7K3Q2Kq7l0RM8j1JM4q9m%k0O6K3n8OO9o0j8M5L1j18L3P9J4n8J1j2K1L0k8kM2
$$ 19 16 -77 -60 -37 45 47 -40 -70 -61 -13 -24 -23 21 -68 -72 -72 -92 -26 -3 -61 -55 14 -46 -64 -19 12 -106 -73 6 20 -38 -27 -39 -18 12 -16 -18 24
14981B4j2Qp8j9j6N4Jo9R2k2K8k2K7j9M5p3O1m5j07J24J3j18J06l1N6o8K5nl0O9pl3LN3
$$ 24 12 20 -58 -77 -93 -39 -38 -107 -15 -37 -9 -31 -4 -23 22 -51 10 -35 -142 -18 -5 -123 -17 -48 8 -60 -35 -40 -70 -1 -8 -41 -38 15
14873A5j05L3N6Np0j0J8K4k2M9m8K5j1Lj9L0MM9j37Q4%lk5oj2K6M0lj8k1n5J18L1j41P7T
$$ 15 -90 -57 -1 4 -66 -76 -58 -34 -56 -7 -55 -30 -41 -38 -57 -27 -23 26 -111 -27 -27 -30 -55 -61 -73 -47 -7 -10 -28 -49 -104 14 45 -96 -19 58
14758E8j22L1j1R6p2m6J2j8L3O1j14J1Q3Rm6J1J3j7l6J9P3m8J5j4n4J8mL9Pn8jJ7O7Jn2L1
$$ 58 -64 -33 -44 52 -20 -66 -54 -72 -39 22 -92 -81 2 11 -35 -24 -11 -28 -64 -45 28 -20 -5 -19 -73 -55 -59 -20 -13 -71 -72 -55 12 13 -39 -8
14644hq0R7J9k2rk1j0l5J24j22P7n0Mj5l6j5K7rO0L5No2K6rK0QJ8l0o0O5j8oN0j3j9Mj13
$$ -8 -88 9 28 6 -3 -24 -34 -69 55 -67 10 -40 -36 -51 -87 -102 -75 -84 -24 11 16 -46 -20 -29 -9 -1 17 -13 -73 -8 -26 -32 18 5 -14 -10 -123
14526a23L8P6mJk2J2K0P2p7J1k4N1j7n4o8P1K5K9o3L7lm7O4j4mm2J07j20J06q8M4pJ9J5O
$$ -123 -85 -9 -13 -12 -34 -22 -2 70 -7 4 -20 31 14 -40 -108 -37 -12 17 -46 -9 -12 -59 5 -9 -13 -55 52 -68 38 -50 -6 -13 6 21 27
14415B7r2Q6j09Q1%k2Qok4QJM9m5O4p6M8o6R2m2k4kj1M9n6N3J3k2kl8K6j8LL9m5ON0j9p7
$$ 27 -65 21 -88 -7 -7 -29 -21 -27 -51 -43 -42 7 -38 26 -50 -2 -68 24 -18 -42 -44 -55 -6 -62 -9 4 -18 -20 -58 -32 -50 -47 -8 -53 -47 3 -16 -93
14294i3N2j8k2O3l2L0j5k4PN3l3m2N5N2p7O2J5ml5m2J0M2Pn9K4K7j8j5P4p6N9m8o2R5Jo1
$$ -93 -41 -59 -81 -18 -50 -20 -35 -59 -52 1 -32 -74 -19 33 -44 18 33 29 -6 -48 -38 4 11 -48 -24 3 -15 -30 44 -32 27 -21 -83 12 13 -48
14179d8J5n6M7Q1j5K7q2K8k5L4K1q5N6o1L3Q0q1k8M0N6kl6k7J8j0L2q6O6Jl7N0l6J8j6L2
$$ -48 -33 -89 -42 39 24 51 -31 -3 -28 6 27 -58 -2 -63 -30 50 -31 -59 -19 37 35 -1 -28 -10 -20 12 -74 -8 -7 -44 6 -30 -12 -28 4
14068DO4j29kQK9Mk2o2N0M5J5L6n7j6j9J0K5O4k9q2j6J49o2%rKm8L0J0l0M6K9p4Q4j02O1
$$ 4 68 -61 -63 -55 -26 -22 -44 -106 -56 -11 4 40 -17 -33 -52 -42 -17 47 18 -64 -80 69 7 7 -2 0 -48 -18 -8 -38 8 37 -37 47 -55 6
13954Fj2k3N5m9mRrn6J00k9J0lJ9j07M7L6l7KN0p6J4N7K4qp4R7j06N4k6M6m5k5J5P9n3j0q
$$ 6 -6 -29 26 -23 -27 -18 -27 -83 17 -12 -2 -5 14 -93 -46 -10 -47 -45 5 -71 -57 0 24 16 -58 39 -67 -13 -39 7 -38 -63 -48 31 -22 -32 -40
13836d0K8l2M0j4K1l1kk3NK0K2L4o4N1l7qq7J34j18N2L4K6r3P3k2m4j3O3j0kM9m3P6q9LK9
$$ -40 -12 -44 -4 -18 3 -28 -30 -53 -48 -28 -6 28 -36 15 -22 -30 -117 17 -101 -49 -15 11 -82 -9 -31 -75 -88 -25 -35 -37 12 -31 45 -44 -41 -12
13722a2J2k9J8lK5j4m7j1lJ7o3Q9l4On5R3J4p2K1K0o0O2OJ8L4j07KMR9p6L0l0M6o8J9J1J8
$$ -12 0 -29 -11 -14 11 -3 -50 -61 -64 -47 -110 -21 -55 -49 -104 -11 3 -69 -48 -28 -88 -26 -20 -2 32 -75 -73 -69 30 -46 -16 -46 0 -68 -49 -38 -20
13604b0k9lJ6Tl5k8O3m3K1L9o4O6NkJ5o1n0N5nJ8m3J3O1m6L0K5q5Q7Jo9K8J6n3J4TL8jk0
$$ -20 -49 -52 -36 -20 -55 -83 -20 -63 -42 -3 -67 -1 4 2 17 -44 -94 -39 -44 -26 -69 -56 5 -41 -11 14 -71 16 17 -52 -24 -8 -61 -47 -33 5 4 -16
13483a6N3k5p3j0OR1p4OK3k4L7o7N9L5ok4J8n5J0Qk3pJ8O3j03J11n7J5n2L9J8m8L7J2p7L5
$$ -16 37 12 -61 -71 -65 26 -48 -42 -19 -43 -6 -73 -14 21 15 -9 9 -46 -36 -28 -51 -58 -40 23 -80 31 -26 -11 -63 -24 -6 -54 -17 -5 -82 -47
13368d7J7l4J05p8M9l3o4L3N7p0N5J1j30P7k6O7K6r1N4K8l9Jk5P7n7kM7l0m8N1K5p1J8k6
$$ -47 -30 -64 41 -37 12 -21 -85 -52 5 -65 -10 1 -129 -52 -78 -11 15 -76 -22 6 -33 -32 -57 20 -37 -39 8 -22 -70 -19 6 -65 -47 -73
13260g3O2m0J4JJ3Ok3O8k3o7M8M0m2n7K5P9m0k5l6J3j2N1J9k9M7n5l4N2L2J9k5m8J7K2p3
$$ -73 -11 -51 -37 -36 -23 -17 -40 28 5 -62 -14 26 -16 -73 -48 31 -9 -34 -70 -57 -69 -18 1 -28 19 -36 -70 -18 14 33 8 -40 -23 -1 -74
13149g4L7n2L5J09j47J35j5q2J3j6R1p8l2P4n9n0J24j7J2j18nP1K6j4m1P5l7l1N3M6j06k3
$$ -74 -37 -89 -54 55 -92 43 28 -54 -41 -57 34 -44 -76 -2 -61 -111 13 -4 8 -110 -115 -44 -18 -32 -73 2 -35 -66 -13 33 -73 -96
13047i6O4J7n3k1M2L9pl0l8k4P2K8O4j43J13r4M2rl3j7M1J2j0N1m2o7R9j1MKJ3o5L3J2PM4
$$ -96 -32 -15 -68 -89 -47 -8 -15 -45 -83 -107 -35 -7 57 -86 27 -67 -25 -34 -67 -84 -43 -31 -41 10 -32 -99 0 -11 -7 -5 8 -57 -24 -12 -5 39
12933C9o6lR9j13K8K4m4L0n4N6j07P6k1J6jK9o6R5j7p0MLN2k9jK8n4M4l5M2k1K6q5N2Tm6
$$ 39 -27 -30 69 -44 -16 8 -36 -6 -60 -4 -111 -35 -56 -40 -41 -12 -78 17 0 -70 -66 -63 -11 -40 -41 -13 -67 -23 -58 -16 -37 -11 -96 -44 8 -38
12818c8O6l3j11M8PJ4p5P8j3J0L6o7O7K5%J9o8k2M0j2j5l2J17j13J3P3k7p2O3jl3N4%k1N
$$ -38 28 -5 -116 -68 -61 -47 -122 -44 -57 -47 -11 -78 -11 14 14 33 -35 -57 -17 -29 -44 -76 41 -72 -59 14 -13 -85 -22 -23 -56 -2 -2 -23 -18
12707a8L3j08R6mj8LJ3J9o3M0k1r4P1M3k6r8J43l8O8q3K7l3M2o8L9jQ6o5qOo7Q5n1ML6J5
$$ -18 15 -93 3 -1 -19 -16 -3 16 -47 -7 -28 -122 -51 -8 -34 -132 11 -27 41 -42 -15 -48 -6 -74 -35 -36 50 -15 -23 -17 -84 1 -50 -46 -10 5
12592Em8J2j4j9M7mk7Q7m1Po4ONK0k6K8kn6N9OM6j0n8P7p8oJ2P5j09P3l6l0Q1k2o0J5O2j6
$$ 5 -43 -31 -45 -64 -17 -21 -48 39 -2 5 -59 -53 -48 -28 -54 -26 -28 -84 -25 -19 27 17 -41 36 -42 -48 -36 39 -70 3 -33 -63 18 -4 -64 -49 13 -3
12472co2kK0N9m1J1K7J1K3k5l5N9r5O6q3j7K7J6rM2O1p9QK2m3L8n9O3k2k5N5q0J02p2j9N3
$$ -3 -65 -67 -47 12 -29 -18 9 20 43 18 -17 42 -53 13 -70 -87 -60 -44 -53 -11 50 -29 -21 1 -42 -4 -63 0 -22 -47 8 -72 30 -42 -61 -8
12357hL0k8L4n7Oj4N8j29J12o1k9N8kK6QNk2j41J23R5r5j6J2M5l8K9J0j1l0k0M0p0O4Nk3k
$$ -8 22 -6 28 -29 -23 -37 21 -108 4 -57 -86 -28 -30 -4 4 9 -13 -154 -31 64 -31 -47 -35 10 -28 1 11 0 -30 -50 -10 -80 -16 -11 -34 -36
12243c6M2%j5r0M1K7M0nOl6O3j7l0J0n8k8L9J7L0M5q0P4j28N4L4o4Q3qn2J6JK1j7j2TP1l0
$$ -36 6 6 -9 -99 -58 -31 9 4 10 -26 37 20 -10 0 -58 -86 -47 -30 0 45 -35 39 -89 -35 -1 -65 18 10 -42 -26 -25 -4 -21 -33 -45 26 -4
12125dn2R9p9P1nr5M8l1J6j7j2P4L5r6M1k5N0k8K1p1N4K6Kn0p5J16n6L6l8j3M7L0o6l7O0
$$ -4 -56 43 -36 35 30 -65 -17 -48 -32 -49 -61 13 48 -48 -7 -32 18 -10 11 -60 -6 20 22 -28 -103 13 -43 -7 -45 -58 -11 19 -47 -84 -24
12014b4j7P7k8J3l5m3rO6lj2oQm2L1oo4L1LN2q3j7P0O3n0k1K1o9R4k7l0Pj8O6o9J1N9L2o3
$$ -24 -41 36 8 21 -14 -57 -66 0 -3 -15 -21 -13 -55 -24 -30 -94 -63 -60 -8 -91 -108 -38 25 -25 -46 -25 -94 0 -27 -57 -50 -68 -2 -71 -60 -1 31 -32
11893c2l0k4J10j6l5J2l1j9J4J3N7L1n0Oo4J6NL3o0L6K9kn5l7P5NTr1M7JO8m3l3O9n4l3P7
$$ -32 -62 -86 24 8 -27 -15 -46 -65 -51 -38 19 50 0 6 -58 -42 -37 -4 -64 -28 1 -1 -56 -93 -18 -13 -8 -99 -52 -51 17 -26 -59 10 -44 -77 0
11775@j5j2Lm6L4l3R5l6o2ON2j3K0M0m6J6Mn4Pk0M2L0n0mN9m2qj0L1k8%L4m5Q2p0NqK5J9
$$ 0 -15 -27 -24 -70 -36 -69 26 -10 -72 -66 -14 -27 -7 33 -13 3 7 -47 -40 -60 -18 12 -38 -42 17 -25 -33 -43 -12 -40 -40 -6 -51 31 -39 -34 -42 -17 2
11651Bj5j2n4N4J1k7J3k7P0J4l2m6L5J2k5qOPqj5o8P8m7R8k8M6o3Jl9Q1r1M3N8q2M5J0l0
$$ 2 -13 -25 -79 -25 -14 -41 -28 -55 15 29 -3 -49 -14 -2 -27 -35 -29 -22 -30 -45 -113 -35 -82 16 -12 34 -29 -28 -67 14 -77 -34 24 -58 -13 -3 -33
11533c3K4l7j2MR9j07J28r6ML8qp3K0J2Rm2K4J8j2lm9l5R6l4J02m7%l7K6k6K9nk6l0O1O6
$$ -33 -9 -46 -58 -54 45 -62 66 -30 -26 12 4 -69 -49 -37 -28 -70 -46 -28 -40 -43 -92 -127 -31 -65 37 -10 -10 -47 -21 -47 -18 -23 -49 -79 -18 48
11419D8q2m0N3P9j29P2p2J00j19J5N6J2Rl5K0p4R3j3qj6L8Pn1n5J10k6k4Rl6N4m7K7k2l1
$$ 48 -34 -74 -21 58 -71 1 -71 29 -90 -75 -19 -7 2 -33 -13 -87 6 -7 -15 -31 7 14 -37 -92 18 -8 -32 -23 -59 -5 -52 -25 -47 -78
11311g8J0M4j1k8j3O6k3o0L8ojK2pRn6P5j0k4J8Qj9kP2m8J9o3Q6r3O9m8k2LO7p2J7N2n4Q6
$$ -78 -68 -24 -35 -63 -76 -10 -33 -93 -55 -61 -62 -40 -47 -38 -94 -19 -29 -53 -35 -27 -46 -48 24 -24 -5 -68 18 -75 -6 -54 -76 -73 -6 -78 -61 -9 -63 23
11190B3n7J4m9QJ06m8m0L7n3P8p9O2n8O6k3K9m8l0P3n0O0o6K2n4M3k3M5m4L5M9l8M3j08P2
$$ 23 -34 -20 -69 -61 45 -3 -43 -6 -59 19 -60 2 -56 10 -13 16 -32 -62 11 -39 21 -45 -23 -77 -34 -57 -12 -56 -21 28 -10 33 -75 -3
11082cK8p8L5N2j14K5Q0l5l3lNM5j8j4m8P7lLm6L4k1O5j29N3MM2r3L3J9P6q4J3J5mJ5Mn1
$$ -3 25 -53 -18 34 -80 -55 25 -10 -43 -46 -41 4 -14 -28 -76 1 -2 1 -45 -11 -32 33 -96 -43 -39 3 -90 -57 -38 38 -46 -33 -18 -22 -7 -3 -54
10964e4J3m4K9K5kl6J21p4K4L4r0jj9O8o5J2K1J4J2o5P4m5L7j3m4R9l4K3p7L7Kk6L5K0k6
$$ -54 -41 -85 -56 -31 -33 -69 52 -22 2 36 -54 -55 -74 -6 -71 -59 -38 -24 -12 -77 -3 -48 -11 -24 -68 31 -3 20 -57 -20 -18 -44 -9 11 -15
10853a5J0L1r7n4J24qr5R3l7R9j12O5m8J8L3J5m1j0J3L0Nl1l3OJ4m5Q8l7n7L0J2ol4K0K4j
$$ -15 -5 26 -71 -125 -1 -9 -104 -11 -48 51 -61 4 -44 -26 7 22 -19 -29 -16 14 19 -12 -45 -39 -25 -70 18 -19 -76 -46 -34 -40 -74 -54 -30 -31
10738c1j5M6j1OPJ9k5Jj4Pm5J3l2R2m5k1K0o3N4nJ1K2l7K2on4R3nOn0l0N1J0p0Q8j8m4O4
$$ -31 -46 0 -11 -5 2 21 -4 -3 -17 -10 -55 -42 -74 18 -27 -48 -28 -91 -37 -42 -31 -9 -46 -24 -30 -84 9 4 10 -40 -70 -19 -9 -79 9 -9 -53 11
10617A1m5OK6m3K5l6N1l4k2L6m0QM0m2J6K1j2Ol4j1NL0P2o7j3Q6m7m1N0J7j07O5k2mP6j18
$$ 11 -34 -28 -2 -45 -20 -56 -5 -39 -61 -25 -65 -57 -17 -59 -43 -22 -34 -28 -62 -73 -68 -38 34 -33 -46 40 -7 -48 2 19 -88 -23 -45 -49 27 -91
10503i1J07L4p3K6lj9k8K7L4m4m5K0M1L2k0o4Q3k7k3K3n3N4Rm1M0m7M3n2N9o0M1l6k0lJ12
$$ -91 16 50 -23 3 0 -19 -47 -20 14 -30 -75 -55 -14 18 -2 -66 17 -10 -33 -10 -63 -9 0 -41 -1 -48 -5 -57 2 -58 -17 -53 -73 -76 36
10392C6j0l7J2pqo4L8L9n7K1Pjj6k4K7J7P0j68N2N1o1J31q1PJ5J4o4o0J40q9K5Nk4K5n4J
$$ 36 26 -11 1 -6 -14 -78 -40 -1 -58 -37 -30 -31 -47 -71 -44 -27 43 -125 -73 -22 -83 48 -33 -26 -11 3 -61 -121 19 -70 -45 -40 -64 -39 -93 -92
10277i2K2R9p1J7M7p4m0M3n8J12n0K8RJ0k6P8j11P6j22L9N5k2jkn7Q9j5TL3j6m7O0J3r6O3
$$ -92 -70 29 -42 -25 22 -52 -92 -49 -107 5 -45 -17 -8 2 -24 54 -57 19 -103 -64 -9 -31 -32 -34 -91 -2 -17 -32 1 -15 -62 -2 11 -85 -22
10166b2k0LrQ4p5kJ6l3L3L7l7j5K1m8N1J7J2m3L2j0p1M3M9o0K4lj8l5P2p2K0M1L8J4j6l3
$$ -22 -42 -39 -48 36 -39 -41 -25 -58 -25 12 -25 -40 -19 -67 -16 1 13 -30 2 -8 -79 -36 13 -47 -23 -26 -44 -79 -7 -79 -59 -18 20 34 18 -15
10051a5l4N7Pm9k3Q0n9Nj1NJ8n9M2j4K8L1k0j8M3q2M6m9K0n6N0K9KmK8Qk3j1L3l4nn5J13
$$ -15 -49 8 15 -34 -57 23 -36 -31 -42 -37 -19 -78 -36 -50 -22 9 -11 -29 14 -68 -22 -71 -51 -107 -57 -28 -26 -30 -2 6 -17 -28 5 -29 -34 -89 24
9934B4p9J8qO4q0L7K5p7L4M6k9k2TK0L0q6J36j7j8r8M4M2j7N1o0J55j76K6N0Nn6N4p1j8O8
$$ 24 -55 -37 -45 19 -61 -24 1 -76 -42 4 -25 -47 -69 -49 -19 -105 31 14 -4 -102 -58 -16 -33 18 -42 113 -63 -37 13 18 -38 16 -55 -73 -5
9822ep5J4K6PpL4l9L2l0j1o4P2O8o4j9K3kqJ15j32O8m0Pj7oM9r6N2J0J5nJ8K0m5o4J09j4
$$ -5 -80 -66 -40 -33 -40 -6 -45 -13 -43 -54 -118 -46 22 -42 -61 -38 -40 -48 67 -65 3 -37 -30 -47 -53 -4 -100 -48 -38 -23 -28 -10 10 -35 -99 10 -4
9705dj0l6K4n8O9m2M0k0K8J0Oo6P1j04M2M9m0J3k2M2o7K7L2K1m0K3o1P1q3N4J8noK7l5J8
$$ -4 -14 -50 -26 -84 -15 -57 -17 -37 -9 1 7 -59 12 -92 -50 -1 -41 -28 -50 -8 -75 -48 -16 5 -35 -12 -73 -2 -85 -31 -13 -18 -24 3 -32 -14
9590a4J0m9L5L1qTJ3q4P6q4N7m4LK9m9R9j0J7j04Q1Mj6ll9J3Lj5L5qj7N7njl4L4k1k6lJ1
$$ -14 -4 -53 -18 13 5 -3 10 -74 2 -82 -25 -69 -66 -37 -86 13 3 20 -84 -3 1 -15 -18 -57 -44 -41 -56 -21 -29 -46 11 6 5 -29 5 -16 -42 -45 -34
9466c4P6n2J4q4J26o9m8P9l8KK1j5J9q1k8N7mJ2L0j4N4n5J8j9N9j43L8J0N5Lo7j0P0K1%j8
$$ -34 42 -10 4 -80 46 -23 -71 8 -30 -28 -7 -22 -3 -84 -112 -55 -59 -47 -17 -31 23 -32 -14 -33 26 -117 -79 -69 -14 -11 -78 -88 -18 3 3 -15
9352a5Om0Q7n5j09O6Q7l0J9o4K4m0M0M9J1k4m1M2q6P6k5J9K1k2Lp2M2O6o3j8qj7Q6m4l0jT
$$ -15 -9 -49 38 -17 -126 -60 27 -3 16 -48 -24 -64 -24 25 36 12 -29 13 -73 3 -22 -3 18 -4 -1 -73 -31 35 -28 -46 -54 -71 15 -29 -59 -60 -61
9234f1O1K2qk6on5j3Q0Ml4Qr0J22o4R6k1j5J1j49J29J0m3m4k3J17k6rl9l2O4J2p2Q5qmk0
$$ -61 0 22 14 -12 -18 -73 -86 -6 -2 -36 -28 -118 4 -60 36 15 0 11 -138 -9 1 -42 -86 -109 8 -18 -27 -66 -98 -34 -22 -94 -9 -17 -21 -41
9119d1N7o4M8l4j7J2P1q2M3Rj0j14J05n0O6r7L8M5n6LK4J1N5l1L4Ml6Rn4J21m3k5o4K1L1
$$ -41 16 -48 0 -34 -51 -39 32 -50 -7 2 -8 -122 -17 -67 -1 -98 -60 -15 -71 -68 -44 -33 22 -9 25 29 -7 2 -52 69 26 1 -63 -42 -11
9008a1q2N9K6oK6n6N8n0L2%o3L5Pk4JJ4k8l4j4Q0k9O1l0mJJ15j19J1K7j2L0n6Q7j01L4%M3
$$ -11 -93 -34 -8 -14 12 -44 14 -36 -4 -4 -67 -32 -25 -49 -48 -34 -62 -96 -110 -30 -59 2 -28 -32 -31 84 -35 -24 3 -9 21 -35 52 -49 -15 -15 28
8890B8L9q5q3N3P7q9NL7K4Oj2o3lP9J3k8J6n2N5q9J9N9o8J23%o1o3M3JOM9r2lM4o7O0p6L7
$$ 28 67 -18 -101 -48 29 -60 -55 -18 6 12 0 -63 -66 13 26 -2 14 -38 17 -72 -53 6 -62 61 61 0 -63 -20 -19 -13 36 -56 -59 -15 -82 -22 -98 -61
8770f1kM1rm2O9q9J01k3k2J5j3M9q4J23r4L6p6N5l0m0O7m5Jj6L9Q3n2n6O1m7Pn2J36Kj9o2
$$ -61 -63 -22 -31 -73 -4 -93 8 -15 -37 -22 -35 14 -70 53 -41 -5 -81 -26 -56 -96 -29 -74 -73 -89 -50 33 -19 -75 -14 -61 -54 -106 30 32 13 -49
8655d9j4M3J0J9p4M2K2%j0l4K6j8nOO3l9pL6j8o4M3n0M3j5k0L9o6J5M3K5lJ4j1J9r1P4o6
$$ -49 -63 -20 -10 9 -65 -23 -1 -1 -11 -45 -19 -37 -42 -36 27 -12 -19 17 -1 -65 -22 -72 -29 -44 -64 -25 -91 -76 -33 -8 -11 3 -8 11 -80 -6 -72
8537g2K2J5k1Q5p1J9J4Ok6m1M2K2k6j8k8TJ38m0l6nN5K3q8L3j8l2O1j0K2km2K9rNjNk6j5
$$ -72 -50 -35 -56 29 -42 -23 -9 -3 -29 -70 -28 -6 -32 -50 -78 -106 32 -8 -44 -49 6 29 -59 -26 -44 -76 -15 -25 -3 -5 -47 -18 -27 -22 -23 -18 -44 -59
8417e9M9o5jN2%O1k5m3R5k7j13MR1r3M2m4N3Jk7O0l9O9m8l7N0N3p1q5J11j1L1J8r2j5L8J6
$$ -59 -10 -75 -76 -24 -24 37 12 -31 64 37 -76 -72 19 -74 -32 -76 -23 -22 -49 11 -28 41 -7 -44 6 59 -12 -97 14 3 34 52 -40 -55 -17 -1
8302ak6j9L6j6o6J5J55p4MM6o9J1l1KK9k8j8K2J6J9K5o6L0k5L7n7M6Mr0R3n7J3L6Ro3j6
$$ -1 -27 -46 -10 -26 -92 -77 78 4 8 54 -15 -4 -35 -33 -4 -32 -50 -28 -12 7 32 -34 -4 -29 8 -49 -3 1 -89 4 -53 -40 -4 5 -58 -74
8188g4J34j03N2p6M1K9lk2J3o9M8kk4l0P1q7J16n2N3j1ml6K8m3N3jk5k7K8jMn6J17j24j6
$$ -74 60 -43 9 -67 -26 3 0 -22 -9 -78 -30 -32 -56 -86 -15 -102 14 -38 15 4 0 -36 -8 -51 2 1 -24 -51 -23 -24 -20 -76 41 -83 -99
8076i9M1J3O0n5K3k9M5k8K0L3m1j4L4l8j5M1n0M4l1P4j7L5p1j0J2o1J15q6P2n5jL5j9mkM8
$$ -99 -58 -45 15 -40 -17 -46 -1 -29 -9 24 -17 -31 3 -35 -50 -9 -59 -15 -46 28 11 46 -25 -35 -23 -84 31 -55 17 -38 -39 -4 -23 -27 -29 19
7962A9n1O6rp4L2l7LO2k1l3K7N4q8N5l7k1NMR1n9j1rQ0j33Q2j1Ok7J5Pk0rR4r2K1RL6o2OQ
$$ 19 -32 34 25 -49 -17 -54 -51 11 -10 -43 -16 38 -50 5 -32 -53 -48 -44 47 -12 -23 -32 48 -85 -3 -14 -8 -35 -20 -13 -33 -42 52 -40 -19 -10 26 -36 -30 -22
7835b2K9o7P7j23Q7m1L6J8L2l3K9m1j1R9j11Mn7J12l5k9M6p2J02j9k4qj6L9o0ojQQ8m6nj
$$ -22 7 -60 17 -106 -19 -60 -24 -6 26 -7 22 -19 -30 69 -42 -38 -95 17 -18 -47 -1 -73 29 10 -14 -22 -38 1 -59 -65 -66 -58 30 -16 -21 -22
7720b2K5k9L9p8J2R9j7l8K3m3K7k4J8k1Qk6M4J6oo5J01m2k3l1PmN5m5m4P6k9M9m0%P2mm8
$$ -22 3 -26 13 -65 -53 46 29 -9 14 -29 -2 -26 -8 -29 -21 -47 -3 13 7 -58 43 1 -22 -53 -46 -50 5 -40 -84 -8 -37 12 -28 -28 44 40 -8
7602hJ3j11P7q7L6M9K7M5p6n1K0O2o2M2J3Rk7J0j8jJ9R1j72M6j6O7p4L7j9P2k1K1n0K9q1
$$ -8 5 -106 -29 -116 -80 -31 -4 41 -35 -86 -66 -4 -66 -24 -11 -2 -29 -19 -37 -38 -19 72 -100 -54 -70 -3 -77 -40 -59 13 -8 13 -37 -8 -89
7491h9L9j0L9L3m6P5j03L9l1K9PLk3k7K1m8O9O6j08K4K2j7m6N5M9j09J08r2K4j5K8K9roJ
$$ -89 -50 -60 -21 12 -34 41 -62 -23 -54 -25 -18 -15 -38 -65 -44 -92 -23 43 -65 -41 -19 -36 -82 -27 22 -87 21 -71 -47 -62 -34 -5 -14 -20 -19
7380a9k9rM3n9R6q2M5j2KK0k0j3%K6JJ0Pl8K2j2M8jo3M1r6K8L5P5lr0J9lk1m0J7P7l1l2J8
$$ -19 -48 -57 -14 -73 23 -59 -14 -26 -24 -4 -24 -37 -37 -11 -10 0 7 -31 -9 -21 27 26 -37 4 -92 -64 -29 46 43 -47 -28 -31 -52 -92 -75 2 -29 -61 -43
7256d3M4ORp2M0L4o0ON8k4p7K4M3K1j4o7M0kk4k1N4J7p4M4kK7j7rR3j10M3K0qmm9o3J99
$$ -43 1 7 16 -56 -16 18 -42 -36 22 -2 -79 -55 -12 9 -5 -72 -32 -34 -58 -79 -25 -8 -82 -38 -40 -13 -30 -39 54 -56 -13 7 -1 -5 -54 -117 82
7138H2j58O4K5l0j3K4Lk2j4J5K7p2L9lrJ4m6P2k2n2O1J4m6k5N8J4p0N1j6P0q2O2k4n9j7R3
$$ 82 -76 -12 13 -17 -30 -6 -3 -25 -39 -24 3 -69 -30 -33 -42 -28 -74 -2 -24 -76 -15 -1 -47 -72 -14 0 -70 -19 -35 35 -47 15 -9 -68 -85 8
7024Hm1k8K4J4K4J6n0N7k2l7LK7L8j24P5JN5j33J10p7j2K5L8n0J20o1n3M6L7j0o7M6j9l0L
$$ 8 -33 -61 -37 -23 1 17 -33 24 2 -35 -32 -5 33 -91 -16 -15 40 -93 17 -60 -72 -47 -9 -59 61 0 -53 -7 30 20 -47 -1 -20 -50 -47
6912d7R5o4j2Pm8J1J05j63J21j7J7n8P4j7lPpo4LJ11r3P4q4P9p0J6l9kR5m2j6L5k7j9j06
$$ -47 48 -16 -28 -21 -69 -58 47 -116 5 -12 5 -53 21 4 1 8 1 -63 -60 51 -42 32 -52 27 -43 -27 -66 -68 27 -15 -31 4 -23 -42 -148
6801a48J38L4l8N8o2K1L7r8O2j4K3Lnm9L2N3m9l0rN1j7k5J0m5M6J6o0J11r6O7q3L8O3j8K7
$$ -148 -10 24 -14 44 -18 3 40 -58 4 -10 13 16 11 -38 -6 47 -2 -32 -41 10 -7 -32 -22 -67 -21 -5 -65 46 -50 17 -66 -28 35 17 44
6690D4j04lL2j5K5k0Mk1R9o9L3m1K2J1j6K4m2J2J5rN5l0j02N9J6k1o2J14q1J5N0O7j11R5
$$ 44 -60 -63 -31 -46 -21 -41 -37 -58 41 -28 5 -36 -14 -3 -19 5 -37 -25 -10 -19 36 6 -96 -37 -21 -42 -104 10 -71 -56 -6 61 -50 45
6581D5p1J2J5K2q2R2l0NRp0m5O1N7l0M1m4K4p9N8l1kJ5rl8O4J3l6QK4l8M5m3J9J8n0Q2r7
$$ 45 -26 -14 1 23 -59 33 3 8 17 -53 -98 -37 20 -10 31 -13 11 -68 -10 -41 -43 -28 -37 -75 -11 2 -34 -26 -2 -40 5 -38 -19 -1 -51 31 -66
6464f6N8rj4lj4j5K4P0K3k8j8l5q4N8l9L9J2m3J09r0k6M3O7l7Pm0O9q0M4pRm8J12j0m4J7
$$ -66 -8 -17 -31 -34 -48 -63 -39 31 54 26 8 -27 -111 -53 -92 -53 -41 -84 25 -65 -91 -48 19 -18 -11 -51 18 -62 -18 -25 -16 -64 48 38 -6 11
6349A1J4k2l9oJ7J5Qj9r1N7K1j5l0N1J0j4JjPk6RN1j5JRK9J5o0k7L2j2lM9o0j4J2K5l1J1
$$ 11 25 3 -36 -42 -25 -10 -2 -21 -112 -55 -34 -49 -79 -28 -18 -32 -31 -32 -25 -51 -42 9 -6 -5 4 33 48 -12 -39 -7 -19 -22 27 -33 -47 -35 -10 -41 -30
6225c0k5L2P4j00nJJ4l6Q3J5k8lk3J6M4l9l0pL6O6j34J06p6l7J20j10J9J5L1n1J9m5O9j3
$$ -30 -55 -23 51 -49 -54 -53 -39 -75 8 23 -5 -8 -31 -15 29 -10 -40 -47 -11 55 -79 27 -49 -86 34 -76 -57 -42 -11 -62 -43 -88 -19 -32
6117c2K9pj5k8J8pO1k7m2J06n7l5k1J28r9%K8k3N3r3Q9o6J8m0J4l1j8L4K1J2O8m5k2%O3l1
$$ -32 -3 -10 -25 -53 -35 -42 19 -8 -50 56 -1 -36 -57 71 -28 -28 0 -23 30 -63 26 -40 -22 -62 -48 -79 -97 -63 -42 -30 38 -7 -29 -29 34 3
6003CrQm9P1r5J19l6l4Kj7M2k1l0j9J5L9l8N2j4k1l0m5J20mn4L7K7m1%O3j03N4m7M1M4K0
$$ 3 -6 2 -47 24 -71 48 12 -22 -20 -37 5 -16 -46 -65 -50 -11 -49 3 -11 -32 -62 -107 13 9 -45 -8 19 -22 -22 41 -62 -8 -55 -14 30 50
5888E0p2L9n5k3K4J4L1nJ6k7q8J10km8j0M7j0LK3l9o0J1PO3J5k5j5TO5j24R0l6L3K7l8n0
$$ 50 -22 17 -38 -61 -37 -23 8 3 19 -8 -96 14 12 -36 -46 1 -9 -6 17 -22 -82 -71 -64 -1 14 -11 -26 -41 24 -100 -10 -46 -13 14 -24 -74
5774g4K9j3J06k1p0J30j24j0ON0p9M0K8l7l1Q6k3J1k5jJ2p6Q1k6j0J8J5n8Q3p6N0M0o3k7q
$$ -74 -45 -58 48 27 -43 87 -37 -47 -41 9 -70 -30 -2 -39 -70 16 -7 4 -21 -22 -10 -86 -5 -31 -41 -23 -8 -66 17 -59 -9 31 -32 -59 -67
5662f7K5n9Q2l0KqR8q3l9M8K5r3R5p9Q7l7L3l7l6J7L9j5l5N0o7M7M1k7n5J19j6n4o9L0N0
$$ -67 -42 -101 -19 -49 -47 -55 43 -40 -79 -31 -6 -99 -4 -83 4 -33 0 -37 -73 -56 -17 -32 -67 -17 -84 -37 4 -23 -78 41 25 -29 -98 -68 -18
5551a8l2M8J0pj18J40k8jp4K6N7L7p7O2k9%n4M6NL1m3j0M8m4j2L1n3l2J7K2j6M6on6M5j4
$$ -18 -50 -2 8 1 -117 23 -5 -6 -80 -54 3 40 -37 25 -4 -4 -58 -12 -7 24 -19 -29 19 -25 -37 -6 -59 -91 -74 -52 -68 -22 -28 -84 -39 -53
5436e3l8J14k8q7P9j3N1K1r6K6J1J0N4q6M3k8l1N4k5K1l4M0m3J3N4l7j3l2L4j9KO5l1kj0
$$ -53 -91 23 -5 -92 -13 -26 25 46 -50 -24 -13 -3 51 -35 8 -20 -51 3 -22 -1 -35 5 -38 -25 29 -8 -21 -53 -19 -38 -36 29 -2 -4 -14
5325a4l7nM6j4Mk7K7m2P7r6O0N7mr8J6qLQn3P6O5m1kK5q0P5j4K2Lo1K9n2L2j3J1J09r6k5
$$ -14 -51 -56 -10 -24 -20 -47 -20 -62 15 -81 -21 36 32 -66 -50 -58 -55 -47 -100 -24 41 0 -2 23 -57 18 4 26 29 -32 -3 -55 -23 -36 -25 84 -12 -37
5204c7L7j5TmK6q2P3m1L4l6mKO0k3P5k8n5L1k3kl1m0R1l4MK7Lo9J08J8p7M3k3ok7J0J8m6J
$$ -37 0 -15 -30 -34 -8 -90 -17 -58 -24 -60 -64 -62 -2 -25 50 22 -33 -2 -25 -27 -58 -98 -7 -41 -37 -10 -7 -76 32 50 -27 16 -7 -13 -40 -30 -12 -58 -57
5080e7kM1l3O4q9P6KJ6j4m9L0j8Qm6L3OJ7KJ1l6J4L6k4n0J8jJ5k9J2N7J2n3JQ7o5o4J04m7
$$ -57 -59 -18 -51 13 -76 0 2 18 4 -45 -15 -33 -25 -71 -38 -32 -15 -13 -2 -38 -24 12 -12 -62 -44 -45 -30 -59 -47 10 22 -31 -30 57 -8 -72 32 -15
4959a5J8K1n2O2K2j44M0m3J15j8l7L0l8L6K2o2K9L1j28N7M8Kl8MRj5L9r6K6Q4m3qQ6m2j9r
$$ -15 3 24 -28 34 56 -88 -48 -91 24 6 -31 -1 -39 -3 19 -43 -14 17 -111 -54 -6 -4 -42 -38 -29 -44 -5 -101 -75 9 -34 -42 44 2 -17 -26
4845b6m2M2O8l9n8N6pJ0j2n5O4m4kK3l9J8l0j8J40n0L9q4P2o8k3L5L8L3r5l2L7M0r3J34
$$ -26 -68 -26 42 3 -55 1 -6 4 -8 -63 1 -43 -45 -22 -61 -43 -73 -91 49 -1 38 -46 26 -42 -65 -30 8 41 -54 -86 -49 -9 -102 32
4737C2j13J07J9o5L5K9po5J9kk1n6N8pJ7K8l1j3k0O9k2l3k3J14o6j%LJ8M6n8rml1K9M2l3
$$ 32 -81 26 45 -20 15 44 37 -28 -9 -11 -32 -88 -30 -37 -20 8 -23 -36 -56 13 -9 -42 -65 49 -17 -18 -18 -15 3 49 -9 -18 -22 -53 -24 18 -15
4619a5n3TP3O7j1%m3L0j4ML8l6m4J7Jj7M1j5K4n1Q7o5K7m6j0jP5Rr2O1pR3j20N3Lk8M2Nl1
$$ -15 -68 -121 -48 19 8 8 -35 -5 -19 -15 23 -13 -57 -40 -39 -56 -15 -30 -6 -57 30 -35 -8 -54 -64 -65 10 19 -73 -12 -19 74 -46 7 10 -18 24 29 -2
4495bm1P5l9k4l9P6L3r1P6j0n2O0p8j3M6M0j2n8O5p3J9M1m9R9j9l2q3J07j02O6M7k4n8L4%
$$ -2 -43 32 -7 -31 -70 6 39 -52 24 14 -38 22 -56 -69 -23 17 5 -53 12 -61 -42 -1 -50 49 30 -2 -85 22 -80 -14 33 9 -49 -15 -15
4384a5L4l6k4K9l9P9k3J6n4o7L9J1l2P9J2k5mK8m4NP5m5k0n0J21j16O7m1j3M0nTP5j00R4
$$ -15 19 -17 -41 -12 -51 28 5 21 -33 -100 -61 -50 -82 -3 9 -16 -20 8 -36 -31 44 -1 -21 -71 50 -66 1 -40 -53 -13 -18 -23 52 -48 46
4272D6r7N7L8o0L8l2J3j9J2l8j4L8j4N2j1l2jK9m9R7r8j1ONrk6K8J07o9l5N8j2n5Q9j07P8
$$ 46 -51 6 44 -16 22 -10 3 -16 -4 -42 -56 -18 -32 20 9 -23 -24 5 -44 53 -45 -56 -50 -45 -54 -80 -52 55 -14 -49 9 -3 -58 31 -76 2
4158Bj8l1K3l0j1L0LjP2q9M6m5j2J8TK8k2l8J7K5PJp0K6N7K3k2TOL3Pj25P4J9n5O7rn1j3
$$ 2 -16 -47 -24 -54 -65 -35 -32 -33 39 -50 -4 -49 -61 -43 -25 3 -19 -57 -40 -15 -8 -7 -77 -51 6 29 7 -15 -9 24 31 -94 -20 -1 -56 11 2 -49 -62
4034f2J1J9kmPK5k4Omm9Q8o6J7k6l4R1j2L5M6n6n0N7p9J22r7qQ9q3L3n9R7kl0k7JL2l2K3
$$ -62 -51 -32 -34 -38 -31 -6 -30 -24 -28 -77 11 -55 -38 -64 -98 -7 -19 16 62 6 -44 13 -66 56 -41 -49 40 -43 -10 -69 28 26 -4 -31 -30 2 -30 -7
3913gk7ll9P3L6m8j8PL3l3j9l2Rj0N1QJ9J8K0l0l1l9L5n4K4j5M2M0l2l8nj7N8P0j00L8K6M
$$ -7 -34 -37 -76 -3 33 -15 -33 -26 7 -26 -45 -77 -68 -78 -27 -19 0 18 38 8 -23 -62 -27 -81 -57 -72 -30 10 -22 -60 -65 -82 -24 46 -54 -16 10 14
3792A4m7J8j0pM3l9l5Q0l6P7j32PL4O4m8O0j12j6L0J6O0QL3j13j7kM4J4M1n8k5J3mN7k8k6
$$ 14 -33 -15 -25 -32 11 -28 -63 17 -19 58 -74 -67 -33 31 -17 43 -69 -85 -55 -39 21 29 62 -51 -68 -70 -26 -12 29 -29 -54 -41 -45 12 -16 -42
3678d2mO4kK0n8k1j9J6J3M8n8J5M7p6qQLoJ18p5N3k0j1q1Q9Kno2O5m0kpQl9K4N9j6ML5j4
$$ -42 -46 18 16 36 -22 -43 -62 -46 -33 15 -43 -28 19 -57 -65 -57 -54 -60 58 -17 36 16 5 -76 13 15 10 -52 13 -27 -29 -36 -28 -67 -43 16 0 4 39 25
3550B5m1rK7n5N2j2p7O7M2l3J3qoo5PN1l2k6P8m6Qj1OM7J0Tj2m1O1p8J6m3M3L9k9Lk8L2l8
$$ 25 -16 -25 2 -53 -1 -13 -90 -23 19 -14 -1 -9 -15 -80 -73 -22 -54 -80 -2 -48 -40 -51 -45 2 12 22 10 -31 30 -48 -32 -75 -32 7 -22 -19 -47 -15 -53
3426e3O2l2K4kM4j10M8lTL6n0M5o9PQ4j46J12l2Jl8J18q5np5J15JM7j09LL0k5J4OJ5k2k5
$$ -53 9 -23 1 -1 43 -67 -19 -22 -25 11 -39 6 -63 -56 28 -118 -6 -38 -37 -75 43 -42 -47 -122 -7 -6 41 -68 -65 -35 -60 -46 -40 -25 -47 -72
$$ [...]
-7516c69
##END= 
##END=
