##TITLE= Compound file, contains several data records
##JCAMP-DX= 5.0
##DATA TYPE= LINK
##BLOCKS=10
##ORIGIN= Department of Chemistry, UWI, JAMAICA
##OWNER= public domain
##TITLE= methane CH4   $$ Beginning of data block 1
##JCAMP-DX= 5.01
##DATA TYPE= IR SPECTRUM
##DATA CLASS= XYDATA
##BLOCK ID=1
##ORIGIN= Department of Chemistry, UWI, JAMAICA
##OWNER= public domain
##LONGDATE= Fri, 22 Feb 2019 15:00:32 -0500 $$ export date from JSpecView
##SPECTROMETER/DATA SYSTEM= computed by Gaussian at WebMo.net
##$MODELS=
<Models>
<ModelData id="I0" type="MOL">
methane CH4
RLDSViewer          3D                             0

  5  4  0  0  0  0  0  0  0  0999 V2000
    0.0000    0.0000    0.0000 C   0  0  0  0  0  0  0  0  0  1
    0.6256    0.6256    0.6256 H   0  0  0  0  0  0  0  0  0  2
   -0.6256   -0.6256    0.6256 H   0  0  0  0  0  0  0  0  0  3
    0.6256   -0.6256   -0.6256 H   0  0  0  0  0  0  0  0  0  4
   -0.6256    0.6256   -0.6256 H   0  0  0  0  0  0  0  0  0  5
  1  2  1  0  0  0
  1  4  1  0  0  0
  1  3  1  0  0  0
  1  5  1  0  0  0
M  END
</ModelData>
<ModelData id="1" type="XYZVIB" baseModel="I0" vibrationScale=".2">
5
Model[1]: PATH=Calculation 2;Standard;Energy=-40.19517;Range=M.O.s;NFock==Conv=0.00D+00;E(RHF)=-40.1951719196 A.U.;PATH=Calculation 2;Standard
C       0.00000      0.00000      0.00000
H       0.62565      0.62565      0.62565
H      -0.62565     -0.62565      0.62565
H       0.62565     -0.62565     -0.62565
H      -0.62565      0.62565     -0.62565
5
Model[2]: FrequencyLabel=T2;ForceConstant=1.5368 mDyne/A;ReducedMass=1.1781 AMU;FreqValue=1487.9434;Frequency=1487.9434 cm^-1;Mode=1;PATH=Calculation 2;FrequenciesFrequencies;IRIntensity=10.2790 KM/Mole;PATH=Calculation 2;FrequenciesFrequencies
C       0.00000      0.00000      0.00000     -0.00000     -0.09000     -0.09000
H       0.62565      0.62565      0.62565     -0.33001      0.10000      0.10000
H      -0.62565     -0.62565      0.62565      0.00000      0.43000      0.43000
H       0.62565     -0.62565     -0.62565      0.33001      0.10000      0.10000
H      -0.62565      0.62565     -0.62565      0.00000      0.43000      0.43000
5
Model[3]: FrequencyLabel=T2;ForceConstant=1.5368 mDyne/A;ReducedMass=1.1781 AMU;FreqValue=1487.9434;Frequency=1487.9434 cm^-1;Mode=2;PATH=Calculation 2;FrequenciesFrequencies;IRIntensity=10.2790 KM/Mole;PATH=Calculation 2;FrequenciesFrequencies
C       0.00000      0.00000      0.00000     -0.00000      0.09000     -0.09000
H       0.62565      0.62565      0.62565     -0.00000     -0.43000      0.43000
H      -0.62565     -0.62565      0.62565      0.33001     -0.10000      0.10000
H       0.62565     -0.62565     -0.62565      0.00000     -0.43000      0.43000
H      -0.62565      0.62565     -0.62565     -0.33001     -0.10000      0.10000
5
$$ [...]
C       0.00000      0.00000      0.00000      0.00000     -0.00000     -0.00000
H       0.62565      0.62565      0.62565      0.29000      0.29000      0.29000
H      -0.62565     -0.62565      0.62565     -0.29000     -0.29000      0.29000
H       0.62565     -0.62565     -0.62565      0.29000     -0.29000     -0.29000
H      -0.62565      0.62565     -0.62565     -0.29000      0.29000     -0.29000
5
Model[8]: FrequencyLabel=T2;ForceConstant=7.0806 mDyne/A;ReducedMass=1.1024 AMU;FreqValue=3301.7466;Frequency=3301.7466 cm^-1;Mode=7;PATH=Calculation 2;FrequenciesFrequencies;IRIntensity=39.8186 KM/Mole;PATH=Calculation 2;FrequenciesFrequencies
C       0.00000      0.00000      0.00000      0.09000      0.00000      0.00000
H       0.62565      0.62565      0.62565     -0.28000     -0.29000     -0.29000
H      -0.62565     -0.62565      0.62565     -0.28000     -0.29000      0.29000
H       0.62565     -0.62565     -0.62565     -0.28000      0.29000      0.29000
H      -0.62565      0.62565     -0.62565     -0.28000      0.29000     -0.29000
5
Model[9]: FrequencyLabel=T2;ForceConstant=7.0806 mDyne/A;ReducedMass=1.1024 AMU;FreqValue=3301.7466;Frequency=3301.7466 cm^-1;Mode=8;PATH=Calculation 2;FrequenciesFrequencies;IRIntensity=39.8186 KM/Mole;PATH=Calculation 2;FrequenciesFrequencies
C       0.00000      0.00000      0.00000     -0.00000      0.07000     -0.07000
H       0.62565      0.62565      0.62565      0.00000      0.01000     -0.01000
H      -0.62565     -0.62565      0.62565     -0.41000     -0.40000      0.40000
H       0.62565     -0.62565     -0.62565     -0.00000      0.01000     -0.01000
H      -0.62565      0.62565     -0.62565      0.41000     -0.40000      0.40000
5
Model[10]: FrequencyLabel=T2;ForceConstant=7.0806 mDyne/A;ReducedMass=1.1024 AMU;FreqValue=3301.7466;Frequency=3301.7466 cm^-1;Mode=9;PATH=Calculation 2;FrequenciesFrequencies;IRIntensity=39.8186 KM/Mole;PATH=Calculation 2;FrequenciesFrequencies
C       0.00000      0.00000      0.00000     -0.00000      0.07000      0.07000
H       0.62565      0.62565      0.62565     -0.41000     -0.40000     -0.40000
H      -0.62565     -0.62565      0.62565      0.00000      0.01000      0.01000
H       0.62565     -0.62565     -0.62565      0.41000     -0.40000     -0.40000
H      -0.62565      0.62565     -0.62565      0.00000      0.01000      0.01000
</ModelData>
</Models>
##$PEAKS=
<Peaks type="IR" xUnitsExpected="1/cm"  >
<PeakData id="1" title="1-CH4 (~3300 cm-1)" peakShape="broad" model="1.8" xMax="3330" xMin="3270"    />
<PeakData id="2" title="2-CH4 (~1490 cm-1)" peakShape="broad" model="1.2" xMax="1510" xMin="1470"    />
</Peaks>
##XUNITS= 1/CM
##YUNITS= TRANSMITTANCE
##XFACTOR= 1
##YFACTOR= 9.999000E-07
##FIRSTX= 3.500640E+03
##FIRSTY= 1
##LASTX= 1.287944E+03
##NPOINTS= 2000
##MINY= 1.000000E-04
##MAXY= 1
##XYDATA= (X++(Y..Y))
3500.64 1000100 1000100 1000100 1000100 1000100 1000100 1000100 1000100 1000100 1000100 1000100 1000100 1000100 1000100 1000100 1000100 1000100 1000100 1000100 1000100 1000100 1000100 1000100 1000100 1000100 1000100 1000100 1000100 1000100 998700 997300 995900 994499 993099 991699 990299 988899 987499 986099 984698 983298 981898 980498 979098 977698 976298 974897 973497 972097 970697 969297 967897 966497 965097 963696 962296 960896
3437.5469 959496 958096 956696 955296 953895 952495 951095 949695 948295 946895 945495 944094 942694 941294 939894 938494 936384 935221 934025 932797 931534 930236 928902
3412.088 927530 926118 924666 923171 921632 920047 918414 916732 914999 913212 911369 909469 907508
3397.6982 905484 903394 901237 899008 896704 894323 891861 889314 886679 883951 881127 878201 875170
3383.3083 872028 868769 865389 861881 858240 854458 850528 846444 842197 837780 833182 828396 823410
3368.919 818215 812799 807151 801257 795106 788681 781969 774954 767618 759944 751912 743503 734695
3354.5293 725466 715792 705648 695007 683843 672126 659826 646912 633353 619115 604165
3342.3533 588470 571997 554714 536593 517605 497728 476947 455252 432645 409142 384774
3330.1772 359595 333681 307140 280115 252787 225383 198175 171482 145666 121120 98252
3318.0015 77458 59088 43406 30548 20491 13040 7848 4468 2419 1263 652 345 198
3303.6118 129 102 100 122 181 310 580 1122 2158 4018 7126 11959 18977 28551 40902 56085 73991
3284.7944 94376 116902 141178 166797 193361 220501 247892 275251 302345 328984 355019
3272.6184 380336 404853 428513 451281 473140 494084 514121 533266 551541 568971 585586
3260.4424 601418 616498 630861 644539 657566 669973 681792 693053 703785 714016 723772
3248.2664 733079 741960 750439 758537 766273 773668 780740 787504 793979 800178 806117 811808 817264
3233.877 822498 827520 832342 836972 841421 845698 849811 853767 857575 861241 864772 868175 871455
3219.487 874617 877668 880612 883454 886199 888850 891413 893890 896285 898602 900844 903014 905116
3205.0974 907151 909123 911034 912887 914684 916427 918118 919759 921352 922899 924402 925862 927281
3190.7078 928660 930001 931305 932574 933808 935009 936179 937318 938918 940518 942118 943718 945318 946918 948519 950119 951719 953319 954919 956519 958120 959720
3166.356I61320J600UJ601J600WJ601J600XJ601J600WJ601J976%S364r00I98300
1626.6556 997400 996500 995600 994699 993799 992899 991999 991099 990199 989299 988399 987499 986599 985699 984798 983898 982998 982098 981198 983248 982933 982608 982274 981931 981578 981214 980840 980454
1595.6624 980057 979648 979226 978791 978342 977879 977402 976909 976399 975873 975330 974768 974187 973585 972963 972319 971652
1576.8451 970961 970244 969501 968730 967930 967100 966237 965340 964408 963438 962428 961377 960281 959139 957948 956705
1559.1346 955407 954051 952633 951150 949597 947970 946265 944477 942600 940628 938555 936374 934078
1544.745 931658 929106 926413 923567 920558 917373 913999 910421 906623 902587 898294 893723 888849
1530.3553 883647 878089 872143 865774 858944 851611 843727 835242 826096 816228 805566 794034 781547
1515.9655 768011 753325 737378 720053 701222 680756 658519 634380 608215 579920 549426
1503.7896 516712 481837 444961 406386 366580 326209 286139 247411 211169 178545 150511
1491.6136 127757 110629 99171 93263 92781 97714 108170 124282 146046 173178 205048 240724
1478.3308 279094 319004 359390 399352 438187 475393 510641 543747 574638 603321 629859
1466.1549 654352 676919 697692 716804 734389 750573 765476 779209 791877 803573 814384
1453.979 824389 833659 842258 850245 857673 864589 871037 877056 882682 887945 892875 897499 901840
1439.5894 905921 909760 913376 916785 920003 923042 925916 928636 931212 933655 935973 938173 940265
1425.1996 942255 944148 945952 947672 949312 950878 952373 953802 955169 956478 957730 958930 960081
1410.8098 961184 962243 963260 964237 965176 966079 966948 967784 968590 969366 970114 970835 971530 972202 972850 973476
1393.0994 974081 974665 975231 975778 976307 976819 977315 977795 978261 978712 979149 979573 979985 980384 980772 981148 981514
1374.2821 982314 983114 983914 984714 985514 986314 987114 987914 988714 989514 990315 991115 991915 992715 993515 994315 995115 995915 996715 997515 998315 999115 999915 1000100 1000100 1000100 1000100 1000100 1000100 1000100 1000100 1000100 1000100 1000100 1000100 1000100 1000100 1000100 1000100 1000100 1000100 1000100 1000100 1000100 1000100 1000100 1000100 1000100 1000100 1000100 1000100 1000100 1000100 1000100 1000100 1000100 1000100 1000100 1000100 1000100 1000100 1000100 1000100 1000100 1000100 1000100 1000100 1000100 1000100 1000100 1000100 1000100 1000100 1000100 1000100 1000100 1000100 1000100
1287.9438A000100  $$checkpoint
##END=$$ End of the data block 1
##TITLE= methane CH4  $$ Beginning of data block 2
##JCAMP-DX= 5.01
##DATA TYPE= RAMAN SPECTRUM
##DATA CLASS= XYDATA
##BLOCK ID=2
##ORIGIN= Department of Chemistry, UWI, JAMAICA
##OWNER= public domain
##LONGDATE= Fri, 22 Feb 2019 15:02:58 -0500 $$ export date from JSpecView
##SPECTROMETER/DATA SYSTEM= computed by Gaussian at WebMO.net
##$MODELS=
<Models>
<ModelData id="R0" type="MOL">
CH4
RLDSViewer          3D                             0

  5  4  0  0  0  0  0  0  0  0999 V2000
    0.0000    0.0000    0.0000 C   0  0  0  0  0  0  0  0  0  1
    0.6256    0.6256    0.6256 H   0  0  0  0  0  0  0  0  0  2
   -0.6256   -0.6256    0.6256 H   0  0  0  0  0  0  0  0  0  3
    0.6256   -0.6256   -0.6256 H   0  0  0  0  0  0  0  0  0  4
   -0.6256    0.6256   -0.6256 H   0  0  0  0  0  0  0  0  0  5
  1  2  1  0  0  0
  1  4  1  0  0  0
  1  3  1  0  0  0
  1  5  1  0  0  0
M  END
</ModelData>
<ModelData id="2" type="XYZVIB" baseModel="R0" vibrationScale=".2">
5
Model[1]: PATH=Calculation 2;Standard;Energy=-40.19517;Range=M.O.s;NFock==Conv=0.00D+00;E(RHF)=-40.1951719196 A.U.;PATH=Calculation 2;Standard
C       0.00000      0.00000      0.00000
H       0.62565      0.62565      0.62565
H      -0.62565     -0.62565      0.62565
H       0.62565     -0.62565     -0.62565
H      -0.62565      0.62565     -0.62565
5
Model[2]: FrequencyLabel=T2;ForceConstant=1.5368 mDyne/A;ReducedMass=1.1781 AMU;FreqValue=1487.9434;Frequency=1487.9434 cm^-1;Mode=1;PATH=Calculation 2;FrequenciesFrequencies;IRIntensity=10.2790 KM/Mole;PATH=Calculation 2;FrequenciesFrequencies
C       0.00000      0.00000      0.00000     -0.00000     -0.09000     -0.09000
H       0.62565      0.62565      0.62565     -0.33001      0.10000      0.10000
H      -0.62565     -0.62565      0.62565      0.00000      0.43000      0.43000
H       0.62565     -0.62565     -0.62565      0.33001      0.10000      0.10000
H      -0.62565      0.62565     -0.62565      0.00000      0.43000      0.43000
5
Model[3]: FrequencyLabel=T2;ForceConstant=1.5368 mDyne/A;ReducedMass=1.1781 AMU;FreqValue=1487.9434;Frequency=1487.9434 cm^-1;Mode=2;PATH=Calculation 2;FrequenciesFrequencies;IRIntensity=10.2790 KM/Mole;PATH=Calculation 2;FrequenciesFrequencies
C       0.00000      0.00000      0.00000     -0.00000      0.09000     -0.09000
H       0.62565      0.62565      0.62565     -0.00000     -0.43000      0.43000
H      -0.62565     -0.62565      0.62565      0.33001     -0.10000      0.10000
H       0.62565     -0.62565     -0.62565      0.00000     -0.43000      0.43000
H      -0.62565      0.62565     -0.62565     -0.33001     -0.10000      0.10000
5
Model[4]: FrequencyLabel=T2;ForceConstant=1.5368 mDyne/A;ReducedMass=1.1781 AMU;FreqValue=1487.9435;Frequency=1487.9435 cm^-1;Mode=3;PATH=Calculation 2;FrequenciesFrequencies;IRIntensity=10.2790 KM/Mole;PATH=Calculation 2;FrequenciesFrequencies
C       0.00000      0.00000      0.00000      0.12000     -0.00000     -0.00000
H       0.62565      0.62565      0.62565     -0.37000      0.23001      0.23001
H      -0.62565     -0.62565      0.62565     -0.37000      0.24000     -0.23001
H       0.62565     -0.62565     -0.62565     -0.37000     -0.23001     -0.23001
H      -0.62565      0.62565     -0.62565     -0.37000     -0.23001      0.24000
5
Model[5]: FrequencyLabel=E;ForceConstant=1.7213 mDyne/A;ReducedMass=1.0078 AMU;FreqValue=1702.5955;Frequency=1702.5955 cm^-1;Mode=4;PATH=Calculation 2;FrequenciesFrequencies;IRIntensity=0.0000 KM/Mole;PATH=Calculation 2;FrequenciesFrequencies
C       0.00000      0.00000      0.00000     -0.00000      0.00000      0.00000
H       0.62565      0.62565      0.62565      0.41000     -0.20001     -0.20001
H      -0.62565     -0.62565      0.62565     -0.41000      0.20001     -0.20001
H       0.62565     -0.62565     -0.62565      0.41000      0.20001      0.20001
H      -0.62565      0.62565     -0.62565     -0.41000     -0.20001      0.20001
5
Model[6]: FrequencyLabel=E;ForceConstant=1.7213 mDyne/A;ReducedMass=1.0078 AMU;FreqValue=1702.5955;Frequency=1702.5955 cm^-1;Mode=5;PATH=Calculation 2;FrequenciesFrequencies;IRIntensity=0.0000 KM/Mole;PATH=Calculation 2;FrequenciesFrequencies
C       0.00000      0.00000      0.00000      0.00000     -0.00000      0.00000
H       0.62565      0.62565      0.62565      0.00000      0.35000     -0.35000
H      -0.62565     -0.62565      0.62565     -0.00000     -0.35000     -0.35000
H       0.62565     -0.62565     -0.62565      0.00000     -0.35000      0.35000
H      -0.62565      0.62565     -0.62565     -0.00000      0.35000      0.35000
5
Model[7]: FrequencyLabel=A1;ForceConstant=6.0699 mDyne/A;ReducedMass=1.0078 AMU;FreqValue=3197.2276;Frequency=3197.2276 cm^-1;Mode=6;PATH=Calculation 2;FrequenciesFrequencies;IRIntensity=0.0000 KM/Mole;PATH=Calculation 2;FrequenciesFrequencies
C       0.00000      0.00000      0.00000      0.00000     -0.00000     -0.00000
H       0.62565      0.62565      0.62565      0.29000      0.29000      0.29000
H      -0.62565     -0.62565      0.62565     -0.29000     -0.29000      0.29000
H       0.62565     -0.62565     -0.62565      0.29000     -0.29000     -0.29000
H      -0.62565      0.62565     -0.62565     -0.29000      0.29000     -0.29000
5
Model[8]: FrequencyLabel=T2;ForceConstant=7.0806 mDyne/A;ReducedMass=1.1024 AMU;FreqValue=3301.7466;Frequency=3301.7466 cm^-1;Mode=7;PATH=Calculation 2;FrequenciesFrequencies;IRIntensity=39.8186 KM/Mole;PATH=Calculation 2;FrequenciesFrequencies
C       0.00000      0.00000      0.00000      0.09000      0.00000      0.00000
H       0.62565      0.62565      0.62565     -0.28000     -0.29000     -0.29000
H      -0.62565     -0.62565      0.62565     -0.28000     -0.29000      0.29000
H       0.62565     -0.62565     -0.62565     -0.28000      0.29000      0.29000
H      -0.62565      0.62565     -0.62565     -0.28000      0.29000     -0.29000
5
Model[9]: FrequencyLabel=T2;ForceConstant=7.0806 mDyne/A;ReducedMass=1.1024 AMU;FreqValue=3301.7466;Frequency=3301.7466 cm^-1;Mode=8;PATH=Calculation 2;FrequenciesFrequencies;IRIntensity=39.8186 KM/Mole;PATH=Calculation 2;FrequenciesFrequencies
C       0.00000      0.00000      0.00000     -0.00000      0.07000     -0.07000
H       0.62565      0.62565      0.62565      0.00000      0.01000     -0.01000
H      -0.62565     -0.62565      0.62565     -0.41000     -0.40000      0.40000
H       0.62565     -0.62565     -0.62565     -0.00000      0.01000     -0.01000
H      -0.62565      0.62565     -0.62565      0.41000     -0.40000      0.40000
5
Model[10]: FrequencyLabel=T2;ForceConstant=7.0806 mDyne/A;ReducedMass=1.1024 AMU;FreqValue=3301.7466;Frequency=3301.7466 cm^-1;Mode=9;PATH=Calculation 2;FrequenciesFrequencies;IRIntensity=39.8186 KM/Mole;PATH=Calculation 2;FrequenciesFrequencies
C       0.00000      0.00000      0.00000     -0.00000      0.07000      0.07000
H       0.62565      0.62565      0.62565     -0.41000     -0.40000     -0.40000
H      -0.62565     -0.62565      0.62565      0.00000      0.01000      0.01000
H       0.62565     -0.62565     -0.62565      0.41000     -0.40000     -0.40000
H      -0.62565      0.62565     -0.62565      0.00000      0.01000      0.01000
</ModelData>
</Models>
##$PEAKS=
<Peaks type="Raman" xUnitsExpected="1/cm"  >
<PeakData id="1" title="1-CH4 (~3300 cm-1)" peakShape="broad" model="2.8" xMax="3330" xMin="3270"    />
<PeakData id="2" title="2-CH4 (~3200 cm-1)" peakShape="broad" model="2.7" xMax="3220" xMin="3180"    />
<PeakData id="3" title="3-CH4 (~1700 cm-1)" peakShape="broad" model="2.5" xMax="1720" xMin="1680"    />
<PeakData id="4" title="4-CH4 (~1490 cm-1)" peakShape="broad" model="2.2" xMax="1510" xMin="1470"    />
</Peaks>
##XUNITS= 1/CM
##YUNITS= ABSORBANCE
##XFACTOR= 1
##YFACTOR= 9.407402E-07
##FIRSTX= 3.500640E+03
##FIRSTY= 0
##LASTX= 1.287943E+03
##NPOINTS= 2000
##MINY= 0
##MAXY= 9.407402E-01
##XYDATA= (X++(Y..Y))
3500.6396 0 0 0 0 0 0 0 0 0 0 0 0 0 0 0 0 0 0 0 0 0 0 0 0 0 0 0 0 0 0 0 0 0 0 0 0 0 0 0 0 0 0 0 0 0 0 0 0 0 0 0 0 0 0 0 0 0 0 0 0 0 0 0 0 0 0 0 0 0 0 0 0 6973 7103 7237 7375 7517 7663 7814 7969 8128 8293 8462 8637 8817 9002 9194 9392
3403.2324 9596 9807 10025 10250 10483 10724 10973 11231 11498 11775 12062 12360 12668 12988 13321 13666 14025 14398
3383.308 14786 15190 15611 16049 16506 16982 17480 17999 18542 19109 19703 20325 20976 21659 22376 23128 23919
3364.4907 24751 25626 26548 27521 28547 29631 30777 31991 33277 34641 36089 37630 39269 41016
3348.9941 42881 44874 47007 49293 51746 54383 57224 60287 63598 67181 71069 75294 79896 84919
3333.4976 90415 96442 103068 110370 118441 127384 137322 148398 160780 174661 190272 207877 227789
3319.108 250367 276027 305236 343307 381302 424483 473348 528227 589114 655423 725678
3306.932 797181 865803 926088 971909 997707 1000000 978481 936124 878227 810921 739847
3294.756 669394 602505 540852 485156 435507 391621 353020 319153 289461 263416 240540
3282.58 220408 202652 186953 173037 160670 149651 139810 131000 123096 115990 109592 103820
3269.2974 98607 93893 89628 85765 82268 79101 76237 73648 71313 69212 67329 65648 64157 62846
3253.8005 61704 60724 59900 59226 58699 58316 58075 57976 58019 58205 58539 59022 59662 60465 61438 62592 63938 65491
3233.8765 67265 69280 71556 74120 77000 80230 83849 87901 92439 97525 103230 109636 116841 124959
3218.38 134123 144489 156241 169590 184784 202107 221881 244463 270234 299577 332833
3206.2039 370230 411762 457026 505007 553852 600721 641865 673073 690525 691826 676766
3194.028 647389 607333 560813 511706 463027 416797 374167 335631 301250 270829 244040
3181.852 220503 193089 175044 159172 145180 132814 121856 112116 103434 95670 88709 82447
3168.5693 76799 71691 67059 62847 59008 55501 52289 49341 46630 44132 41824 39690 37712 35875
3153.0725 34168 32577 31093 29707 28410 27196 26056 24986 23980 23032 22139 21297 20501 19748 19036
3136.469 18361 17722 17114 16538 15989 15468 14971 14498 14046 13615 13204 12811 12435 12075 11731 11401 11084
3117.6519 10781 10490 10210 9942 9683 9435 9196 8966 8745 8531 8325 8127 7936 7751 7572 7400 7233
3098.8345 7072 6917 6766 6620 6479 6342 6210 6082 5957 5836 5719 5606 5496 5389 5285 5184 5086 4990
3078.9102D898r0q8m720%S132K334M4M5M6M7M9N1TN4N5N7N8O0O2O5O6C212
1802.6526 3283 3356 3431 3509 3590 3673 3760 3849 3942 4038 4137 4241 4348 4459 4575 4695 4820 4950 5085 5226 5372
1779.4077 5525 5685 5851 6025 6207 6397 6595 6804 7022 7250 7490 7742 8007 8285 8578 8887 9212 9556
1759.4835 9919 10302 10709 11139 11596 12081 12596 13145 13730 14354 15021 15735 16500 17321 18204 19155 20180 21289
1739.5592 22488 23789 25204 26744 28426 30265 32283 34501 36945 39647 42640 45967 49675 53819
1724.0626 58466 63691 69584 76250 83807 92397 102174 113314 126002 140426 156751 175088 195436
1709.6729 217598 241079 264977 287910 308050 323348 331943 332667 325420 311196 291769 269190
1696.3901 245349 221714 199270 178577 159876 143197 128445 115461 104058 94051 85261
1684.2142 77530 70715 64692 59354 54610 50381 46600 43209 40159 37408 34920 32663 30612 28742
1668.7175 27034 25469 24033 22713 21496 20372 19332 18369 17474 16642 15868 15145 14470 13838 13247
1652.114 12692 12170 11680 11219 10784 10373 9986 9619 9272 8944 8632 8336 8055 7788 7534 7292 7062
1633.2968 6842 6632 6431 6240 6057 5882 5714 5553 5399 5251 5109 4973 4842 4717 4596 4479 4367 4259
1613.3724 4155 4055 3959 3865 3775 3688 3887 3812 3739 3668 3601 3536 3473 3413 3355 3299 3245 3193 3144 3096 3050 3006 2964 2923
1586.8069 2884 2847 2811 2777 2744 456 467 478 490 502 514 527 541 555 569 584 600 616 634 651 670 689 709 730 753 776 800 825 851
1554.7067 879 908 939 971 1004 1040 1077 1117 1159 1203 1249 1298 1351 1406 1465 1527 1594 1665 1740 1821 1908 2001 2100 2207 2322
1527.0342 2447 2581 2727 2884 3056 3243 3446 3669 3914 4183 4479 4807 5170 5573 6023 6525 7089 7722
1507.1099 8437 9245 10161 11202 12388 13738 15277 17026 19005 21228 23695 26382 29229 32127
1491.6133 34907 37349 39204 40246 40333 39455 37730 35375 32637 29747 26881 24160 21651 19384
1476.1167 17362 15573 13999 12616 11403 10337 9400 8574 7843 7196 6621 6108 5650 5239 4869 4535
1458.4062 4234 3960 3711 3485 3278 3088 2914 2754 2606 2470 2344 2227 2119 2018 1924 1836 1754 1678 1606
1437.3751 1539 1476 1416 1360 1307 1258 1211 1166 1124 1084 1047 1011 977 944 913 884 856 830 804 780 757 734 713 693 673 655 637
1407.4888 619 603 587 572 557 543 530 516 504 492 480 469 458 447 437 427 418 408 400 391 383 375 367 359 352 345 338 331 325 318 312 306 300 295 289 284 279 0 0 0 0 0 0 0 0 0 0 0 0 0 0 0 0 0 0 0 0 0 0 0 0 0 0 0 0 0 0 0 0 0 0 0 0 0 0 0 0 0 0 0 0 0 0 0 0 0 0 0 0 0 0 0 0 0 0 0 0 0 0 0 0 0 0 0 0 0 0 0
1287.9434@  $$checkpoint
##END=$$ End of the data block 2
##TITLE= chloromethane CH3Cl $$ Beginning of data block 5
##JCAMP-DX= 5.01
##DATA TYPE= IR SPECTRUM
##DATA CLASS= XYDATA
##BLOCK ID=3
##ORIGIN= Department of Chemistry, UWI, JAMAICA
##OWNER= public domain
##LONGDATE= Fri, 22 Feb 2019 15:00:32 -0500 $$ export date from JSpecView
##SPECTROMETER/DATA SYSTEM= computed by Gaussian at WebMo.net
##$MODELS=
<Models>
<ModelData id="I1" type="MOL">
chloromethane CClH3
RLDSViewer          3D                             0

  5  4  0  0  0  0  0  0  0  0999 V2000
    0.0000    0.0000   -1.1276 C   0  0  0  0  0  0  0  0  0  1
    0.0000    0.0000    0.6572 Cl  0  0  0  0  0  0  0  0  0  2
    0.0000    1.0224   -1.4689 H   0  0  0  0  0  0  0  0  0  3
   -0.8854   -0.5112   -1.4689 H   0  0  0  0  0  0  0  0  0  4
    0.8854   -0.5112   -1.4689 H   0  0  0  0  0  0  0  0  0  5
  1  2  1  0  0  0
  1  4  1  0  0  0
  1  3  1  0  0  0
  1  5  1  0  0  0
M  END
</ModelData>
<ModelData id="3" type="XYZVIB" baseModel="I1" vibrationScale=".2">
5
Model[1]: PATH=Calculation 2;Standard;Energy=-499.09314;Range=M.O.s;NFock==Conv=0.21D-09;E(RHF)=-499.093152586 A.U.;PATH=Calculation 2;Standard
C       0.00000      0.00000     -1.12760
Cl      0.00000      0.00000      0.65720
H       0.00000      1.02243     -1.46893
H      -0.88545     -0.51122     -1.46893
H       0.88545     -0.51122     -1.46893
5
Model[2]: FrequencyLabel=A1;ForceConstant=2.5598 mDyne/A;ReducedMass=7.0998 AMU;FreqValue=782.2599;Frequency=782.2599 cm^-1;Mode=1;PATH=Calculation 2;FrequenciesFrequencies;IRIntensity=47.1784 KM/Mole;PATH=Calculation 2;FrequenciesFrequencies
C       0.00000      0.00000     -1.12760      0.00000     -0.00000      0.61000
Cl      0.00000      0.00000      0.65720     -0.00000     -0.00000     -0.25000
H       0.00000      1.02243     -1.46893     -0.00000     -0.05000      0.43000
H      -0.88545     -0.51122     -1.46893      0.04000      0.03000      0.43000
H       0.88545     -0.51122     -1.46893     -0.04000      0.03000      0.43000
5
Model[3]: FrequencyLabel=E;ForceConstant=0.8908 mDyne/A;ReducedMass=1.1671 AMU;FreqValue=1138.1641;Frequency=1138.1641 cm^-1;Mode=2;PATH=Calculation 2;FrequenciesFrequencies;IRIntensity=2.3496 KM/Mole;PATH=Calculation 2;FrequenciesFrequencies
C       0.00000      0.00000     -1.12760     -0.00000     -0.11000     -0.00000
Cl      0.00000      0.00000      0.65720      0.00000      0.02000      0.00000
H       0.00000      1.02243     -1.46893      0.00000      0.13000      0.75000
H      -0.88545     -0.51122     -1.46893     -0.06000      0.23001     -0.38000
H       0.88545     -0.51122     -1.46893      0.06000      0.23001     -0.38000
5
Model[4]: FrequencyLabel=E;ForceConstant=0.8908 mDyne/A;ReducedMass=1.1671 AMU;FreqValue=1138.1641;Frequency=1138.1641 cm^-1;Mode=3;PATH=Calculation 2;FrequenciesFrequencies;IRIntensity=2.3496 KM/Mole;PATH=Calculation 2;FrequenciesFrequencies
C       0.00000      0.00000     -1.12760     -0.11000      0.00000      0.00000
Cl      0.00000      0.00000      0.65720      0.02000     -0.00000     -0.00000
H       0.00000      1.02243     -1.46893      0.27001     -0.00000     -0.00000
H      -0.88545     -0.51122     -1.46893      0.16000     -0.06000     -0.65000
H       0.88545     -0.51122     -1.46893      0.16000      0.06000      0.65000
5
Model[5]: FrequencyLabel=A1;ForceConstant=1.5802 mDyne/A;ReducedMass=1.1338 AMU;FreqValue=1538.0455;Frequency=1538.0455 cm^-1;Mode=4;PATH=Calculation 2;FrequenciesFrequencies;IRIntensity=30.1864 KM/Mole;PATH=Calculation 2;FrequenciesFrequencies
C       0.00000      0.00000     -1.12760     -0.00000      0.00000     -0.11000
Cl      0.00000      0.00000      0.65720      0.00000      0.00000     -0.01000
H       0.00000      1.02243     -1.46893      0.00000      0.20001      0.54000
H      -0.88545     -0.51122     -1.46893     -0.17000     -0.10000      0.54000
H       0.88545     -0.51122     -1.46893      0.17000     -0.10000      0.54000
5
Model[6]: FrequencyLabel=E;ForceConstant=1.6503 mDyne/A;ReducedMass=1.0556 AMU;FreqValue=1628.9427;Frequency=1628.9427 cm^-1;Mode=5;PATH=Calculation 2;FrequenciesFrequencies;IRIntensity=4.7647 KM/Mole;PATH=Calculation 2;FrequenciesFrequencies
C       0.00000      0.00000     -1.12760     -0.07000     -0.00000     -0.00000
Cl      0.00000      0.00000      0.65720     -0.00000     -0.00000      0.00000
H       0.00000      1.02243     -1.46893      0.74000     -0.00000     -0.00000
H      -0.88545     -0.51122     -1.46893      0.07000     -0.38000      0.27001
H       0.88545     -0.51122     -1.46893      0.07000      0.38000     -0.27001
5
Model[7]: FrequencyLabel=E;ForceConstant=1.6503 mDyne/A;ReducedMass=1.0556 AMU;FreqValue=1628.9427;Frequency=1628.9427 cm^-1;Mode=6;PATH=Calculation 2;FrequenciesFrequencies;IRIntensity=4.7647 KM/Mole;PATH=Calculation 2;FrequenciesFrequencies
C       0.00000      0.00000     -1.12760      0.00000     -0.07000     -0.00000
Cl      0.00000      0.00000      0.65720      0.00000     -0.00000      0.00000
H       0.00000      1.02243     -1.46893     -0.00000     -0.15001     -0.31000
H      -0.88545     -0.51122     -1.46893     -0.38000      0.52000      0.16000
H       0.88545     -0.51122     -1.46893      0.38000      0.52000      0.16000
5
Model[8]: FrequencyLabel=A1;ForceConstant=6.4615 mDyne/A;ReducedMass=1.0272 AMU;FreqValue=3267.4742;Frequency=3267.4742 cm^-1;Mode=7;PATH=Calculation 2;FrequenciesFrequencies;IRIntensity=33.3068 KM/Mole;PATH=Calculation 2;FrequenciesFrequencies
C       0.00000      0.00000     -1.12760      0.00000      0.00000      0.04000
Cl      0.00000      0.00000      0.65720      0.00000      0.00000      0.00000
H       0.00000      1.02243     -1.46893      0.00000      0.55000     -0.17000
H      -0.88545     -0.51122     -1.46893     -0.48000     -0.28000     -0.17000
H       0.88545     -0.51122     -1.46893      0.48000     -0.28000     -0.17000
5
Model[9]: FrequencyLabel=E;ForceConstant=7.4335 mDyne/A;ReducedMass=1.1102 AMU;FreqValue=3371.1227;Frequency=3371.1227 cm^-1;Mode=8;PATH=Calculation 2;FrequenciesFrequencies;IRIntensity=9.8409 KM/Mole;PATH=Calculation 2;FrequenciesFrequencies
C       0.00000      0.00000     -1.12760     -0.10000     -0.00000      0.00000
Cl      0.00000      0.00000      0.65720      0.00000      0.00000     -0.00000
H       0.00000      1.02243     -1.46893     -0.02000      0.00000     -0.00000
H      -0.88545     -0.51122     -1.46893      0.58000      0.34000      0.21000
H       0.88545     -0.51122     -1.46893      0.58000     -0.34000     -0.21000
5
Model[10]: FrequencyLabel=E;ForceConstant=7.4335 mDyne/A;ReducedMass=1.1102 AMU;FreqValue=3371.1227;Frequency=3371.1227 cm^-1;Mode=9;PATH=Calculation 2;FrequenciesFrequencies;IRIntensity=9.8409 KM/Mole;PATH=Calculation 2;FrequenciesFrequencies
C       0.00000      0.00000     -1.12760      0.00000     -0.10000      0.00000
Cl      0.00000      0.00000      0.65720     -0.00000      0.00000     -0.00000
H       0.00000      1.02243     -1.46893      0.00000      0.78000     -0.24000
H      -0.88545     -0.51122     -1.46893      0.34000      0.18001      0.12000
H       0.88545     -0.51122     -1.46893     -0.34000      0.18001      0.12000
</ModelData>
</Models>
##$PEAKS=
<Peaks type="IR" xUnitsExpected="1/cm"  >
<PeakData id="1" title="1-CClH3 (~3370 cm-1)" peakShape="broad" model="3.10" xMax="3390" xMin="3350"    />
<PeakData id="2" title="2-CClH3 (~3270 cm-1)" peakShape="broad" model="3.9" xMax="3290" xMin="3250"    />
<PeakData id="3" title="3-CClH3 (~1630 cm-1)" peakShape="broad" model="3.7" xMax="1650" xMin="1610"    />
<PeakData id="4" title="4-CClH3 (~1540 cm-1)" peakShape="broad" model="3.6" xMax="1560" xMin="1520"    />
<PeakData id="5" title="5-CClH3 (~1140 cm-1)" peakShape="broad" model="3.4" xMax="1160" xMin="1120"    />
<PeakData id="6" title="6-CClH3 (~780 cm-1)" peakShape="broad" model="3.3" xMax="800" xMin="760" />
</Peaks>
##XUNITS= 1/CM
##YUNITS= TRANSMITTANCE
##YUNITS= TRANSMITTANCE
##XFACTOR= 1
##YFACTOR= 9.999000E-07
##FIRSTX= 3.571123E+03
##FIRSTY= 1
##LASTX= 5.822599E+02
##NPOINTS= 2001
##MINY= 1.000000E-04
##MAXY= 1
##XYDATA= (X++(Y..Y))
3571.1228 1000100 1000100 1000100 1000100 1000100 1000100 1000100 1000100 1000100 1000100 1000100 1000100 1000100 1000100 1000100 1000100 1000100 1000100 1000100 1000100 1000100 1000100 1000100 1000100 1000100 1000100 1000100 1000100 1000100 1000100 1000100 1000100 1000100 1000100 1000100 1000100 1000100 1000100 1000100 1000100 1000100 1000100 1000100 1000100 1000100 1000100 1000100 1000100 1000100 1000100 1000100 1000100 1000100 1000100 973510 972844 972153 971435 970690 969916 969111 968273 967402 966494 965549 964563 963535 962462
3469.5015 961342 960172 958948 957668 956328 954925 953453 951910 950289 948587 946797 944914 942931
3450.0737 940841 938636 936308 933847 931245 928489 925567 922468 919176 915674 911947 907974 903734
3430.6462 899204 894357 889164 883593 877607 871168 864229 856741 848647 839885 830384 820065 808839
3411.2185 796607 783256 768662 752686 735172 715948 694828 671610 646077 618010 587191
3394.7798 553422 516548 476497 433324 387286 323805 275898 227985 181743 139121 102057
3378.341 72037 49667 34513 25380 20911 20172 22977 29939 42244 61155 87382 120663 159773
3358.9133 202877 247994 293340 337514 379526 418762 454896 487818 517559 544241 568035
3342.4746 589135 607742 624051 638245 650492 660940 669721 676951 682726 687128 690225 692070
3324.5415 692702 692148 690426 687538 683479 678232 671767 664047 655022 644634 632812 619477 604538
3305.114 587900 569457 549100 526723 502221 475508 446522 415246 381726 346104 308649
3288.675 269794 230181 190683 152410 116657 84779 57977 37018 21994 12243 6550
3272.2363 3551 2119 1533 1448 1812 2847 5121 9619 17676 30660 49543 74589 105314 140676
3251.3145 179359 225791 268137 310214 351259 390736 428297 463748 497004 528061 556971
3234.8757 583823 608725 631799 653169 672960 691294 708285 724041 738664 752246 764874
3218.4368 776626 787575 797785 807318 816227 824563 832371 839692 846563 853019 859092 864809 870197
3199.0093 875279 880079 884614 888905 892967 896816 900467 903931 907223 910352 913328 916162 918862
3179.5818 921436 923893 926237 928477 930619 932667 934627 936505 938304 940028 941683 943271 944796
3160.154I46261J408J355J303J254J209J164J122J082M3942%s35j2964I86809
1744.9275 986470 986117 985751 985370 984974 984562 984133 983686 983219 982733 982226 981697 981143 980565 979960 979326 978662
1719.5222 977967 977237 976470 975665 974819 973928 972989 972000 970956 969854 968688 967455 966149 964763 963292
1697.1057 961729 960066 958293 956403 954383 952223 949909 947426 944758 941888 938793 935452 931837
1677.6781 927919 923664 919034 913986 908469 902426 895792 888492 880438 871530 861651 850668 838424
1658.2505 824740 776637 759317 739934 718203 693805 666400 635640 601196 562811 520371
1641.8118 474029 424346 372467 320247 270244 225456 188796 162481 147739 144980 154184
1625.373 174989 206391 246444 292386 341165 390030 436883 480369 519767 554827 585606
1608.9343 612336 635336 654951 671524 685369 696769 705970 713182 718582 722314 724499 725227
1591.0011 724569 722576 719277 714689 708808 701617 693084 683165 671799 658913 644423 628231 610229
1571.5735 590300 568323 544175 517741 488923 457655 423925 387800 349465 309261 267734
1555.1348 225676 184156 144492 108166 76631 51017 31819 18706 10609 6090 3813 2842
1537.2015 2699 3307 4980 8475 15004 26038 42886 66240 95960 131156 170479 212431 255604
1517.7739 298815 341151 381963 420824 457488 491844 523875 560620 588368 614019 637708
1501.3352 659578 679766 698407 715629 731552 746286 759934 772587 784332 795247 805401
1484.8965 814858 823678 831912 839608 846810 853558 859886 865827 871411 876665 881614 886280 890683
1465.4689 894842 898775 902496 906022 909363 912534 915545 918406 921127 923717 926184 928536 930778
1446.0413 932919 934964 936918 938787 940575 942287 943927 945500 947008 948455 949844 951179 952462
1426.6136 953696 954883 956025 957125 958185 959206 960191 1000100 1000100 1000100 1000100 1000100 1000100 1000100 1000100 1000100 1000100 1000100 1000100 1000100 1000100 1000100 1000100 1000100 1000100 1000100 1000100 1000100 1000100 1000100 1000100 1000100 1000100 1000100 1000100 1000100 1000100 1000100 1000100 1000100 1000100 1000100 1000100 1000100 1000100 1000100 1000100 1000100 1000100 1000100 1000100 1000100 1000100 1000100 1000100 1000100 1000100 1000100 1000100 1000100 1000100 1000100 1000100 1000100 1000100 1000100 1000100 1000100 1000100 1000100 1000100 1000100 1000100 1000100 1000100 1000100 1000100 1000100 1000100 1000100 1000100 1000100 1000100 1000100 1000100 1000100 1000100 1000100 1000100 1000100 1000100 1000100 1000100 1000100 1000100 1000100 1000100 1000100 1000100 1000100 1000100 1000100 1000100 1000100 1000100 1000100 1000100 1000100 1000100 1000100 1000100 1000100 1000100 993686 993524 993355 993180 992998
1250.2708 992809 992612 992407 992194 991972 991740 991498 991246 990982 990707 990418 990117 989801 989470 989123 988759 988377
1224.8654 987975 987552 987107 986638 986143 985621 985069 984485 983866 983211 982516 981777 980991 980154 979261 978308 977288
1199.4601 976197 975026 973769 972416 970958 969383 967680 965834 963830 961648 959268 956666 953814
1180.0325 950680 947227 943413 939186 934488 929249 923389 916811 909402 901025 891521 880698 868331
1160.6049 854153 837852 819066 797392 772392 743628 710724 673480 632045 587170 540490
1144.1661 494746 453728 421782 402882 399598 412393 439492 477373 521713 568409 614269
1127.7274 657227 696209 730856 761253 787723 810686 830587 847845 862841 875904 887321
1111.2886 897333 906144 913926 920825 926963 932442 937349 941759 945733 949326 952584 955546 958245
1091.861 960712 962971 965045 966953 968712 970337 971840 973234 974529 975734 976857 977904 978884
1072.4333 979800 980659 981465 982223 982935 983606 984239 984837 985401 985936 986441 986921 987375 987807 988217 988607 988979
1047.0281 989332 989670 989991 990298 990592 990872 991141 991397 991643 991879 992105 992322 992530 992730 992923 993108 993285
1021.62274 993456 993621 993780 1000100 1000100 1000100 1000100 1000100 1000100 1000100 1000100 1000100 1000100 1000100 1000100 1000100 1000100 1000100 1000100 1000100 1000100 1000100 1000100 1000100 1000100 1000100 1000100 1000100 1000100 1000100 1000100 1000100 1000100 1000100 1000100 1000100 1000100 1000100 1000100 1000100 1000100 1000100 1000100 1000100 1000100 1000100 1000100 1000100 1000100 1000100 1000100 1000100 1000100 1000100 1000100 1000100 1000100 1000100 1000100 1000100 1000100 1000100 1000100 1000100 1000100 1000100 1000100 1000100 1000100 1000100 1000100 1000100 1000100 1000100 1000100 1000100 1000100 1000100 1000100 1000100 937541 936005 934412 932760 931046 929266 927418 925498 923503
888.61835 921427 919268 917020 914680 912240 909698 907045 904277 901386 898366 895208 891906 888448
869.19073 884828 881033 877054 872878 868493 863885 859040 853941 848572 842914 836947 830649 823997
849.7631 816965 809525 801649 793303 784452 775059 765082 754477 743195 731184 718389 704749
831.82996 690201 674674 658097 640392 621482 601284 579716 556699 532159 506029 478261
815.3912 448830 417744 385060 350897 315460 279055 242120 205234 169134 134698 102903
798.95245 74737 51058 32414 18882 9981 4765 2074 854 358 172 109 100 137 260 596
776.536 1455 3439 7495 14775 26349 42907 64595 91039 121484 154975 190516 227181
758.6028 264175 300854 336726 371434 404734 436475 466578 495016 521802 546977 570601
742.16406 592744 613486 632906 651088 668111 684053 698988 712987 726115 738436 750005
725.72534 760878 771103 780727 789792 798337 806399 814011 821204 828007 834445 840543 846324 851807
706.2977 857013 861958 866660 871133 875392 879449 883317 887007 890529 893893 897108 900183 903125
686.8701 905942 908640 911226 913707 916087 918371 920566 922675 924702 926652 928529 930335 932075
667.4425 933752 935368 936927 938431 1000100 1000100 1000100 1000100 1000100 1000100 1000100 1000100 1000100 1000100 1000100 1000100 1000100 1000100 1000100 1000100 1000100 1000100 1000100 1000100 1000100 1000100 1000100 1000100 1000100 1000100 1000100 1000100 1000100 1000100 1000100 1000100 1000100 1000100 1000100 1000100 1000100 1000100 1000100 1000100 1000100 1000100 1000100 1000100 1000100 1000100 1000100 1000100 1000100 1000100 1000100 1000100 1000100
582.2599A000100  $$checkpoint
##END=$$ End of the data block 5
##TITLE= chloromethane CH3Cl   $$ Beginning of data block 6
##JCAMP-DX= 5.01
##DATA TYPE= RAMAN SPECTRUM
##DATA CLASS= XYDATA
##BLOCK ID=4
##ORIGIN= Department of Chemistry, UWI, JAMAICA
##OWNER= public domain
##LONGDATE= Fri, 22 Feb 2019 15:02:58 -0500 $$ export date from JSpecView
##SPECTROMETER/DATA SYSTEM= computed by Gaussian at WebMO.net
##$MODELS=
<Models>
<ModelData id="R1" type="MOL">
CH3Cl
RLDSViewer          3D                             0

  5  4  0  0  0  0  0  0  0  0999 V2000
    0.0000    0.0000   -1.1276 C   0  0  0  0  0  0  0  0  0  1
    0.0000    0.0000    0.6572 Cl  0  0  0  0  0  0  0  0  0  2
    0.0000    1.0224   -1.4689 H   0  0  0  0  0  0  0  0  0  3
   -0.8854   -0.5112   -1.4689 H   0  0  0  0  0  0  0  0  0  4
    0.8854   -0.5112   -1.4689 H   0  0  0  0  0  0  0  0  0  5
  1  2  1  0  0  0
  1  4  1  0  0  0
  1  3  1  0  0  0
  1  5  1  0  0  0
M  END
</ModelData>
<ModelData id="4" type="XYZVIB" baseModel="R1" vibrationScale=".2">
5
Model[1]: PATH=Calculation 2;Standard;Energy=-499.09314;Range=M.O.s;NFock==Conv=0.21D-09;E(RHF)=-499.093152586 A.U.;PATH=Calculation 2;Standard
C       0.00000      0.00000     -1.12760
Cl      0.00000      0.00000      0.65720
H       0.00000      1.02243     -1.46893
H      -0.88545     -0.51122     -1.46893
H       0.88545     -0.51122     -1.46893
5
Model[2]: FrequencyLabel=A1;ForceConstant=2.5598 mDyne/A;ReducedMass=7.0998 AMU;FreqValue=782.2599;Frequency=782.2599 cm^-1;Mode=1;PATH=Calculation 2;FrequenciesFrequencies;IRIntensity=47.1784 KM/Mole;PATH=Calculation 2;FrequenciesFrequencies
C       0.00000      0.00000     -1.12760      0.00000     -0.00000      0.61000
Cl      0.00000      0.00000      0.65720     -0.00000     -0.00000     -0.25000
H       0.00000      1.02243     -1.46893     -0.00000     -0.05000      0.43000
H      -0.88545     -0.51122     -1.46893      0.04000      0.03000      0.43000
H       0.88545     -0.51122     -1.46893     -0.04000      0.03000      0.43000
5
Model[3]: FrequencyLabel=E;ForceConstant=0.8908 mDyne/A;ReducedMass=1.1671 AMU;FreqValue=1138.1641;Frequency=1138.1641 cm^-1;Mode=2;PATH=Calculation 2;FrequenciesFrequencies;IRIntensity=2.3496 KM/Mole;PATH=Calculation 2;FrequenciesFrequencies
C       0.00000      0.00000     -1.12760     -0.00000     -0.11000     -0.00000
Cl      0.00000      0.00000      0.65720      0.00000      0.02000      0.00000
H       0.00000      1.02243     -1.46893      0.00000      0.13000      0.75000
H      -0.88545     -0.51122     -1.46893     -0.06000      0.23001     -0.38000
H       0.88545     -0.51122     -1.46893      0.06000      0.23001     -0.38000
5
Model[4]: FrequencyLabel=E;ForceConstant=0.8908 mDyne/A;ReducedMass=1.1671 AMU;FreqValue=1138.1641;Frequency=1138.1641 cm^-1;Mode=3;PATH=Calculation 2;FrequenciesFrequencies;IRIntensity=2.3496 KM/Mole;PATH=Calculation 2;FrequenciesFrequencies
C       0.00000      0.00000     -1.12760     -0.11000      0.00000      0.00000
Cl      0.00000      0.00000      0.65720      0.02000     -0.00000     -0.00000
H       0.00000      1.02243     -1.46893      0.27001     -0.00000     -0.00000
H      -0.88545     -0.51122     -1.46893      0.16000     -0.06000     -0.65000
H       0.88545     -0.51122     -1.46893      0.16000      0.06000      0.65000
5
Model[5]: FrequencyLabel=A1;ForceConstant=1.5802 mDyne/A;ReducedMass=1.1338 AMU;FreqValue=1538.0455;Frequency=1538.0455 cm^-1;Mode=4;PATH=Calculation 2;FrequenciesFrequencies;IRIntensity=30.1864 KM/Mole;PATH=Calculation 2;FrequenciesFrequencies
C       0.00000      0.00000     -1.12760     -0.00000      0.00000     -0.11000
Cl      0.00000      0.00000      0.65720      0.00000      0.00000     -0.01000
H       0.00000      1.02243     -1.46893      0.00000      0.20001      0.54000
H      -0.88545     -0.51122     -1.46893     -0.17000     -0.10000      0.54000
H       0.88545     -0.51122     -1.46893      0.17000     -0.10000      0.54000
5
Model[6]: FrequencyLabel=E;ForceConstant=1.6503 mDyne/A;ReducedMass=1.0556 AMU;FreqValue=1628.9427;Frequency=1628.9427 cm^-1;Mode=5;PATH=Calculation 2;FrequenciesFrequencies;IRIntensity=4.7647 KM/Mole;PATH=Calculation 2;FrequenciesFrequencies
C       0.00000      0.00000     -1.12760     -0.07000     -0.00000     -0.00000
Cl      0.00000      0.00000      0.65720     -0.00000     -0.00000      0.00000
H       0.00000      1.02243     -1.46893      0.74000     -0.00000     -0.00000
H      -0.88545     -0.51122     -1.46893      0.07000     -0.38000      0.27001
H       0.88545     -0.51122     -1.46893      0.07000      0.38000     -0.27001
5
Model[7]: FrequencyLabel=E;ForceConstant=1.6503 mDyne/A;ReducedMass=1.0556 AMU;FreqValue=1628.9427;Frequency=1628.9427 cm^-1;Mode=6;PATH=Calculation 2;FrequenciesFrequencies;IRIntensity=4.7647 KM/Mole;PATH=Calculation 2;FrequenciesFrequencies
C       0.00000      0.00000     -1.12760      0.00000     -0.07000     -0.00000
Cl      0.00000      0.00000      0.65720      0.00000     -0.00000      0.00000
H       0.00000      1.02243     -1.46893     -0.00000     -0.15001     -0.31000
H      -0.88545     -0.51122     -1.46893     -0.38000      0.52000      0.16000
H       0.88545     -0.51122     -1.46893      0.38000      0.52000      0.16000
5
Model[8]: FrequencyLabel=A1;ForceConstant=6.4615 mDyne/A;ReducedMass=1.0272 AMU;FreqValue=3267.4742;Frequency=3267.4742 cm^-1;Mode=7;PATH=Calculation 2;FrequenciesFrequencies;IRIntensity=33.3068 KM/Mole;PATH=Calculation 2;FrequenciesFrequencies
C       0.00000      0.00000     -1.12760      0.00000      0.00000      0.04000
Cl      0.00000      0.00000      0.65720      0.00000      0.00000      0.00000
H       0.00000      1.02243     -1.46893      0.00000      0.55000     -0.17000
H      -0.88545     -0.51122     -1.46893     -0.48000     -0.28000     -0.17000
H       0.88545     -0.51122     -1.46893      0.48000     -0.28000     -0.17000
5
Model[9]: FrequencyLabel=E;ForceConstant=7.4335 mDyne/A;ReducedMass=1.1102 AMU;FreqValue=3371.1227;Frequency=3371.1227 cm^-1;Mode=8;PATH=Calculation 2;FrequenciesFrequencies;IRIntensity=9.8409 KM/Mole;PATH=Calculation 2;FrequenciesFrequencies
C       0.00000      0.00000     -1.12760     -0.10000     -0.00000      0.00000
Cl      0.00000      0.00000      0.65720      0.00000      0.00000     -0.00000
H       0.00000      1.02243     -1.46893     -0.02000      0.00000     -0.00000
H      -0.88545     -0.51122     -1.46893      0.58000      0.34000      0.21000
H       0.88545     -0.51122     -1.46893      0.58000     -0.34000     -0.21000
5
Model[10]: FrequencyLabel=E;ForceConstant=7.4335 mDyne/A;ReducedMass=1.1102 AMU;FreqValue=3371.1227;Frequency=3371.1227 cm^-1;Mode=9;PATH=Calculation 2;FrequenciesFrequencies;IRIntensity=9.8409 KM/Mole;PATH=Calculation 2;FrequenciesFrequencies
C       0.00000      0.00000     -1.12760      0.00000     -0.10000      0.00000
Cl      0.00000      0.00000      0.65720     -0.00000      0.00000     -0.00000
H       0.00000      1.02243     -1.46893      0.00000      0.78000     -0.24000
H      -0.88545     -0.51122     -1.46893      0.34000      0.18001      0.12000
H       0.88545     -0.51122     -1.46893     -0.34000      0.18001      0.12000
</ModelData>
</Models>
##$PEAKS=
<Peaks type="Raman" xUnitsExpected="1/cm"  >
<PeakData id="1" title="1-CClH3 (~3410 cm-1)" peakShape="broad" model="4.10" xMax="3440" xMin="3380"    />
<PeakData id="2" title="2-CClH3 (~1400 cm-1)" peakShape="broad" model="4.9" xMax="1420" xMin="1400"    />
<PeakData id="3" title="3-CClH3 (~875 cm-1)" peakShape="broad" model="4.8" xMax="890" xMin="860"    />
<PeakData id="4" title="4-CClH3 (~730 cm-1)" peakShape="broad" model="4.7" xMax="745" xMin="715"    />
<PeakData id="5" title="5-CClH3 (~405 cm-1)" peakShape="broad" model="4.4" xMax="420" xMin="390"    />
<PeakData id="6" title="6-CClH3 (~290 cm-1)" peakShape="broad" model="4.3" xMax="305" xMin="275"    />
</Peaks>
##XUNITS= 1/CM
##YUNITS= ABSORBANCE
##XFACTOR= 1
##YFACTOR= 8.555580E-07
##FIRSTX= 3.555197E+03
##FIRSTY= 0
##LASTX= 1.386623E+02
##NPOINTS= 2000
##MINY= 0
##MAXY= 8.555580E-01
##XYDATA= (X++(Y..Y))
3555.1973 0 0 0 0 0 0 0 0 0 0 0 0 0 0 0 0 0 0 0 0 0 0 0 0 0 0 0 0 0 0 0 0 0 0 7022 7296 7587 7895 8222 8570 8941 9336 9758 10209 10691 11209 11765 12363 13008 13704
3469.7412 14458 15275 16163 17131 18187 19343 20613 22010 23554 25264 27166 29289 31668 34345
3445.8135 37371 40810 44738 49252 54470 60544 67667 76088 86128 98216 112918 131002 153509
3423.595 181875 218078 264831 325763 405404 508423 636823 783110 920080 1000000
3406.5037 983889 880292 735925 593501 472983 377815 304638 248656 205597 172135
3389.4124 145812 124842 107929 94129 82744 73258 65280 58514 52730 47750 43434 39670
3368.903 36370 33460 30883 28590 26541 24702 23047 21552 20197 18965 17841 16815 15873 15009
3344.9753 14212 13478 12798 12168 11584 11041 10534 10062 9621 9208 8821 8458 8116 7795 7493 7208 6938
3315.9202@%S068J351N2N6O0O2O7P2P6Q1Q7R2J00J07J15J24J34J45J57C109
1456.3954 3295 3498 3720 3965 4233 4530 4859 5225 5633 6091 6606 7188 7849 8605 9473 10477 11645
1427.3403 13015 14635 16566 18891 21719 25197 29526 34982 41945 50938 62657 77976 97790
1405.1217 122487 150624 176969 192341 189242 169316 141548 114154 90974 72669 58594
1386.3214 47827 39545 33109 28046 24012 20759 18105 15915 14090 12556 11255 10142 9184 8354
1362.3937 7630 6995 6436 5940 5499 5105 4751 4433 4145 3885 3648 3432 3234 3053 2887 2734 2592 2462
1331.6295B340j12j04r8r1q5p9p4p0o6o2n8n5n1j335%T00K106Q2Q7R3B466
955.6226 2570 2681 2800 2926 3061 3206 3361 3528 3708 3901 4110 4336 4581 4847 5137 5454 5801 6182
924.85846 6601 7064 7577 8147 8784 9497 10300 11208 12239 13417 14770 16335 18157 20293 22818 25830
897.5125 29455 33864 39287 46037 54544 65401 79422 97695 121580 152475 190981 234852
877.00305 275929 299897 295065 263997 220702 177989 141846 113306 91360 74571 61658
858.2027 51623 43729 37440 32368 28229 24815 21970 19577 17548 15814 14320 13026 11897 10907
834.27496 10035 9262 8574 7959 7408 6912 6463 6057 7042 6758 6506 6283 6087 5915 5766 5638 5531
805.2199 5443 5373 5321 5286 5269 5270 5288 5325 5380 5455 5551 5669 5811 3975 4245 4542 4872 5239 5648 6107 6623
769.3283 7207 7870 8627 9498 10504 11676 13049 14673 16609 18940 21775 25263 29603 35073 42055
743.6915 51071 62821 78179 98046 122807 151017 177431 192842 189736 169758 141918 114452
723.18207 91211 72859 58747 47951 39648 33195 28119 24075 20813 18152 15957 14127 12589
700.96344 11284 10169 9208 8376 7650 7014 6453 5956 5513 5118 4764 4445 4156 3895 3657 3441 3243
671.9084 3061 2894 2741 2599 2468 2347 2234 2129 2031 1940 1855 1776 1701 1631 1565 1503 1445 1390 1338 0 0
636.01685 0 0 0 0 0 0 0 0 0 0 0 0 0 0 0 0 0 0 0 0 0 0 0 0 0 0 0 0 0 0 0 0 0 0 0 0 0 0 0 0 0 0 0 0 0 0 0 0 0 0 0 0 0 0 0 0 0 0 0 0 0 0 0 0 0 0 0 0 0 0 0 0 0 0 0 0 0 0 0 0 0 0 0 0 860 894 929 967 1007 1050 1095 1144 1195 1250 1310 1373 1441 1514 1593 1679 1771 1871 1980 2098 2228 2369
454.84988 2525 2696 2885 3095 3328 3588 3879 4207 4578 4999 5480 6033 6672 7416 8289 9320 10550
425.7948 12031 13831 16046 18803 22278 26712 32439 39903 49658 62277 78005 95924 112701
403.57623 122491 120517 107827 90144 72698 57936 46279 37315 30458 25184 21085 17861
383.06674 15292 13220 11530 11010 9882 8941 8151 7483 6916 6434 6022 5670 5370 5115 4898 4716
355.7208 4566 4443 4347 4275 4226 4199 4193 4210 4248 4309 4393 4502 4638 4803 5001 5235 5511 5834 6211 6653 7171
319.82922 7779 8497 9347 10361 11578 12234 14066 16318 19122 22655 27165 32989 40579 50499 63332
294.1924 79326 97548 114610 124565 122558 109654 91671 73929 58917 47063 37947 30974
273.68295 25610 21442 18163 15551 13444 11725 10307 9125 8132 7289 6568 5948 5410 4942 4530
248.04611 4168 3847 3561 3306 3077 2871 2685 2516 2362 2222 2095 1977 1870 1770 1679 1594 1516 1443 1375
215.5728 1312 1253 1198 1147 1099 1054 1011 971 933 898 864 0 0 0 0 0 0 0 0 0 0 0 0 0 0 0 0 0 0 0 0 0 0 0 0 0 0 0 0 0 0 0 0 0 0
138.6623@  $$checkpoint
##END=$$ End of the data block 4
##TITLE= dichloromethane CH2Cl2 $$ Beginning of data block 5
##JCAMP-DX= 5.01
##DATA TYPE= IR SPECTRUM
##DATA CLASS= XYDATA
##BLOCK ID=5
##ORIGIN= Department of Chemistry, UWI, JAMAICA
##OWNER= public domain
##LONGDATE= Fri, 22 Feb 2019 15:00:32 -0500 $$ export date from JSpecView
##SPECTROMETER/DATA SYSTEM= computed by Gaussian at WebMo.net
##$MODELS=
<Models>
<ModelData id="I2" type="MOL">
dichloromethane CH2Cl2
RLDSViewer          3D                             0

  5  4  0  0  0  0  0  0  0  0999 V2000
    0.0000    0.0000    0.7615 C   0  0  0  0  0  0  0  0  0  1
    0.8900    0.0000    1.3691 H   0  0  0  0  0  0  0  0  0  2
    0.0000    1.4729   -0.2149 Cl  0  0  0  0  0  0  0  0  0  3
   -0.8900    0.0000    1.3691 H   0  0  0  0  0  0  0  0  0  4
    0.0000   -1.4729   -0.2149 Cl  0  0  0  0  0  0  0  0  0  5
  1  2  1  0  0  0
  1  4  1  0  0  0
  1  3  1  0  0  0
  1  5  1  0  0  0
M  END
</ModelData>
<ModelData id="5" type="XYZVIB" baseModel="I2" vibrationScale=".2">
5
Model[1]: PATH=Calculation 1;Input;Energy=NaN;NFock==Conv=0.50D-08;E(RHF)=-957.984015823 A.U.;PATH=Calculation 1;Input
C       0.00000      0.00000      0.76151
H       0.88548      0.00000      1.36914
Cl      0.00000      1.47291     -0.21492
H      -0.88548      0.00000      1.36914
Cl     -0.00000     -1.47291     -0.21492
5
Model[2]: FrequencyLabel=A1;ForceConstant=1.1009 mDyne/A;ReducedMass=19.2176 AMU;FreqValue=311.8229;Frequency=311.8229 cm^-1;Mode=1;PATH=Calculation 2;FrequenciesFrequencies;IRIntensity=0.8638 KM/Mole;PATH=Calculation 2;FrequenciesFrequencies
C       0.00000     -0.00000      0.76151     -0.00000     -0.00000     -0.42000
H       0.88548     -0.00000      1.36914     -0.01000      0.00000     -0.42000
Cl      0.00000      1.47291     -0.21492      0.00000      0.48000      0.08000
H      -0.88548      0.00000      1.36914      0.01000     -0.00000     -0.42000
Cl     -0.00000     -1.47291     -0.21492     -0.00000     -0.48000      0.08000
5
Model[3]: FrequencyLabel=A1;ForceConstant=2.5838 mDyne/A;ReducedMass=7.2901 AMU;FreqValue=775.5988;Frequency=775.5988 cm^-1;Mode=2;PATH=Calculation 2;FrequenciesFrequencies;IRIntensity=21.4163 KM/Mole;PATH=Calculation 2;FrequenciesFrequencies
C       0.00000     -0.00000      0.76151      0.00000      0.00000      0.62000
H       0.88548     -0.00000      1.36914      0.07000     -0.00000      0.52000
Cl      0.00000      1.47291     -0.21492     -0.00000      0.13000     -0.12000
H      -0.88548      0.00000      1.36914     -0.07000      0.00000      0.52000
Cl     -0.00000     -1.47291     -0.21492      0.00000     -0.13000     -0.12000
5
Model[4]: FrequencyLabel=B2;ForceConstant=3.2430 mDyne/A;ReducedMass=7.7090 AMU;FreqValue=844.9850;Frequency=844.9850 cm^-1;Mode=3;PATH=Calculation 2;FrequenciesFrequencies;IRIntensity=154.7649 KM/Mole;PATH=Calculation 2;FrequenciesFrequencies
C       0.00000     -0.00000      0.76151      0.00000      0.67000     -0.00000
H       0.88548     -0.00000      1.36914     -0.00000      0.50000      0.00000
Cl      0.00000      1.47291     -0.21492     -0.00000     -0.13000      0.09000
H      -0.88548      0.00000      1.36914     -0.00000      0.50000     -0.00000
Cl     -0.00000     -1.47291     -0.21492     -0.00000     -0.13000     -0.09000
5
Model[5]: FrequencyLabel=B1;ForceConstant=0.7902 mDyne/A;ReducedMass=1.3545 AMU;FreqValue=995.0310;Frequency=995.0310 cm^-1;Mode=4;PATH=Calculation 2;FrequenciesFrequencies;IRIntensity=0.8552 KM/Mole;PATH=Calculation 2;FrequenciesFrequencies
C       0.00000     -0.00000      0.76151      0.17000     -0.00000     -0.00000
H       0.88548     -0.00000      1.36914     -0.26000      0.00000      0.65000
Cl      0.00000      1.47291     -0.21492     -0.02000      0.00000     -0.00000
H      -0.88548      0.00000      1.36914     -0.26000      0.00000     -0.65000
Cl     -0.00000     -1.47291     -0.21492     -0.02000      0.00000      0.00000
5
Model[6]: FrequencyLabel=A2;ForceConstant=1.0386 mDyne/A;ReducedMass=1.0180 AMU;FreqValue=1315.8865;Frequency=1315.8865 cm^-1;Mode=5;PATH=Calculation 2;FrequenciesFrequencies;IRIntensity=0.0000 KM/Mole;PATH=Calculation 2;FrequenciesFrequencies
C       0.00000     -0.00000      0.76151      0.00000      0.00000      0.00000
H       0.88548     -0.00000      1.36914      0.00000      0.71000     -0.00000
Cl      0.00000      1.47291     -0.21492      0.01000     -0.00000     -0.00000
H      -0.88548      0.00000      1.36914     -0.00000     -0.71000     -0.00000
Cl     -0.00000     -1.47291     -0.21492     -0.01000      0.00000     -0.00000
5
Model[7]: FrequencyLabel=B2;ForceConstant=1.3952 mDyne/A;ReducedMass=1.1247 AMU;FreqValue=1451.0435;Frequency=1451.0435 cm^-1;Mode=6;PATH=Calculation 2;FrequenciesFrequencies;IRIntensity=73.4247 KM/Mole;PATH=Calculation 2;FrequenciesFrequencies
C       0.00000     -0.00000      0.76151     -0.00000     -0.10000      0.00000
H       0.88548     -0.00000      1.36914      0.00000      0.70000     -0.00000
Cl      0.00000      1.47291     -0.21492      0.00000     -0.00000      0.01000
H      -0.88548      0.00000      1.36914      0.00000      0.70000      0.00000
Cl     -0.00000     -1.47291     -0.21492      0.00000     -0.00000     -0.01000
5
Model[8]: FrequencyLabel=A1;ForceConstant=1.6633 mDyne/A;ReducedMass=1.0770 AMU;FreqValue=1619.0406;Frequency=1619.0406 cm^-1;Mode=7;PATH=Calculation 2;FrequenciesFrequencies;IRIntensity=0.5552 KM/Mole;PATH=Calculation 2;FrequenciesFrequencies
C       0.00000     -0.00000      0.76151     -0.00000     -0.00000     -0.08000
H       0.88548     -0.00000      1.36914     -0.42000      0.00000      0.57000
Cl      0.00000      1.47291     -0.21492      0.00000      0.00000     -0.00000
H      -0.88548      0.00000      1.36914      0.42000     -0.00000      0.57000
Cl     -0.00000     -1.47291     -0.21492     -0.00000     -0.00000     -0.00000
5
Model[9]: FrequencyLabel=A1;ForceConstant=6.9271 mDyne/A;ReducedMass=1.0552 AMU;FreqValue=3338.0477;Frequency=3338.0477 cm^-1;Mode=8;PATH=Calculation 2;FrequenciesFrequencies;IRIntensity=12.3040 KM/Mole;PATH=Calculation 2;FrequenciesFrequencies
C       0.00000     -0.00000      0.76151     -0.00000     -0.00000     -0.07000
H       0.88548     -0.00000      1.36914      0.59000      0.00000      0.38000
Cl      0.00000      1.47291     -0.21492      0.00000      0.00000      0.00000
H      -0.88548      0.00000      1.36914     -0.59000     -0.00000      0.38000
Cl     -0.00000     -1.47291     -0.21492     -0.00000     -0.00000      0.00000
5
Model[10]: FrequencyLabel=B1;ForceConstant=7.6996 mDyne/A;ReducedMass=1.1171 AMU;FreqValue=3420.2274;Frequency=3420.2274 cm^-1;Mode=9;PATH=Calculation 2;FrequenciesFrequencies;IRIntensity=0.4589 KM/Mole;PATH=Calculation 2;FrequenciesFrequencies
C       0.00000     -0.00000      0.76151     -0.10000     -0.00000      0.00000
H       0.88548     -0.00000      1.36914      0.58000      0.00000      0.39000
Cl      0.00000      1.47291     -0.21492      0.00000      0.00000     -0.00000
H      -0.88548      0.00000      1.36914      0.58000      0.00000     -0.39000
Cl     -0.00000     -1.47291     -0.21492      0.00000      0.00000      0.00000
</ModelData>
</Models>
##$PEAKS=
<Peaks type="IR" xUnitsExpected="1/cm"  >
<PeakData id="1" title="1-(~3338 cm-1)" peakShape="broad" model="5.9" xMax="3370" xMin="3300"    />
<PeakData id="2" title="2-(~1450 cm-1)" peakShape="broad" model="5.7" xMax="1470" xMin="1430"    />
<PeakData id="3" title="3-(~844 cm-1)" peakShape="broad" model="5.4" xMax="870" xMin="820"    />
<PeakData id="4" title="3-(~775 cm-1)" peakShape="broad" model="5.3" xMax="795" xMin="755"    />
<PeakData id="5" title="3-(~300 cm-1)" peakShape="broad" model="5.3" xMax="315" xMin="285"    />
</Peaks>
##XUNITS= 1/CM
##YUNITS= TRANSMITTANCE
##XFACTOR= 1
##YFACTOR= 9.999000E-07
##FIRSTX= 3.618473E+03
##FIRSTY= 1
##LASTX= 1.118228E+02
##NPOINTS= 2000
##MINY= 1.000000E-04
##MAXY= 1
##XYDATA= (X++(Y..Y))
3618.473 1000100 1000100 1000100 1000100 1000100 1000100 1000100 1000100 1000100 1000100 1000100 1000100 1000100 1000100 1000100 1000100 1000100 1000100 1000100 1000100 1000100 1000100 1000100 1000100 1000100 1000100 1000100 1000100 1000100 1000100 1000100 1000100 1000100 1000100 1000100 1000100 1000100 1000100 1000100 1000100 1000100 1000100 1000100 1000100 1000100 999907 999901 999895 999888 999882 999875 999868 999860 999852 999843 999834 999825 999815 999805 999794 999782 999770 999757 999743 999728 999713 999696 999679 999660 999640 999618 999595 999571 999544
3488.6619 999516 999485 999452 999416 999377 999334 999288 999237 999182 999121 999054 998980 998898 998807 998705 998591 998463 998318 995100 992652 992276
3451.824 991860 991397 990878 990290 989621 988853 987961 985099 985099 985099 985099 985099 985099 985099 985099 985099 984098 983098 982098 981098 980098 979098 977798 977698 977598 977098 976099
3404.4602 976532 976670 976555 976213 975668 974930 974007 972899 971601 970104 968394 966451 964252 961764 958951
3378.1475 955766 952152 948043 943354 937985 931811 924680 916404 906751 895434 882103 866325 847582
3355.3428 825264 798694 767192 730230 687730 640562 591190 544200 506074 483671 481687
3336.0464 500564 536280 582179 631549 679402 722907 760950 793473 820951 844049 863454
3316.7505 879789 893592 905308 915306 923882 931278 937691 943280 948174 952481 956463 959837 962844
3293.9458 965533 967947 970122 972087 973868 975487 976963 978312 979547 980682 981726 982689 983579 984404
3269.387 985168 985879 986540 987157 987733 988271 988776 989249 989693 990111 990504 990874 991224 991554 991866 992162 992441
3239.5652I92707K52K39K28K16K06J97J87J79J71J63J56J50N049%Z42k34I99859
1734.46 999852 999844 999836 999828 999819 999809 999800 999789 999779 999767 999755 999743 999730 999716 999701 999685 999668 999650 999632 999612 999590 999568 999543 999517 999490 999460 999428 999393 999356 999316
1681.8337 999272 999225 999173 999117 999056 998989 998916 998835 998745 998646 998536 998413 998275 998120 997944 997745 997519 997258 996958 996358
1646.7498 995758 995158 994558 993958 993358 992758 992158 991557 990957 990357 989757 989157 988557 987957 987357 986757 986157 985557 984957 984357 983757 983157 982557 981956 981356 980756 980156 979556 978956 978356 977756 977156 976556 975956 975356 974756 974156 973556 972956 972356 971755 971155 968623 968725 968397 967578 966711 965795 964827
1560.794 963807 962731 961596 960400 959140 957811 956409 954930 953368 951719 949977 948134 946183
1537.9893 944117 941927 939604 937136 934512 931720 928745 925572 922183 918560 914680 910520 906054
1515.1846 901252 896080 890501 884474 877951 870879 863197 854837 845723 835766 825050 813088 799940
1492.38 785461 769484 751820 732256 710554 686449 659654 629862 596758 560041 519458
1473.0837 474857 426269 374026 318903 262280 206252 153588 107371 70256 43527 26550
1453.7875 17209 13133 12814 16116 24314 39687 64501 99730 144429 196128 251757 308450
1432.737 363977 416829 466132 511483 552805 590222 623975 654359 681687 706268 728396
1413.4408 748338 766338 782613 797357 810740 822913 834007 844138 853410 861912 869723 876912
1392.3904 883543 889668 895336 900591 905470 910008 914234 918176 921858 925302 928528 931554 934395
1369.5858 937065 939579 941947 944181 946291 948285 950171 951958 953651 955258 956783 958233 959612
1346.7811 960925 962176 963368 964505 965591 966628 967619 968568 969475 970345 971845 973345 974845 976345 977846 979346 980846
1316.9597I82346J500UJ501J500XJ501J252%S03l60j1Tj2j3Uj4j5j6j7I99588
1092.4219 999569 999550 999529 999508 999485 999461 999435 999408 999379 999348 999315 999280 999243 999203 999160 999114 999064 999011 998954 998892 998825 998752 998673 998587 998493
1048.5668 998390 998276 998152 998014 997861 997691 997502 997290 997051 996782 996475 996126 995726 995264 994729 994103 993368
1018.7454 992498 991461 990216 988709 986874 984630 981878 978512 976512 974512 972511 970511 968511 966511 964511 962510 960510
988.9239 958510 956510 954510 952509 950509 948509 946509 944509 942508 940508 938508 936508 934508 932507 930507 928507 926507 924507 922506 920506 918506 916506 914506 915091 912490
945.0689 909738 906828 903752 900502 897066 893433 889592 885528 881226 876670 871842 866721 861286
922.2642 855513 849375 842844 835888 828472 820558 812104 803064 793387 783016 771892 759945 747103
899.4596 733283 718398 702352 678886 660183 639997 618206 594681 569293 541920 512447
880.1634 480784 446880 410739 372456 332357 290579 247846 205006 163195 123811 88415
860.8671 58518 35236 18913 8886 3631 1322 466 187 105 100 162 385 1079 2998 7499 16336
832.7999 31067 52462 80286 113483 150553 189899 230065 269848 308325 344828 378898
813.5037 410236 438654 464035 486300 505381 521197 533640 542552 547714 548834 545533 537352
792.45325 523765 504235 478330 445940 407618 365040 321403 281431 250627 233899 234341
773.15704 252673 287118 333668 387091 442387 495822 545178 589485 628591 662795 692598
753.8608 718557 741211 761045 778481 793877 807536 819712 830616 840424 849285 857322 864641
732.8104 871331 877465 883109 888318 891318 894318 897319 900319 903319 906319 909320 912320 915320 918321 921321 924321 927322 930322
701.23474 933322 936322 939323 942323 945323 948324 951324 954324 957325 960325 963325 966325 969326 972326 975326 978327 981327
671.4133I84327L001L000P71L000K001L000J000%S29l64j1Tj2j3Tj4I99648
417.054 999633 999617 999600 999583 999564 999544 999524 999502 999479 999454 999428 999401 999371 999340 999307 999272 999234 999194 999150 999104 999054 999000 998942 998880 998812
373.19894 998739 998659 998572 998477 998372 998258 998132 997993 997839 997667 997476 997262 997021 996748 996439 996087 995682 995216
341.6233 994675 994043 993301 992422 991375 990117 988595 986742 984476 981696 978297 974186 969337 963893
317.06448 958303 953428 950401 950125 952692 957312 962846 968363 973340 977590 981115 984002 986356 988278
292.50565 989856 991159 992242 993149 993915 994565 995121 995601 996016 996377 996694 996973 997219 997438 997633 997808
264.4384 997965 998107 998236 998352 998458 998555 998643 998724 998799 998868 998931 998990 999044 999095 999142 999186 999227 999265 999301 999334 999366 999395
225.84595 999423 999450 999474 999498 999520 999541 999560 999579 999597 999614 999630 999645 999660 999674 999687 999700 999712 999723 999734 999745 1000100 1000100 1000100 1000100 1000100 1000100 1000100 1000100 1000100 1000100 1000100 1000100 1000100 1000100 1000100 1000100 1000100 1000100 1000100 1000100 1000100 1000100 1000100 1000100 1000100 1000100 1000100 1000100 1000100 1000100 1000100 1000100 1000100 1000100 1000100 1000100 1000100 1000100 1000100 1000100 1000100 1000100 1000100 1000100 1000100
111.8228A000100  $$checkpoint
##END=$$ End of the data block 5
##TITLE= dichloromethane CH2Cl2 $$ Beginning of data block 6
##JCAMP-DX= 5.01
##DATA TYPE= RAMAN SPECTRUM
##DATA CLASS= XYDATA
##BLOCK ID=6
##ORIGIN= Department of Chemistry, UWI, JAMAICA
##OWNER= public domain
##LONGDATE= Fri, 22 Feb 2019 15:02:58 -0500 $$ export date from JSpecView
##SPECTROMETER/DATA SYSTEM= computed by Gaussian at WebMO.net
##$MODELS=
<Models>
<ModelData id="R2" type="MOL">
CH2Cl2
RLDSViewer          3D                             0

  5  4  0  0  0  0  0  0  0  0999 V2000
    0.0000    0.0000    0.7615 C   0  0  0  0  0  0  0  0  0  1
    0.8900    0.0000    1.3691 H   0  0  0  0  0  0  0  0  0  2
    0.0000    1.4729   -0.2149 Cl  0  0  0  0  0  0  0  0  0  3
   -0.8900    0.0000    1.3691 H   0  0  0  0  0  0  0  0  0  4
    0.0000   -1.4729   -0.2149 Cl  0  0  0  0  0  0  0  0  0  5
  1  2  1  0  0  0
  1  4  1  0  0  0
  1  3  1  0  0  0
  1  5  1  0  0  0
M  END
</ModelData>
<ModelData id="6" type="XYZVIB" baseModel="R2" vibrationScale=".2">
5
Model[1]: PATH=Calculation 1;Input;Energy=NaN;NFock==Conv=0.50D-08;E(RHF)=-957.984015823 A.U.;PATH=Calculation 1;Input
C       0.00000     -0.00000      0.76151
H       0.88548     -0.00000      1.36914
Cl      0.00000      1.47291     -0.21492
H      -0.88548      0.00000      1.36914
Cl     -0.00000     -1.47291     -0.21492
5
Model[2]: FrequencyLabel=A1;ForceConstant=1.1009 mDyne/A;ReducedMass=19.2176 AMU;FreqValue=311.8229;Frequency=311.8229 cm^-1;Mode=1;PATH=Calculation 2;FrequenciesFrequencies;IRIntensity=0.8638 KM/Mole;PATH=Calculation 2;FrequenciesFrequencies
C       0.00000     -0.00000      0.76151     -0.00000     -0.00000     -0.42000
H       0.88548     -0.00000      1.36914     -0.01000      0.00000     -0.42000
Cl      0.00000      1.47291     -0.21492      0.00000      0.48000      0.08000
H      -0.88548      0.00000      1.36914      0.01000     -0.00000     -0.42000
Cl     -0.00000     -1.47291     -0.21492     -0.00000     -0.48000      0.08000
5
Model[3]: FrequencyLabel=A1;ForceConstant=2.5838 mDyne/A;ReducedMass=7.2901 AMU;FreqValue=775.5988;Frequency=775.5988 cm^-1;Mode=2;PATH=Calculation 2;FrequenciesFrequencies;IRIntensity=21.4163 KM/Mole;PATH=Calculation 2;FrequenciesFrequencies
C       0.00000     -0.00000      0.76151      0.00000      0.00000      0.62000
H       0.88548     -0.00000      1.36914      0.07000     -0.00000      0.52000
Cl      0.00000      1.47291     -0.21492     -0.00000      0.13000     -0.12000
H      -0.88548      0.00000      1.36914     -0.07000      0.00000      0.52000
Cl     -0.00000     -1.47291     -0.21492      0.00000     -0.13000     -0.12000
5
Model[4]: FrequencyLabel=B2;ForceConstant=3.2430 mDyne/A;ReducedMass=7.7090 AMU;FreqValue=844.9850;Frequency=844.9850 cm^-1;Mode=3;PATH=Calculation 2;FrequenciesFrequencies;IRIntensity=154.7649 KM/Mole;PATH=Calculation 2;FrequenciesFrequencies
C       0.00000     -0.00000      0.76151      0.00000      0.67000     -0.00000
H       0.88548     -0.00000      1.36914     -0.00000      0.50000      0.00000
Cl      0.00000      1.47291     -0.21492     -0.00000     -0.13000      0.09000
H      -0.88548      0.00000      1.36914     -0.00000      0.50000     -0.00000
Cl     -0.00000     -1.47291     -0.21492     -0.00000     -0.13000     -0.09000
5
Model[5]: FrequencyLabel=B1;ForceConstant=0.7902 mDyne/A;ReducedMass=1.3545 AMU;FreqValue=995.0310;Frequency=995.0310 cm^-1;Mode=4;PATH=Calculation 2;FrequenciesFrequencies;IRIntensity=0.8552 KM/Mole;PATH=Calculation 2;FrequenciesFrequencies
C       0.00000     -0.00000      0.76151      0.17000     -0.00000     -0.00000
H       0.88548     -0.00000      1.36914     -0.26000      0.00000      0.65000
Cl      0.00000      1.47291     -0.21492     -0.02000      0.00000     -0.00000
H      -0.88548      0.00000      1.36914     -0.26000      0.00000     -0.65000
Cl     -0.00000     -1.47291     -0.21492     -0.02000      0.00000      0.00000
5
Model[6]: FrequencyLabel=A2;ForceConstant=1.0386 mDyne/A;ReducedMass=1.0180 AMU;FreqValue=1315.8865;Frequency=1315.8865 cm^-1;Mode=5;PATH=Calculation 2;FrequenciesFrequencies;IRIntensity=0.0000 KM/Mole;PATH=Calculation 2;FrequenciesFrequencies
C       0.00000     -0.00000      0.76151      0.00000      0.00000      0.00000
H       0.88548     -0.00000      1.36914      0.00000      0.71000     -0.00000
Cl      0.00000      1.47291     -0.21492      0.01000     -0.00000     -0.00000
H      -0.88548      0.00000      1.36914     -0.00000     -0.71000     -0.00000
Cl     -0.00000     -1.47291     -0.21492     -0.01000      0.00000     -0.00000
5
Model[7]: FrequencyLabel=B2;ForceConstant=1.3952 mDyne/A;ReducedMass=1.1247 AMU;FreqValue=1451.0435;Frequency=1451.0435 cm^-1;Mode=6;PATH=Calculation 2;FrequenciesFrequencies;IRIntensity=73.4247 KM/Mole;PATH=Calculation 2;FrequenciesFrequencies
C       0.00000     -0.00000      0.76151     -0.00000     -0.10000      0.00000
H       0.88548     -0.00000      1.36914      0.00000      0.70000     -0.00000
Cl      0.00000      1.47291     -0.21492      0.00000     -0.00000      0.01000
H      -0.88548      0.00000      1.36914      0.00000      0.70000      0.00000
Cl     -0.00000     -1.47291     -0.21492      0.00000     -0.00000     -0.01000
5
Model[8]: FrequencyLabel=A1;ForceConstant=1.6633 mDyne/A;ReducedMass=1.0770 AMU;FreqValue=1619.0406;Frequency=1619.0406 cm^-1;Mode=7;PATH=Calculation 2;FrequenciesFrequencies;IRIntensity=0.5552 KM/Mole;PATH=Calculation 2;FrequenciesFrequencies
C       0.00000     -0.00000      0.76151     -0.00000     -0.00000     -0.08000
H       0.88548     -0.00000      1.36914     -0.42000      0.00000      0.57000
Cl      0.00000      1.47291     -0.21492      0.00000      0.00000     -0.00000
H      -0.88548      0.00000      1.36914      0.42000     -0.00000      0.57000
Cl     -0.00000     -1.47291     -0.21492     -0.00000     -0.00000     -0.00000
5
Model[9]: FrequencyLabel=A1;ForceConstant=6.9271 mDyne/A;ReducedMass=1.0552 AMU;FreqValue=3338.0477;Frequency=3338.0477 cm^-1;Mode=8;PATH=Calculation 2;FrequenciesFrequencies;IRIntensity=12.3040 KM/Mole;PATH=Calculation 2;FrequenciesFrequencies
C       0.00000     -0.00000      0.76151     -0.00000     -0.00000     -0.07000
H       0.88548     -0.00000      1.36914      0.59000      0.00000      0.38000
Cl      0.00000      1.47291     -0.21492      0.00000      0.00000      0.00000
H      -0.88548      0.00000      1.36914     -0.59000     -0.00000      0.38000
Cl     -0.00000     -1.47291     -0.21492     -0.00000     -0.00000      0.00000
5
Model[10]: FrequencyLabel=B1;ForceConstant=7.6996 mDyne/A;ReducedMass=1.1171 AMU;FreqValue=3420.2274;Frequency=3420.2274 cm^-1;Mode=9;PATH=Calculation 2;FrequenciesFrequencies;IRIntensity=0.4589 KM/Mole;PATH=Calculation 2;FrequenciesFrequencies
C       0.00000     -0.00000      0.76151     -0.10000     -0.00000      0.00000
H       0.88548     -0.00000      1.36914      0.58000      0.00000      0.39000
Cl      0.00000      1.47291     -0.21492      0.00000      0.00000     -0.00000
H      -0.88548      0.00000      1.36914      0.58000      0.00000     -0.39000
Cl     -0.00000     -1.47291     -0.21492      0.00000      0.00000      0.00000
</ModelData>
</Models>
##$PEAKS=
<Peaks type="Raman" xUnitsExpected="1/cm"  >
<PeakData id="1" title="1-CH2Cl2 (~3420 cm-1)" peakShape="broad" model="6.10" xMax="3450" xMin="3390"    />
<PeakData id="2" title="2-CH2Cl2 (~3340 cm-1)" peakShape="broad" model="6.9" xMax="3360" xMin="3320"    />
<PeakData id="3" title="3-CH2Cl2 (~1620 cm-1)" peakShape="broad" model="6.8" xMax="1640" xMin="1600"    />
<PeakData id="4" title="4-CH2Cl2 (~1450 cm-1)" peakShape="broad" model="6.7" xMax="1470" xMin="1430"    />
<PeakData id="5" title="5-CH2Cl2 (~1315 cm-1)" peakShape="broad" model="6.6" xMax="1330" xMin="1300"    />
<PeakData id="6" title="6-CH2Cl2 (~995 cm-1)" peakShape="broad" model="6.5" xMax="1010" xMin="980"    />
<PeakData id="7" title="7-CH2Cl2 (~845 cm-1)" peakShape="broad" model="6.4" xMax="860" xMin="830"    />
<PeakData id="8" title="8-CH2Cl2 (~775 cm-1)" peakShape="broad" model="6.3" xMax="790" xMin="760"    />
<PeakData id="9" title="9-CH2Cl2 (~310 cm-1)" peakShape="broad" model="6.2" xMax="325" xMin="295"    />
</Peaks>
##XUNITS= 1/CM
##YUNITS= ABSORBANCE
##XFACTOR= 1
##YFACTOR= 7.463537E-07
##FIRSTX= 3.618473E+03
##FIRSTY= 0
##LASTX= 1.118229E+02
##NPOINTS= 2000
##MINY= 0
##MAXY= 7.463537E-01
##XYDATA= (X++(Y..Y))
3618.4731 0 0 0 0 0 0 0 0 0 0 0 0 0 0 0 0 0 0 0 0 0 0 0 0 0 0 0 0 0 0 0 0 0 0 0 0 0 0 0 0 0 0 0 0 0 4841 4986 5138 5297 5464 5638 5821 6013 6215 6427 6650 6884 7132 7393 7668 7959
3511.4668 8267 8592 8938 9305 9694 10108 10550 11021 11523 12061 12637 13255 13920 14635 15406 16239 17142 18120
3479.891 19185 20344 21611 22999 24523 26202 28056 30112 32397 34949 37807 41023 44658 55813
3455.3323 60733 66354 72817 80291 88994 99197 111248 125590 142791 163576 188868 219819
3434.282 257805 304345 360790 427613 503012 580881 649263 692131 696587 661343 597674
3414.9858 521724 446500 379138 322081 275160 237122 206458 181763 161855 145781 132796
3395.6895 122322 113913 107225 101997 98032 95181 93338 92430 92415 93277 95027 97699 101359 106101
3371.1306 112054 119393 128345 139202 152345 168261 187581 211118 239915 275303 318944 372831
3350.0803 439159 519886 615691 723950 835788 933840 994822 1000000 947496 853675 741975
3330.784 631276 531930 447478 377663 320654 274250 236395 205357 179738 158435 140585
3311.4878 125517 112703 101730 92271 84067 76910 70631 60503 55727 51485 47703 44316 41273
3288.683 38529 36046 33794 31743 29872 28161 26591 25147 23817 22590 21454 20401 19423 18513
3264.1243 17666 16875 16136 15444 14795 14186 13614 13076 12568 12090 11639 11212 10808 10425 10062 9718 9392
3234.303I081k96k81k68k56k44k33k22k13k04o864%Z42R79L0L1L2L3A141
1727.4431 1178 1217 1257 1300 1345 1393 1443 1496 1551 1610 1673 1738 1808 1883 1961 2045 2135 2230 2332 2440 2557 2682 2816
1687.0966 2961 3117 3286 3468 3666 3882 4116 4373 4653 4962 5301 5677 6092 6555 7071 7649 8300 9035
1655.5209 9870 10823 11916 13176 14640 16349 18360 20742 23584 27002 31142 36190 42380 49989
1630.962 59324 70659 84089 99248 114902 128630 137188 137968 130708 117687 102173 86795
1609.9116 72997 61271 51583 43676 37246 32004 27711 24171 21232 18772 16698 14937 13432
1587.1069 12136 11014 10038 9182 8430 7764 7173 6646 6175 5751 5515 5173 4864 4583 4328 4094 3881
1557.2855 3686 3507 3342 3191 3051 2922 2803 2694 2592 2499 2412 2332 2258 2190 2128 2071 2018 1971 1927 1889 1854
1520.4473 1824 1797 1775 1757 1743 1734 1729 1728 1732 1742 1757 1778 1806 912 981 1058 1145 1242 1353 1477 1620 1784 1972 2191
1478.3464 2447 2748 3105 3530 4042 4662 5417 6344 7483 8880 10577 12587 14857 17200 19255 20536
1450.2792 20653 19566 17617 15294 12992 10927 9172 7721 6538 6507 5750 5137 4638 4230 3895
1423.9662 3620 3393 3207 3053 2928 2827 2747 2685 2638 2605 2586 2578 2581 2594 2617 2650 2692 2744 2805 2876 2956 3048 3150 3264
1381.8654 3390 3530 3685 3856 4044 4252 4481 4735 5015 5326 5672 6057 6487 6968 7510 8120 8812 9598
1350.2897 10497 11530 12722 14108 15728 17635 19895 22594 25840 29773 34570 40453 47547 56427
1325.7308 67208 79982 94401 109290 122347 130488 131229 124324 111939 97183 82556 69431
1304.6804 58278 49063 41543 35426 30441 26358 22991 20195 17855 15882 14208 12776 11543 10476
1280.1216 9547 8734 8018 7385 6823 6322 5873 5470 5106 4777 4478 4207 3959 3732 3524 3333 3156 2994
1248.5459 2843 2704 2574 2453 2341 2236 2138 2047 1961 1880 1804 1733 1666 1602 1542 1486 1432 1382 1334 1288 1245 1203 1164
1208.1993 1127 1091 1058 1025 994 965 937 910 0 0 0 0 0 0 0 0 0 0 0 0 0 0 0 0 0 0 0 0 0 0 0 0 0 0 0 0 0 0 0 0 0 0 0 0 0 0 0 0 0 0 0 0 0 0 247 254 262 270 279 288 297 307 317 328 339 351 364 377 391 406 422 438 456 475
1078.3883 494 516 538 562 588 615 645 676 710 746 786 828 874 924 979 1038 1102 1173 1251 1336 1431 1536 1652 1783 1928
1034.5333 2092 2278 2488 2728 3004 3322 3691 4122 4628 5229 5945 6807 7851 9123 10684 12602 14955
1004.71185 17813 21198 25020 28966 32427 34584 34781 32950 29668 25757 21880 18402 15446 13004
980.153 11010 9389 8068 6986 6093 5352 4732 4209 3766 4320 4022 3768 3553 3369 3213 3081
952.08575 2969 2875 2797 2733 2682 2643 2614 2595 2585 2585 2592 2608 2632 2664 2704 2753 2809 2874 2948 3032 3125 3229 3344 3472 3612
908.2307 3768 3939 4127 4335 4565 4818 5099 5410 7261 7691 8168 8700 9293 9959 10708 11556 12519
878.4093 13619 14884 16346 17812 19811 22169 24971 28326 32377 37300 43318 50697 59731 70681
853.85046 83638 98255 113354 126628 134984 135935 129231 117051 102510 88122 75263 64409
832.80005 55527 48379 42676 38150 34577 31776 29611 27974 26789 25998 25561 25455 25667 26198 27061
806.487 28280 29892 31954 34540 37748 41710 46595 52623 60078 69312 80751 94861 112063
783.6824 132498 155606 179485 200419 213425 214493 203221 183110 159175 135457 114172
764.3861 96075 81113 68894 58945 50827 44170 38673 34101 30269 27033 24280 21922 19889
741.5815 18125 16585 15234 14042 12986 12046 11206 10451 9772 9158 7714 7232 6793 6393 6026 5690
713.5143 5382 5097 4834 4591 4366 4157 3962 3781 3611 3453 3305 3166 3036 2913 2798 2690 2587 2491
681.93866B399q6q2p8p3p0o7o3o0n8n4n2n0m8m5m4j469%S26M68J4TJ6E28
422.3167 545 562 581 600 621 642 665 689 714 741 769 799 830 863 899 936 976 1019 1065 1113 1165 1221 1280 1345 1414 1488 1569
374.95325 1656 1750 1853 1965 2088 2222 2369 2531 2710 2909 3130 3376 3652 3963 4314 4712 5167 5689
343.3776 6291 6990 7806 8766 9903 11260 12892 14868 17278 20234 23866 28323 33735 40147 47384
317.06458 54858 61412 65498 65871 62404 56188 48781 41439 34851 29253 24627 20853 17782 15280
292.50574 13230 11540 10137 8962 7972 7131 6413 5794 5259 4792 4384 4025 3707 3425 3173 2948
264.4385 2745 2563 2398 2248 2112 1987 1873 1769 1673 1584 1503 1427 1357 1292 1232 1175 1123 1073 1027 984 944 906
225.84604 870 836 804 774 746 719 693 669 646 625 604 584 566 548 531 515 499 484 470 457 0 0 0 0 0 0 0 0 0 0 0 0 0 0 0 0 0 0 0 0 0 0 0 0 0 0 0 0 0 0 0 0 0 0 0 0 0 0 0 0 0 0 0 0 0
111.8229@  $$checkpoint
##END=$$ End of the data block 8
##TITLE= chloroform CHCl3  $$ Beginning of data block 9
##JCAMP-DX= 5.01
##DATA TYPE= IR SPECTRUM
##DATA CLASS= XYDATA
##BLOCK ID=7
##ORIGIN= Department of Chemistry, UWI, JAMAICA
##OWNER= public domain
##LONGDATE= Fri, 22 Feb 2019 15:00:32 -0500 $$ export date from JSpecView
##SPECTROMETER/DATA SYSTEM= computed by Gaussian at WebMo.net
##$MODELS=
<Models>
<ModelData id="I3" type="MOL">
CHCl3
RLDSViewer          3D                             0

  5  4  0  0  0  0  0  0  0  0999 V2000
    0.0000    0.0000    0.4496 C   0  0  0  0  0  0  0  0  0  1
   -0.0000    1.6804   -0.0827 Cl  0  0  0  0  0  0  0  0  0  2
    1.4552   -0.8402   -0.0827 Cl  0  0  0  0  0  0  0  0  0  3
   -1.4552   -0.8402   -0.0827 Cl  0  0  0  0  0  0  0  0  0  4
    0.0000    0.0000    1.5211 H   0  0  0  0  0  0  0  0  0  5
  1  2  1  0  0  0
  1  4  1  0  0  0
  1  3  1  0  0  0
  1  5  1  0  0  0
M  END
</ModelData>
<ModelData id="7" type="XYZVIB" baseModel="I3" vibrationScale=".2">
5
Model[1]: PATH=Calculation 1;Input;Energy=NaN;NFock==Conv=0.47D-08;E(RHF)=-1416.86840659 A.U.;PATH=Calculation 1;Input
C       0.00000      0.00000      0.44965
Cl     -0.00000      1.68037     -0.08273
Cl      1.45524     -0.84019     -0.08273
Cl     -1.45524     -0.84019     -0.08273
H       0.00000      0.00000      1.52111
5
Model[2]: FrequencyLabel=E;ForceConstant=1.2731 mDyne/A;ReducedMass=25.9308 AMU;FreqValue=288.6623;Frequency=288.6623 cm^-1;Mode=1;PATH=Calculation 2;FrequenciesFrequencies;IRIntensity=0.3085 KM/Mole;PATH=Calculation 2;FrequenciesFrequencies
C       0.00000      0.00000      0.44965     -0.31000     -0.00000      0.00000
Cl     -0.00000      1.68037     -0.08273      0.52000     -0.00000     -0.00000
Cl      1.45524     -0.84019     -0.08273     -0.20001      0.42000     -0.03000
Cl     -1.45524     -0.84019     -0.08273     -0.20001     -0.42000      0.03000
H       0.00000      0.00000      1.52111     -0.45000     -0.00000      0.00000
5
Model[3]: FrequencyLabel=E;ForceConstant=1.2731 mDyne/A;ReducedMass=25.9308 AMU;FreqValue=288.6623;Frequency=288.6623 cm^-1;Mode=2;PATH=Calculation 2;FrequenciesFrequencies;IRIntensity=0.3085 KM/Mole;PATH=Calculation 2;FrequenciesFrequencies
C       0.00000      0.00000      0.44965     -0.00000      0.31000     -0.00000
Cl     -0.00000      1.68037     -0.08273      0.00000      0.44000      0.03000
Cl      1.45524     -0.84019     -0.08273     -0.42000     -0.28000     -0.02000
Cl     -1.45524     -0.84019     -0.08273      0.42000     -0.28000     -0.02000
H       0.00000      0.00000      1.52111     -0.00000      0.45000     -0.00000
5
Model[4]: FrequencyLabel=A1;ForceConstant=1.9749 mDyne/A;ReducedMass=20.5881 AMU;FreqValue=403.4927;Frequency=403.4927 cm^-1;Mode=3;PATH=Calculation 2;FrequenciesFrequencies;IRIntensity=0.8375 KM/Mole;PATH=Calculation 2;FrequenciesFrequencies
C       0.00000      0.00000      0.44965     -0.00000     -0.00000     -0.49001
Cl     -0.00000      1.68037     -0.08273      0.00000      0.40000      0.06000
Cl      1.45524     -0.84019     -0.08273      0.35000     -0.20001      0.06000
Cl     -1.45524     -0.84019     -0.08273     -0.35000     -0.20001      0.06000
H       0.00000      0.00000      1.52111     -0.00000      0.00000     -0.51000
5
Model[5]: FrequencyLabel=A1;ForceConstant=2.5381 mDyne/A;ReducedMass=8.0679 AMU;FreqValue=730.7218;Frequency=730.7218 cm^-1;Mode=4;PATH=Calculation 2;FrequenciesFrequencies;IRIntensity=10.0967 KM/Mole;PATH=Calculation 2;FrequenciesFrequencies
C       0.00000      0.00000      0.44965     -0.00000      0.00000      0.67000
Cl     -0.00000      1.68037     -0.08273      0.00000      0.12000     -0.08000
Cl      1.45524     -0.84019     -0.08273      0.10000     -0.06000     -0.08000
Cl     -1.45524     -0.84019     -0.08273     -0.10000     -0.06000     -0.08000
H       0.00000      0.00000      1.52111     -0.00000      0.00000      0.70000
5
Model[6]: FrequencyLabel=E;ForceConstant=3.8091 mDyne/A;ReducedMass=8.4544 AMU;FreqValue=874.4630;Frequency=874.4630 cm^-1;Mode=5;PATH=Calculation 2;FrequenciesFrequencies;IRIntensity=159.9198 KM/Mole;PATH=Calculation 2;FrequenciesFrequencies
C       0.00000      0.00000      0.44965     -0.00000      0.73000     -0.00000
Cl     -0.00000      1.68037     -0.08273      0.00000     -0.16000      0.07000
Cl      1.45524     -0.84019     -0.08273      0.06000     -0.06000     -0.03000
Cl     -1.45524     -0.84019     -0.08273     -0.06000     -0.06000     -0.03000
H       0.00000      0.00000      1.52111     -0.00000      0.65000     -0.00000
5
Model[7]: FrequencyLabel=E;ForceConstant=3.8091 mDyne/A;ReducedMass=8.4544 AMU;FreqValue=874.4630;Frequency=874.4630 cm^-1;Mode=6;PATH=Calculation 2;FrequenciesFrequencies;IRIntensity=159.9198 KM/Mole;PATH=Calculation 2;FrequenciesFrequencies
C       0.00000      0.00000      0.44965      0.73000      0.00000      0.00000
Cl     -0.00000      1.68037     -0.08273     -0.02000     -0.00000      0.00000
Cl      1.45524     -0.84019     -0.08273     -0.12000      0.06000      0.06000
Cl     -1.45524     -0.84019     -0.08273     -0.12000     -0.06000     -0.06000
H       0.00000      0.00000      1.52111      0.65000      0.00000      0.00000
5
Model[8]: FrequencyLabel=E;ForceConstant=1.2564 mDyne/A;ReducedMass=1.0897 AMU;FreqValue=1398.8804;Frequency=1398.8804 cm^-1;Mode=7;PATH=Calculation 2;FrequenciesFrequencies;IRIntensity=39.7410 KM/Mole;PATH=Calculation 2;FrequenciesFrequencies
C       0.00000      0.00000      0.44965      0.00000     -0.08000     -0.00000
Cl     -0.00000      1.68037     -0.08273     -0.00000     -0.00000      0.01000
Cl      1.45524     -0.84019     -0.08273      0.00000      0.00000     -0.01000
Cl     -1.45524     -0.84019     -0.08273     -0.00000      0.00000     -0.01000
H       0.00000      0.00000      1.52111     -0.00000      1.00000      0.00000
5
Model[9]: FrequencyLabel=E;ForceConstant=1.2564 mDyne/A;ReducedMass=1.0897 AMU;FreqValue=1398.8804;Frequency=1398.8804 cm^-1;Mode=8;PATH=Calculation 2;FrequenciesFrequencies;IRIntensity=39.7410 KM/Mole;PATH=Calculation 2;FrequenciesFrequencies
C       0.00000      0.00000      0.44965     -0.08000     -0.00000      0.00000
Cl     -0.00000      1.68037     -0.08273      0.00000     -0.00000      0.00000
Cl      1.45524     -0.84019     -0.08273     -0.00000      0.00000      0.01000
Cl     -1.45524     -0.84019     -0.08273     -0.00000     -0.00000     -0.01000
H       0.00000      0.00000      1.52111      1.00000      0.00000     -0.00000
5
Model[10]: FrequencyLabel=A1;ForceConstant=7.4508 mDyne/A;ReducedMass=1.0895 AMU;FreqValue=3406.9064;Frequency=3406.9064 cm^-1;Mode=9;PATH=Calculation 2;FrequenciesFrequencies;IRIntensity=0.0325 KM/Mole;PATH=Calculation 2;FrequenciesFrequencies
C       0.00000      0.00000      0.44965     -0.00000     -0.00000     -0.09000
Cl     -0.00000      1.68037     -0.08273     -0.00000     -0.00000      0.00000
Cl      1.45524     -0.84019     -0.08273     -0.00000      0.00000      0.00000
Cl     -1.45524     -0.84019     -0.08273      0.00000      0.00000      0.00000
H       0.00000      0.00000      1.52111      0.00000     -0.00000      1.00000
</ModelData>
</Models>
##$PEAKS=
<Peaks type="IR" xUnitsExpected="1/cm"  >
<PeakData id="1" title="1-(~1400 cm-1)" peakShape="broad" model="7.9" xMax="1430" xMin="1370"    />
<PeakData id="2" title="2-(~875 cm-1)" peakShape="broad" model="7.7" xMax="890" xMin="860"    />
<PeakData id="3" title="3-(~730 cm-1)" peakShape="broad" model="7.6" xMax="750" xMin="710"    />
<PeakData id="4" title="4-(~400 cm-1)" peakShape="broad" model="7.5" xMax="420" xMin="380"    />
<PeakData id="5" title="5-(~290 cm-1)" peakShape="broad" model="7.4" xMax="310" xMin="270"    />
</Peaks>
##XUNITS= 1/CM
##YUNITS= TRANSMITTANCE
##XFACTOR= 1
##YFACTOR= 9.999000E-07
##FIRSTX= 3.555197E+03
##FIRSTY= 1
##LASTX= 1.386623E+02
##NPOINTS= 2000
##MINY= 1.000000E-04
##MAXY= 1
##XYDATA= (X++(Y..Y))
3555.1973 1000100 1000100 1000100 1000100 1000100 1000100 1000100 1000100 1000100 1000100 1000100 1000100 1000100 1000100 1000100 1000100 1000100 1000100 1000100 1000100 1000100 1000100 1000100 1000100 1000100 1000100 1000100 1000100 1000100 1000100 1000100 1000100 1000100 1000100 1000093 1000093 1000093 1000093 1000092 1000092 1000092 1000091 1000091 1000090 1000090 1000090 1000089 1000088 1000088 1000087 1000086 1000086 1000085 1000084 1000083 1000082 1000081 1000079 1000078 1000076 1000075 1000073 1000070 1000068 1000065 1000062 1000058 1000054 1000049 1000043 1000037 1000029 1000019 1000008 999994 999977
3425.304 999956 999930 999896 999852 999795 999721 999624 999504 999367 999239 999164 999180 999276 999411 999545 999657 999746 999815 999867 999908 999939
3389.4124I99964J9J6J3J1QTOTMULTKVJKJY%JT%J%J%TJ%TJ%TJO%S068j5945I83537
1485.4504 982883 982190 981455 980673 979842 978956 978012 977003 975924 974769 973529 972197 970763 969217 967547
1459.8136 965739 963778 961646 959324 956788 954012 950965 947611 943909 939809 935254 930176 924494
1437.5951 918112 910914 902760 893482 882874 870685 856605 840254 821164 798757 772325 741011
1417.0856 703804 659561 607112 545501 474490 395423 312363 232823 166577 121748 101396
1398.2853 105205 133356 185574 257093 338756 421198 497997 566074 624705 674430 716313
1379.4849 751532 781194 806264 827549 845713 861297 874740 886398 896559 905460 913294
1360.6846 920219 926367 931848 936752 941156 945124 948711 951963 954921 957617 960083 962342 964417
1338.466 966328 968091 969720 971229 972630 973932 975144 976274 977330 978318 979243 980111 980926 981693
1314.5383I82415O80O42O06J5757%T00o2635k364k499k644k799k968l148I17698
950.4953 914140 910352 906314 902003 897396 892465 887180 881507 875410 868846 861769 854125 845855
928.2767 836894 827166 816586 805058 792475 778714 763638 747090 728895 708857 686757
909.4763 662353 635384 605568 572619 536258 496242 452408 404743 353484 299251 243224
890.676 187302 134193 87241 49773 23902 9254 2836 737 209 100 116 301 1139
868.4574 4227 12827 30816 60464 101256 150541 204882 261092 316719 370106 420271 466731
847.94794 509344 548178 583428 615352 644234 670360 694005 715426 734857 752509 768572
829.1476 783215 796588 808824 820040 830340 838103 846752 854727 862091 868902 875209 881058
808.6381 886487 891533 896227 900598 904670 908467 912009 915313 918395 921271 923952 926449 928772
786.41956 930929 932927 994124 993720 993274 992780 992232 991619 990934 990163 989292 988303 987175 985881 984386
760.7827 982649 980616 978218 975366 971945 967799 962723 956444 948588 938656 925982 909722 888899
738.56415 862668 831056 796450 765355 747776 751287 774261 807452 841591 871603 896058
719.7638 915327 930347 942068 951278 958587 964449 969203 973100 976327 979023 981297 983229 984884
697.5452 986311 987550 988631 989580 990418 991160 991821 992412 992943 993421 993853 994244 994601 994925 995223 995495
670.1993 995745 995976 996189 996385 996568 996737 996895 997041 997178 997306 997426 997538 997644 997743 997836 997924 998006 998085
639.43506 1000100 1000100 1000100 1000100 1000100 1000100 1000100 1000100 1000100 1000100 1000100 1000100 1000100 1000100 1000100 1000100 1000100 1000100 1000100 1000100 1000100 1000100 1000100 1000100 1000100 1000100 1000100 1000100 1000100 1000100 1000100 1000100 1000100 1000100 1000100 1000100 1000100 1000100 1000100 1000100 1000100 1000100 1000100 1000100 1000100 1000100 1000100 1000100 1000100 1000100 1000100 1000100 1000100 1000100 1000100 1000100 1000100 1000100 1000100 1000100 1000100 1000100 1000100 1000100 1000100 1000100 1000100 1000100 1000100 1000100 1000100 1000100 1000100 1000100 1000100 1000100 1000100 1000100 1000100 1000100 1000100 1000100 1000100 1000100 1000100 1000100 999931 999924 999917 999910 999902 999893 999884 999875 999865 999854 999842 999830 999816 999802 999786 999770 999751 999732 999710 999687 999661 999634 999603 999569 999532 999491 999445
446.30426 999394 999336 999272 999199 999116 999022 998913 998787 998641 998469 998266 998025 997734 997380 996945 996404 995723 994854 993733
413.83096 992273 990369 987912 984857 981389 978152 976269 976648 979091 982506 985887 988757 991029 992779
389.90323 994120 995153 995957 996589 997093 997500 997832 997982 998205 998392 998550 998683 998797 998894 998978 999050 999112 999166
359.13904 999212 999251 999285 999313 999337 999356 999371 999383 999390 999394 999395 999391 999384 999373 999358 999338 999314 999284 999247 999204 999153 999093 999021 998937 998837 998718
314.70187 998575 998404 998356 998096 997775 997376 996873 996232 995405 994328 992922 991106 988848 986281 983884 982488
287.35593 982769 984579 987108 989609 991731 993409 994701 995691 996453 997046 997512 997884 998184 998429 998631
261.7191 998799 998941 999061 999163 999252 999329 999395 999454 999506 999551 999592 999629 999661 999691 999717 999741 999763 999783 999801 999818 999833 999847 999861
222.40929 999873 999884 999894 999904 999913 999921 999929 999936 999943 999950 999956 999962 999967 999972 999977 1000100 1000100 1000100 1000100 1000100 1000100 1000100 1000100 1000100 1000100 1000100 1000100 1000100 1000100 1000100 1000100 1000100 1000100 1000100 1000100 1000100 1000100 1000100 1000100 1000100 1000100 1000100 1000100 1000100 1000100 1000100 1000100 1000100 1000100
138.6623A000100  $$checkpoint
##END=$$ End of the data block 7
##TITLE= chloroform CHCl3   $$ Beginning of data block 8
##JCAMP-DX= 5.01
##DATA TYPE= RAMAN SPECTRUM
##DATA CLASS= XYDATA
##BLOCK ID=8
##ORIGIN= Department of Chemistry, UWI, JAMAICA
##OWNER= public domain
##LONGDATE= Fri, 22 Feb 2019 15:02:58 -0500 $$ export date from JSpecView
##SPECTROMETER/DATA SYSTEM= computed by Gaussian at WebMO.net
##$MODELS=
<Models>
<ModelData id="R3" type="MOL">
CH2Cl2
RLDSViewer          3D                             0

  5  4  0  0  0  0  0  0  0  0999 V2000
    0.0000    0.0000    0.4496 C   0  0  0  0  0  0  0  0  0  1
   -0.0000    1.6804   -0.0827 Cl  0  0  0  0  0  0  0  0  0  2
    1.4552   -0.8402   -0.0827 Cl  0  0  0  0  0  0  0  0  0  3
   -1.4552   -0.8402   -0.0827 Cl  0  0  0  0  0  0  0  0  0  4
    0.0000    0.0000    1.5211 H   0  0  0  0  0  0  0  0  0  5
  1  2  1  0  0  0
  1  4  1  0  0  0
  1  3  1  0  0  0
  1  5  1  0  0  0
M  END
</ModelData>
<ModelData id="8" type="XYZVIB" baseModel="R3" vibrationScale=".2">
5
Model[1]: PATH=Calculation 1;Input;Energy=NaN;NFock==Conv=0.47D-08;E(RHF)=-1416.86840659 A.U.;PATH=Calculation 1;Input
C       0.00000      0.00000      0.44965
Cl     -0.00000      1.68037     -0.08273
Cl      1.45524     -0.84019     -0.08273
Cl     -1.45524     -0.84019     -0.08273
H       0.00000      0.00000      1.52111
5
Model[2]: FrequencyLabel=E;ForceConstant=1.2731 mDyne/A;ReducedMass=25.9308 AMU;FreqValue=288.6623;Frequency=288.6623 cm^-1;Mode=1;PATH=Calculation 2;FrequenciesFrequencies;IRIntensity=0.3085 KM/Mole;PATH=Calculation 2;FrequenciesFrequencies
C       0.00000      0.00000      0.44965     -0.31000     -0.00000      0.00000
Cl     -0.00000      1.68037     -0.08273      0.52000     -0.00000     -0.00000
Cl      1.45524     -0.84019     -0.08273     -0.20001      0.42000     -0.03000
Cl     -1.45524     -0.84019     -0.08273     -0.20001     -0.42000      0.03000
H       0.00000      0.00000      1.52111     -0.45000     -0.00000      0.00000
5
Model[3]: FrequencyLabel=E;ForceConstant=1.2731 mDyne/A;ReducedMass=25.9308 AMU;FreqValue=288.6623;Frequency=288.6623 cm^-1;Mode=2;PATH=Calculation 2;FrequenciesFrequencies;IRIntensity=0.3085 KM/Mole;PATH=Calculation 2;FrequenciesFrequencies
C       0.00000      0.00000      0.44965     -0.00000      0.31000     -0.00000
Cl     -0.00000      1.68037     -0.08273      0.00000      0.44000      0.03000
Cl      1.45524     -0.84019     -0.08273     -0.42000     -0.28000     -0.02000
Cl     -1.45524     -0.84019     -0.08273      0.42000     -0.28000     -0.02000
H       0.00000      0.00000      1.52111     -0.00000      0.45000     -0.00000
5
Model[4]: FrequencyLabel=A1;ForceConstant=1.9749 mDyne/A;ReducedMass=20.5881 AMU;FreqValue=403.4927;Frequency=403.4927 cm^-1;Mode=3;PATH=Calculation 2;FrequenciesFrequencies;IRIntensity=0.8375 KM/Mole;PATH=Calculation 2;FrequenciesFrequencies
C       0.00000      0.00000      0.44965     -0.00000     -0.00000     -0.49001
Cl     -0.00000      1.68037     -0.08273      0.00000      0.40000      0.06000
Cl      1.45524     -0.84019     -0.08273      0.35000     -0.20001      0.06000
Cl     -1.45524     -0.84019     -0.08273     -0.35000     -0.20001      0.06000
H       0.00000      0.00000      1.52111     -0.00000      0.00000     -0.51000
5
Model[5]: FrequencyLabel=A1;ForceConstant=2.5381 mDyne/A;ReducedMass=8.0679 AMU;FreqValue=730.7218;Frequency=730.7218 cm^-1;Mode=4;PATH=Calculation 2;FrequenciesFrequencies;IRIntensity=10.0967 KM/Mole;PATH=Calculation 2;FrequenciesFrequencies
C       0.00000      0.00000      0.44965     -0.00000      0.00000      0.67000
Cl     -0.00000      1.68037     -0.08273      0.00000      0.12000     -0.08000
Cl      1.45524     -0.84019     -0.08273      0.10000     -0.06000     -0.08000
Cl     -1.45524     -0.84019     -0.08273     -0.10000     -0.06000     -0.08000
H       0.00000      0.00000      1.52111     -0.00000      0.00000      0.70000
5
Model[6]: FrequencyLabel=E;ForceConstant=3.8091 mDyne/A;ReducedMass=8.4544 AMU;FreqValue=874.4630;Frequency=874.4630 cm^-1;Mode=5;PATH=Calculation 2;FrequenciesFrequencies;IRIntensity=159.9198 KM/Mole;PATH=Calculation 2;FrequenciesFrequencies
C       0.00000      0.00000      0.44965     -0.00000      0.73000     -0.00000
Cl     -0.00000      1.68037     -0.08273      0.00000     -0.16000      0.07000
Cl      1.45524     -0.84019     -0.08273      0.06000     -0.06000     -0.03000
Cl     -1.45524     -0.84019     -0.08273     -0.06000     -0.06000     -0.03000
H       0.00000      0.00000      1.52111     -0.00000      0.65000     -0.00000
5
Model[7]: FrequencyLabel=E;ForceConstant=3.8091 mDyne/A;ReducedMass=8.4544 AMU;FreqValue=874.4630;Frequency=874.4630 cm^-1;Mode=6;PATH=Calculation 2;FrequenciesFrequencies;IRIntensity=159.9198 KM/Mole;PATH=Calculation 2;FrequenciesFrequencies
C       0.00000      0.00000      0.44965      0.73000      0.00000      0.00000
Cl     -0.00000      1.68037     -0.08273     -0.02000     -0.00000      0.00000
Cl      1.45524     -0.84019     -0.08273     -0.12000      0.06000      0.06000
Cl     -1.45524     -0.84019     -0.08273     -0.12000     -0.06000     -0.06000
H       0.00000      0.00000      1.52111      0.65000      0.00000      0.00000
5
Model[8]: FrequencyLabel=E;ForceConstant=1.2564 mDyne/A;ReducedMass=1.0897 AMU;FreqValue=1398.8804;Frequency=1398.8804 cm^-1;Mode=7;PATH=Calculation 2;FrequenciesFrequencies;IRIntensity=39.7410 KM/Mole;PATH=Calculation 2;FrequenciesFrequencies
C       0.00000      0.00000      0.44965      0.00000     -0.08000     -0.00000
Cl     -0.00000      1.68037     -0.08273     -0.00000     -0.00000      0.01000
Cl      1.45524     -0.84019     -0.08273      0.00000      0.00000     -0.01000
Cl     -1.45524     -0.84019     -0.08273     -0.00000      0.00000     -0.01000
H       0.00000      0.00000      1.52111     -0.00000      1.00000      0.00000
5
Model[9]: FrequencyLabel=E;ForceConstant=1.2564 mDyne/A;ReducedMass=1.0897 AMU;FreqValue=1398.8804;Frequency=1398.8804 cm^-1;Mode=8;PATH=Calculation 2;FrequenciesFrequencies;IRIntensity=39.7410 KM/Mole;PATH=Calculation 2;FrequenciesFrequencies
C       0.00000      0.00000      0.44965     -0.08000     -0.00000      0.00000
Cl     -0.00000      1.68037     -0.08273      0.00000     -0.00000      0.00000
Cl      1.45524     -0.84019     -0.08273     -0.00000      0.00000      0.01000
Cl     -1.45524     -0.84019     -0.08273     -0.00000     -0.00000     -0.01000
H       0.00000      0.00000      1.52111      1.00000      0.00000     -0.00000
5
Model[10]: FrequencyLabel=A1;ForceConstant=7.4508 mDyne/A;ReducedMass=1.0895 AMU;FreqValue=3406.9064;Frequency=3406.9064 cm^-1;Mode=9;PATH=Calculation 2;FrequenciesFrequencies;IRIntensity=0.0325 KM/Mole;PATH=Calculation 2;FrequenciesFrequencies
C       0.00000      0.00000      0.44965     -0.00000     -0.00000     -0.09000
Cl     -0.00000      1.68037     -0.08273     -0.00000     -0.00000      0.00000
Cl      1.45524     -0.84019     -0.08273     -0.00000      0.00000      0.00000
Cl     -1.45524     -0.84019     -0.08273      0.00000      0.00000      0.00000
H       0.00000      0.00000      1.52111      0.00000     -0.00000      1.00000
</ModelData>
</Models>
##$PEAKS=
<Peaks type="Raman" xUnitsExpected="1/cm"  >
<PeakData id="1" title="A1-CH group stretch (~3410 cm-1)" peakShape="broad" model="8.10" xMax="3440" xMin="3380"    />
<PeakData id="2" title="E-symm stretch of CH group (~1400 cm-1)" peakShape="broad" model="8.9" xMax="1420" xMin="1400"    />
<PeakData id="3" title="E- H-C-H scissors (~875 cm-1)" peakShape="broad" model="8.8" xMax="890" xMin="860"    />
<PeakData id="4" title="A1- H-C-H wagging (~730 cm-1)" peakShape="broad" model="8.7" xMax="745" xMin="715"    />
<PeakData id="5" title="A1-asymm stretch of CCl group (~405 cm-1)" peakShape="broad" model="8.4" xMax="420" xMin="390"    />
<PeakData id="6" title="E-symm stretch of CCl group (~290 cm-1)" peakShape="broad" model="8.3" xMax="305" xMin="275"    />
</Peaks>
##XUNITS= 1/CM
##YUNITS= ABSORBANCE
##XFACTOR= 1
##YFACTOR= 8.555580E-07
##FIRSTX= 3.555197E+03
##FIRSTY= 0
##LASTX= 1.386623E+02
##NPOINTS= 2000
##MINY= 0
##MAXY= 8.555580E-01
##XYDATA= (X++(Y..Y))
3555.1973 0 0 0 0 0 0 0 0 0 0 0 0 0 0 0 0 0 0 0 0 0 0 0 0 0 0 0 0 0 0 0 0 0 0 7022 7296 7587 7895 8222 8570 8941 9336 9758 10209 10691 11209 11765 12363 13008 13704
3469.7412 14458 15275 16163 17131 18187 19343 20613 22010 23554 25264 27166 29289 31668 34345
3445.8135 37371 40810 44738 49252 54470 60544 67667 76088 86128 98216 112918 131002 153509
3423.595 181875 218078 264831 325763 405404 508423 636823 783110 920080 1000000
3406.5037 983889 880292 735925 593501 472983 377815 304638 248656 205597 172135
3389.4124 145812 124842 107929 94129 82744 73258 65280 58514 52730 47750 43434 39670
3368.903 36370 33460 30883 28590 26541 24702 23047 21552 20197 18965 17841 16815 15873 15009
3344.9753 14212 13478 12798 12168 11584 11041 10534 10062 9621 9208 8821 8458 8116 7795 7493 7208 6938
3315.9202@%S068J351N2N6O0O2O7P2P6Q1Q7R2J00J07J15J24J34J45J57C109
1456.3954 3295 3498 3720 3965 4233 4530 4859 5225 5633 6091 6606 7188 7849 8605 9473 10477 11645
1427.3403 13015 14635 16566 18891 21719 25197 29526 34982 41945 50938 62657 77976 97790
1405.1217 122487 150624 176969 192341 189242 169316 141548 114154 90974 72669 58594
1386.3214 47827 39545 33109 28046 24012 20759 18105 15915 14090 12556 11255 10142 9184 8354
1362.3937 7630 6995 6436 5940 5499 5105 4751 4433 4145 3885 3648 3432 3234 3053 2887 2734 2592 2462
1331.6295B340j12j04r8r1q5p9p4p0o6o2n8n5n1j335%T00K106Q2Q7R3B466
955.6226 2570 2681 2800 2926 3061 3206 3361 3528 3708 3901 4110 4336 4581 4847 5137 5454 5801 6182
924.85846 6601 7064 7577 8147 8784 9497 10300 11208 12239 13417 14770 16335 18157 20293 22818 25830
897.5125 29455 33864 39287 46037 54544 65401 79422 97695 121580 152475 190981 234852
877.00305 275929 299897 295065 263997 220702 177989 141846 113306 91360 74571 61658
858.2027 51623 43729 37440 32368 28229 24815 21970 19577 17548 15814 14320 13026 11897 10907
834.27496 10035 9262 8574 7959 7408 6912 6463 6057 7042 6758 6506 6283 6087 5915 5766 5638 5531
805.2199 5443 5373 5321 5286 5269 5270 5288 5325 5380 5455 5551 5669 5811 3975 4245 4542 4872 5239 5648 6107 6623
769.3283 7207 7870 8627 9498 10504 11676 13049 14673 16609 18940 21775 25263 29603 35073 42055
743.6915 51071 62821 78179 98046 122807 151017 177431 192842 189736 169758 141918 114452
723.18207 91211 72859 58747 47951 39648 33195 28119 24075 20813 18152 15957 14127 12589
700.96344 11284 10169 9208 8376 7650 7014 6453 5956 5513 5118 4764 4445 4156 3895 3657 3441 3243
671.9084 3061 2894 2741 2599 2468 2347 2234 2129 2031 1940 1855 1776 1701 1631 1565 1503 1445 1390 1338 0 0
636.01685 0 0 0 0 0 0 0 0 0 0 0 0 0 0 0 0 0 0 0 0 0 0 0 0 0 0 0 0 0 0 0 0 0 0 0 0 0 0 0 0 0 0 0 0 0 0 0 0 0 0 0 0 0 0 0 0 0 0 0 0 0 0 0 0 0 0 0 0 0 0 0 0 0 0 0 0 0 0 0 0 0 0 0 0 860 894 929 967 1007 1050 1095 1144 1195 1250 1310 1373 1441 1514 1593 1679 1771 1871 1980 2098 2228 2369
454.84988 2525 2696 2885 3095 3328 3588 3879 4207 4578 4999 5480 6033 6672 7416 8289 9320 10550
425.7948 12031 13831 16046 18803 22278 26712 32439 39903 49658 62277 78005 95924 112701
403.57623 122491 120517 107827 90144 72698 57936 46279 37315 30458 25184 21085 17861
383.06674 15292 13220 11530 11010 9882 8941 8151 7483 6916 6434 6022 5670 5370 5115 4898 4716
355.7208 4566 4443 4347 4275 4226 4199 4193 4210 4248 4309 4393 4502 4638 4803 5001 5235 5511 5834 6211 6653 7171
319.82922 7779 8497 9347 10361 11578 12234 14066 16318 19122 22655 27165 32989 40579 50499 63332
294.1924 79326 97548 114610 124565 122558 109654 91671 73929 58917 47063 37947 30974
273.68295 25610 21442 18163 15551 13444 11725 10307 9125 8132 7289 6568 5948 5410 4942 4530
248.04611 4168 3847 3561 3306 3077 2871 2685 2516 2362 2222 2095 1977 1870 1770 1679 1594 1516 1443 1375
215.5728 1312 1253 1198 1147 1099 1054 1011 971 933 898 864 0 0 0 0 0 0 0 0 0 0 0 0 0 0 0 0 0 0 0 0 0 0 0 0 0 0 0 0 0 0 0 0 0 0
138.6623@  $$checkpoint
##END=$$ End of the data block 8
##TITLE= carbon tetrachloride CCl4     $$ Begin of the data block 9
##JCAMP-DX=5.01 $$
##DATA TYPE=INFRARED SPECTRUM
##DATA CLASS=XYDATA
##BLOCK ID=9
##ORIGIN= Department of Chemistry, UWI, Mona, Jamaica
##OWNER= public domain
##LONGDATE= 2007/10/17 19:21:58.0937 -0500 $$ export date from JSpecView
##SPECTROMETER/DATA SYSTEM= computed by Gaussian at WebMO.net
##$MODELS=
<Models>
<ModelData id="I4" type="MOL">
CCl4
RLDSViewer          3D                             0

  5  4  0  0  0  0  0  0  0  0999 V2000
    0.0000    0.0000    0.0000 C   0  0  0  0  0  0  0  0  0  1
    1.0198    1.0198    1.0198 Cl  0  0  0  0  0  0  0  0  0  2
   -1.0198   -1.0198    1.0198 Cl  0  0  0  0  0  0  0  0  0  3
    1.0198   -1.0198   -1.0198 Cl  0  0  0  0  0  0  0  0  0  4
   -1.0198    1.0198   -1.0198 Cl  0  0  0  0  0  0  0  0  0  5
  1  2  1  0  0  0
  1  3  1  0  0  0
  1  5  1  0  0  0
  1  4  1  0  0  0
M  END
</ModelData>
<ModelData id="9" type="XYZVIB" baseModel="I4" vibrationScale=".2">
5
Model[1]: PATH=Calculation 2;Standard;Energy=-1875.7449;Range=M.O.s;NFock==Conv=0.65D-09;E(RHF)=-1875.74483690 A.U.;PATH=Calculation 2;Standard
C       0.00000      0.00000      0.00000
Cl      1.01983      1.01983      1.01983
Cl     -1.01983     -1.01983      1.01983
Cl      1.01983     -1.01983     -1.01983
Cl     -1.01983      1.01983     -1.01983
5
Model[2]: FrequencyLabel=E;ForceConstant=1.2232 mDyne/A;ReducedMass=34.9689 AMU;FreqValue=243.6598;Frequency=243.6598 cm^-1;Mode=1;PATH=Calculation 2;FrequenciesFrequencies;IRIntensity=0.0000 KM/Mole;PATH=Calculation 2;FrequenciesFrequencies
C       0.00000      0.00000      0.00000     -0.00000      0.00000     -0.00000
Cl      1.01983      1.01983      1.01983     -0.31000      0.39000     -0.08000
Cl     -1.01983     -1.01983      1.01983      0.31000     -0.39000     -0.08000
Cl      1.01983     -1.01983     -1.01983     -0.31000     -0.39000      0.08000
Cl     -1.01983      1.01983     -1.01983      0.31000      0.39000      0.08000
5
Model[3]: FrequencyLabel=E;ForceConstant=1.2232 mDyne/A;ReducedMass=34.9689 AMU;FreqValue=243.6598;Frequency=243.6598 cm^-1;Mode=2;PATH=Calculation 2;FrequenciesFrequencies;IRIntensity=0.0000 KM/Mole;PATH=Calculation 2;FrequenciesFrequencies
C       0.00000      0.00000      0.00000     -0.00000     -0.00000      0.00000
Cl      1.01983      1.01983      1.01983     -0.27001     -0.13000      0.40000
Cl     -1.01983     -1.01983      1.01983      0.27001      0.13000      0.40000
Cl      1.01983     -1.01983     -1.01983     -0.27001      0.13000     -0.40000
Cl     -1.01983      1.01983     -1.01983      0.27001     -0.13000     -0.40000
5
Model[4]: FrequencyLabel=T2;ForceConstant=2.2796 mDyne/A;ReducedMass=31.9029 AMU;FreqValue=348.2508;Frequency=348.2508 cm^-1;Mode=3;PATH=Calculation 2;FrequenciesFrequencies;IRIntensity=0.1155 KM/Mole;PATH=Calculation 2;FrequenciesFrequencies
C       0.00000      0.00000      0.00000     -0.10000     -0.19000      0.29000
Cl      1.01983      1.01983      1.01983      0.10000      0.19000     -0.29000
Cl     -1.01983     -1.01983      1.01983     -0.43000     -0.34000      0.24000
Cl      1.01983     -1.01983     -1.01983     -0.08000      0.37000     -0.11000
Cl     -1.01983      1.01983     -1.01983      0.44000     -0.15001      0.05000
5
Model[5]: FrequencyLabel=T2;ForceConstant=2.2796 mDyne/A;ReducedMass=31.9029 AMU;FreqValue=348.2508;Frequency=348.2508 cm^-1;Mode=4;PATH=Calculation 2;FrequenciesFrequencies;IRIntensity=0.1155 KM/Mole;PATH=Calculation 2;FrequenciesFrequencies
C       0.00000      0.00000      0.00000      0.28000     -0.23001     -0.05000
Cl      1.01983      1.01983      1.01983     -0.28000      0.23001      0.05000
Cl     -1.01983     -1.01983      1.01983     -0.18001      0.32000     -0.04000
Cl      1.01983     -1.01983     -1.01983      0.23001     -0.28000     -0.45000
Cl     -1.01983      1.01983     -1.01983      0.14000     -0.19000      0.46001
5
Model[6]: FrequencyLabel=T2;ForceConstant=2.2796 mDyne/A;ReducedMass=31.9029 AMU;FreqValue=348.2508;Frequency=348.2508 cm^-1;Mode=5;PATH=Calculation 2;FrequenciesFrequencies;IRIntensity=0.1155 KM/Mole;PATH=Calculation 2;FrequenciesFrequencies
C       0.00000      0.00000      0.00000     -0.21000     -0.21000     -0.21000
Cl      1.01983      1.01983      1.01983     -0.36001     -0.36001     -0.36001
Cl     -1.01983     -1.01983      1.01983      0.02000      0.02000      0.40000
Cl      1.01983     -1.01983     -1.01983      0.40000      0.02000      0.02000
Cl     -1.01983      1.01983     -1.01983      0.02000      0.40000      0.02000
5
Model[7]: FrequencyLabel=A1;ForceConstant=5.2155 mDyne/A;ReducedMass=34.9689 AMU;FreqValue=503.1319;Frequency=503.1319 cm^-1;Mode=6;PATH=Calculation 2;FrequenciesFrequencies;IRIntensity=0.0000 KM/Mole;PATH=Calculation 2;FrequenciesFrequencies
C       0.00000      0.00000      0.00000      0.00000      0.00000      0.00000
Cl      1.01983      1.01983      1.01983      0.29000      0.29000      0.29000
Cl     -1.01983     -1.01983      1.01983     -0.29000     -0.29000      0.29000
Cl      1.01983     -1.01983     -1.01983      0.29000     -0.29000     -0.29000
Cl     -1.01983      1.01983     -1.01983     -0.29000      0.29000     -0.29000
5
Model[8]: FrequencyLabel=T2;ForceConstant=6.2901 mDyne/A;ReducedMass=13.1130 AMU;FreqValue=902.3061;Frequency=902.3061 cm^-1;Mode=7;PATH=Calculation 2;FrequenciesFrequencies;IRIntensity=164.0075 KM/Mole;PATH=Calculation 2;FrequenciesFrequencies
C       0.00000      0.00000      0.00000      0.56000      0.56000      0.56000
Cl      1.01983      1.01983      1.01983     -0.11000     -0.11000     -0.11000
Cl     -1.01983     -1.01983      1.01983     -0.05000     -0.05000      0.01000
Cl      1.01983     -1.01983     -1.01983      0.01000     -0.05000     -0.05000
Cl     -1.01983      1.01983     -1.01983     -0.05000      0.01000     -0.05000
5
Model[9]: FrequencyLabel=T2;ForceConstant=6.2901 mDyne/A;ReducedMass=13.1130 AMU;FreqValue=902.3061;Frequency=902.3061 cm^-1;Mode=8;PATH=Calculation 2;FrequenciesFrequencies;IRIntensity=164.0075 KM/Mole;PATH=Calculation 2;FrequenciesFrequencies
C       0.00000      0.00000      0.00000     -0.19000     -0.58000      0.76000
Cl      1.01983      1.01983      1.01983      0.01000      0.02000     -0.03000
Cl     -1.01983     -1.01983      1.01983      0.09000      0.10000     -0.11000
Cl      1.01983     -1.01983     -1.01983      0.03000      0.00000     -0.05000
Cl     -1.01983      1.01983     -1.01983     -0.05000      0.08000     -0.09000
5
Model[10]: FrequencyLabel=T2;ForceConstant=6.2901 mDyne/A;ReducedMass=13.1130 AMU;FreqValue=902.3061;Frequency=902.3061 cm^-1;Mode=9;PATH=Calculation 2;FrequenciesFrequencies;IRIntensity=164.0075 KM/Mole;PATH=Calculation 2;FrequenciesFrequencies
C       0.00000      0.00000      0.00000      0.77000     -0.55000     -0.23001
Cl      1.01983      1.01983      1.01983     -0.03000      0.02000      0.01000
Cl     -1.01983     -1.01983      1.01983     -0.05000     -0.00000      0.03000
Cl      1.01983     -1.01983     -1.01983     -0.11000      0.10000      0.09000
Cl     -1.01983      1.01983     -1.01983     -0.08000      0.08000     -0.05000
</ModelData>
</Models>
##$PEAKS=
<Peaks type="IR" xUnitsExpected="1/cm"  >
<PeakData id="1" title="1-CCl4 (~900 cm-1)" peakShape="broad" model="9.10" xMax="920" xMin="900" />
<PeakData id="2" title="2-CCl4 (~350 cm-1)" peakShape="broad" model="9.6" xMax="370" xMin="330" />
</Peaks>
##XUNITS=1/CM
##YUNITS= TRANSMITTANCE
##XFACTOR= 1
##YFACTOR= 9.999000E-07
##FIRSTX= 1.102306E+03
##FIRSTY= 1
##LASTX= 1.002974E+02
##NPOINTS= 1894
##MINY= 1.000000E-04
##MAXY= 1
##XYDATA= (X++(Y..Y))
1102.3062A000100%Y8k00o50q50Vq51q50S1q51q50S1q51q50S1q51q50I62696
1036.67 961846 960996 960146 959296 958446 957596 956746 955896 955046 954195 953345 952495 951645 950795 949945 949095 948245 947395 946545 945695 944844 943994 943144 942294 941444 940594 939744 938894 938044 937792 937257 936715 936166 935610 935047 934477 933899 933313 932720
1016.0264 932119 931510 930893 930268 929635 928992 928342 927682 927014 926336 925649 924952 924246 923530 922804 922068 921321
1007.02795 920564 919796 919017 918227 917426 916613 915788 914951 914102 913240 912366 911478 910578 909663 908735 907793 906837
998.0294 905866 904880 903879 902863 901830 900782 899717 898635 897536 896420 895285 894133 892962 891771
990.6189 890562 889332 888083 886812 885521 884207 882872 881514 880134 878729 877301 875848 874370
983.73773 872866 871336 869779 868195 866582 864941 863270 861570 859838 858075 856280 854452 852590
976.8565 850693 848761 846793 844788 842745 840662 838540 836378 834173 831925 829634 827298 824915
969.97534 822485 820007 817479 814901 812270 809585 806846 804050 801197 798284 795311 792275 789176
963.0941 786011 782778 779477 776104 772659 769139 765543 761868 758112 754273 750349 746338 742237
956.2129 738044 733756 729372 724887 720301 715609 710810 705900 700877 695737 690478 685096 679588
949.3317 673951 668181 662276 656232 650045 643712 637229 630593 623800 616846 609728 602442 594985
942.4505 587352 579541 571548 563369 555001 546441 537685 528731 519577 510220 500657 490887 480909
935.56934 470722 460326 449720 438905 427884 416659 405232 393609 381794 369795 357620
929.74677 345277 332779 320138 307368 294487 281512 268465 255369 242250 229135 216056
923.9242 203045 190137 177370 164785 152423 140326 128541 117110 106080 95495 85396
918.1016 75824 66814 58399 50602 43443 36934 31075 25862 21277 17297 13888 11011 8617 6658
910.6911 5080 3830 2856 2110 1547 1129 823 601 442 330 251 195 157 131 114 104 100 101 107 120 140 171
899.046 215 280 371 501 683 936 1285 1758 2391 3225 4306 5684 7411 9541 12127 15217 18855
890.04755 23079 27918 33394 39519 46295 53716 61769 70431 79675 89468 99770 110543 121742
883.1663 133323 145241 157452 169911 182575 195404 208359 221402 234500 247620 260733
877.34375 273812 286832 299770 312608 325327 337912 350348 362623 374727 386652 398389
871.5212 409932 421277 432419 443356 454085 464606 474916 485018 494910 504595 514074 523348
865.1693 532420 541292 549967 558448 566739 574841 582760 590497 598058 605444 612661 619711 626599
858.28815 633327 639900 646321 652594 658722 664709 670559 676274 681857 687313 692645 697855 702947
851.4069 707923 712787 717542 722190 726735 731178 735522 739771 743926 747990 751965 755854 759659
844.5257 763381 767024 770589 774078 777493 780836 784109 787314 790452 793525 796535 799483 802372
837.64453 805201 807974 810690 813353 815962 818520 821027 823485 825896 828259 830577 832850 835080
830.7633 837268 839414 841519 843585 845613 847603 849556 851474 853356 855204 857019 858801 860551
823.88214 862269 863958 865616 867246 868847 870420 871966 873485 874978 876446 877889 879307 880702
817.0009 882073 883421 884747 886052 887335 888596 889838 891059 892261 893443 894607 895752 896879
810.11975 897988 899080 900155 901213 902255 903281 904291 905286 906265 907230 908181 909117 910039 910948 911843
802.1799 912725 913594 914451 915295 916127 916947 917755 918552 919337 920112 920875 921628 922370 923102 923824 924536 925238
793.1814 925931 926614 927288 927953 928609 929256 929895 930525 931147 931760 932366 932964 933554 934136 934711 935278 935839
784.18286 936392 936938 937477 938009 938535 939135 939735 940335 940935 941535 942135 942735 943335 943936 944536 945136 945736 946336 946936 947536 948136 948736 949336 949936 950536 951136 951736 952336 952936 953537 954137 954737 955337 955937 956537 957137 957737 958337 958937 959537 960137 960737 961337 961937 962537 963137 963738 964338 964938 965538 966138 966738 967338 967938 968538 969138 969738 970338 970938 971538 972138 972738 973338 973939 974539 975139
749.24756I75739O00S2O01O00S6O01O00XJ759J000%V92m5%j%j%Tj%j%A000050
461.82507 1000050 1000050 1000049 1000049 1000048 1000048 1000047 1000047 1000046 1000046 1000045 1000044 1000044 1000043 1000043 1000042 1000042 1000041 1000040 1000040 1000039 1000039 1000038 1000037 1000037 1000036 1000035 1000035 1000034 1000033 1000033 1000032 1000031 1000030 1000030 1000029 1000028 1000027 1000026 1000026 1000025 1000024 1000023 1000022 1000021 1000020 1000019 1000018 1000017 1000016 1000015 1000014 1000013 1000012 1000011 1000010 1000009 1000008 1000007 1000005 1000004 1000003 1000002 1000000 999999
427.4191 999998 999996 999995 999994 999992 999991 999989 999988 999986 999984 999983 999981 999979 999978 999976 999974 999972 999970 999968 999966 999964 999962 999960 999958 999956 999953 999951 999949 999946 999944 999941 999939 999936 999933 999930 999927 999924 999921 999918 999915 999912 999908 999905 999901 999898 999894 999890 999886 999882 999878 999873 999869 999864 999860 999855 999850 999844 999839 999834 999828 999822 999816 999810 999803 999797 999790
392.48376 999783 999775 999768 999760 999752 999743 999734 999725 999716 999706 999696 999685 999674 999663 999651 999639 999626 999613 999599 999584 999569 999554 999537 999520 999502 999484 999464 999443 999422 999400 999376 999351 999325 999298 999269
373.95746 999239 999208 999174 999139 999102 999063 999021 998978 998931 998883 998831 998776 998718 998656 998591 998521 998447 998368 998285 998196 998101 998001 997893 997779
361.2537 997658 997529 997392 997247 997092 996929 996757 996576 996386 996188 995982 995770 995552 995332 995110 994890 994675
352.2552 994469 994277 994102 993949 993823 993726 993663 993634 993641 993685 993762 993871 994009 994171 994354 994552 994762 994979 995201
342.19806 995422 995642 995858 996068 996270 996465 996651 996829 996997 997157 997307 997449 997583 997709 997827 997938 998043
333.19955 998141 998233 998320 998401 998478 998550 998618 998682 998742 998799 998852 998903 998951 998996 999039 999079 999117 999154 999188 999221 999252 999281 999309 999336
320.49582 999361 999386 999409 999431 999452 999472 999491 999510 999527 999544 999560 999576 999590 999605 999618 999631 999644 999656 999668 999679 999690 999700 999710 999720 999729 999738 999747 999755 999763 999771 999778 999786 999793 999799 999806 999812
301.4402 999819 999824 999830 999836 999841 999847 999852 999857 999861 999866 999871 999875 999879 999884 999888 999892 999895 999899 999903 999906 999910 999913 999916 999920 999923 999926 999929 999932 999934 999937 999940 999942 999945 999947 999950 999952 999954 999957 999959 999961 999963 999965 999967 999969 999971 999973 999975 999977 999978 999980 999982 999983 999985 999987 999988 999990
271.79807 999991 999993 999994 999996 999997 999998 1000000 1000001 1000002 1000003 1000005 1000006 1000007 1000008 1000009 1000011 1000012 1000013 1000014 1000015 1000016 1000017 1000018 1000019 1000020 1000021 1000022 1000022 1000023 1000024 1000025 1000026 1000027 1000028 1000028 1000029 1000030 1000031 1000031 1000032 1000033 1000034 1000034 1000035 1000036 1000036 1000037 1000038 1000038 1000039 1000040 1000040 1000041 1000041 1000042 1000043 1000043 1000044 1000044 1000045 1000045 1000046 1000046
238.45071A000047%J%J%J%J%J%TJ%J%TJ%M5%T39A000100
100.29738A000100  $$checkpoint
##END=  $$ end of CCl4 block 9
##TITLE= carbon tetrachloride CCl4    $$ Beginning of data block 10
##JCAMP-DX= 5.01
##DATA TYPE= RAMAN SPECTRUM
##DATA CLASS= XYDATA
##BLOCK ID=10
##ORIGIN= Department of Chemistry, UWI, JAMAICA
##OWNER= public domain
##LONGDATE= 2012/02/20 19:49:53.0481 -0500 $$ export date from JSpecView
##SPECTROMETER/DATA SYSTEM= computed by Gaussian at WebMO.net
##$MODELS=
<Models>
<ModelData id="R4" type="MOL">
CCl4
RLDSViewer          3D                             0

  5  4  0  0  0  0  0  0  0  0999 V2000
    0.0000    0.0000    0.0000 C   0  0  0  0  0  0  0  0  0  1
    1.0198    1.0198    1.0198 Cl  0  0  0  0  0  0  0  0  0  2
   -1.0198   -1.0198    1.0198 Cl  0  0  0  0  0  0  0  0  0  3
    1.0198   -1.0198   -1.0198 Cl  0  0  0  0  0  0  0  0  0  4
   -1.0198    1.0198   -1.0198 Cl  0  0  0  0  0  0  0  0  0  5
  1  2  1  0  0  0
  1  3  1  0  0  0
  1  5  1  0  0  0
  1  4  1  0  0  0
M  END
</ModelData>
<ModelData id="10" type="XYZVIB" baseModel="R4" vibrationScale=".2">
5
Model[1]: PATH=Calculation 2;Standard;Energy=-1875.7449;Range=M.O.s;NFock==Conv=0.65D-09;E(RHF)=-1875.74483690 A.U.;PATH=Calculation 2;Standard
C       0.00000      0.00000      0.00000
Cl      1.01983      1.01983      1.01983
Cl     -1.01983     -1.01983      1.01983
Cl      1.01983     -1.01983     -1.01983
Cl     -1.01983      1.01983     -1.01983
5
Model[2]: FrequencyLabel=E;ForceConstant=1.2232 mDyne/A;ReducedMass=34.9689 AMU;FreqValue=243.6598;Frequency=243.6598 cm^-1;Mode=1;PATH=Calculation 2;FrequenciesFrequencies;IRIntensity=0.0000 KM/Mole;PATH=Calculation 2;FrequenciesFrequencies
C       0.00000      0.00000      0.00000     -0.00000      0.00000     -0.00000
Cl      1.01983      1.01983      1.01983     -0.31000      0.39000     -0.08000
Cl     -1.01983     -1.01983      1.01983      0.31000     -0.39000     -0.08000
Cl      1.01983     -1.01983     -1.01983     -0.31000     -0.39000      0.08000
Cl     -1.01983      1.01983     -1.01983      0.31000      0.39000      0.08000
5
Model[3]: FrequencyLabel=E;ForceConstant=1.2232 mDyne/A;ReducedMass=34.9689 AMU;FreqValue=243.6598;Frequency=243.6598 cm^-1;Mode=2;PATH=Calculation 2;FrequenciesFrequencies;IRIntensity=0.0000 KM/Mole;PATH=Calculation 2;FrequenciesFrequencies
C       0.00000      0.00000      0.00000     -0.00000     -0.00000      0.00000
Cl      1.01983      1.01983      1.01983     -0.27001     -0.13000      0.40000
Cl     -1.01983     -1.01983      1.01983      0.27001      0.13000      0.40000
Cl      1.01983     -1.01983     -1.01983     -0.27001      0.13000     -0.40000
Cl     -1.01983      1.01983     -1.01983      0.27001     -0.13000     -0.40000
5
Model[4]: FrequencyLabel=T2;ForceConstant=2.2796 mDyne/A;ReducedMass=31.9029 AMU;FreqValue=348.2508;Frequency=348.2508 cm^-1;Mode=3;PATH=Calculation 2;FrequenciesFrequencies;IRIntensity=0.1155 KM/Mole;PATH=Calculation 2;FrequenciesFrequencies
C       0.00000      0.00000      0.00000     -0.10000     -0.19000      0.29000
Cl      1.01983      1.01983      1.01983      0.10000      0.19000     -0.29000
Cl     -1.01983     -1.01983      1.01983     -0.43000     -0.34000      0.24000
Cl      1.01983     -1.01983     -1.01983     -0.08000      0.37000     -0.11000
Cl     -1.01983      1.01983     -1.01983      0.44000     -0.15001      0.05000
5
Model[5]: FrequencyLabel=T2;ForceConstant=2.2796 mDyne/A;ReducedMass=31.9029 AMU;FreqValue=348.2508;Frequency=348.2508 cm^-1;Mode=4;PATH=Calculation 2;FrequenciesFrequencies;IRIntensity=0.1155 KM/Mole;PATH=Calculation 2;FrequenciesFrequencies
C       0.00000      0.00000      0.00000      0.28000     -0.23001     -0.05000
Cl      1.01983      1.01983      1.01983     -0.28000      0.23001      0.05000
Cl     -1.01983     -1.01983      1.01983     -0.18001      0.32000     -0.04000
Cl      1.01983     -1.01983     -1.01983      0.23001     -0.28000     -0.45000
Cl     -1.01983      1.01983     -1.01983      0.14000     -0.19000      0.46001
5
Model[6]: FrequencyLabel=T2;ForceConstant=2.2796 mDyne/A;ReducedMass=31.9029 AMU;FreqValue=348.2508;Frequency=348.2508 cm^-1;Mode=5;PATH=Calculation 2;FrequenciesFrequencies;IRIntensity=0.1155 KM/Mole;PATH=Calculation 2;FrequenciesFrequencies
C       0.00000      0.00000      0.00000     -0.21000     -0.21000     -0.21000
Cl      1.01983      1.01983      1.01983     -0.36001     -0.36001     -0.36001
Cl     -1.01983     -1.01983      1.01983      0.02000      0.02000      0.40000
Cl      1.01983     -1.01983     -1.01983      0.40000      0.02000      0.02000
Cl     -1.01983      1.01983     -1.01983      0.02000      0.40000      0.02000
5
Model[7]: FrequencyLabel=A1;ForceConstant=5.2155 mDyne/A;ReducedMass=34.9689 AMU;FreqValue=503.1319;Frequency=503.1319 cm^-1;Mode=6;PATH=Calculation 2;FrequenciesFrequencies;IRIntensity=0.0000 KM/Mole;PATH=Calculation 2;FrequenciesFrequencies
C       0.00000      0.00000      0.00000      0.00000      0.00000      0.00000
Cl      1.01983      1.01983      1.01983      0.29000      0.29000      0.29000
Cl     -1.01983     -1.01983      1.01983     -0.29000     -0.29000      0.29000
Cl      1.01983     -1.01983     -1.01983      0.29000     -0.29000     -0.29000
Cl     -1.01983      1.01983     -1.01983     -0.29000      0.29000     -0.29000
5
Model[8]: FrequencyLabel=T2;ForceConstant=6.2901 mDyne/A;ReducedMass=13.1130 AMU;FreqValue=902.3061;Frequency=902.3061 cm^-1;Mode=7;PATH=Calculation 2;FrequenciesFrequencies;IRIntensity=164.0075 KM/Mole;PATH=Calculation 2;FrequenciesFrequencies
C       0.00000      0.00000      0.00000      0.56000      0.56000      0.56000
Cl      1.01983      1.01983      1.01983     -0.11000     -0.11000     -0.11000
Cl     -1.01983     -1.01983      1.01983     -0.05000     -0.05000      0.01000
Cl      1.01983     -1.01983     -1.01983      0.01000     -0.05000     -0.05000
Cl     -1.01983      1.01983     -1.01983     -0.05000      0.01000     -0.05000
5
Model[9]: FrequencyLabel=T2;ForceConstant=6.2901 mDyne/A;ReducedMass=13.1130 AMU;FreqValue=902.3061;Frequency=902.3061 cm^-1;Mode=8;PATH=Calculation 2;FrequenciesFrequencies;IRIntensity=164.0075 KM/Mole;PATH=Calculation 2;FrequenciesFrequencies
C       0.00000      0.00000      0.00000     -0.19000     -0.58000      0.76000
Cl      1.01983      1.01983      1.01983      0.01000      0.02000     -0.03000
Cl     -1.01983     -1.01983      1.01983      0.09000      0.10000     -0.11000
Cl      1.01983     -1.01983     -1.01983      0.03000      0.00000     -0.05000
Cl     -1.01983      1.01983     -1.01983     -0.05000      0.08000     -0.09000
5
Model[10]: FrequencyLabel=T2;ForceConstant=6.2901 mDyne/A;ReducedMass=13.1130 AMU;FreqValue=902.3061;Frequency=902.3061 cm^-1;Mode=9;PATH=Calculation 2;FrequenciesFrequencies;IRIntensity=164.0075 KM/Mole;PATH=Calculation 2;FrequenciesFrequencies
C       0.00000      0.00000      0.00000      0.77000     -0.55000     -0.23001
Cl      1.01983      1.01983      1.01983     -0.03000      0.02000      0.01000
Cl     -1.01983     -1.01983      1.01983     -0.05000     -0.00000      0.03000
Cl      1.01983     -1.01983     -1.01983     -0.11000      0.10000      0.09000
Cl     -1.01983      1.01983     -1.01983     -0.08000      0.08000     -0.05000
</ModelData>
</Models>
##$PEAKS=
<Peaks type="Raman" xUnitsExpected="1/cm"  >
<PeakData id="1" title="1-CCl4 (~900 cm-1)" peakShape="broad" model="10.9" xMax="920" xMin="880"    />
<PeakData id="2" title="2-CCl4 (~500 cm-1)" peakShape="broad" model="10.8" xMax="520" xMin="480"    />
<PeakData id="3" title="3-CCl4 (~350 cm-1)" peakShape="broad" model="10.5" xMax="370" xMin="330"    />
<PeakData id="4" title="4-CCl4 (~245 cm-1)" peakShape="broad" model="10.3" xMax="260" xMin="230"    />
</Peaks>
##XUNITS= 1/CM
##YUNITS= ABSORBANCE
##XFACTOR= 1
##YFACTOR= 7.547643E-07
##FIRSTX= 1.102306E+03
##FIRSTY= 0
##LASTX= 4.365980E+01
##NPOINTS= 2001
##MINY= 0
##MAXY= 7.547643E-01
##XYDATA= (X++(Y..Y))
1102.3062@%S51O923O1O2O3O4TO5O7TO8O9P0P1P2P3P4P5P6P7P8Q0TQ2H564
1009.1452 8648 8733 8820 8908 8997 9088 9180 9273 9368 9464 9562 9661 9762 9865 9969 10074 10182 10291 10401 10514 10629
998.0294 10745 10863 10983 11105 11230 11356 11484 11615 11748 11883 12020 12160 12303 12447 12595 12745 12898
989.03094 13053 13211 13372 13536 13703 13874 14047 14224 14404 14587 14774 14964 15159 15357 15558 15764 15974
980.0325 16188 16407 16630 16857 17089 17326 17568 17814 18067 18324 18587 18855 19130 19410 19697 19990 20289
971.03394 20595 20909 21229 21556 21892 22235 22586 22945 23313 23690 24076 24471 24877 25292 25717 26154 26601
962.03546 27060 27531 28014 28510 29018 29541 30078 30629 31195 31777 32375 32990 33623 34274 34943 35632 36342
953.037 37072 37825 38600 39400 40223 41073 41949 42854 43787 44751 45747 46775 47838 48937 50074 51250
944.5678 52467 53727 55032 56384 57786 59240 60748 62313 63937 65625 67379 69202 71098 73072
937.1573 75126 77265 79495 81820 84245 86775 89418 92179 95066 98085 101245 104554 108021 111655
929.74677 115469 119472 123677 128096 132744 137637 142789 148219 153945 159988 166369 173113 180244
922.86554 187791 195781 204248 213226 222751 232862 243602 255016 267151 280059 293793 308410
916.5137 323969 340530 358155 376907 396846 418032 440518 464349 489559 516167 544169
910.6911 573536 604200 636055 668938 702631 736843 771210 805292 838566 870443 900276
904.8686 927383 951079 970709 985693 995564 1000000 998855 992167 980156 963207 941837 916664
898.51666 888358 857608 825083 791411 757154 722801 688762 655370 622884 591500 561357
892.69415 532543 505109 479074 454431 431156 409208 388539 369093 350810 333628 317484
886.8716 302318 288069 274680 262095 250260 239128 228651 218784 209488 200724 192456 184650
880.5197 177277 170308 163715 157475 151565 145962 140648 135604 130814 126261 121931 117810 113886
873.6385 110147 106582 103181 99934 96833 93869 91035 88323 85727 83240 80857 78571 76379
866.7573 74275 72255 70313 68447 66653 64927 63265 61665 60124 58638 57206 55825 54492 53206
859.3468 51964 50763 49604 48483 47399 46350 45335 44353 43402 42480 41587 40722 39883 39070 38280
851.4069 37514 36771 36049 35348 34667 34005 33362 32737 32128 31537 30961 30401 29856 29325 28809 28305 27815
842.40845 27337 26871 26417 25974 25542 25121 24710 24308 23917 23535 23162 22797 22441 22093 21754 21421 21097
833.4099 20780 20469 20166 19869 19579 19295 19017 18745 18479 18218 17963 17713 17468 17228 16993 16763 16538
824.41144 16317 16100 15888 15680 15475 15275 15079 14886 14697 14512 14330 14151 13976 13804 13635 13469 13306
815.41296 13146 12989 12835 12683 12534 12388 12244 12103 11964 11827 11693 11561 11432 11304 11179 11055 10934
806.4144 10814 10697 10581 10468 10356 10246 10137 10031 9926 9823 9721 9621 9522 9425 9329 9235 9142 9051 8961
796.3573 8872 8785 8698 8614 8530 8447 8366 8286 8207 8129 8053 7977 7902 7829 7756 7685 7614 7545 7476 7408 7342 7276 7211 7146 7083 7021 6959 6898 0 0
780.4776@%T97M192L7L8UL9M0TM1TM2TM3M4TM5TM6M7TM8M9N0TN1N2TN3E448
607.389 5503 5559 5615 5673 5731 5790 5850 5911 5973 6036 6100 6165 6231 6299 6367 6436 6507 6578 6651 6725 6800 6877 6954 7033 7114 7196 7279 7364
592.56793 7450 7538 7627 7718 7810 7904 8000 8098 8197 8298 8401 8506 8613 8722 8833 8946 9062 9179 9299 9421
581.98145 9546 9673 9803 9935 10070 10208 10348 10492 10638 10787 10940 11096 11255 11418 11584 11754 11927 12105
572.4536 12286 12471 12661 12855 13053 13256 13464 13677 13894 14117 14345 14579 14819 15064 15315 15573 15837
563.45514 16108 16386 16671 16964 17264 17572 17888 18213 18547 18890 19242 19605 19977 20360 20754 21160 21577
554.45667 22007 22449 22905 23374 23858 24357 24872 25402 25950 26515 27099 27702 28324 28968 29634 30322 31034
545.4581 31771 32534 33324 34143 34992 35872 36786 37733 38717 39739 40801 41905 43053 44248 45492 46788
536.98895 48138 49546 51014 52547 54147 55819 57567 59395 61308 63312 65411 67613 69922 72346
529.5784 74892 77568 80383 83345 86465 89753 93221 96880 100744 104828 109146 113716 118555 123682
522.1679 129118 134886 141009 147512 154424 161772 169589 177906 186757 196178 206207 216880 228235
515.28674 240309 253138 266754 281185 296451 312563 329520 347303 365872 385161 405073
509.46417 425476 446193 467004 487642 507791 527094 545159 561574 575923 587810 596883
503.64163 602860 605547 604853 600803 593530 583267 570327 555083 537942 519321 499626 479236
497.28973 458492 437690 417078 396857 377185 358181 339928 322479 305867 290102 275179
491.4672 261085 247795 235279 223503 212432 202027 192252 183068 174440 166332 158710 151544
485.1153 144803 138459 132484 126855 121548 116541 111814 107350 103129 99137 95359 91779 88387
478.2341 85169 82115 79214 76457 73835 71339 68963 66699 64540 62481 60515 58637 56842 55126
470.82358 53484 51911 50406 48962 47579 49640 48396 47203 46058 44959 43904 42891 41917 40981
463.41306 40081 39215 38382 37581 36809 36065 35349 34659 33994 33353 32735 32139 31564 31009 30474 29957 29458
454.41455 28977 28512 28063 27629 27210 26806 26415 26038 25673 25321 24981 24652 24335 24028 23732 23447 23171
445.41608 22905 22648 22400 22161 21930 21708 21493 21287 21088 20897 20713 20537 20367 20204 20048 19898 19754
436.41757 19617 19486 19361 19242 19129 19021 18919 18823 18732 18646 18566 18491 18421 18357 18297 18243 18194 18149 18110 18075 18045 18021
424.77246 18001 17986 17976 17970 17970 17974 17984 17998 18017 18041 18070 18105 18144 18188 18237 18292 18352 18417 18488 18564 18646 18733 18826 18925 19030 19141
411.01007 19258 19381 19511 19647 19790 19940 20097 20261 20433 20612 20799 20994 21197 21409 21629 21858 22097
402.01157 22345 22603 22871 23149 23439 23739 24051 24376 24712 25062 25425 25802 26193 26599 27021 27459 27914
393.0131 28387 28877 29387 29917 30468 31040 31635 32254 32897 33566 34263 34988 35743 36529 37348 38202 39092
384.0146 40020 40988 41999 38913 40051 41238 42477 43770 45122 46535 48013 49559 51179 52876
376.60406 54655 56522 58481 60540 62703 64978 67373 69895 72553 75356 78314 81438 84739 88230
369.19354 91923 95835 99980 104374 109036 113986 119243 124830 130770 137089 143812 152468 160097 168217
361.78302 176858 186051 195825 206210 217231 228911 241266 254306 268028 282418 297444 313053
355.43112 329165 345674 362437 379277 395977 412282 427903 442524 455811 467428 477056
349.60858 484409 489260 491451 490910 487656 481797 473521 463081 450780 436946 421916 406017 389557
342.7274 372811 356019 339380 323059 307182 291844 277114 263035 249632 236915 224879
336.90482 213513 202798 192708 183218 174298 165917 158045 150652 143709 137187 131059 125299 119884
330.02362 114789 109995 105480 101226 97215 93432 89862 86489 83302 80288 77436 74735 72177
323.14243 69752 67452 65269 63195 61226 59353 57572 55878 54264 52727 51263 49867 48535 47264
315.7319 46052 44894 43788 42732 41722 40757 39835 38952 38108 37301 36529 35790 35083 34406 33759 33140
307.26273 32547 31981 31439 30921 30425 29952 29501 29070 28658 28266 27893 27538 27200 26879 26575 26287 26015
298.26422 25759 25517 25290 25078 24880 24696 24526 24370 24227 24097 23981 23878 23788 23711 23648 23597 23560 23535 23524
288.2071 23527 23543 23573 23616 23674 23746 23833 23934 24051 24184 24332 24497 24679 24879 25097 25333 25589 25865 26162
278.14996 26481 26822 27187 27577 27993 28435 28907 29408 29940 30505 31105 31742 32418 33134 33894 34700 35554
269.15146 36460 37421 38441 39522 40669 41887 43180 44553 46012 47563 49212 50965 52831 54816
261.74094 56931 59183 61582 64139 66866 69772 72872 76176 79699 83455 87455 91714 96245 101058
254.33041 106165 111571 117282 123295 129606 136199 143051 150127 157379 164745 172145 179484 186649
247.44922 193512 199932 205762 210853 215062 218266 220361 221278 220986 219492 216844 213127 208451 202952
240.03868 196773 190065 182973 175633 168166 160679 153261 145984 138903 132062 125491 119208 113225
233.15749 107545 102169 97089 92297 87783 83535 79539 75783 72252 68934 62467 59564 56835
226.27629 54268 51854 49582 47443 45427 43526 41734 40041 38442 36931 35501 34148 32866 31651
218.86577 30499 29405 28367 27379 26440 25547 24696 23885 23112 22375 21670 20998 20355 19741 19153 18590 18050
209.86726 17534 17038 16563 16106 15668 15247 14843 14454 14079 13719 13372 13038 12716 12405 12106 11817 11538
200.86877 11268 11008 10756 10513 10278 10051 9831 9618 9412 9212 9018 8831 8649 8472 8301 8135 7974
191.87029 7817 7665 7517 7374 7234 7099 6967 6839 6714 6592 6474 6359 6247 6138 6032 5928 5827 5728
182.34247 5632 5539 5447 5358 5271 5186 5103 5023 4943 4866 4791 4717 4645 4575 4506 4439 4373 4309 4246 4184 4124 4065 4007 3951 3895 3841 3788
168.05074 3736 3685 3635 3586 3538 3491 3445 3400 3356 3312 3270 3228 3187 3147 3107 3069 3031 2993 2957 2921 2885 2851 2817 2783 2750 2718 2686 2655 2624 2594 2565 2536
151.1124 2507 2479 2451 2424 2397 2371 2345 2320 2295 2270 2246 2222 2198 2175 2152 2130 2108 2086 2065 2044 2023 2003 1982 1963 1943 1924 1905 1886 1868 1850 1832 1814 1797 1780 1763 1746 1730 1714 1698 1682 1666 1651 1636
128.3515A621j5j4Xj3Tj496%S48@
43.6598@  $$checkpoint
##END= $$ End of the data block 10
##END= $$ end of file