##TITLE= Compound file, contains several data records
##JCAMP-DX= 5.0
##DATA TYPE= LINK
##BLOCKS=4
##ORIGIN= Department of Chemistry, UWI, JAMAICA
##OWNER= public domain
##TITLE= chloroform $$ Begin of the data block
##JCAMP-DX=5.01 $$
##DATA TYPE=INFRARED SPECTRUM
##DATA CLASS=XYDATA
##BLOCK ID=1
##ORIGIN= Department of Chemistry, UWI, Mona, Jamaica
##OWNER= public domain
##LONGDATE= 2007/10/17 19:21:58.0937 -0500 $$ export date from JSpecView
##SPECTROMETER/DATA SYSTEM= PERKIN-ELMER 1000 FT-IR
##$MODELS=
<Models>
<ModelData id="chcl3" type="MOL">
CHCl3
RLDSViewer          3D                             0

  5  4  0  0  0  0  0  0  0  0999 V2000
    0.0000    0.0000    0.4971 C   0  0  0  0  0  0  0  0  0  1
    0.0000    0.0000    1.5871 H   0  0  0  0  0  0  0  0  0  2
    0.0000    1.6593   -0.0896 Cl  0  0  0  0  0  0  0  0  0  3
   -1.4370   -0.8297   -0.0896 Cl  0  0  0  0  0  0  0  0  0  4
    1.4370   -0.8297   -0.0896 Cl  0  0  0  0  0  0  0  0  0  5
  1  2  1  0  0  0
  1  3  1  0  0  0
  1  5  1  0  0  0
  1  4  1  0  0  0
M  END
</ModelData>
<ModelData id="2" type="XYZVIB" baseModel="chcl3" vibrationScale=".2">
5
Model[1]: Convg=0.7033D-08;-V/T=2.0004;Energy=NaN;Range=M.O.s;E(RHF)=-1416.86840659 A.U.;PATH=Calculation 1;Input
C     0.00000    0.00000    0.00000
H     0.00000    0.00000    1.09000
Cl    1.65934    0.00000   -0.58667
Cl   -0.82967    1.43703   -0.58667
Cl   -0.82967   -1.43703   -0.58667
5
Model[2]: Convg=0.7033D-08;-V/T=2.0004;Energy=-1416.8685;Range=M.O.s;E(RHF)=-1416.86840659 A.U.;PATH=Calculation 1;Standard
C     0.00000    0.00000    0.49707
H     0.00000    0.00000    1.58707
Cl    0.00000    1.65934   -0.08960
Cl   -1.43703   -0.82967   -0.08960
Cl    1.43703   -0.82967   -0.08960
5
Model[3]: IRIntensity=0.3557 KM/Mole;ReducedMass=26.2449 AMU;ForceConstant=1.3644 mDyne/A;Frequency=297.0416 cm^-1;FrequencyLabel=E;PATH=Calculation 1;FrequenciesFrequencies
C     0.00000    0.00000    0.49707   -0.31000    0.00000    0.00000
H     0.00000    0.00000    1.58707   -0.44000    0.00000    0.00000
Cl    0.00000    1.65934   -0.08960    0.52000    0.00000    0.00000
Cl   -1.43703   -0.82967   -0.08960   -0.20000   -0.42000    0.03000
Cl    1.43703   -0.82967   -0.08960   -0.20000    0.42000   -0.03000
5
Model[4]: IRIntensity=0.3557 KM/Mole;ReducedMass=26.2449 AMU;ForceConstant=1.3644 mDyne/A;Frequency=297.0416 cm^-1;FrequencyLabel=E;PATH=Calculation 1;FrequenciesFrequencies
C     0.00000    0.00000    0.49707    0.00000    0.31000    0.00000
H     0.00000    0.00000    1.58707    0.00000    0.44000    0.00000
Cl    0.00000    1.65934   -0.08960    0.00000    0.44000    0.03000
Cl   -1.43703   -0.82967   -0.08960    0.42000   -0.28000   -0.02000
Cl    1.43703   -0.82967   -0.08960   -0.42000   -0.28000   -0.02000
5
Model[5]: IRIntensity=0.8827 KM/Mole;ReducedMass=20.8013 AMU;ForceConstant=2.0780 mDyne/A;Frequency=411.7711 cm^-1;FrequencyLabel=A1;PATH=Calculation 1;FrequenciesFrequencies
$$ [...]
Cl   -1.43703   -0.82967   -0.08960   -0.06000   -0.05000   -0.03000
Cl    1.43703   -0.82967   -0.08960    0.06000   -0.05000   -0.03000
5
Model[8]: IRIntensity=150.8250 KM/Mole;ReducedMass=7.7939 AMU;ForceConstant=3.4807 mDyne/A;Frequency=870.6255 cm^-1;FrequencyLabel=E;PATH=Calculation 1;FrequenciesFrequencies
C     0.00000    0.00000    0.49707    0.70000    0.00000    0.00000
H     0.00000    0.00000    1.58707    0.69000    0.00000    0.00000
Cl    0.00000    1.65934   -0.08960   -0.02000    0.00000    0.00000
Cl   -1.43703   -0.82967   -0.08960   -0.12000   -0.06000   -0.06000
Cl    1.43703   -0.82967   -0.08960   -0.12000    0.06000    0.06000
5
Model[9]: IRIntensity=40.5189 KM/Mole;ReducedMass=1.1034 AMU;ForceConstant=1.3066 mDyne/A;Frequency=1417.6560 cm^-1;FrequencyLabel=E;PATH=Calculation 1;FrequenciesFrequencies
C     0.00000    0.00000    0.49707    0.00000   -0.09000    0.00000
H     0.00000    0.00000    1.58707    0.00000    1.00000    0.00000
Cl    0.00000    1.65934   -0.08960    0.00000    0.00000    0.01000
Cl   -1.43703   -0.82967   -0.08960    0.00000    0.00000   -0.01000
Cl    1.43703   -0.82967   -0.08960    0.00000    0.00000   -0.01000
5
Model[10]: IRIntensity=40.5189 KM/Mole;ReducedMass=1.1034 AMU;ForceConstant=1.3066 mDyne/A;Frequency=1417.6560 cm^-1;FrequencyLabel=E;PATH=Calculation 1;FrequenciesFrequencies
C     0.00000    0.00000    0.49707   -0.09000    0.00000    0.00000
H     0.00000    0.00000    1.58707    1.00000    0.00000    0.00000
Cl    0.00000    1.65934   -0.08960    0.00000    0.00000    0.00000
Cl   -1.43703   -0.82967   -0.08960    0.00000    0.00000   -0.01000
Cl    1.43703   -0.82967   -0.08960    0.00000    0.00000    0.01000
5
Model[11]: IRIntensity=0.0972 KM/Mole;ReducedMass=1.0897 AMU;ForceConstant=6.7234 mDyne/A;Frequency=3236.0024 cm^-1;FrequencyLabel=A1;PATH=Calculation 1;FrequenciesFrequencies
C     0.00000    0.00000    0.49707    0.00000    0.00000   -0.09000
H     0.00000    0.00000    1.58707    0.00000    0.00000    1.00000
Cl    0.00000    1.65934   -0.08960    0.00000    0.00000    0.00000
Cl   -1.43703   -0.82967   -0.08960    0.00000    0.00000    0.00000
Cl    1.43703   -0.82967   -0.08960    0.00000    0.00000    0.00000
</ModelData>
</Models>
##$PEAKS=
<Peaks type="IR" xUnitsExpected="1/cm"  >
<PeakData id="1" title="A1- C-H stretch (~3020 cm-1)" peakShape="broad" model="2.11" xMax="3050" xMin="3000"    />
<PeakData id="2" title="E- C-H bend (~1220 cm-1)" peakShape="broad" model="2.10" xMax="1240" xMin="1200"    />
<PeakData id="3" title="E-asymm bend of CCl group (~773 cm-1)" peakShape="broad" model="2.8" xMax="780" xMin="730"    />
<PeakData id="4" title="A1-symm bend of CCl group (~671 cm-1)" peakShape="broad" model="2.6" xMax="680" xMin="660"    />
</Peaks>
##XUNITS=1/CM
##YUNITS=TRANSMITTANCE
##XFACTOR=1.0000000000
##YFACTOR=0.0000302396
##FIRSTX=550.00000000
##LASTX=4400.00000000
##FIRSTY=0.12107075
##NPOINTS=7701
##DELTAX=0.50000000
##XYDATA=(X++(Y..Y))
550D004J41J21R8P0M3Tm2K8J18J42J21J13J15Q8L0j3MP2J46J83J54P0j7m1J8J14J74
563.5F097J53Q4N0Q3J38J44Q3Pj3M2J30J88J75J06L3RL9P8Q1N2L8Q5J72K28J96Q8j3
577H553m0J0Q6J37J38J04O8N9R1J51K02K10J65Q9K2j5l0k6oM4J24K02K41K18J56J03
590A1056R3J16J34J22R3Q1R6J21J16P8L1J5L7P9J13J33J50J70J77J51Q9K6QN2J29J84
603A3650J82J28P6P0J14J63J72J29P1M7P5J25J47J19O6K8L7Q8J46J78J61R9K7k0j2
615.5A6066M3J16J73J92J68J07L0l2n2k0M0Q5R1O8N5P5J19J54J52J16P8O8Q8J18J30
628A8228J17Q8O7O6R1J31J73J93J78J34Q2N1M9O4Q4J04J31J60J73J52J07O6O1R1J29
640.5B0970J42J17O8L2L0O1R5J02P9M9M3P1J08J27J13P8M2J8KokJ6M3O4P3UP9Q2P0
$$ plain form
550 4004 4145 4266 4364 4434 4477 4520 4478 4506 4624 4766 4887 5000 5115 5203 5233 5220 5224 5296 5442 5625 5779 5849 5832 5791 5809 5923 6097
563.5 6097 6250 6334 6384 6467 6605 6749 6832 6839 6826 6868 6998 7186 7361 7467 7500 7509 7548 7626 7707 7759 7797 7882 8054 8282 8478 8566 8553
577 8553 8513 8523 8609 8746 8884 8988 9056 9115 9206 9357 9559 9769 9934 10023 10045 10030 10000 9974 9968 10012 10136 10338 10579 10797 10953 11056
590 11056 11149 11265 11399 11521 11614 11695 11791 11912 12028 12106 12137 12152 12189 12268 12381 12514 12664 12834 13011 13162 13251 13277 13285 13337 13466 13650
603 13650 13832 13960 14036 14106 14220 14383 14555 14684 14755 14802 14877 15002 15149 15268 15334 15362 15399 15487 15633 15811 15972 16071 16098 16078 16066
615.5 16066 16109 16225 16398 16590 16758 16865 16895 16863 16811 16791 16831 16916 17007 17075 17130 17205 17324 17478 17630 17746 17824 17892 17980 18098 18228
628 18228 18345 18433 18500 18566 18657 18788 18961 19154 19332 19466 19548 19599 19648 19712 19796 19900 20031 20191 20364 20516 20623 20689 20750 20841 20970
640.5 20970 21112 21229 21297 21329 21359 21420 21515 21617 21696 21745 21788 21859 21967 22094 22207 22285 22327 22345 22347 22341 22339 22355 22398 22462 22535 22608 22681 22760 22842 22912
655.5B2912M0Nj8j9j5k1m9q4j13j42j90k70l69m59n28n96o99q42r87j074j083j038
666.5A4361r72q91p61n46k53P3L73O11P83R27J059J155J160J045Q58O86N87N50N25
676B1330M76L95L01K20J74J72K04K34K23J61P4R%M3J07J55J57J11L7k3l4J3Q6J39J44
688.5B4908J06N3J2j1k1k6k5j3J2M4P3Q8Q1N3K3lk1m0n8o3m4pK0J8j0l6l9j9Jjk5m9
704.5B4981m9k0J5K2j6q1j32j39j03o1m3n7q5j03r6p2n0m9p4j12j39j38j19j13j31
717B3036j64j83j79j69j77k05k32k38k26k12k07k13k27k55k95l35l55l46l27l18l29
727.5A7844l57l89m23m57m75m60m13l59l28l33l72m29m87n28n25m67l76l02k87l28
737.5I749l77l89l60l15k80k63k57k62k76k88k73k14j27m4jom1p6r3r1p4m4pK4L8L1
$$ plain form
655.5 22912 22952 22957 22939 22920 22905 22884 22835 22751 22638 22496 22306 22036 21667 21208 20680 20084 19385 18543 17556 16482 15399 14361
666.5 14361 13389 12498 11737 11191 10938 11011 11384 11995 12778 13705 14764 15919 17079 18124 18982 19668 20255 20805 21330
676 21330 21806 22201 22502 22722 22896 23068 23272 23506 23729 23890 23964 23973 23973 24016 24123 24278 24435 24546 24583 24560 24526 24539 24625 24764 24908
688.5 24908 25014 25067 25079 25068 25047 25021 24996 24983 24995 25039 25112 25200 25281 25334 25357 25354 25333 25293 25235 25172 25128 25121 25141 25159 25149 25113 25074 25055 25056 25055 25030 24981
704.5 24981 24932 24912 24927 24949 24933 24852 24720 24581 24478 24417 24374 24317 24232 24129 24033 23961 23911 23862 23788 23676 23537 23399 23280 23167 23036
717 23036 22872 22689 22510 22341 22164 21959 21727 21489 21263 21051 20844 20631 20404 20149 19854 19519 19164 18818 18491 18173 17844
727.5 17844 17487 17098 16675 16218 15743 15283 14870 14511 14183 13850 13478 13049 12562 12034 11509 11042 10666 10364 10077 9749
737.5 9749 9372 8983 8623 8308 8028 7765 7508 7246 6970 6682 6409 6195 6068 6024 6023 6017 5976 5900 5807 5716 5642 5598 5591 5615 5653 5684
750.5E684J4lk0l4m8n0l6j3Jlj8k6j7LJ9K7L2L0J6j9o0q2o8l0NJ6RNJ8L8L7Om7r2j06
768E188q5m4rOKqj1%J7L3L7K3kk2j1M0J15J75J87J59J38J72K61L65M42M84N13N54N92
782.5I311O06N93N91O25O85P24P14O64O14N89N87N91N90N83N66N40N07M80M68M61M48
793B1537M21L86L61L51L48L35L05K70K48K43K46K44K31K21K22K31K28K04J64J27J08
803.5B7031J11J28J50J68J78J76J68J58J45J29J04P3M5L7O1J11J50J42Q2Nk9JO5J12
815.5B9501J14R4Q4R2R5P3L9J5J7K7TK0K6N3R0J02P8L3KJ0N0Q8R0N1kk7j2K6N3TL8
831C1000K1Mj4k9k6NM7O7N2K1NJ4L5M0K8J5RMj3l8n3m6j5J3K3Ml1o5p9o8l9j3kj0k2
848.5C0844k7k4j8rOL1N1N4M1L1L8O2P9P6N4L0J3kj7k3j0K7O4P9O8M2K3J9TK0J7J3
$$ plain form
750.5 5684 5698 5695 5675 5641 5593 5543 5507 5494 5495 5492 5474 5448 5431 5434 5453 5480 5512 5542 5558 5539 5479 5397 5329 5299 5304 5320 5329 5334 5352 5390 5427 5433 5386 5294 5188
768 5188 5103 5059 5050 5056 5058 5050 5039 5039 5056 5089 5126 5149 5147 5125 5114 5154 5269 5444 5631 5790 5928 6100 6361 6726 7168 7652 8165 8719 9311
782.5 9311 9917 10510 11101 11726 12411 13135 13849 14513 15127 15716 16303 16894 17484 18067 18633 19173 19680 20160 20628 21089 21537
793 21537 21958 22344 22705 23056 23404 23739 24044 24314 24562 24805 25051 25295 25526 25747 25969 26200 26428 26632 26796 26923 27031
803.5 27031 27142 27270 27420 27588 27766 27942 28110 28268 28413 28542 28646 28719 28764 28801 28862 28973 29123 29265 29347 29352 29323 29324 29389 29501
815.5 29501 29615 29709 29793 29885 29980 30053 30092 30107 30124 30151 30178 30198 30224 30277 30367 30469 30547 30580 30582 30592 30642 30730 30820 30871 30869 30842 30830 30856 30909 30962 31000
831 31000 31021 31025 31011 30982 30956 30961 31008 31075 31127 31148 31153 31167 31202 31242 31270 31285 31294 31298 31285 31247 31194 31148 31133 31146 31169 31173 31142 31077 30998 30930 30891 30878 30876 30866 30844
848.5 30844 30817 30793 30775 30766 30772 30803 30854 30908 30949 30980 31018 31080 31159 31235 31289 31319 31332 31330 31313 31290 31280 31307 31371 31450 31518 31560 31583 31602 31621 31641 31658 31671
864.5C1671J4UJ2Oj1l5n2m1MN2P1L9k2p2q1n5j8MNrk7l8m0k8oK2M7O2O5N0J9j3l5l3
882C1555j2K0M6N7M6K3NMK0L1K3lk7k8j3KJqlK2N2O9O2M0J6jj4k6l8m2l4j9qj2k6l8
900C1742l1oK1L4L0J7PNTPQMj2l8o3o9m9j7QJ6J9K4K7J3k1n6o8m9k0mj0j9j1J0J8q
918C1464o4j12j25j02o6n0n4o5To0o4q6j14j18r3n1k5k6m2n0l7j2J2K8M4O2Q2R6J00
932.5C0407R7Q8P8P0O9P6Q7R3Q8Q0P6P5O5M0J0rJL3O3O8M0ol7l8j0K0L4K5J2QJ5J8
948.5C1736Qrk3k0lJ9L5M0L1J1j3l1l4k1KJ8TMj3k1j1MJ7J9J2MlolKMjrj5qNJ3Onr
968.5C1750LK2K8J9lj7k1j3kPJ5TRmj9k6Tj4LK1K7K0lk3k8j1J1J6jk3l0j5JTj3j9o
987C1651J8K5Nl2n0m0qJ9K6J1j5l9m7l2lK4L0J8%qTrj9l0k8j5jLmonTj9l8m6k5J2L7
$$ plain form
864.5 31671 31685 31699 31713 31725 31731 31720 31685 31633 31592 31596 31648 31719 31758 31736 31664 31583 31528 31510 31514 31519 31510 31483 31445 31405 31377 31371 31393 31440 31502 31567 31617 31636 31623 31588 31555
882 31555 31543 31563 31609 31666 31712 31735 31740 31744 31764 31795 31818 31815 31788 31760 31747 31749 31750 31742 31739 31761 31813 31882 31944 31984 32000 31999 31985 31959 31921 31879 31845 31826 31818 31806 31780 31742
900 31742 31711 31705 31726 31760 31790 31807 31814 31819 31824 31831 31839 31843 31831 31793 31730 31661 31612 31595 31603 31619 31638 31662 31689 31702 31681 31625 31557 31508 31488 31484 31474 31455 31444 31454 31472 31464
918 31464 31400 31288 31163 31061 30995 30945 30891 30826 30761 30701 30637 30551 30437 30319 30226 30175 30150 30124 30082 30032 29995 29983 29995 30023 30067 30129 30211 30307 30407
932.5 30407 30504 30592 30670 30740 30809 30885 30972 31065 31153 31233 31309 31384 31449 31489 31499 31490 31491 31524 31587 31655 31695 31689 31652 31614 31604 31624 31658 31683 31695 31703 31718 31736
948.5 31736 31744 31735 31712 31692 31689 31708 31743 31783 31814 31825 31812 31781 31747 31726 31728 31746 31764 31768 31755 31734 31723 31727 31744 31763 31775 31779 31776 31770 31767 31769 31773 31772 31763 31748 31740 31745 31758 31764 31759 31750
968.5 31750 31753 31775 31803 31822 31819 31802 31781 31768 31766 31773 31788 31803 31812 31808 31789 31763 31737 31723 31726 31747 31774 31794 31791 31768 31740 31729 31740 31756 31755 31732 31702 31687 31688 31689 31676 31657 31651
987 31651 31669 31694 31699 31667 31617 31577 31569 31588 31614 31625 31610 31571 31524 31492 31489 31513 31543 31561 31561 31553 31545 31536 31517 31487 31459 31444 31443 31446 31442 31436 31431 31426 31407 31369 31323 31298 31310 31347
1006C1347K5j9o4q3o4k9JJ1Ooj6k0j3%J2J0pk9m4Tl3j9mNJj7m3n4l8rJ0Kk4m2m0k8
1024C0641j9k0Tj3rk0m3o2o1m3j8KK0L4L9K5qm4o1n1k1J1K8K3Lk2m2m4l0qPNrk6l0
1041.5C0114k0nMKqj7k0rQK4K5Qj4k2oK9N6TL0%pJ7N5Q1P7N1K3J1RQ%qoNJ4TJ3J9L9
1061C0650N1M5J7pj4jJ2J5RJ0J7J9Rj2k3j6LK0K1Qor%J8L2L1J5nj5j2kMPJ0J9K5J8
1079.5C0963%j4j5pkpj4rOK3K8K6K4K6K9K2Ppj2pjMNORJ5J7J6Oqk7m1m5k8LL4M9M1
1098.5C1115J5pj7j3olnj0j5k1Tj3%RJ3J2TJ4J1Jj4k7l4l5k7j2KLj2l3l8j8PJ3ok6
1116.5C0814k4KK9L2J0j2j9rNJ3J5J0Lrj9k4k1j2mNJ8L2M1L6J9KlRK0J9Lj2rJ2L2L6
1134.5C1040K0KrqnlLJ4K3K0Mj2j3lJ0Tmj8k3j7oJONKjmnmoj1j6j9k0j4p%LMKmj3k1
$$ plain form
1006 31347 31372 31353 31289 31206 31142 31113 31114 31125 31131 31125 31109 31089 31076 31076 31088 31098 31091 31062 31018 30974 30941 30922 30918 30923 30924 30907 30864 30810 30772 30763 30773 30775 30751 30709 30669 30641
1024 30641 30622 30602 30582 30569 30560 30540 30497 30435 30374 30331 30313 30315 30335 30369 30408 30433 30425 30381 30320 30269 30248 30259 30287 30310 30313 30291 30249 30205 30175 30167 30174 30179 30170 30144 30114
1041.5 30114 30094 30089 30093 30095 30087 30070 30050 30041 30049 30073 30098 30106 30092 30070 30064 30093 30149 30205 30235 30235 30228 30245 30300 30381 30458 30509 30532 30543 30552 30560 30560 30552 30546 30551 30565 30579 30592 30611 30650
1061 30650 30701 30746 30763 30756 30742 30741 30753 30768 30777 30787 30804 30823 30832 30820 30797 30781 30784 30804 30825 30833 30827 30818 30818 30836 30868 30899 30914 30909 30894 30882 30880 30884 30891 30901 30920 30945 30963
1079.5 30963 30963 30949 30934 30927 30925 30918 30904 30895 30901 30924 30952 30978 31002 31028 31057 31079 31086 31079 31067 31060 31059 31063 31068 31074 31083 31098 31115 31131 31137 31129 31102 31061 31016 30988 30991 31025 31074 31115
1098.5 31115 31130 31123 31106 31093 31087 31084 31079 31069 31054 31033 31012 30999 30999 31008 31021 31033 31045 31059 31070 31071 31057 31030 30996 30961 30934 30922 30924 30927 30915 30882 30844 30826 30833 30846 30840 30814
1116.5 30814 30790 30792 30821 30853 30863 30851 30832 30823 30828 30841 30856 30866 30869 30860 30841 30817 30796 30784 30780 30785 30803 30835 30876 30912 30931 30933 30930 30939 30959 30978 30981 30969 30960 30972 31004 31040
1134.5 31040 31060 31062 31053 31045 31040 31037 31040 31054 31077 31097 31101 31089 31076 31073 31083 31093 31089 31071 31048 31031 31025 31026 31032 31037 31039 31038 31034 31029 31025 31019 31008 30992 30973 30953 30939 30932 30932 30935 30939 30941 30937 30924 30903
1156C0903k4k2j9j3nNJ3J1%j8l1Tk1pMJ0J1QLpj6k1k0j2m%lj2k3l0k8j7j0rj7k8l0
1174.5C0490k4j4rj3k2l0l5Tl3k9k6Tl2l9m2l7l3m3o1p2o3l7j6j4k8l4k9j9k7n3q1
1190B9434r3r0q2q4q8Tq7q8r7j09j15j18j24j44j69j92k08k18k28k44k67k95l25l53
1202B5528l84m22m73n31n85o36o88p53q30r08r79j045j113j176j219j223j185j112
1211A0266j008q77p25n65m15k86j86j08m8MN9J29K17L28M57N95P33Q64R75J062J117
1221.5A2588J142J139J110J056R79Q94Q14P54P07O64O16N62N03M45L91L52L30L17L05
1231B5668K87K61K34K11J91J72J58J48J45J44J40J28J14R9Q7P8P5P7Q3Q8Q3O9N1M2
1243B8833M5N8O3N2L1J0KRK8M5N8N7M7L4K4TL1M3N4TM2K2MJJ6L5M3L3J6NJ1K5L4L2
$$ plain form
1156 30903 30879 30857 30838 30825 30820 30825 30838 30849 30849 30831 30800 30769 30748 30741 30745 30755 30766 30774 30777 30770 30754 30733 30713 30701 30697 30697 30694 30682 30659 30629 30601 30584 30574 30565 30548 30520 30490
1174.5 30490 30466 30452 30443 30430 30408 30378 30343 30308 30275 30246 30220 30194 30162 30123 30081 30044 30011 29968 29907 29835 29772 29735 29719 29705 29677 29643 29614 29595 29568 29515 29434
1190 29434 29341 29251 29169 29085 28997 28909 28822 28734 28637 28528 28413 28295 28171 28027 27858 27666 27458 27240 27012 26768 26501 26206 25881 25528
1202 25528 25144 24722 24249 23718 23133 22497 21809 21056 20226 19318 18339 17294 16181 15005 13786 12563 11378 10266
1211 10266 9258 8381 7656 7091 6676 6390 6204 6096 6048 6052 6111 6240 6457 6785 7242 7837 8570 9434 10409 11471 12588
1221.5 12588 13730 14869 15979 17035 18014 18908 19722 20476 21183 21847 22463 23025 23528 23973 24364 24716 25046 25363 25668
1231 25668 25955 26216 26450 26661 26852 27024 27182 27330 27475 27619 27759 27887 28001 28100 28187 28265 28340 28417 28500 28588 28671 28740 28791 28833
1243 28833 28878 28936 28999 29051 29082 29092 29094 29103 29131 29176 29234 29291 29338 29372 29396 29420 29451 29494 29548 29602 29644 29666 29670 29671 29687 29722 29765 29798 29814 29819 29830 29855 29889 29921
1260B9921K4J6TJ8K0TJ6J4J6K6L8M2L4K1J3J8K6K7J7MTJ3K3K1Qpj3qOK5M0M5L6J9K
1277.5C0561qj1j0mOJ7K3K0J2OQJ5J7J4RTJ4K3K8K3J1oj6j4lQJ1Mpj5j4kJ9L9M4K9
1295.5C0860jk6l1j6OJ8J5KqrjQJ4TJ3Pmj8l2l4j8QK4K0jk0j9kJ6K2J6PLJpk0k8k5
1314.5C0754oJ8L2L0J7LmpTrj4j5j1kPJ0Q%pj0plNJ1J6J7J2NmqTnjmj5k5k3nJ9K9J4
1335C0807j3k5nL1N4M1Kl5m6k9JK7L7K9J1j0j7j0%Lqj9j7%J9K4J3nj6j5j0qj3j5lJ8
1353C0798L2K6Lk0k6j5oj3k7l0j0J9L4K8J3J0J5J4ml1m4l6j7pTnNJ7Tjk2l2k4rLJ0
1371C0658J6J9J1rk9l8k9rRK1K7TJ6j1m0n5m4j7KTj1j8j2oj0k0j8OL4L7Nl8n5l3NK3
1389C0416Ok9m7l4KL7N1M6K7Pqk0k3j7lJ5K3J0k0m9n5l3%K1TJ0jqj6k7l3k4pPKk2n1
$$ plain form
1260 29921 29945 29961 29977 29995 30015 30035 30051 30065 30081 30107 30145 30187 30221 30242 30255 30273 30299 30326 30343 30347 30351 30364 30387 30408 30416 30409 30396 30388 30394 30419 30459 30504 30540 30559 30561
1277.5 30561 30553 30542 30532 30528 30534 30551 30574 30594 30606 30612 30620 30635 30652 30666 30675 30684 30698 30721 30749 30772 30783 30777 30761 30747 30744 30752 30763 30767 30760 30745 30731 30729 30748 30787 30831 30860
1295.5 30860 30859 30833 30802 30786 30792 30810 30825 30827 30819 30810 30809 30817 30831 30845 30858 30865 30861 30843 30811 30777 30759 30767 30791 30811 30810 30790 30771 30769 30785 30807 30823 30830 30833 30834 30827 30807 30779 30754
1314.5 30754 30748 30766 30798 30828 30845 30848 30844 30837 30830 30821 30807 30792 30781 30779 30786 30796 30804 30804 30797 30787 30780 30777 30782 30793 30809 30826 30838 30843 30839 30831 30823 30818 30817 30813 30798 30773 30750 30745 30764 30793 30807
1335 30807 30794 30769 30764 30795 30849 30890 30892 30857 30811 30782 30783 30810 30847 30876 30887 30877 30860 30850 30850 30853 30845 30826 30809 30809 30828 30852 30865 30860 30844 30829 30819 30811 30798 30783 30780 30798
1353 30798 30830 30856 30859 30839 30813 30798 30792 30779 30752 30722 30712 30731 30765 30793 30806 30816 30831 30845 30841 30810 30766 30730 30713 30706 30699 30694 30699 30716 30733 30732 30710 30678 30654 30645 30648 30658
1371 30658 30674 30693 30704 30695 30666 30628 30599 30590 30599 30620 30647 30674 30690 30679 30639 30584 30540 30523 30525 30527 30516 30498 30486 30480 30470 30450 30432 30438 30472 30509 30514 30476 30421 30388 30393 30416
1389 30416 30422 30393 30346 30312 30314 30351 30402 30448 30475 30482 30474 30454 30431 30414 30411 30426 30449 30459 30439 30390 30335 30302 30302 30323 30344 30354 30353 30345 30329 30302 30269 30245 30238 30245 30247 30225 30174
1407.5C0174o6n6l1qlj6l2l9l8l4l7l6k4mJ0Ooj0mqm4r7j29j07m0K6O0N5L7K1J1Kn
1424B9528lLToj6j1J4M6O8O9M9J8qj5kJ7K4J8J3K5N4O9N2Ol4l5%M0N2L5J4RJ8K1Qj2
1442C0131j5%K1K5J4J2L2O5Q3O4K0k4l9k4LK0K2J1NJ1K2K9K7L2N7J01J34J25O2k8j02
1457.5C0896j31j19q4m5j6kJMJ9M1M9K0l9r0r8n9nK8K2pl0l2j4OJ7K2K5K1%m0q4j00
1473.5C0176p4k1J7J3k1m8m4j4J7L4L6L2L1L3L9M7M8L0jk5j5K9P8R6P1K5j1j7mJ0Q
1489C0575qk6l4k5q%orML3M9K3l4p7p1j9K8L2ll7m0j8jTj2k3k2nL8J01J45J22J6j18
1506C0569j97j75q7j3Lk1l4j8Jj2n5q7p5k8J5L3K7J6%l7q7j14q1J0J03J43J18O8L0
1520.5C0015Pk3o3q7o9k4Lj1m3m2OO0O6J4n2p3l6K4O3O5N2N6P3Q0N3qo4q3n7j0L4P0
$$ plain form
1407.5 30174 30108 30052 30021 30013 30010 29994 29962 29923 29885 29851 29814 29778 29754 29750 29760 29766 29760 29750 29746 29738 29694 29597 29468 29361 29321 29347 29407 29462 29499 29520 29531 29533 29528
1424 29528 29525 29528 29531 29525 29509 29498 29512 29558 29626 29695 29744 29762 29754 29739 29737 29754 29778 29796 29809 29834 29888 29957 30009 30015 29981 29946 29946 29986 30038 30073 30087 30096 30114 30135 30143 30131
1442 30131 30116 30116 30137 30162 30176 30188 30220 30285 30368 30432 30452 30428 30389 30365 30368 30388 30410 30421 30426 30437 30459 30488 30515 30547 30604 30705 30839 30964 31026 30998 30896
1457.5 30896 30765 30646 30562 30517 30501 30499 30500 30504 30523 30564 30613 30633 30594 30504 30406 30347 30342 30370 30392 30385 30355 30323 30309 30315 30332 30354 30379 30400 30400 30360 30276 30176
1473.5 30176 30102 30081 30098 30111 30090 30042 29998 29984 30001 30035 30071 30103 30134 30167 30206 30253 30301 30331 30330 30305 30290 30319 30397 30493 30564 30589 30578 30561 30557 30567 30575
1489 30575 30567 30541 30507 30482 30474 30474 30468 30459 30463 30496 30545 30568 30534 30457 30386 30367 30395 30427 30424 30387 30347 30329 30328 30327 30315 30292 30270 30265 30303 30404 30549 30671 30687 30569
1506 30569 30372 30197 30110 30097 30100 30079 30045 30027 30028 30016 29961 29874 29799 29771 29786 29819 29846 29862 29862 29825 29738 29624 29543 29553 29656 29799 29917 29985 30015
1520.5 30015 30022 29999 29936 29849 29780 29756 29759 29748 29705 29663 29669 29729 29795 29809 29757 29684 29648 29672 29735 29800 29852 29908 29981 30061 30114 30106 30042 29959 29902 29892 29926 29996
1536.5B9996J07J41J49J07K3n4q4o7m0l0Tj2L1P2P3K5l8p3o5k8J0L0L8L6K7J4lj4j1
1551C0330PK6Tjl6n2l5kL1P3J52K68L54L05P8k32m51m57k83o3P8J06O9K6Kj3k9m6n5
1565.5C0176n2k9J8P9J19R9J3r0j48j33p1j5PNQK3L2J7k2o1p3n2k1noj5j7rpj1k0k1
1581.5B9718j6Tk6l7l2mK7M1K6jj9j7jQLj0j8rQK2TRlmMJ6J8Pqj8j3kMjj3j9j2MJ9
1601B9657K4J8OkjRK7L6L1J2k%J6L1TK2J0OQJ2J4J1NjJ1M6Q6R3M1m6j07r9k6N5R1O9
1619C0194K3JJ8M9N7K8k4o3p1m5oL4O1P1N8K4j3l6l4j6MJ5J1nk3j6K5P3P1j0j23j69
1635C0163q6P2J83J65M6o1p8k5L2M6K8Nj2k1j6J0M4O0M3J6LJ4L0L1Lm2q5Tj2J06J67
1650.5C0744O5j83l98l88j32J96L67K94R2n6o8j4J4lk4j8%NJ1L6O9P1K0n0q3o0j1J5
$$ plain form
1536.5 29996 30103 30244 30393 30500 30523 30469 30385 30318 30278 30248 30218 30206 30237 30309 30382 30407 30369 30296 30231 30203 30213 30243 30281 30317 30344 30358 30355 30341 30330
1551 30330 30337 30363 30389 30388 30352 30300 30265 30263 30294 30367 30519 30787 31141 31446 31524 31292 30841 30384 30101 30038 30116 30222 30291 30317 30319 30306 30277 30231 30176
1565.5 30176 30124 30095 30113 30192 30311 30410 30423 30333 30185 30052 29981 29966 29973 29978 29986 30009 30041 30058 30036 29975 29902 29850 29829 29824 29818 29803 29786 29777 29770 29759 29739 29718
1581.5 29718 29702 29686 29660 29623 29591 29587 29614 29655 29681 29680 29661 29644 29643 29651 29654 29644 29626 29617 29625 29647 29669 29678 29675 29671 29675 29691 29709 29716 29708 29690 29677 29675 29679 29678 29665 29646 29634 29638 29657
1601 29657 29681 29699 29705 29703 29702 29711 29738 29774 29805 29817 29815 29815 29831 29862 29893 29915 29925 29931 29939 29951 29965 29976 29981 29980 29991 30037 30123 30216 30257 30211 30104 30005 29979 30034 30125 30194
1619 30194 30217 30218 30236 30285 30342 30370 30346 30283 30212 30167 30161 30195 30256 30327 30385 30409 30396 30360 30326 30310 30314 30329 30340 30335 30312 30296 30321 30394 30465 30455 30332 30163
1635 30163 30077 30149 30332 30497 30543 30482 30404 30379 30411 30457 30485 30490 30478 30457 30441 30451 30495 30555 30598 30614 30617 30631 30661 30692 30695 30653 30568 30483 30471 30577 30744
1650.5 30744 30809 30626 30228 29840 29708 29904 30271 30565 30657 30601 30533 30519 30533 30530 30506 30488 30488 30493 30504 30540 30609 30680 30700 30650 30567 30507 30496 30511
1664.5C0511QjJ2M5O1L0l9j00j04m1M5R1O8Rj9J4O9Q0J6q0j30r9j5N8Q1N5J9%NJ4J0
1680C0673nmL5J09J68J44J5j58k64k26p3R1J60J17L0k9l5k4Tk6qK2L3J4oJ4O3Q5L8
1694.5C0929m4r3p5j9K5O2J22J91J87M6j82l35k93r1J15J88J19Qm5l0LJ1mj9k1j3%
1708C0742J6K6K4J0jTNQKmqj4k2j5L1J03J47J10lj27j81j46n8J6M6L8K0MmrToLQP%
1726C0758qTLK0K8K0jk1TLL7N4L1l0r3j10o3J9P6P3K9kJ5N8P5L3m0q8p1j2M5N9K9j4
1743C0883l6k9kJ9K2J2MNRO%TOJk2n0n4k4K1M5L6J4LOTqk5k7j2OJ7K8M1M9L3j2n9p5
1762C0837m7kK9TJ6J5L3N0M0mn1p0m5MM5O1M9K0j6n0n9l3J6N3M5km8n4k5J3L0TK1J4
1779C0944kk4m4Tk4NK7L4K8Rj2k8k9j6n%MJ1K3K8K5J9J8J6jl4o0n4j4L4N5L9Mk2k1
$$ plain form
1664.5 30511 30519 30518 30530 30575 30636 30666 30627 30527 30423 30382 30427 30518 30586 30595 30576 30590 30659 30739 30755 30675 30545 30446 30431 30489 30570 30625 30644 30644 30649 30663 30673
1680 30673 30668 30664 30699 30808 30976 31120 31135 30977 30713 30487 30414 30505 30665 30782 30812 30783 30748 30724 30700 30674 30666 30688 30721 30735 30729 30743 30806 30891 30929
1694.5 30929 30885 30792 30717 30698 30723 30785 30907 31098 31285 31331 31149 30814 30521 30430 30545 30733 30852 30860 30815 30785 30788 30799 30795 30776 30755 30742 30742
1708 30742 30758 30784 30808 30818 30817 30816 30821 30829 30831 30827 30819 30805 30783 30768 30799 30902 31049 31159 31156 31029 30848 30702 30644 30660 30706 30744 30764 30768 30764 30755 30746 30740 30743 30751 30758 30758
1726 30758 30750 30742 30745 30765 30793 30813 30812 30791 30770 30773 30810 30864 30895 30865 30772 30662 30599 30618 30694 30767 30796 30794 30809 30867 30942 30975 30935 30847 30776 30764 30809 30868 30897 30883
1743 30883 30847 30818 30816 30835 30857 30869 30873 30878 30887 30893 30893 30893 30899 30900 30878 30828 30774 30750 30771 30816 30852 30866 30869 30875 30881 30873 30848 30821 30809 30815 30832 30860 30901 30950 30983 30971 30912 30837
1762 30837 30790 30788 30817 30846 30862 30877 30910 30960 31000 30996 30945 30875 30830 30834 30879 30940 30989 31009 30993 30943 30884 30851 30867 30920 30965 30963 30915 30861 30836 30849 30879 30909 30930 30944
1779 30944 30942 30918 30874 30830 30806 30811 30838 30872 30900 30909 30897 30869 30840 30824 30819 30819 30823 30834 30857 30885 30910 30929 30947 30963 30962 30928 30868 30814 30800 30834 30889 30928 30932 30910 30889
1796.5C0889%J9Tol4m9l3jK4K7Pj2k0j5qkQK3L5L0Oj5j8jK1K6J3rk4k9k5j5mOJ1J3
1814.5C0857J3J5J4Pnj5j8j4j0lNJ7K3J8QLRJ3Jk6m9m7j8K0M5N2M7L0Ll0n5Tl1kJ3
1832C0835Roj4j3pJQJ6K0J7Nj0j6nJ1J8RlML4N9N0ko0q0m5J2M4L2lk8k3oLmk1k8j9
1851C0794LK4K9J9jj8k3j8j0m%MPMJTLJ0J1J0RTLqk1k3qJ5K8K5J3OTMnk0l2k9j9qk
1871.5C0789knj2j6j2KJ8K5J5Jqrnoj0j3j2j1qJJ2K1K0J1%pj1j8k3j0J8M8N0K3j7l8
1889.5C0801k7lJ5J4Kj1j8k1j8pQJ6Rnj2mRJ8J6QJmqj2rLJ3Rqk3k0jJ7K0J2Kjmj2k2
1909.5C0743j9%K3K7Rj7l2k6qQK0K7K9J9nk9l8k6lJ7K7L1L4L1J5j1k9Tj6kjj0j5j0
1926.5C0734KOJnpmJjnTKJ2K1J8Ppj3j1jLjj0j4j3kJ1K5L4L3J7j1l2l4j6NJ0lk0k5
$$ plain form
1796.5 30889 30889 30908 30927 30921 30887 30838 30805 30804 30828 30855 30862 30850 30830 30815 30807 30805 30813 30836 30871 30901 30907 30892 30874 30873 30894 30920 30933 30924 30900 30871 30846 30831 30827 30833 30844 30857
1814.5 30857 30870 30885 30899 30906 30901 30886 30868 30854 30844 30841 30846 30863 30886 30904 30912 30915 30924 30937 30938 30912 30863 30816 30798 30818 30863 30915 30962 30992 30995 30965 30910 30855 30824 30822 30835
1832 30835 30844 30838 30824 30811 30804 30805 30813 30829 30849 30866 30871 30861 30845 30840 30851 30869 30878 30875 30879 30913 30972 31022 31020 30960 30880 30835 30847 30891 30923 30920 30892 30869 30863 30866 30862 30841 30813 30794
1851 30794 30797 30821 30850 30869 30868 30850 30827 30809 30799 30795 30795 30799 30806 30810 30811 30812 30815 30825 30836 30846 30855 30864 30867 30859 30838 30815 30807 30822 30850 30875 30888 30894 30900 30904 30899 30879 30847 30818 30799 30791 30789
1871.5 30789 30787 30782 30770 30754 30742 30744 30762 30787 30802 30803 30795 30786 30781 30775 30765 30752 30740 30729 30721 30722 30734 30755 30775 30786 30786 30779 30768 30750 30727 30717 30735 30783 30833 30856 30839 30801
1889.5 30801 30774 30771 30786 30800 30802 30791 30773 30752 30734 30727 30735 30751 30760 30755 30743 30739 30748 30766 30782 30790 30791 30787 30779 30767 30758 30761 30774 30783 30775 30752 30732 30731 30748 30768 30780 30782 30781 30777 30765 30743
1909.5 30743 30724 30724 30747 30774 30783 30766 30734 30708 30700 30708 30728 30755 30784 30803 30798 30769 30731 30705 30702 30719 30746 30777 30811 30842 30857 30846 30817 30788 30772 30770 30769 30759 30744 30734
1926.5 30734 30736 30742 30743 30738 30731 30727 30728 30727 30722 30717 30719 30731 30752 30770 30777 30770 30757 30746 30745 30748 30747 30737 30723 30710 30708 30719 30744 30778 30811 30828 30817 30785 30751 30735 30740 30750 30747 30727 30702
1946C0702j6lkj0j4lJ7L0K7J0rj3lJ2J4Lj4k1j1NJ6J4Lpj2j1pmj%jnpmKQJ3RKj0k1
1966.5C0678k4j8nJ0J8TJ1OL%nj1j6j4mRJ9TRpj6ToQJ7J3jj9k7k1nJ1J6J1jj6k1j6
1985.5C0607MK3L1J9lj7j2OJ6J1qk1j9lJ1Oj2l1l4j5J4L3L2J3qj6j2%OLlnKJ5K3J9
2003.5C0675PmpTj0j7j9rQK4TJ2jqomrj6k0j3NK4L2J9rl2l4j4QK0TJ5J1Lrk2k7j6L
2023C0597J8K1J2%rj4j3j0njKQJ4J6J2MnqpoprqkPJ2RJj0j5j3nLJ2J8J9J2mk0k7j6
2043.5C0583%J2Rkj3To%LKULNOMmj1j4nRJ6Rj2k8Tj1J0J9J1jo%J3K0J7J0L%koj6k5
2065C0565k8j9lJ4K2J4Jj1TmMKornRK1K2J0nj4rPJ9K0Pqj8j7rkMNPTMmj3j6j3mMOK
2087C0548lT%K%noKQRjj3j6j4nLQJ1TMnj1rmLKj%MQMpk0k7j8LK7L7K5kk6l1j1J7L1
$$ plain form
1946 30702 30686 30683 30681 30671 30657 30654 30671 30701 30728 30738 30729 30716 30713 30725 30739 30742 30728 30707 30696 30701 30717 30731 30734 30727 30715 30704 30697 30693 30692 30692 30691 30686 30679 30675 30677 30685 30698 30707 30709 30699 30678
1966.5 30678 30654 30636 30631 30641 30659 30677 30688 30694 30697 30697 30692 30681 30665 30651 30647 30656 30675 30694 30703 30696 30680 30664 30658 30666 30683 30696 30695 30676 30649 30628 30623 30634 30650 30661 30660 30644 30623 30607
1985.5 30607 30611 30634 30665 30684 30681 30664 30652 30658 30674 30685 30677 30656 30637 30634 30645 30651 30639 30608 30574 30559 30573 30606 30638 30651 30643 30627 30615 30615 30621 30624 30621 30616 30618 30633 30656 30675
2003.5 30675 30682 30678 30671 30664 30654 30637 30618 30609 30617 30641 30665 30677 30676 30668 30662 30658 30649 30633 30613 30600 30605 30629 30661 30680 30671 30639 30605 30591 30599 30619 30639 30654 30665 30668 30659 30637 30610 30594 30597
2023 30597 30615 30636 30648 30648 30639 30625 30612 30602 30597 30596 30598 30606 30620 30636 30648 30652 30647 30639 30632 30626 30619 30610 30602 30600 30607 30619 30628 30629 30619 30604 30591 30586 30589 30601 30619 30638 30650 30646 30626 30599 30583
2043.5 30583 30583 30595 30604 30602 30589 30576 30570 30570 30573 30575 30577 30579 30582 30587 30593 30597 30593 30582 30568 30563 30572 30588 30597 30585 30557 30529 30518 30528 30547 30558 30557 30551 30551 30564 30584 30601 30611 30614 30614 30612 30606 30590 30565
2065 30565 30537 30518 30515 30529 30551 30565 30566 30555 30544 30540 30544 30546 30540 30531 30526 30535 30556 30578 30588 30583 30569 30560 30567 30586 30606 30613 30605 30587 30570 30561 30559 30563 30568 30575 30582 30586 30582 30569 30553 30540 30536 30540 30546 30548
2087 30548 30545 30542 30542 30544 30544 30539 30533 30535 30543 30552 30551 30538 30522 30508 30503 30506 30514 30525 30536 30540 30535 30524 30515 30511 30514 30516 30515 30515 30519 30527 30531 30524 30504 30477 30459 30462 30489 30526 30551 30549 30523 30492 30481 30498 30529
2109.5C0529K0pk7k3kJ8K3J1nj3rk%kmTlUjNRTKpj3j7j6j2mLRJ1J0RNjrj1lRJ7J0o
2131.5C0502j8j4%RPmj0TlJKUjnpjQJ3Mj1k1j9j0kTm%J3K4K7J6kj7k2j7p%JkJRJ6J5
2153.5C0463%j6k4j7lMNjkjMPJ4J9J3jj9k5j6JQNlmKLnj1oJ1K3J7kj7j5nJjqrlKL%
2175.5C0391%NROnj8k2j4NJ9K3J2lj5j2kJ0J1Mqj7j6j0lLT%jknpj1oOK2L0K1Lj6k1
2195.5C0369j4jJ0TKj0j9j8mJ4K4J5nk2k3rLQOMQTKrj5rMJ2RkqlJ0J9J3mk2k5j5%R
2216C0322J1PTNLjnqj2j6j7j0KQMpj3oOJ3J2OLJmj1j3rLJ2J4J0L%lpj3j4j1kQJ1RM
2238C0302Jkoqp%J2J8J2qk6l0j8mKjlKJ0J4J2PNPJqj3oJ1K3J6mk2k4j4%PRJ3J5J3J
2259C0309j1j8j1%NKmnjMRQMjnTlJK%jJLTlqnNJ6TNrj6j2kMKnmKJ2J3Lj2j8j1KJ2TM
$$ plain form
2109.5 30529 30549 30542 30515 30492 30490 30508 30531 30542 30537 30524 30515 30513 30513 30511 30507 30503 30500 30497 30494 30493 30498 30507 30516 30518 30511 30498 30481 30465 30453 30449 30452 30461 30472 30482 30491 30496 30495 30486 30475 30472 30481 30498 30508 30502
2131.5 30502 30484 30470 30470 30479 30486 30482 30472 30462 30459 30460 30462 30464 30466 30465 30460 30453 30452 30460 30473 30477 30466 30445 30426 30416 30414 30412 30408 30408 30421 30445 30472 30488 30486 30469 30447 30430 30423 30423 30424 30422 30423 30432 30448 30463
2153.5 30463 30463 30447 30423 30406 30403 30407 30412 30411 30409 30408 30412 30419 30433 30452 30465 30464 30445 30420 30404 30405 30413 30418 30415 30411 30413 30416 30411 30400 30394 30405 30428 30445 30443 30426 30411 30406 30407 30406 30398 30389 30386 30388 30391 30391
2175.5 30391 30391 30396 30405 30411 30406 30388 30366 30352 30357 30376 30399 30411 30408 30393 30381 30379 30389 30400 30404 30396 30379 30363 30353 30350 30353 30356 30356 30355 30353 30348 30341 30330 30324 30330 30352 30382 30403 30406 30390 30369
2195.5 30369 30355 30354 30364 30374 30376 30366 30347 30329 30325 30339 30363 30378 30373 30351 30328 30319 30322 30330 30336 30340 30348 30356 30358 30349 30334 30325 30329 30341 30350 30348 30340 30337 30347 30366 30379 30375 30353 30328 30313 30313 30322
2216 30322 30333 30340 30347 30352 30355 30354 30349 30341 30329 30313 30296 30286 30288 30296 30300 30293 30280 30274 30280 30293 30305 30311 30314 30315 30311 30300 30287 30278 30281 30293 30307 30317 30320 30320 30317 30310 30297 30283 30272 30270 30278 30289 30298 30302
2238 30302 30303 30301 30295 30287 30280 30280 30292 30310 30322 30314 30288 30258 30240 30236 30238 30237 30234 30236 30246 30260 30272 30279 30284 30291 30292 30284 30271 30265 30276 30299 30315 30311 30289 30265 30251 30251 30258 30267 30280 30295 30308 30309
2259 30309 30298 30280 30269 30269 30274 30276 30272 30267 30266 30270 30279 30287 30291 30290 30285 30280 30277 30278 30280 30280 30279 30280 30283 30286 30283 30275 30270 30275 30291 30307 30312 30303 30287 30275 30273 30277 30279 30274 30270 30272 30284 30297 30300 30288 30270 30259 30261 30273 30285 30289
2284C0289mrTnMJ8K6K3Mj6k4j6%QMljRK0J5mk1k3pJ6K8K1Pqj4j8k4k5j9mJ1J6J1QJ7
2304C0301K9L2J7nj9j7pjLQJ8K0Nk3m3l7oK7M2L1Oj5k1j2kJrk0k2qJ1K2K5K2K5K4J0
2322.5C0412j7l7Tj7Jkj7j9J1N8Q1N4j6q2j06p7k0K7M1K9J2J1L5O0O2K3l6p6o7j1N0
2338C0330P6N6Qk5l0j0NOok0k7k6j9jK0L5K4j2n3o7l6K2O5O7L2nj4J0M1M9K2k0n1m7
2355C0399j2K1K4qm9o3l8NL2TJ5%oTjJ1K4L0J3k1n2o2n1k8oRTkj5TJK0Tmk6k5nJ4J0
2374.5C0194rj8j4j1k5n0n9l8LL9M7K8ll0m0l3j5%Jj4l5m8m4k7j0mj1k5l7m0l5l3l9
2391B9565m9n8n9To5p8r5j05j09j10j12j11j01q0n7l7k6j9qJ2L6N9P4Q1Q0P7P0O4O0
2405.5B8840O2O6O9O6N2L4K0J6K8M7O3O5N1K8OonLJ5K7K9K0%j9k0kK2L3J8qk4j6NJ9
$$ plain form
2284 30289 30285 30276 30267 30262 30266 30284 30310 30333 30337 30321 30297 30281 30281 30289 30293 30290 30289 30298 30318 30333 30329 30308 30285 30278 30294 30322 30343 30350 30342 30328 30310 30286 30261 30242 30238 30249 30265 30276 30284 30301
2304 30301 30330 30362 30379 30374 30355 30338 30331 30330 30333 30341 30359 30379 30384 30361 30318 30281 30275 30302 30344 30375 30381 30366 30345 30333 30331 30332 30323 30303 30281 30273 30284 30306 30331 30353 30378 30402 30412
2322.5 30412 30395 30358 30321 30304 30305 30303 30286 30267 30278 30336 30417 30471 30455 30373 30267 30190 30170 30197 30238 30267 30279 30290 30325 30385 30447 30470 30434 30358 30291 30280 30330
2338 30330 30406 30462 30470 30445 30415 30405 30410 30416 30410 30390 30363 30337 30318 30317 30337 30372 30396 30384 30331 30264 30228 30250 30315 30382 30414 30409 30395 30405 30446 30495 30517 30497 30446 30399
2355 30399 30387 30408 30432 30424 30375 30312 30274 30279 30311 30343 30358 30358 30352 30346 30345 30356 30380 30410 30423 30402 30350 30288 30237 30209 30203 30212 30221 30219 30204 30189 30190 30210 30230 30226 30200 30175 30170 30184 30194
2374.5 30194 30185 30167 30153 30142 30117 30067 30008 29970 29973 30012 30059 30087 30084 30054 30014 29981 29966 29966 29967 29953 29918 29870 29826 29799 29789 29785 29774 29749 29712 29672 29637 29604 29565
2391 29565 29516 29458 29399 29340 29275 29197 29102 28997 28888 28778 28666 28555 28454 28374 28317 28280 28254 28235 28227 28239 28275 28334 28408 28489 28569 28646 28716 28780 28840
2405.5 28840 28902 28968 29037 29103 29155 29189 29209 29225 29253 29300 29363 29428 29479 29507 29513 29507 29502 29505 29520 29547 29576 29596 29596 29577 29557 29555 29577 29610 29628 29620 29596 29580 29585 29604
2422.5B9604J5KqojTlTJOLnj2j0l%mj4j9j6lJ2K0J9Nqj6j3lMQTRTPLTJ1K1K4J6LkL
2444.5B9666J7K8L0K0Lj1j9j7oMRTQJ1J8K4K3J4Kpj3j1lRK0K6K2Qrj9j6nQJ5J3Nlj0
2463.5B9863j0nNJ5J6RjlLJ1Tkj3j0NK2TOj3k0j1JPKmpm%ORJ3J4J1NKNQTjj0j4rLJ5
2485.5B9960J8J6J0Mknqj1j2rlMRJ1QLkqj4j7j3mMQNJKQJ0P%kLJ1Opj9j4PK4K3Kk1
2507B9993l0k0kJ2J9J3Lrj6j1JJ1J3PKLPNmj7k1j7oOJ3J5Poj6j7pPJ6TRLoj1TkJ1J8
2528B9981J4kj4j6pMQNLQJ2TKj4k4Tj5kPJ3J6TJ4Okj2j9k0j5oMNJlMK1L6L4J2j6l1
2548.5B9996k5j0MLmqmMJ1Ook1k9k5j3%PJ4K0K5K4Qj3k6j8LK1K3RljQJ3Kj7k9k4nJ0
2568B9930J2Kj1j6j0KJ0TMqj4TmOJ1PLJjmj0j2rKJ1J4J0LJKLKT%lj3k2k5j6%J1TM%
$$ plain form
2422.5 29604 29619 29621 29613 29607 29606 29605 29602 29599 29600 29606 29609 29604 29592 29582 29579 29579 29575 29561 29542 29526 29523 29535 29555 29574 29579 29571 29555 29542 29539 29543 29551 29559 29568 29577 29584 29587 29590 29601 29622 29646 29662 29665 29663 29666
2444.5 29666 29683 29711 29741 29761 29764 29753 29734 29717 29711 29715 29724 29733 29741 29752 29770 29794 29817 29831 29833 29826 29813 29802 29799 29808 29828 29854 29876 29884 29875 29856 29840 29835 29843 29858 29871 29876 29873 29863
2463.5 29863 29853 29848 29853 29868 29884 29893 29892 29889 29892 29903 29914 29912 29899 29889 29894 29916 29938 29944 29931 29911 29900 29901 29908 29910 29906 29899 29895 29895 29901 29910 29923 29937 29948 29953 29955 29960 29968 29976 29975 29965 29951 29942 29945 29960
2485.5 29960 29978 29994 30004 30008 30006 30001 29993 29982 29970 29961 29958 29962 29971 29982 29990 29993 29991 29983 29969 29952 29939 29935 29939 29947 29952 29953 29955 29963 29973 29980 29980 29978 29981 29992 29998 29991 29972 29958 29965 29989 30012 30014 29993
2507 29993 29963 29943 29941 29953 29972 29985 29988 29979 29963 29952 29953 29964 29977 29984 29986 29989 29996 30001 29997 29980 29959 29942 29936 29942 29955 29970 29977 29971 29955 29938 29931 29938 29954 29970 29979 29982 29976 29965 29954 29952 29963 29981
2528 29981 29995 29993 29979 29963 29956 29960 29968 29973 29976 29984 29996 30008 30010 29996 29972 29948 29933 29931 29938 29951 29967 29983 29997 30003 30001 29989 29970 29950 29935 29929 29933 29938 29939 29936 29940 29961 29997 30031 30043 30027 29996
2548.5 29996 29971 29961 29965 29968 29964 29956 29952 29956 29967 29973 29967 29946 29917 29892 29879 29879 29886 29900 29920 29945 29969 29977 29964 29938 29920 29923 29944 29967 29976 29973 29972 29980 29993 29995 29978 29949 29925 29920 29930
2568 29930 29942 29944 29933 29917 29907 29909 29919 29929 29933 29925 29911 29897 29893 29899 29910 29917 29920 29921 29920 29916 29906 29894 29885 29887 29898 29912 29922 29925 29926 29928 29931 29933 29935 29935 29932 29919 29897 29872 29856 29856 29867 29878 29882 29882
2590B9882LRJ0MJPJ7J6Kj7k6j9kPLmoJOLpj3j0lPJ0J1Okj3j8j3JJ2J4Moj3j4j2pMJ8
2611.5B9853K7K4J1mqoTj2k0k1j0LRUJ3J6J1lj4TlJ1J3Jj8l0l1j6LJ9K2J7RQJ2J4O
2630.5B9904rk2k5j5lJnj2j0NK3L2K6Rqj4j1mkpj3j4nPJ5J2kj2j1lKkj1j2jJ1J6Rm
2650B9835rqnj0j5j1MK4L7L0J2pj6j8j5j4j3j2rmJL%mj0j3j2nLJ3K1K4J7Jj7k3j2N
2669B9768J5Ppj1kJ4J5Jj8k4j0J0K2J7Lqj1pmjJNQOmj7k5k1j0JLJKOTJpr%J1J2Jrj1
2691B9720nkoj2rNK2L1K6Rj1k5k6j4KJ2J0K%LQO%mjMOjj0j7k1j6kJ6L4L5J9mj7j5j
2711.5B9751J1J8J3kk2m1m5k7KK5L0J6pk4k7k1rOJ4J3Noj1j0mKPQKqj5j4jJ7K4J8%
2730B9688j7j9j2KJ1J2QMKTJjk%QJ3Qqk6l0j6PK0J4%n%ROqj7j2jNmj4j1NK1K0Lj3j7
$$ plain form
2590 29882 29885 29894 29904 29908 29909 29916 29933 29949 29951 29934 29908 29889 29887 29894 29897 29893 29887 29888 29894 29897 29890 29877 29867 29864 29871 29881 29892 29898 29896 29883 29865 29852 29853 29865 29879 29883 29877 29864 29850 29838 29831 29835 29853
2611.5 29853 29880 29904 29915 29911 29903 29897 29891 29879 29859 29838 29828 29831 29840 29849 29858 29871 29887 29898 29895 29881 29867 29864 29875 29888 29889 29871 29841 29810 29794 29797 29816 29838 29855 29864 29872 29884 29898 29904
2630.5 29904 29895 29873 29848 29833 29830 29831 29826 29814 29804 29809 29832 29864 29890 29899 29891 29877 29866 29862 29860 29853 29840 29826 29821 29828 29843 29855 29853 29841 29830 29827 29829 29827 29816 29804 29803 29814 29830 29839 29835
2650 29835 29826 29818 29813 29803 29788 29777 29781 29805 29842 29872 29884 29877 29861 29843 29828 29814 29801 29789 29780 29776 29777 29780 29780 29776 29766 29753 29741 29736 29739 29752 29773 29797 29814 29815 29798 29775 29763 29768
2669 29768 29783 29790 29783 29772 29770 29784 29799 29800 29782 29758 29748 29758 29780 29797 29800 29792 29781 29774 29770 29769 29770 29775 29783 29789 29785 29768 29743 29722 29712 29713 29716 29717 29719 29725 29731 29732 29725 29716 29716 29727 29739 29740 29731 29720
2691 29720 29715 29713 29707 29695 29686 29691 29713 29744 29770 29779 29768 29743 29717 29703 29705 29717 29727 29729 29729 29732 29740 29746 29746 29742 29741 29745 29751 29750 29740 29723 29702 29686 29684 29700 29734 29769 29788 29784 29767 29752 29751
2711.5 29751 29762 29780 29793 29791 29769 29728 29683 29656 29658 29683 29713 29729 29722 29698 29671 29650 29641 29647 29661 29674 29679 29673 29662 29652 29648 29650 29657 29665 29667 29659 29644 29630 29629 29646 29670 29688 29688
2730 29688 29671 29652 29640 29642 29653 29665 29673 29677 29679 29681 29682 29681 29679 29679 29687 29700 29708 29700 29674 29644 29628 29635 29655 29669 29669 29664 29664 29673 29679 29671 29654 29642 29641 29646 29642 29628 29617 29622 29643 29663 29666 29653 29636
2751.5B9636j0l%kT%TlkLJ1J3Noj3j4oMJ6K6K9K0jk3l6l5k5j2jQJ5K1TJ5NlT%NTK%
2772.5B9660jkpj7k3j7JJ9K5J2rk5k7j4MJ6J5OkJRTmk1k5qJ7K9J9lj9k0j2nmqoLJ2
2792B9578J3Kj8l3Tj9JJ0RQJ3K7L4K5Lj8k7k0oNO%pj1qmKMNLjpqkRJ5Rnj9k0j4olm
2814B9488jPJ5J4Kj0j4lJ3K6K4Rj1k4Tj7p%jlnlKJ1J8TJ2%j3k0k2j5nPJ3J4J2ROjj6
2834.5B9505l5m6m3k5%J7K6K5K3J8Oj7l9m8l5rJ5K1Rqj9j8j2j6l2m8Tk7%J3Poj1lK
2852B9142lj4j5jJ4J5kk2k8j7OK7L5K9J1j1k8l0k1pOJ6K2TJ5LnTLNjj4k4k9k5j5jJ5
2871B9068K8L3K5Oj4l0l2j8MJ7J3ql0l5k1LJ9K2J2oj9j8%K4L6K3j1m5n8m7k6rMJ5K2
2888.5B8947J9Nj4k0j2MQpk8l9l0nJ9K7J9%j6k0qJ0K2J6mk4k7j0J7L3L0J8PKkj2j9
$$ plain form
2751.5 29636 29626 29623 29623 29621 29619 29619 29619 29616 29614 29617 29628 29641 29646 29640 29627 29613 29607 29611 29627 29653 29682 29702 29701 29678 29642 29607 29582 29570 29569 29577 29592 29613 29634 29649 29654 29651 29648 29648 29653 29658 29660 29660
2772.5 29660 29659 29657 29650 29633 29610 29593 29594 29613 29638 29650 29641 29616 29589 29575 29579 29595 29610 29616 29614 29615 29624 29633 29629 29608 29583 29575 29592 29621 29640 29637 29618 29598 29586 29581 29577 29569 29563 29566 29578
2792 29578 29591 29593 29575 29542 29509 29490 29491 29501 29510 29518 29531 29558 29592 29617 29620 29602 29575 29555 29549 29554 29560 29560 29553 29542 29534 29530 29532 29536 29541 29544 29543 29536 29528 29526 29535 29550 29559 29554 29535 29515 29501 29495 29492 29488
2814 29488 29487 29494 29509 29523 29525 29515 29501 29498 29511 29537 29561 29570 29559 29535 29511 29494 29487 29487 29486 29483 29478 29475 29477 29488 29506 29524 29536 29536 29523 29503 29481 29466 29461 29468 29481 29495 29507 29516 29522 29521 29505
2834.5 29505 29470 29424 29381 29356 29356 29373 29399 29424 29447 29465 29471 29454 29415 29367 29332 29323 29338 29359 29368 29360 29341 29323 29311 29295 29263 29215 29167 29140 29140 29153 29160 29154 29143 29140 29142
2852 29142 29139 29125 29110 29109 29123 29138 29136 29114 29086 29069 29075 29102 29137 29166 29177 29166 29138 29108 29087 29080 29086 29102 29124 29146 29161 29164 29159 29154 29157 29162 29161 29147 29123 29094 29069 29054 29053 29068
2871 29068 29096 29129 29154 29160 29146 29116 29084 29066 29070 29087 29100 29092 29062 29027 29006 29009 29028 29050 29062 29056 29037 29019 29019 29043 29079 29102 29091 29046 28988 28941 28915 28906 28910 28925 28947
2888.5 28947 28966 28971 28957 28937 28925 28929 28937 28930 28902 28863 28833 28828 28847 28874 28893 28893 28877 28857 28849 28859 28881 28897 28893 28869 28842 28832 28849 28882 28912 28930 28937 28939 28937 28925 28906
2906B8906k1j7j3j1rKJ6J9Oj6k6k0mMKmj0j7k7l8m0l2k1j4j2qlJnj3j5r%Joj3j2oj
2925.5B8514lmKJ4K7K8K1Qnj5k2k4j7%J9L1K8J7RNLjj0j2JK4M6M9L2Prj2nkpj3j0O
2944.5B8720K6L8L1J3mrkQJ3J0Jj0j9k1j7lJ4K5K3Nk1m4m9l1jK5L2J4j5m1n0m0j5Q
2961.5B8614K0J4lj8k3k0j4j9k9l9m2l5k0nNPkk2m1m9m1j7PK0J2j1k8k9j3OJ2OklN
2979B8203J4K1K9L7M1L3J6%oJJ0J3J2TJ6J8J1mj9TJL1N1M5J3k7m9m6k9rJRJ4J2ql7
2997B8411o1Tm2k0j0j7k5l0l3m3o2p9q3p5o6o7q1j00j16j29j41j56j71j82j92k04k25
3010.5B5940k59k96l32l59l83m13m50m88n15n21n05m74m34l87l25k42j46m4M7J22J84
3021A9720K37K85L20L43L53L51L44L31L13K93K75K63K57K50K44K34K19J99J77J56J44
$$ plain form
2906 28906 28885 28868 28855 28844 28835 28837 28853 28872 28878 28862 28836 28816 28812 28816 28818 28814 28804 28787 28760 28722 28682 28650 28629 28615 28603 28595 28592 28593 28588 28575 28560 28551 28551 28552 28546 28533 28521 28515 28514
2925.5 28514 28511 28507 28509 28523 28550 28578 28599 28607 28602 28587 28565 28541 28524 28524 28543 28574 28602 28619 28628 28633 28636 28635 28625 28613 28614 28638 28684 28733 28765 28772 28763 28751 28746 28744 28737 28724 28714 28720
2944.5 28720 28746 28784 28815 28828 28824 28815 28813 28821 28834 28844 28845 28835 28816 28795 28778 28775 28789 28814 28837 28842 28821 28777 28728 28697 28696 28721 28753 28767 28752 28711 28661 28621 28606 28614
2961.5 28614 28634 28648 28645 28627 28604 28584 28570 28551 28522 28483 28441 28406 28386 28381 28386 28393 28391 28369 28328 28279 28238 28221 28228 28248 28260 28249 28221 28192 28179 28185 28197 28203 28201 28198 28203
2979 28203 28217 28238 28267 28304 28345 28378 28394 28394 28388 28389 28399 28412 28424 28436 28452 28470 28481 28477 28458 28439 28440 28471 28522 28567 28580 28553 28504 28458 28429 28420 28421 28430 28444 28456 28448 28411
2997 28411 28350 28289 28247 28227 28217 28200 28175 28145 28112 28069 28007 27928 27845 27770 27704 27637 27556 27456 27340 27211 27070 26914 26743 26561 26369 26165 25940
3010.5 25940 25681 25385 25053 24694 24311 23898 23448 22960 22445 21924 21419 20945 20511 20124 19799 19557 19411 19367 19414 19536 19720
3021 19720 19957 20242 20562 20905 21258 21609 21953 22284 22597 22890 23165 23428 23685 23935 24179 24413 24632 24831 25008 25164 25308
3031.5B5308J40TJ35J26J13J03J01J03TR5Q0O5N5N0TM9M8N2N9O5O4N5M4M0TM2L4K1
3045.5B7380J0J3K6M2N0M7M0L2K4J3%pkJ1K4L0K5J8J4J6K2K6K7K2J6Plj0j1pl%LJ2
3062.5B7907K6L5L1J2j0j9j2QK2J9Jj9k5j1J2L1L0J5nj3j2mPJ9K9L3K5J2kojPJ7K8
3079.5B8187L7M0L1J6M%kpj5j9j1MK3L2K7J0qj5nJ6L3L4K1J1RJ6TRKJMKorlRJ1%j3
3099B8492j4LK2L0K0Lj0j1lJ0K3K7J6ok4k7j4QK4K6J5jj1pQK5L3K4Mj5j9nJ5K5J7m
3117B8699k0j8jJ7J8Lj5k4k1j4oNJ6K3J8Lj0j2jJ0J3OJKPJ2J3RLnj3TnMOkj4j9j0P
3137B8672J7J4Jp%J7K9K6Qpj4j0orj6j7lJ9L7L6J4j7l6l1pJ5J9MrqRK1J6mj9j6MK5
3156B8767L2K2Mqj4j3j2j1j0rpnlJPJ3TOrk0k2j2KRNnj1qKJ2J7TQj1l1m2l7j4J1K8
$$ plain form
3031.5 25308 25448 25588 25723 25849 25962 26065 26166 26269 26372 26467 26547 26612 26667 26717 26767 26816 26864 26916 26975 27040 27104 27159 27203 27243 27283 27325 27359 27380
3045.5 27380 27390 27403 27429 27471 27521 27568 27608 27640 27664 27677 27677 27670 27668 27679 27703 27733 27758 27776 27790 27806 27828 27854 27881 27903 27919 27926 27923 27913 27902 27895 27892 27892 27895 27907
3062.5 27907 27933 27968 27999 28011 28001 27982 27970 27978 28000 28019 28020 28001 27976 27965 27977 28008 28038 28053 28048 28035 28023 28019 28026 28045 28074 28107 28132 28144 28142 28136 28135 28142 28159 28187
3079.5 28187 28224 28264 28295 28311 28315 28315 28313 28306 28291 28272 28261 28265 28288 28320 28347 28357 28349 28334 28329 28345 28378 28412 28433 28444 28453 28469 28485 28494 28496 28497 28501 28503 28497 28488 28485 28494 28505 28505 28492
3099 28492 28478 28481 28503 28533 28553 28556 28546 28535 28532 28542 28565 28592 28608 28602 28578 28551 28537 28545 28569 28595 28610 28609 28598 28591 28599 28624 28657 28681 28685 28670 28651 28646 28661 28686 28703 28699
3117 28699 28679 28661 28660 28677 28695 28698 28683 28659 28638 28624 28618 28623 28639 28662 28680 28683 28673 28661 28660 28670 28683 28689 28690 28692 28699 28711 28724 28733 28736 28731 28718 28705 28700 28704 28710 28708 28694 28675 28665 28672
3137 28672 28689 28703 28704 28697 28697 28714 28743 28769 28777 28770 28756 28746 28740 28731 28715 28698 28695 28714 28751 28787 28801 28784 28748 28717 28710 28725 28744 28748 28739 28731 28740 28761 28777 28773 28754 28738 28742 28767
3156 28767 28799 28821 28825 28817 28803 28790 28778 28767 28757 28748 28741 28736 28733 28734 28741 28754 28767 28773 28764 28744 28722 28710 28712 28721 28726 28721 28710 28702 28704 28716 28733 28750 28758 28747 28716 28674 28637 28623 28634 28662
3176B8662L3L4K7J6nl1m6l9j1K6N2N4L0lk7k9j0J3K3J3j0k9l3k2oJjrpLJ1Prk0j4J0
3194B8654L1L3J4rk5k6k2j4mLNJlKJ4K3J9QkmTrj8k5j9oNRTQRPMJKMNONLlj6k9l4k4
3216.5B8588kJ9K5J2j5l9m1k2J2M0N0L8J5nj4ToMQMrk4l2k6nJ6K8K6J6LlpolJMJqj8
3236B8611k1j5pnqj1mJ0K3K2Rqj7j5nMQNlj1j2lJ1K1J5lk2k4j2OJ2Olql%Jmj2j6k1
3256.5B8491k2j4LK4L5L0J1j3k7k5j2JJ1J3J2OJlmk%kpj1j4j1lOJ4TOoj1oLRMqj8j6
3276.5B8459j0mk%RK2K8K2Kj9k7j8KJ6J9J2Lpj5k4l0k3mJ6K0Lj7k0OL9N2L1j0m1m2
3294B8448k0OK3K2Pj3l0Tj1J8L5K7Oj2j5j0Tj4TkRJ0Jpolqk0k1qJ4K3J6NMJ2J5%k5
3313.5B8422m0l7j8KK0K9L6TK4Kk8n0n7m0qK7M6M3K6Q%JK%pj3j0omrj6j7pOJ5J4OJ
$$ plain form
3176 28662 28695 28729 28756 28772 28767 28736 28690 28651 28640 28666 28718 28772 28802 28799 28772 28743 28733 28746 28769 28782 28772 28743 28710 28688 28682 28683 28682 28673 28666 28669 28680 28687 28678 28658 28644 28654
3194 28654 28685 28718 28732 28723 28698 28672 28650 28636 28632 28635 28640 28641 28638 28640 28654 28677 28696 28704 28702 28698 28694 28685 28667 28642 28623 28617 28622 28631 28640 28648 28657 28664 28668 28669 28671 28675 28680 28686 28691 28694 28691 28675 28646 28612 28588
3216.5 28588 28586 28605 28630 28642 28627 28588 28547 28525 28537 28577 28627 28665 28680 28675 28661 28647 28641 28645 28653 28657 28648 28624 28592 28566 28561 28577 28605 28631 28647 28650 28647 28640 28634 28631 28632 28636 28637 28629 28611
3236 28611 28590 28575 28568 28563 28555 28544 28540 28550 28573 28595 28604 28596 28579 28564 28559 28563 28571 28576 28573 28562 28550 28547 28558 28579 28594 28591 28569 28545 28533 28539 28551 28557 28554 28546 28543 28543 28544 28540 28528 28512 28491
3256.5 28491 28469 28455 28458 28482 28517 28547 28558 28545 28518 28493 28481 28482 28493 28506 28518 28524 28525 28522 28518 28516 28516 28514 28507 28496 28482 28471 28468 28474 28488 28502 28508 28502 28491 28485 28488 28497 28501 28493 28475 28459
3276.5 28459 28449 28445 28443 28443 28452 28474 28502 28524 28526 28507 28480 28462 28464 28480 28499 28511 28514 28507 28492 28468 28438 28415 28411 28427 28447 28450 28433 28413 28419 28458 28510 28541 28531 28490 28448
3294 28448 28428 28434 28457 28479 28486 28473 28443 28413 28402 28420 28455 28482 28488 28476 28461 28451 28441 28427 28413 28411 28420 28430 28431 28424 28418 28415 28407 28387 28366 28358 28372 28395 28411 28416 28420 28432 28447 28447 28422
3313.5 28422 28382 28345 28327 28329 28349 28378 28414 28450 28474 28476 28448 28398 28341 28301 28293 28320 28366 28409 28435 28443 28443 28444 28446 28446 28439 28426 28416 28410 28406 28397 28381 28364 28357 28363 28378 28392 28398 28399
3332.5B8399JORQLpj7k2Tj4lPJ2J5J9J8J2%qj2j0omTk%jqj2j0JJ1J5J0jj0j7Tj4j0
3352.5B8315jJ1K4L2K7Nk1l9l5j9n%jJRJ8J7QlolKMLMQJ2J3QJpj2j1nKLlj0j3qknj2
3374B8306j7oJ4L1K8J1j1k2k0j1pmKJ4K5TPk0l9l4j0J8L2K8J6PKnj8k8k4lK0L4K5L
3392B8369j6k2j6olpj1pKOMLRK9M5M1Rl2n4m1oK4K7Lk2k5oJ9L0K3Qkm%LNRJ0lk6m9
3412.5B8320n4l8j1J2K4K9L2K9K0Mj0j5j2nLKpj8k5j7%J8K0Qpj3pNJ5K1K8TJ8kk1k7
3430.5B8347j5KJ0Lj0j3mJ0J7J1JpTnopmNJ7K0J1mj3j2mKMKJMJj3k9l3j6J4L7L5J6
3450B8368JLJ2J1j0l1l3j1J2J1j2l1k7OM3O1M4Nk9m1k6mJ0NlTNRKqlJ9L4K0j8m5l3
3468.5B8313J5O2P4M8Qj5Tpnj3k3k5k2j4rnLJ2J9K1J9TK2J8Kk5m2l9j5J3K6TK1K4K6
$$ plain form
3332.5 28399 28400 28406 28415 28423 28426 28419 28402 28380 28358 28344 28341 28348 28360 28375 28394 28412 28424 28424 28416 28404 28394 28388 28384 28380 28378 28378 28377 28369 28357 28347 28348 28359 28374 28384 28383 28373 28356 28339 28325 28315
3352.5 28315 28314 28325 28349 28381 28408 28413 28392 28353 28318 28299 28294 28294 28293 28294 28303 28321 28338 28346 28343 28337 28334 28336 28340 28343 28347 28355 28367 28380 28388 28389 28382 28370 28359 28354 28356 28359 28356 28346 28333 28325 28323 28318 28306
3374 28306 28289 28283 28297 28328 28356 28367 28356 28334 28314 28303 28296 28292 28294 28308 28333 28358 28365 28345 28306 28272 28262 28280 28312 28340 28356 28363 28365 28360 28342 28314 28290 28287 28307 28341 28366 28369
3392 28369 28353 28331 28315 28309 28306 28299 28288 28281 28283 28289 28293 28296 28305 28334 28379 28420 28429 28397 28343 28302 28296 28320 28347 28350 28328 28303 28297 28316 28346 28369 28377 28375 28371 28371 28374 28379 28388 28398 28395 28369 28320
3412.5 28320 28266 28228 28217 28229 28253 28282 28314 28343 28363 28367 28357 28342 28330 28325 28328 28330 28323 28305 28280 28263 28263 28281 28301 28309 28302 28289 28282 28287 28302 28323 28351 28379 28397 28395 28374 28347
3430.5 28347 28332 28334 28344 28347 28337 28324 28320 28330 28347 28358 28359 28352 28345 28340 28334 28327 28323 28328 28345 28365 28376 28372 28359 28347 28343 28345 28349 28351 28352 28356 28357 28344 28315 28282 28266 28280 28317 28352 28368
3450 28368 28369 28372 28384 28395 28385 28354 28321 28310 28322 28333 28321 28290 28263 28269 28312 28373 28417 28422 28393 28352 28326 28322 28332 28337 28334 28331 28336 28345 28347 28339 28336 28355 28389 28409 28391 28346 28313
3468.5 28313 28328 28390 28464 28512 28520 28505 28490 28483 28478 28465 28442 28417 28395 28381 28372 28367 28370 28382 28401 28422 28441 28460 28482 28500 28502 28477 28435 28396 28381 28394 28420 28446 28467 28491 28517
3486B8517K0jk1k9j9oKJmpkOJ6K6K9K3Rmj2j5j7j8j5lJ4K6TJ8RL%pj6k1j9qknj5j7
3506B8462%K8N0N1K6ql1l8l1j8qkJMOROkj2j1QL9O3O0K6j2l3k1PK7J8j3m5m9k6PK4
3524.5B8562J4j0k2j4LJ5J4J1J3J6J2pk7l6k9j3MJ9L2L6K8Oj0qQK2J5rk6j8RL1L4J7
3541.5B8692jj4j5rRL2M3L0j0m8o1m3j0K0L8M4M3L3J4ok1l2l8Tk5JK2K7J0j1j6mJ5
3558B8671K0Nj9k7j0K0L8K6K%L5P4P0J2o1q8n6oJ3ok8k4mNloRK8K2j2m0l6mK5K7Pq
3576.5B8671qlJTlj5l3n3n5m5l8m8o4n3%P1J18J08N8Ok0j9j1oKK3N5P3N6Ql9m6JO3
3593.5B8756Q0K8n8j11r3l0K3K8Kj4oJ0Trk1j1J1J8Mj4j2QJ8RrTM%m6j05j18n4N2J18
3610.5B8459R5Po9q7n5j5RK1L3M1L9K6J3ml4p5j09j06o4pK9L4K5K1K9L7L2J6%QN3J17
$$ plain form
3486 28517 28537 28536 28515 28486 28467 28461 28463 28464 28460 28453 28451 28457 28473 28499 28528 28551 28560 28556 28544 28529 28512 28494 28479 28476 28490 28516 28542 28560 28569 28572 28572 28565 28549 28528 28509 28501 28499 28494 28479 28462
3506 28462 28462 28490 28540 28591 28617 28609 28578 28540 28509 28491 28483 28481 28482 28486 28492 28501 28507 28505 28493 28482 28490 28529 28592 28652 28678 28666 28633 28612 28619 28646 28664 28651 28606 28557 28531 28538 28562
3524.5 28562 28576 28566 28544 28530 28533 28548 28562 28573 28586 28602 28614 28607 28580 28544 28515 28502 28506 28525 28557 28593 28621 28627 28617 28609 28617 28639 28654 28645 28619 28601 28610 28641 28675 28692
3541.5 28692 28691 28677 28662 28653 28662 28694 28737 28767 28757 28709 28648 28605 28595 28615 28653 28697 28740 28773 28787 28781 28760 28728 28690 28652 28627 28628 28650 28677 28687 28676 28660 28656 28671
3558 28671 28691 28696 28677 28650 28640 28660 28698 28724 28726 28726 28761 28835 28905 28917 28856 28768 28712 28706 28719 28713 28685 28661 28657 28662 28659 28653 28662 28690 28712 28700 28660 28624 28620 28645 28672 28679 28671
3576.5 28671 28663 28660 28661 28662 28659 28644 28611 28558 28503 28458 28420 28372 28308 28255 28255 28326 28444 28552 28610 28616 28596 28577 28566 28560 28562 28585 28640 28713 28769 28777 28738 28692 28693 28756
3593.5 28756 28836 28864 28806 28695 28602 28572 28595 28623 28625 28611 28605 28615 28625 28616 28595 28584 28595 28613 28617 28603 28591 28599 28617 28626 28617 28608 28612 28612 28566 28461 28343 28289 28341 28459
3610.5 28459 28554 28561 28492 28405 28350 28335 28344 28365 28398 28439 28478 28504 28517 28513 28479 28404 28295 28189 28125 28118 28147 28181 28206 28227 28256 28293 28325 28341 28341 28349 28402 28519
3626.5B8519J58J22Nj40k25k00q3M8J25J23O8Qk6k8oK3M3M7L3J3kpjPJ4J6J7J9K1J7
3641.5B8728Nj5k7j3L5R4J31J13L7n8j16r8j7O5Q1J2r5j57j28l8N0Q6P9O4N9M5ko3
3655.5B8857r6p2j5K7K8%k2j5J3M2N5M3Rk9m6l5oJ2J1MJ1L4N5N7L8Lm7j04j47j40p4
3671B8451K5J17J73J91J63P5o6k07k65k06p9K8N3J8k4l5k3j5k6m3n4m7j6L3P4P6M0
3684.5B8411%jL3N2J5n1p2j7O9R6L4n3p6j1P2R4L8l3n1j6K8M4L4K8L1K6Kk1j0L5P7
3700B8807O5%p5j02o8rL3L2Oj9j7K0O9R3O1j9q4p5J3J12J34N4o6j33j10l6K1L0J3j
3715B8749KJ1J6J8J3Jj2%M6R5TK1q3j35r1J2J03J28R1K0n2j03j19r0l7J2L7N4P1P4
3730B8947K9n1r7m4P8J61J19k1j33j23j8Q0R2K4o2j02p3OQ2R5L9k0JJ04J65N5k02m11
$$ plain form
3626.5 28519 28677 28799 28804 28664 28439 28239 28156 28204 28329 28452 28520 28528 28502 28474 28468 28491 28534 28581 28614 28627 28625 28618 28617 28624 28638 28654 28671 28690 28711 28728
3641.5 28728 28733 28718 28691 28678 28713 28807 28938 29051 29088 29030 28914 28816 28799 28864 28945 28957 28862 28705 28577 28539 28589 28675 28754 28818 28877 28922 28920 28857
3655.5 28857 28761 28689 28674 28701 28729 28729 28707 28692 28705 28747 28802 28845 28854 28825 28779 28744 28738 28750 28761 28765 28776 28810 28865 28922 28960 28963 28916 28812 28665 28525 28451
3671 28451 28476 28593 28766 28957 29120 29195 29129 28922 28657 28451 28372 28400 28453 28471 28447 28412 28389 28374 28348 28305 28251 28204 28188 28221 28295 28371 28411
3684.5 28411 28411 28410 28443 28495 28510 28459 28387 28370 28439 28535 28569 28516 28440 28429 28501 28595 28633 28600 28549 28533 28561 28605 28639 28667 28698 28724 28726 28705 28695 28730 28807
3700 28807 28872 28872 28797 28695 28627 28618 28651 28683 28689 28670 28653 28673 28742 28835 28896 28877 28793 28718 28731 28843 28977 29031 28965 28832 28722 28686 28707 28737 28750 28749
3715 28749 28751 28762 28778 28796 28809 28810 28798 28798 28844 28939 29034 29055 28972 28837 28746 28758 28861 28989 29080 29100 29048 28945 28826 28736 28699 28711 28748 28802 28873 28947
3730 28947 28976 28925 28828 28784 28862 29023 29142 29121 28988 28865 28847 28927 29019 29043 28981 28879 28806 28812 28894 28989 29028 29008 29009 29113 29278 29333 29131 28720
3744B8720l81j30J59L07K83J87J06K8p9j74j70m9Q5J05jj26j50o5M9J07R3L8k1n8n3
3756.5B8810lO2P8J7q4j35r2J0Q4Q2L2mJ2N4O8L3l4q3q6l9K3O4N5Jo0q9o7j3L7N3L5
3772B8821Oj3TkNkj4j5J5N8P7L9m6j16j18n2K8O7O3M8N3O1L9j6p1q5m8PM6TJ8j9m5
3788.5B8822m2j6J5L0K1Lj2j1QL9O7P3L9k4q2j03p6k4L7R4J39J41Q1k8j28j64j36q0
3802.5B8683k7K7R8J64J65O8q2j91j88r1K2Q3P8M2J2NT%qJM2R5J07L2j06k15k12r4
3816.5B8515N7J55J80J67J49J02pj55k52k29j05K2Q1P5N6N9O5L5k5p1o8k8J1K6L1L6
3829.5B8882L3Mm4o9l5L3O4J2p9j12l4R4J47O8p0j28m8Q2J21K3j13j49m6R6J44O4o3
3843B8877j18p2J5O0M5J5RK2K1jj0K5Q3J09P6K4MJ0k8j45k75k90j40Q3K23J98O5m3
$$ plain form
3744 28720 28339 28209 28368 28675 28958 29145 29251 29279 29200 29026 28856 28807 28892 28997 28996 28870 28720 28655 28704 28811 28904 28942 28921 28863 28810
3756.5 28810 28807 28869 28947 28964 28880 28745 28653 28663 28747 28829 28861 28857 28869 28923 28991 29024 28990 28907 28821 28782 28805 28869 28924 28925 28865 28776 28709 28696 28733 28786 28821
3772 28821 28827 28814 28801 28799 28804 28802 28788 28773 28788 28846 28923 28962 28916 28800 28682 28630 28658 28725 28788 28836 28889 28950 28989 28973 28902 28817 28769 28776 28822 28868 28886 28867 28822
3788.5 28822 28780 28764 28779 28809 28830 28833 28821 28810 28818 28857 28924 28997 29036 29012 28930 28827 28751 28727 28764 28858 28997 29138 29219 29191 29063 28899 28763 28683
3802.5 28683 28656 28683 28781 28945 29110 29178 29096 28905 28717 28626 28648 28731 28809 28851 28863 28868 28873 28873 28865 28866 28908 29003 29110 29142 29036 28821 28609 28515
3816.5 28515 28572 28727 28907 29074 29223 29325 29318 29163 28911 28682 28577 28599 28680 28755 28811 28870 28935 28970 28945 28874 28806 28778 28789 28815 28846 28882
3829.5 28882 28915 28919 28875 28806 28771 28804 28868 28880 28801 28689 28655 28749 28896 28964 28894 28766 28718 28800 28921 28944 28831 28682 28636 28732 28876 28940 28877
3843 28877 28759 28687 28702 28762 28807 28822 28831 28853 28874 28873 28863 28888 28971 29080 29156 29180 29184 29194 29166 29021 28746 28456 28316 28399 28622 28820 28885 28842
3857B8842n5nL6M5M2M4L5km8n3lN9O7Lq9j35j06k5N8J16J47J52J13K1r9j82j70o6O0
3871.5B8802J25R2or4j21q4j9K7L5J7J0M0R0J09M7p2j66j61o2M6R2P1M6N9Q2N6l8j37
3885.5B8886j58q3K8R3Q5M6K6K9J7k9p9q6l5L7P4N3kn1o9m7RP1R8N6m0j15j03j1Q0
3900B8780Q6J0o8p4qO5Q2M7Kj9k1Tk8Tj7JRKj4k2j0J4L6L4Ok7l4jN2P3L5m1r7q3qP2
3918B8785R7N5j6o0m8nK8L1J2mj0j5k7m2m4k3RL1L3K0QRJ8K0Kk9n4Tk6NJ3ol4l9j0
3935.5B8630L4O1N3J9j7l1j7J3M4N4L6lm1n4l9j1POkoj%pj2nJ2K1J5jj0nRJ5J2KkK
3954B8781J1J7TJ0rl2m5l8rK7M8L6Kl3m1j5K2L9K6ol2l6k0JJ3TMj2k5l0k0jK2L3K6
3971.5B8744jl8n7m0J2O4Q2N2Lk7k4mO%plQOj2l3m0k9pJ1J5J0LJQJ7K4K0Prj9j7mJ6
$$ plain form
3857 28842 28787 28782 28818 28863 28905 28949 28984 28982 28934 28881 28878 28937 29004 29007 28918 28783 28677 28652 28710 28826 28973 29125 29238 29259 29160 28978 28808 28742 28802
3871.5 28802 28927 29019 29013 28919 28798 28714 28695 28722 28757 28774 28784 28824 28914 29023 29070 28998 28832 28671 28609 28655 28747 28818 28864 28923 29005 29061 29023 28886
3885.5 28886 28728 28645 28673 28766 28851 28897 28923 28952 28969 28940 28861 28775 28740 28777 28851 28904 28902 28851 28782 28735 28744 28815 28913 28969 28929 28814 28711 28700 28780
3900 28780 28866 28876 28808 28734 28726 28791 28873 28920 28922 28903 28882 28861 28833 28805 28788 28789 28798 28800 28786 28764 28754 28768 28804 28838 28844 28817 28783 28782 28834 28907 28942 28901 28804 28721 28713 28785
3918 28785 28882 28937 28921 28861 28813 28808 28836 28867 28879 28875 28865 28850 28823 28781 28737 28714 28723 28754 28787 28807 28815 28824 28842 28862 28864 28835 28781 28727 28701 28706 28719 28713 28679 28640 28630
3935.5 28630 28664 28725 28778 28797 28780 28749 28732 28745 28789 28843 28879 28876 28835 28781 28742 28731 28738 28744 28742 28736 28735 28735 28728 28716 28711 28723 28744 28759 28758 28748 28743 28752 28767 28779 28781 28779 28781
3954 28781 28792 28809 28826 28836 28827 28795 28750 28712 28703 28730 28778 28814 28816 28783 28742 28727 28749 28788 28814 28808 28776 28740 28720 28721 28734 28747 28751 28739 28714 28684 28664 28663 28685 28718 28744
3971.5 28744 28743 28705 28648 28608 28620 28684 28766 28818 28821 28794 28770 28766 28772 28772 28765 28762 28770 28776 28764 28731 28691 28662 28655 28666 28681 28691 28694 28695 28703 28720 28744 28764 28771 28762 28743 28726 28722 28738
3990.5B8738K6J8pl3m1k3OK6K4Rj0j7Tj3q%J3K6L2K7J0j3l7n0m6k3J2L8M2K1oj9j2
4007B8693MPlj0LK8M7L7Nk9m4l8j7KJ2J4Pmj7k4k0lJ7L4L3J5j0k8l0j8lNQJ2J5Qj0
4025.5B8698l5m0j5K7N9N1J3k5l2j0J7K2Lj7k5k0j5j4nJ9M5N3L1j2m7n5l7j4lpj3o
4041.5B8591J7M3N4L9Ll1m8m0j4J2K8L1K5J7RNJjlj1k5l8Tj9QL0TJ7Krj5k2k6k0jK1
4059.5B8622L2K6Qrj5qNK0K3J2oj6j0PJ4Nj5l0k7rJ7L7L9K2rl5l8j6J6L6TK1Kj3k8
4077B8716l6l0qK0L2J9j3m3n2l7j3PJ5J7J8J9J7J1Jrj5k0k4k7k5j3RL4M7L8Qk8m8l9
4094B8548j1J4K2J5OQJ3Roj9j8lRMrj2MK9L6J7j3k6j1J8L2J4k4n5n1j5K6M4L0KpJ1
4112B8631L9M7K5j0l3l0j8j6k5k7j2J3K6J8KmQK1J5j2m3n5m1j9%PJ3K5L9M1K1j3m1
$$ plain form
3990.5 28738 28764 28782 28775 28742 28701 28678 28684 28710 28734 28743 28733 28716 28699 28686 28678 28678 28691 28717 28749 28776 28786 28773 28736 28686 28640 28617 28629 28667 28709 28730 28724 28705 28693
4007 28693 28697 28704 28701 28691 28694 28722 28769 28806 28811 28782 28738 28700 28683 28685 28697 28711 28718 28714 28697 28673 28653 28650 28667 28701 28734 28749 28739 28711 28681 28663 28660 28665 28673 28685 28700 28708 28698
4025.5 28698 28663 28623 28608 28635 28694 28745 28758 28733 28701 28691 28708 28730 28733 28716 28691 28671 28656 28642 28637 28656 28701 28754 28785 28773 28726 28671 28634 28620 28617 28610 28597 28591
4041.5 28591 28608 28651 28705 28744 28747 28716 28668 28628 28614 28626 28654 28685 28710 28727 28736 28741 28742 28741 28738 28727 28702 28664 28626 28607 28615 28645 28675 28692 28694 28685 28670 28648 28622 28602 28601 28622
4059.5 28622 28654 28680 28688 28679 28664 28656 28661 28681 28704 28716 28710 28694 28684 28691 28705 28710 28695 28665 28638 28629 28646 28683 28722 28744 28735 28700 28662 28646 28662 28698 28734 28755 28757 28744 28716
4077 28716 28680 28650 28642 28662 28694 28713 28700 28657 28605 28568 28555 28562 28577 28594 28612 28631 28648 28659 28660 28651 28636 28616 28592 28565 28540 28527 28536 28570 28617 28655 28663 28635 28587 28548
4094 28548 28537 28551 28573 28588 28594 28602 28615 28624 28618 28599 28581 28578 28587 28591 28582 28570 28574 28603 28639 28656 28643 28617 28606 28624 28656 28670 28646 28591 28540 28525 28551 28595 28625 28627 28620 28631
4112 28631 28670 28717 28742 28732 28699 28669 28651 28635 28610 28583 28571 28584 28610 28628 28630 28626 28634 28655 28670 28658 28615 28560 28519 28500 28500 28507 28520 28545 28584 28625 28646 28633 28592
4128.5B8592m3k2KJ8K3L2M5N1L5Jl0l9k6rnj9l2l4j7J4M5O1M8J0l5o1n8l6j2JPJ2J8
4145B8537K1J4MjJMNkj2k5l3l1j6J2L4L8K1j1l3l9k7rOJ4K3L5M6M1J4k2m9n0l1j0L
4162.5B8472J0K1L4TJ2k4m5l4OM6N9L8jl5m8m5l5k9k1nJ9M3M7K8Kr%J7J3k4p2r9q4
4179B8291l4J7M3L7J9QMlk0l9m3l0j1LJ2K5M0TJ2l4o3n2j3K2K8J1j2k5k8k6j9j1Tk5
4196B8113m6n7m8l0j8k3l0k4oOnl4o8q5q1o8n7n3n0m8m9n9q0j04j14j01p1m8m3n3o3
4211.5B6503n7l5j2kj2l1m2k5J8O7R5R0N7K5J6L5O8R6J10J05Q6N9L7L1M3O1P2O4M0
4226B7562J3jOL1N7O4M2J0qPM0O1N1J1k9m0j5L0O3TL1j0k5rK1L7K8RLJ5L1K9Rj6l7
4243.5B8134n2o0n3k3K0N6O2M2J7NTQJqj3j0mkoj0j2rKJ2J4Q%jOJ2TP%TKLTNJ1J3J0
$$ plain form
4128.5 28592 28549 28527 28529 28547 28570 28602 28647 28698 28733 28734 28704 28665 28639 28630 28625 28606 28574 28540 28523 28537 28582 28643 28691 28701 28666 28605 28547 28511 28499 28500 28507 28519 28537
4145 28537 28558 28572 28576 28575 28576 28580 28585 28583 28571 28546 28513 28482 28466 28478 28512 28550 28571 28560 28527 28488 28461 28452 28458 28472 28495 28530 28576 28617 28631 28609 28560 28510 28479 28469 28472
4162.5 28472 28482 28503 28537 28571 28583 28559 28514 28480 28486 28532 28591 28629 28628 28593 28545 28500 28465 28436 28415 28410 28429 28472 28519 28547 28549 28540 28540 28557 28570 28546 28474 28375 28291
4179 28291 28257 28274 28317 28354 28373 28381 28385 28382 28362 28323 28280 28250 28239 28242 28254 28279 28319 28359 28371 28337 28274 28222 28209 28231 28259 28270 28258 28233 28205 28179 28160 28149 28138 28113
4196 28113 28067 28010 27962 27932 27914 27891 27861 27837 27831 27837 27832 27798 27730 27645 27564 27496 27439 27386 27336 27288 27239 27180 27100 26996 26882 26781 26710 26662 26619 26566 26503
4211.5 26503 26446 26411 26399 26397 26385 26354 26312 26287 26305 26372 26467 26557 26614 26639 26655 26690 26758 26854 26964 27069 27155 27214 27251 27282 27325 27386 27458 27522 27562
4226 27562 27575 27574 27580 27611 27668 27732 27774 27784 27776 27783 27823 27884 27935 27946 27917 27877 27862 27892 27955 28018 28049 28039 28014 28005 28026 28063 28091 28100 28103 28118 28149 28178 28187 28171 28134
4243.5 28134 28082 28022 27969 27946 27966 28022 28084 28126 28143 28148 28153 28161 28162 28154 28141 28131 28127 28125 28119 28109 28097 28088 28090 28102 28116 28124 28124 28123 28129 28141 28153 28160 28160 28160 28162 28165 28168 28173 28184 28197 28207
4264B8207LlokMJ6K7L0J7rl1l5j6J5L9M3K5lk4TmK3M0L1%l5n6n2k4J4M3M6K5jj7rJ4
4282.5B8311L2L9L2K0Pj0k8m1l7j4J7L7L5J4j1k4j5RL6M7L3Lk7m3m2l0k0j1jJ2K4K5
4298.5B8379J4mk0k4k2j4oMRQmj9k6j6PL0M4M6L5J6lj8TnJ1J6QjOK2L1J4k5o3p1m3
4316.5B8298JL4M3K7jl0n0n1k8J4N5P5N8K0j4k4j4nqj2JK6L8Rm8q9p2pN3O0J2m1m9
4333B8281qM4O0K8k1n0l9kL6N6N4L8J2j6m0n3m9l8k2rOJ5J8RnqJJ3Pj3l3k7J0N6Q2
4350.5B8393P0K8j5l4k4NK5K2Oqj0qj7l3l8k2OJ9J3lmJ2K5J9jj4qNOj4m3n5l2J3M9
4368B8333M8Mn1p6n0QN7O9N4L5K5J9Lj6k4j0QJ2ql4m4l0qNKlLJ5J9Lk1l1j4J6L4K7
4386B8379Lj9l7n1n3l0K0O7P5M2lk3j8j6k6l9m1k9oL1P9R3J6j24j73M5K39M37
$$ plain form
4264 28207 28210 28207 28201 28199 28203 28219 28246 28276 28293 28284 28253 28218 28202 28217 28256 28299 28324 28321 28297 28273 28269 28292 28332 28363 28363 28328 28272 28220 28196 28210 28253 28299 28324 28323 28306 28297 28311
4282.5 28311 28343 28382 28414 28434 28441 28431 28403 28362 28325 28311 28328 28365 28400 28414 28403 28379 28364 28373 28409 28456 28489 28492 28465 28422 28380 28350 28330 28319 28318 28330 28354 28379
4298.5 28379 28393 28389 28369 28345 28323 28309 28303 28307 28316 28324 28320 28301 28275 28259 28266 28296 28340 28386 28421 28437 28434 28416 28398 28393 28404 28420 28428 28427 28433 28455 28486 28500 28475 28412 28341 28298
4316.5 28298 28299 28333 28376 28403 28402 28372 28322 28271 28243 28257 28312 28387 28445 28465 28451 28427 28413 28408 28400 28388 28389 28415 28453 28462 28414 28325 28253 28246 28299 28359 28371 28330 28281
4333 28281 28273 28317 28377 28405 28384 28334 28295 28293 28329 28385 28439 28477 28489 28473 28433 28380 28331 28293 28271 28262 28268 28283 28301 28310 28305 28297 28298 28311 28318 28305 28272 28245 28255 28311 28393
4350.5 28393 28463 28491 28476 28442 28418 28423 28448 28470 28476 28468 28458 28450 28433 28400 28362 28340 28346 28365 28378 28375 28371 28383 28408 28427 28426 28412 28404 28409 28415 28401 28358 28303 28271 28284 28333
4368 28333 28381 28385 28334 28258 28208 28216 28273 28342 28396 28431 28456 28475 28478 28462 28438 28428 28436 28448 28440 28406 28362 28332 28324 28329 28331 28328 28331 28346 28365 28368 28347 28316 28302 28318 28352 28379
4386 28379 28382 28363 28326 28275 28222 28192 28212 28279 28354 28396 28393 28370 28352 28336 28310 28271 28230 28201 28195 28226 28305 28398 28414 28290 28117 28162 28401 28838
4400B8838
$$ plain form
4400 28838
##END=  $$ end of CHCl3
##TITLE= deuterochloroform
##JCAMP-DX= 5.01
##DATA TYPE= INFRARED SPECTRUM
##DATA CLASS= XYDATA
##BLOCK ID= 2
##ORIGIN= Department of Chemistry, UWI, JAMAICA
##OWNER= public domain
##LONGDATE= 2012/02/20 19:49:53.0481 -0500 $$ export date from JSpecView
##$MODELS=
<Models>
<ModelData id="cdcl3" type="MOL">
CDCl3
RLDSViewer          3D                             0

  5  4  0  0  0  0  0  0  0  0999 V2000
    0.0000    0.0000    0.4971 C   0  0  0  0  0  0  0  0  0  1
    0.0000    0.0000    1.5871 H   0  0  0  0  0  0  0  0  0  2
    0.0000    1.6593   -0.0896 Cl  0  0  0  0  0  0  0  0  0  3
   -1.4370   -0.8297   -0.0896 Cl  0  0  0  0  0  0  0  0  0  4
    1.4370   -0.8297   -0.0896 Cl  0  0  0  0  0  0  0  0  0  5
  1  2  1  0  0  0
  1  3  1  0  0  0
  1  5  1  0  0  0
  1  4  1  0  0  0
M  END
</ModelData>
<ModelData id="3" type="XYZVIB" baseModel="cdcl3" vibrationScale=".2">
5
Model[1]: Convg=0.7033D-08;-V/T=2.0004;Energy=NaN;Range=M.O.s;E(RHF)=-1416.86840659 A.U.;PATH=Calculation 1;Input
C     0.00000    0.00000    0.00000
H     0.00000    0.00000    1.09000
Cl    1.65934    0.00000   -0.58667
Cl   -0.82967    1.43703   -0.58667
Cl   -0.82967   -1.43703   -0.58667
5
Model[2]: Convg=0.7033D-08;-V/T=2.0004;Energy=-1416.8685;Range=M.O.s;E(RHF)=-1416.86840659 A.U.;PATH=Calculation 1;Standard
C     0.00000    0.00000    0.49707
H     0.00000    0.00000    1.58707
Cl    0.00000    1.65934   -0.08960
Cl   -1.43703   -0.82967   -0.08960
Cl    1.43703   -0.82967   -0.08960
5
Model[3]: IRIntensity=0.3557 KM/Mole;ReducedMass=26.2449 AMU;ForceConstant=1.3644 mDyne/A;Frequency=297.0416 cm^-1;FrequencyLabel=E;PATH=Calculation 1;FrequenciesFrequencies
C     0.00000    0.00000    0.49707   -0.31000    0.00000    0.00000
H     0.00000    0.00000    1.58707   -0.44000    0.00000    0.00000
Cl    0.00000    1.65934   -0.08960    0.52000    0.00000    0.00000
Cl   -1.43703   -0.82967   -0.08960   -0.20000   -0.42000    0.03000
Cl    1.43703   -0.82967   -0.08960   -0.20000    0.42000   -0.03000
5
Model[4]: IRIntensity=0.3557 KM/Mole;ReducedMass=26.2449 AMU;ForceConstant=1.3644 mDyne/A;Frequency=297.0416 cm^-1;FrequencyLabel=E;PATH=Calculation 1;FrequenciesFrequencies
C     0.00000    0.00000    0.49707    0.00000    0.31000    0.00000
H     0.00000    0.00000    1.58707    0.00000    0.44000    0.00000
Cl    0.00000    1.65934   -0.08960    0.00000    0.44000    0.03000
Cl   -1.43703   -0.82967   -0.08960    0.42000   -0.28000   -0.02000
Cl    1.43703   -0.82967   -0.08960   -0.42000   -0.28000   -0.02000
5
Model[5]: IRIntensity=0.8827 KM/Mole;ReducedMass=20.8013 AMU;ForceConstant=2.0780 mDyne/A;Frequency=411.7711 cm^-1;FrequencyLabel=A1;PATH=Calculation 1;FrequenciesFrequencies
C     0.00000    0.00000    0.49707    0.00000    0.00000   -0.49000
H     0.00000    0.00000    1.58707    0.00000    0.00000   -0.50000
Cl    0.00000    1.65934   -0.08960    0.00000    0.41000    0.06000
Cl   -1.43703   -0.82967   -0.08960   -0.35000   -0.20000    0.06000
Cl    1.43703   -0.82967   -0.08960    0.35000   -0.20000    0.06000
5
Model[6]: IRIntensity=11.7197 KM/Mole;ReducedMass=8.0233 AMU;ForceConstant=2.6203 mDyne/A;Frequency=744.5117 cm^-1;FrequencyLabel=A1;PATH=Calculation 1;FrequenciesFrequencies
C     0.00000    0.00000    0.49707    0.00000    0.00000    0.67000
H     0.00000    0.00000    1.58707    0.00000    0.00000    0.70000
Cl    0.00000    1.65934   -0.08960    0.00000    0.11000   -0.08000
Cl   -1.43703   -0.82967   -0.08960   -0.10000   -0.06000   -0.08000
Cl    1.43703   -0.82967   -0.08960    0.10000   -0.06000   -0.08000
5
Model[7]: IRIntensity=150.8250 KM/Mole;ReducedMass=7.7939 AMU;ForceConstant=3.4807 mDyne/A;Frequency=870.6255 cm^-1;FrequencyLabel=E;PATH=Calculation 1;FrequenciesFrequencies
C     0.00000    0.00000    0.49707    0.00000    0.70000    0.00000
H     0.00000    0.00000    1.58707    0.00000    0.69000    0.00000
Cl    0.00000    1.65934   -0.08960    0.00000   -0.15000    0.07000
Cl   -1.43703   -0.82967   -0.08960   -0.06000   -0.05000   -0.03000
Cl    1.43703   -0.82967   -0.08960    0.06000   -0.05000   -0.03000
5
Model[8]: IRIntensity=150.8250 KM/Mole;ReducedMass=7.7939 AMU;ForceConstant=3.4807 mDyne/A;Frequency=870.6255 cm^-1;FrequencyLabel=E;PATH=Calculation 1;FrequenciesFrequencies
C     0.00000    0.00000    0.49707    0.70000    0.00000    0.00000
H     0.00000    0.00000    1.58707    0.69000    0.00000    0.00000
Cl    0.00000    1.65934   -0.08960   -0.02000    0.00000    0.00000
Cl   -1.43703   -0.82967   -0.08960   -0.12000   -0.06000   -0.06000
Cl    1.43703   -0.82967   -0.08960   -0.12000    0.06000    0.06000
5
Model[9]: IRIntensity=40.5189 KM/Mole;ReducedMass=1.1034 AMU;ForceConstant=1.3066 mDyne/A;Frequency=1417.6560 cm^-1;FrequencyLabel=E;PATH=Calculation 1;FrequenciesFrequencies
C     0.00000    0.00000    0.49707    0.00000   -0.09000    0.00000
H     0.00000    0.00000    1.58707    0.00000    1.00000    0.00000
Cl    0.00000    1.65934   -0.08960    0.00000    0.00000    0.01000
Cl   -1.43703   -0.82967   -0.08960    0.00000    0.00000   -0.01000
Cl    1.43703   -0.82967   -0.08960    0.00000    0.00000   -0.01000
5
Model[10]: IRIntensity=40.5189 KM/Mole;ReducedMass=1.1034 AMU;ForceConstant=1.3066 mDyne/A;Frequency=1417.6560 cm^-1;FrequencyLabel=E;PATH=Calculation 1;FrequenciesFrequencies
C     0.00000    0.00000    0.49707   -0.09000    0.00000    0.00000
H     0.00000    0.00000    1.58707    1.00000    0.00000    0.00000
Cl    0.00000    1.65934   -0.08960    0.00000    0.00000    0.00000
Cl   -1.43703   -0.82967   -0.08960    0.00000    0.00000   -0.01000
Cl    1.43703   -0.82967   -0.08960    0.00000    0.00000    0.01000
5
Model[11]: IRIntensity=0.0972 KM/Mole;ReducedMass=1.0897 AMU;ForceConstant=6.7234 mDyne/A;Frequency=3236.0024 cm^-1;FrequencyLabel=A1;PATH=Calculation 1;FrequenciesFrequencies
C     0.00000    0.00000    0.49707    0.00000    0.00000   -0.09000
H     0.00000    0.00000    1.58707    0.00000    0.00000    1.00000
Cl    0.00000    1.65934   -0.08960    0.00000    0.00000    0.00000
Cl   -1.43703   -0.82967   -0.08960    0.00000    0.00000    0.00000
Cl    1.43703   -0.82967   -0.08960    0.00000    0.00000    0.00000
</ModelData>
</Models>
##$PEAKS=
<Peaks type="IR" xUnitsExpected="1/cm"  >
<PeakData id="1" title="A1- C-D stretch (~2254 cm-1)" peakShape="broad" model="3.11" xMax="2285" xMin="2225"    />
<PeakData id="2" title="E- C-D bend (~910 cm-1)" peakShape="broad" model="3.10" xMax="930" xMin="890"    />
<PeakData id="3" title="E-asymm bend of CCl group (~773 cm-1)" peakShape="broad" model="3.8" xMax="790" xMin="730"    />
<PeakData id="4" title="A1-symm bend of CCl group (~671 cm-1)" peakShape="broad" model="3.6" xMax="690" xMin="660"
</Peaks>
##XUNITS= 1/CM
##YUNITS= TRANSMITTANCE
##XFACTOR=1.0000000000
##YFACTOR=0.0000312500
##FIRSTX=520.00000000
##LASTX=4400.00000000
##FIRSTY=0.61121875
##DELTAX=1.00000000
##NPOINTS=3881
##XYDATA=(X++(Y..Y))
520A9559K43K20P2o8L0J63N4j21L3M39O37M95J76j33k80j35J90L70TM63O66O95M66
543B4604K56J51l5l22l59P4O00P03M21J81J93K67J99R4J69L81M75L16L7j33r7N8J79
566B8412K37K91L54L25J59j4l9N0J03Q6P9J25J67J69J41R9Q0J19J85J83Q6j3k7K4N5
591C1436K8l6o7K4J87K64J64%j03j00l7J5J4k2j6N2J13Q4%o9j03k6Q8J08Kj00j10o4
619C1726o0p9o5k4oJ6R7J83J68M4l9TK3M7Qlo4j10j40j65k31l55n26p24r46j169j375
646B6192j562j703j680j318n43N11J521K143K197J782J205P63N52M82M34L54K53J60
664C1743Q9J0p9j17l9J05J77J11%k5j1J6Tnl4o0q2r0p6n5o1r6j25j15p9o6q9j27j52
693C0684j74k16k69k92k68k55l05m02m68m76m77n26o27p27p92q42r32j078j227j310
$$ plain form
520 19559 19802 20022 20094 20026 20056 20219 20273 20152 20185 20624 21261 21756 21932 21799 21519 21384 21574 21944 22314 22777 23443 24138 24604
543 24604 24860 25011 24976 24654 24295 24369 24969 25672 26093 26274 26467 26734 26933 27027 27196 27577 28052 28368 28405 28272 28175 28233 28412
566 28412 28649 28940 29294 29619 29778 29764 29725 29775 29878 29964 30043 30168 30335 30504 30645 30744 30824 30943 31128 31311 31397 31384 31357 31381 31436
591 31436 31464 31428 31361 31385 31572 31836 32000 32000 31897 31797 31760 31775 31789 31767 31751 31803 31916 32000 32000 31931 31828 31802 31890 31998 32000 31900 31790 31726
619 31726 31666 31587 31522 31498 31492 31508 31605 31788 31956 32000 31961 31922 31945 31992 32000 31997 31933 31823 31683 31518 31287 30932 30406 29682 28736 27567 26192
646 26192 24630 22927 21247 19929 19386 19897 21418 23561 25758 27540 28745 29508 30060 30542 30976 31330 31583 31743
664 31743 31832 31842 31763 31646 31607 31712 31889 32000 32000 31975 31964 31980 31996 31991 31957 31897 31815 31725 31649 31594 31533 31437 31312 31197 31118 31052 30963 30836 30684
693 30684 30510 30294 30025 29733 29465 29210 28905 28503 28035 27559 27082 26556 25929 25202 24410 23568 22636 21558 20331 19021
713A9021j329j362j440j511j500j392j223j022p94n80m90n35n13k27J57K58L0k11k01
732E136J1J66J38Pj02j45j39q3JP7J15J30J53J75K04L68P90J377J846K033J990J862
754A6110J761J680J558J362J133R26P71O71O20N92N49M73L86L24L09L16L03K58K04
773C0306J75J60J37J17J14J18J01P5N6N9P0P9P7N6L1K4L4M0L4K9K7J5nj7%K3J8k2m6
802C1885j3M8O5J5k4n0k6RK0Qj2j6jK5M1K6nl8l3KK7K5Kj7k5k0JK7L9J5k3m1k3PJ7
837C1937PKTmk2l3l5m0Tk1QJ5k1o6p2l9j7k9n0m8l0k9m8p0p4o2n4o0o5n3k6j7m3r6
871C0707j51j87j92j68j40j43k02k93l61l66l43l48l98m51m74m78m97n41o16p39r22
892B2697j146j375j602j863k148k346k308j986j470r32m87j81j6L8L1j3o0Tj1L3M5
$$ plain form
713 19021 17692 16330 14890 13379 11879 10487 9264 8242 7448 6868 6378 5843 5330 5103 5260 5518 5548 5337 5136
732 5136 5147 5313 5451 5458 5356 5211 5072 4989 4990 5067 5182 5312 5465 5640 5844 6212 7002 8379 10225 12258 14248 16110
754 16110 17871 19551 21109 22471 23604 24530 25301 25972 26592 27184 27733 28206 28592 28916 29225 29541 29844 30102 30306
773 30306 30481 30641 30778 30895 31009 31127 31228 31303 31359 31418 31488 31567 31644 31700 31731 31755 31789 31829 31863 31892 31919 31934 31929 31912 31912 31935 31953 31931 31885
802 31885 31872 31920 31985 32000 31976 31926 31900 31909 31929 31937 31925 31909 31908 31933 31974 32000 31995 31957 31924 31926 31953 31978 31980 31963 31938 31918 31919 31946 31985 32000 31977 31936 31913 31920 31937
837 31937 31944 31946 31948 31944 31922 31889 31854 31814 31774 31753 31761 31776 31755 31689 31617 31578 31561 31532 31482 31434 31404 31375 31327 31257 31183 31121 31067 31007 30942 30889 30863 30846 30803 30707
871 30707 30556 30369 30177 30009 29869 29726 29524 29231 28870 28504 28161 27813 27415 26964 26490 26012 25515 24974 24358 23619 22697
892 22697 21551 20176 18574 16711 14563 12217 9909 7923 6453 5521 5034 4853 4837 4875 4906 4893 4833 4773 4762 4795 4840
913D840Q4K50O32J252J958K475K627K439K083J727J444J228J057R16P88O60N35M38
931B7433L91L74L45K92K31J89J67J63J68J69J52J23R6Q5Q2TQ0P2N6M9N9P6TN5L5TM0
958C1175L5K4K1L2M3M1K9J6J1J3J7TJ5J2QJkJ2K5J9j0l8m0j6QJ1qk6k2kOkj0nJ7L1
994C1458L0J8J0PTOQJ5J6J1MLNMJKQNpj5oJ5K1Mj5j1%OTJ0Rjj2j0%Mjpj1j2j6j5j1
1037C1543jQTKrj5j7j0PK3L1K2Kj2TJOJmKJ4J7Oj4k4j4J1K8J5j8m1l4pJ7J9Qpj7k0
1076C1515j7j3j2k4m4n7m9l3k9l9n2o1n8m7l2k5k6k7k2j8j7j0J0L2M0L1K8L9M9M8L5
1107C1115L0L2L5K5J2J4K6L6L2J1rj5mJ0J5J3J6K3K1QNJ8L1TJ8NJLJ5K6K5J7QKqj7
1143C1626k0rRK0J5Mpj2j7k1j8j4j1j0kLlj5k4k1j0jJ%KTJ%KJ0J8L0L7L1J3JjQJ3J2
$$ plain form
913 4840 4924 5174 5806 7058 9016 11491 14118 16557 18640 20367 21811 23039 24096 25012 25800 26460 26995 27433
931 27433 27824 28198 28543 28835 29066 29255 29422 29585 29753 29922 30074 30197 30293 30378 30460 30542 30622 30694 30750 30799 30858 30934 31010 31065 31100 31135 31175
958 31175 31210 31234 31255 31287 31330 31371 31400 31416 31427 31440 31457 31474 31489 31501 31509 31510 31508 31520 31545 31564 31554 31516 31476 31460 31468 31479 31471 31445 31423 31421 31427 31425 31415 31410 31427 31458
994 31458 31488 31506 31516 31523 31530 31536 31544 31559 31575 31586 31590 31593 31598 31602 31603 31605 31613 31618 31611 31596 31590 31605 31626 31630 31615 31604 31604 31610 31616 31626 31635 31634 31622 31612 31612 31616 31615 31608 31597 31585 31569 31554 31543
1037 31543 31542 31550 31558 31560 31551 31536 31519 31509 31516 31539 31570 31592 31594 31582 31570 31571 31577 31578 31574 31576 31590 31607 31613 31599 31575 31561 31572 31600 31615 31597 31556 31522 31515 31532 31551 31559 31552 31535 31515
1076 31515 31498 31485 31473 31449 31405 31348 31299 31266 31237 31198 31146 31085 31027 30980 30948 30923 30897 30870 30848 30830 30813 30803 30813 30845 30885 30916 30944 30983 31032 31080 31115
1107 31115 31145 31177 31212 31237 31249 31263 31289 31325 31357 31368 31359 31344 31340 31350 31365 31378 31394 31417 31438 31446 31451 31469 31500 31531 31549 31554 31555 31558 31573 31599 31624 31641 31649 31651 31643 31626
1143 31626 31606 31597 31606 31626 31641 31645 31638 31626 31609 31588 31570 31556 31545 31535 31533 31536 31533 31518 31494 31473 31463 31462 31463 31463 31465 31467 31468 31468 31470 31480 31498 31528 31565 31596 31609 31610 31609 31617 31630 31642
1183C1642J3J5J4NkonjJlokQJ0Jj0oOJ0%j2j8j5oNRPKmj4k5l1k1KK4L2K6J0pj5TmJ4
1226C1628K8K4jk4TjJ9J1j6l3k2LJ8J2lj6k1k0j2%KjokPJ4RKmlJKMOLoj6j7rjJ%TN
1270C1541PMljLNJTjlqnNJ2R%rj8k3j7kJ3J5Kj8k6k0mPJ2J5J3JoKJ6TMmKJ0Rlj2j3
1315C1529kJ1J3Kj4j8j3jJ0J3J2MlTMOmj6j7LK2J4k0n2m9j9J0J4Kj4k0j5ojTKLlj7
1354C1366l1l5k9j0J0Tj9o3p7n0pJ2om4o9n7k3j2m6r1j00p3m5l5k8k1j7j6kK2L6K5
1386C0475QJ4M3O8P2O1L3MKM1P9O8L1J9N0P5N2Jk2KL3L1%k0j5NJ8J9TK6J1m5r7o6L3
1421C1128Q9M6l2m3RN0L7jk5k6j5QL3K0l7p1l3L4M7Lm0m4k0JTk0l9l3k2k9k6J5M9N
1455C1019j02j65j23k8K9L3J6j6n9q1n9j3K5M6M1Jm3l9%J7%J2O8J03P1Rj0K5O9P3M4
$$ plain form
1183 31642 31655 31670 31684 31689 31687 31681 31676 31675 31676 31673 31667 31665 31673 31683 31684 31674 31668 31674 31684 31684 31672 31654 31639 31633 31638 31647 31654 31656 31652 31638 31613 31582 31561 31563 31587 31619 31645 31655 31648 31633 31618 31614 31628
1226 31628 31656 31680 31679 31655 31631 31630 31649 31660 31644 31611 31589 31592 31610 31622 31619 31603 31582 31562 31550 31550 31552 31551 31545 31543 31550 31564 31573 31575 31571 31568 31569 31571 31575 31581 31584 31578 31562 31545 31536 31535 31536 31536 31536 31541
1270 31541 31548 31552 31549 31548 31551 31556 31557 31558 31557 31554 31546 31541 31546 31558 31567 31567 31558 31540 31517 31500 31498 31511 31526 31528 31510 31484 31464 31460 31467 31479 31494 31507 31508 31502 31504 31520 31536 31540 31536 31538 31548 31557 31554 31542 31529
1315 31529 31527 31538 31551 31553 31539 31521 31508 31507 31517 31530 31542 31546 31543 31540 31544 31550 31546 31530 31513 31516 31538 31552 31532 31480 31431 31412 31422 31436 31438 31424 31404 31389 31383 31382 31381 31383 31386 31383 31366
1354 31366 31335 31300 31271 31261 31271 31281 31262 31199 31122 31072 31065 31077 31071 31027 30958 30901 30878 30866 30820 30729 30629 30556 30511 30476 30448 30427 30410 30394 30392 30414 30450 30475
1386 30475 30483 30497 30540 30608 30680 30741 30774 30778 30780 30821 30900 30968 30999 31018 31068 31143 31195 31196 31174 31176 31209 31240 31240 31220 31205 31210 31228 31247 31266 31292 31303 31258 31161 31095 31128
1421 31128 31217 31263 31231 31188 31197 31247 31284 31283 31258 31232 31217 31225 31258 31278 31241 31170 31137 31171 31218 31221 31181 31137 31117 31118 31119 31099 31060 31027 31005 30976 30950 30965 31014 31019
1455 31019 30917 30752 30629 30601 30630 30663 30679 30663 30604 30523 30464 30451 30476 30522 30563 30564 30521 30482 30482 30499 30499 30511 30579 30682 30753 30762 30752 30777 30846 30919 30963
1486C0963K1J7Oj3oN1J00Q2K0j4LK0Rj0rL0R4J28O2p3j49q4L2O9J4k9J3P6N1n2r4R
1518C1337J26Q6o6j34n1N2N8jn1n4rO5R7L0q9j38m6J20K11J39n6k11j99n2O9O0k0m3
1546C1230J1M7Om3k1J1k7q1k4J15J42l4k50k71o9J44J61K2p5k7O4N5m8j15p1L5R8N3
1574C1038p3j61j16J3R3P0Ol0l1j9n%pk3TpJ3J8Roj3j2j1qKJ3J0lqOK7M1L8K5PmlK3
1612C0889O7Q2J6r2j26l7Q7J30P1l0q8n5K9O7J8m2m8rM0Q6Q1j1j27j40l5O8P8K7pJ5
1642C1004N7N3j8j06j24l1J27K13J09j29k71j65O9J85J18J5OM9M8j5o8m6L1R2P6jp7
1669C1201q4qR1J11K1r4r8NP2L6J1Q9J41Nk14k43l0J74J64K5o7m2M8R7J6j22j19O8
1697C1254J67k8k92k48Q0L01K09j3j15o5J7M3K4J5K0J7Jjj3o0j06o2M6J10P1jl3j7
$$ plain form
1486 30963 30984 31001 31007 30994 30988 31039 31139 31221 31241 31227 31230 31250 31259 31249 31240 31270 31364 31492 31554 31481 31332 31248 31280 31349 31363 31334 31347 31423 31474 31422 31328 31337
1518 31337 31463 31549 31483 31349 31298 31350 31408 31407 31356 31302 31293 31358 31455 31485 31396 31258 31212 31332 31543 31682 31626 31415 31216 31164 31233 31293 31273 31230
1546 31230 31241 31288 31294 31251 31230 31241 31214 31133 31109 31224 31366 31332 31082 30811 30742 30886 31047 31069 30994 30967 31031 31086 31038 30923 30852 30887 30985 31038
1574 31038 30965 30804 30688 30701 30794 30864 30870 30840 30809 30790 30785 30785 30778 30755 30732 30725 30738 30756 30765 30759 30746 30734 30723 30715 30717 30730 30740 30737 30729 30735 30762 30803 30841 30866 30873 30869 30866 30889
1612 30889 30956 31038 31054 30962 30836 30799 30886 31016 31087 31057 30969 30914 30943 31010 31028 30986 30938 30929 30969 31055 31136 31125 30998 30858 30823 30891 30969 30996 30989 31004
1642 31004 31061 31114 31096 30990 30866 30835 30962 31175 31284 31155 30884 30719 30788 30973 31091 31106 31112 31161 31209 31194 31126 31080 31111 31203 31279 31278 31201
1669 31201 31117 31109 31200 31311 31332 31238 31140 31145 31217 31253 31264 31353 31494 31499 31285 31042 31012 31186 31350 31375 31308 31266 31314 31411 31427 31305 31186 31254
1697 31254 31421 31393 31101 30853 30933 31234 31443 31430 31315 31250 31267 31310 31334 31349 31369 31386 31387 31386 31373 31313 31207 31145 31191 31301 31372 31371 31338 31321
1725C1321J2K2ll0nO1Tn4j66j20N4J64R9l9q4j9M0K8kJ2M4M0Kl5n9o8k9M6R6O0k7o8
1757C1354j8N9O4j0p6o1J3O2L7j9k3L9O9j1j23j22j0P7O4J8kj2l5l4mJ3j5n3n6l0k
1788C1153J0oo2j12r5j2O3P9N8L6K0OLMOJ1J7J8J3J0Lk1m2l9oK4K5Jk3k2oJ3L3M8L1
1823C1239k5o0j1P7Q9Lp1n1J8N1M3K2OnpQL9O2M0l2q8o2J9O3L8pj9mJ3J8Rpj6j3NK3
1859C1407K7J1j3k1nK4M2K3k5o1n0j0K2K5J7Ooj0JQJnkJoj0NK2J1k1l6j7J5K4Mj4j3
1896C1371MJ1NjJL%lJL%j0j5r%L%MJ9J8j3m0k1K4L7Nk5j6OJ2LJL%pnKMmj0TMK3K9O
1941C1413l0l7j2J4TJjNO%jJknmlmoT%OJ5K1J0j8l6k5MJ9J5Jj1j3pLJ1Qkj0oOJ2Mp
1985C1343j1oLJ4J0j0k4j9kNJkKRTOjTNJ0RN%opnkJMOMpj5j0MJ1PmpnkUPJ5J4Krj1
$$ plain form
1725 31321 31333 31355 31352 31322 31317 31378 31439 31385 31219 31099 31153 31317 31416 31377 31293 31274 31314 31342 31340 31352 31396 31436 31438 31403 31344 31276 31247 31293 31389 31449 31422 31354
1757 31354 31336 31395 31459 31449 31373 31312 31325 31387 31424 31405 31382 31421 31490 31479 31356 31234 31224 31301 31365 31383 31381 31369 31334 31300 31296 31309 31294 31241 31185 31155 31153
1788 31153 31163 31157 31095 30983 30888 30876 30939 31018 31076 31112 31132 31138 31141 31145 31151 31162 31179 31197 31210 31220 31223 31202 31160 31121 31115 31139 31164 31165 31142 31120 31114 31127 31160 31208 31239
1823 31239 31214 31154 31143 31220 31309 31312 31241 31190 31208 31259 31302 31324 31330 31325 31318 31326 31365 31427 31467 31435 31347 31285 31304 31367 31405 31398 31379 31375 31388 31406 31415 31408 31392 31379 31384 31407
1859 31407 31434 31445 31432 31411 31406 31430 31472 31495 31470 31409 31359 31349 31371 31396 31413 31419 31413 31403 31404 31412 31413 31408 31406 31407 31401 31391 31396 31418 31429 31408 31372 31355 31370 31394 31398 31384 31371
1896 31371 31375 31386 31391 31390 31391 31394 31394 31391 31392 31395 31395 31385 31370 31361 31361 31364 31364 31368 31387 31405 31392 31352 31331 31355 31392 31397 31372 31356 31362 31374 31377 31378 31381 31381 31374 31369 31371 31375 31371 31361 31351 31355 31378 31407 31413
1941 31413 31383 31346 31334 31348 31362 31363 31362 31367 31373 31373 31372 31373 31371 31366 31362 31359 31355 31349 31343 31343 31349 31364 31385 31395 31377 31341 31316 31320 31339 31354 31355 31344 31331 31324 31327 31338 31346 31344 31334 31328 31334 31346 31350 31343
1985 31343 31332 31326 31329 31343 31353 31343 31319 31300 31298 31303 31304 31302 31304 31313 31322 31328 31327 31326 31331 31341 31350 31355 31355 31349 31342 31337 31335 31336 31340 31346 31350 31343 31328 31318 31322 31333 31340 31336 31329 31324 31322 31320 31318 31325 31340 31354 31356 31347 31336
2034C1336j0j3j5lJ7K4J4%pj0qmMRQKnpkRJ4Qnj3j1kOPkj3j6oQTKkLPN%k%KJK%lTJ
2083C1335J1TKrj1qpnjJLRJ1Pmj6j8j3lPJ6J5Mpj2pJLJkjQJ1Jj2j3lPMrj8j3KJ3J6
2128C1307RkqpLJ3Qmj3ToJTjlkTmpmLNKj%lop%O%rpOJ0jj5TjQNmkORjj6k2j7lPNj0
2181C1198j7qORKqTkJ1J8J4mj9j6mK%pTnJNMjpm%Tkjkrj2pOJ0kj2j1jkpnLTqj8j3o
2230C1057lj%lj2k3l1l7l9l5l0k9m6q1j24j58j94k68m14o01p27o72m10l6K94M78N05
2257B8360M38L46K73K18J72J34J14J09J01P4M8L8M3M9M6L8K7J6J1J7L1L4K7J5J2J4
2283C0805J5J0LKOPjj1pJ2K5K1Jj1j0okKRJ0lk3l3k2nLPLnj3j1jNkk0l0l4k8j6PK5
2324C0684J4k2n0m5k1j0j2oJ0K2Qj7l6l7j6J3K7K5J6J1J0K5O7J03P9Jo2o3m5n9r0q6
$$ plain form
2034 31336 31326 31313 31298 31295 31312 31336 31350 31350 31343 31333 31325 31321 31325 31334 31342 31344 31339 31332 31330 31339 31353 31361 31356 31343 31332 31330 31336 31343 31341 31328 31312 31306 31314 31322 31324 31322 31325 31332 31337 31337 31335 31335 31337 31338 31340 31340 31337 31334 31335
2083 31335 31346 31357 31359 31350 31339 31331 31324 31319 31318 31319 31322 31331 31342 31349 31345 31329 31311 31298 31295 31302 31318 31333 31337 31330 31318 31311 31312 31315 31316 31314 31313 31321 31332 31333 31321 31308 31305 31312 31316 31307 31289 31276 31278 31291 31307
2128 31307 31316 31314 31306 31299 31302 31315 31323 31319 31306 31293 31287 31288 31289 31288 31285 31283 31281 31277 31270 31266 31269 31274 31276 31275 31275 31272 31266 31259 31259 31265 31265 31256 31249 31255 31265 31264 31249 31234 31233 31241 31246 31242 31240 31246 31255 31254 31238 31216 31199 31196 31203 31208 31198
2181 31198 31181 31173 31179 31188 31190 31182 31174 31172 31183 31201 31215 31211 31192 31176 31172 31174 31174 31167 31160 31155 31156 31161 31165 31164 31157 31153 31153 31153 31151 31150 31148 31139 31127 31120 31126 31136 31134 31122 31111 31110 31108 31101 31096 31099 31102 31094 31076 31063 31057
2230 31057 31054 31053 31053 31050 31038 31015 30984 30947 30908 30873 30843 30814 30768 30687 30563 30405 30211 29943 29529 28928 28201 27529 27119 27083 27377 27855 28360
2257 28360 28798 29144 29417 29635 29807 29941 30055 30164 30265 30339 30387 30425 30468 30517 30563 30601 30628 30644 30655 30672 30703 30737 30764 30779 30791 30805
2283 30805 30820 30830 30833 30835 30841 30848 30847 30836 30829 30841 30866 30887 30888 30877 30867 30861 30859 30861 30870 30880 30877 30854 30821 30799 30794 30797 30804 30807 30802 30789 30778 30777 30782 30780 30760 30730 30696 30668 30652 30659 30684
2324 30684 30698 30676 30626 30581 30560 30550 30538 30532 30542 30564 30572 30555 30519 30482 30466 30479 30506 30531 30547 30558 30568 30593 30660 30763 30842 30843 30781 30718 30673 30614 30524 30438
2356C0438m0kJj2nJ9L5K6PkOK8N3P0O5M4K0J4K8M8N6M6L0K5K6L4M3TK6Jj2oQJ5J0%
2392C1186nlMOkj0TkL%UKLJ1J3Rmj4j3kRJ0jj2j1%O%j0qKNlq%J5K1Nj8k9j7MJ6J0k
2438C1156pjJ1J0pk1j7mL%jLRQJnqrj0qkNJ0RMlj2j5nJ1K1J1pj8j5nMQTNkqj2pjPN
2485C1099JTLMmrpNJ5J4Kj2j5mROqk0j4LJ4J0oj2rjKmrTkRJ3J1ONMkj3j8j4lQJ3Pm
2531C1065j1jJ4J7Rlpj2j0KJ1QmoMJ2Nj1j7mJ3J7KrpJjj3TJJ7J6Mqj3nJ0J7Pj1j6m
2573C1066J1J7J0%rj1lNPTRJ1jj8k2oJ0Rmj4j3oJQJ2J0QPKopMRJj3TnMOJ1J2Lj0j7
2617C1082j3mNJ3QlpJJ4J1jj3j6qJONJmn%RJ2Ooj4rkKTLK%lmTnprTmNJ7TMj6j9mQN
2667C1050k%O%pmKJqj3oKQJ0O%momnok%knTkLMK%JKJ%JNMmj3j2opj2rMJ4J2Krj3pK
$$ plain form
2356 30438 30398 30396 30397 30385 30380 30399 30434 30460 30467 30465 30471 30499 30552 30622 30687 30731 30751 30765 30793 30841 30897 30943 30973 30998 31024 31058 31101 31144 31170 31171 31159 31153 31161 31176 31186 31186
2392 31186 31181 31178 31182 31188 31186 31176 31166 31164 31167 31167 31167 31167 31169 31172 31183 31196 31205 31201 31187 31174 31172 31181 31191 31190 31178 31167 31167 31173 31173 31163 31155 31157 31162 31159 31151 31151 31166 31187 31192 31174 31145 31128 31132 31148 31158 31156
2438 31156 31149 31148 31159 31169 31162 31141 31124 31120 31123 31123 31122 31125 31134 31142 31143 31138 31130 31121 31111 31103 31101 31106 31116 31125 31129 31126 31114 31099 31094 31105 31126 31137 31130 31112 31097 31092 31096 31104 31112 31117 31115 31107 31095 31088 31087 31094 31099
2485 31099 31100 31101 31104 31108 31104 31095 31088 31093 31108 31122 31124 31112 31097 31093 31102 31108 31100 31080 31066 31069 31083 31093 31087 31075 31066 31065 31067 31063 31054 31045 31043 31052 31065 31076 31082 31087 31091 31089 31076 31058 31044 31041 31049 31062 31069 31065
2531 31065 31054 31053 31067 31084 31093 31090 31083 31071 31061 31063 31074 31082 31078 31072 31076 31088 31093 31082 31065 31061 31074 31091 31093 31084 31077 31078 31077 31064 31051 31052 31069 31085 31089 31081 31068 31063 31073 31090 31097 31086 31070 31066
2573 31066 31077 31094 31104 31104 31095 31084 31081 31086 31093 31100 31109 31120 31119 31101 31079 31073 31083 31092 31088 31074 31061 31055 31056 31064 31076 31086 31094 31101 31103 31097 31090 31094 31103 31104 31091 31078 31073 31077 31083 31094 31106 31109 31099 31082
2617 31082 31069 31065 31070 31083 31091 31088 31081 31082 31096 31107 31106 31093 31077 31069 31070 31076 31081 31082 31078 31073 31073 31082 31094 31100 31094 31080 31071 31069 31071 31073 31076 31078 31078 31075 31071 31067 31062 31055 31046 31037 31033 31038 31055 31072 31076 31060 31041 31037 31045 31050
2667 31050 31048 31048 31054 31054 31047 31043 31045 31046 31038 31025 31019 31021 31029 31039 31045 31045 31041 31035 31031 31026 31020 31018 31018 31016 31011 31006 31004 31007 31011 31013 31013 31014 31016 31017 31017 31018 31023 31027 31023 31010 30998 30992 30985 30973 30964 30968 30982 30994 30996 30987 30974 30967 30969
2720C0969QPONlj2j7j0KJ0J1J0Lnj1mQJ0kj8j9oJ2J9J5Jj4j7rLJ1J0Jj0j2LK0J9jj8
2760C0975j8q%KLMNMmj0j7j8j2%QJ1J4J6J5Jj7k5j1J2K3J3rk0j4JQLj0rMJ7J5Lqj1
2800C0936pULJ4J6Kj7k3j7jJ2J3PMQMj1k1j0J5K7K1Mj5k7l1k2oLTKT%jkKjj0j2lQM
2843C0859j6l2l5k4j7j9j8nJ6K5J6kj7j2OK4K6J4jj0nLRPL%jLJ0J6J4kk2k5pJ2J8J1
2881C0822Lnk1k9j4J1K1Rrk0k1j6j0Tj5j9k0j7j9j7nJ0J1JjQJ4Nj4k3j3KMj1k5k7j2
2918C0528JKrj9j6jJ3J4JrqKQRQJ0J4J6J7J8K4TJ6QOJ0Ork5k3mJ7K4J4%j1j5j2lNP
2959C0658PJ0Qnj4qLJj3j9kJ7J6mj8j2nj0j5qLPKjLMJnpn%RJ3TRNOJ2J5J2JolKQJ0
3005C0695J5J4Mrj2%J5K2J4jj4ToJPJ1J2Q%mTjlj1j5j1KJ5J9J0pk3k4rJ0K1J9Qmj1
$$ plain form
2720 30969 30977 30984 30990 30995 30992 30980 30963 30953 30955 30965 30976 30986 30989 30984 30973 30969 30977 30987 30985 30967 30948 30942 30954 30973 30988 30989 30975 30958 30949 30952 30963 30973 30974 30964 30952 30955 30975 30994 30993 30975
2760 30975 30957 30949 30949 30951 30954 30958 30963 30967 30963 30953 30936 30918 30906 30906 30914 30925 30939 30955 30970 30971 30954 30929 30918 30930 30953 30966 30957 30937 30923 30924 30932 30935 30925 30916 30920 30937 30952 30955 30947 30936
2800 30936 30929 30922 30915 30918 30932 30948 30950 30933 30910 30893 30892 30904 30917 30924 30928 30936 30940 30929 30908 30898 30913 30940 30961 30965 30950 30923 30892 30870 30864 30867 30870 30872 30874 30874 30873 30871 30873 30872 30862 30850 30847 30855 30859
2843 30859 30843 30811 30776 30752 30735 30716 30698 30693 30709 30734 30750 30748 30731 30719 30725 30749 30775 30789 30788 30778 30773 30776 30785 30792 30795 30795 30794 30797 30807 30823 30837 30835 30813 30788 30781 30793 30811 30822
2881 30822 30825 30820 30799 30770 30756 30767 30788 30797 30788 30768 30747 30731 30721 30711 30696 30677 30657 30640 30621 30604 30599 30609 30620 30621 30620 30628 30642 30647 30633 30610 30597 30599 30603 30592 30567 30540 30528
2918 30528 30529 30531 30522 30503 30487 30486 30499 30513 30514 30505 30497 30499 30507 30516 30524 30534 30548 30564 30581 30599 30623 30647 30663 30671 30677 30687 30693 30684 30659 30636 30632 30649 30673 30687 30687 30676 30661 30649 30646 30651 30658
2959 30658 30665 30675 30683 30678 30664 30656 30659 30660 30647 30628 30626 30643 30659 30655 30637 30625 30620 30610 30595 30587 30590 30597 30599 30598 30601 30605 30606 30601 30594 30589 30589 30598 30611 30624 30633 30638 30644 30656 30671 30683 30684 30678 30675 30677 30685 30695
3005 30695 30710 30724 30728 30719 30707 30707 30722 30744 30758 30757 30743 30729 30723 30724 30731 30742 30754 30762 30762 30758 30754 30753 30750 30739 30724 30713 30715 30730 30749 30759 30752 30729 30705 30696 30706 30727 30746 30754 30750 30739
3045C0739nQJ3Mj2j9j2LRKrqNJ7J3nk1k2oJ7K2Qj1j4mKJ%momORlj7j4RK6J9ok3j8P
3088C0696K3J6rk6Tj3mOJ4J6Jk0k6pJ4K0R%kTpj0ojTKJ0J1Jj0nMpl2l9j4K0L0J0j4
3128C0622j9mRNj4k8k2jK2K5Rk4m9n1l0olj6k9l6k8k2k4l2Tj8jQOQJ6K3K1RNJ6L0K9
3166C0374K1J7K4L0K2MpJJ8K1Lj7j3J0K2Pk4l5j5J3K6J7Lj2k2j8jJ9K2Mj3j4lOJno
3203C0480loqjMJmjK%ol%pj1mJ0Roj5j1orj3jJ7K6J6nj6j3lNPNkj2j5nOR%rqKPNlo
3252C0399kMjj4k3j8MK2K0jj7j6JJ9K4J0j1j8nQMj5k4rJ3J7%j5pRJ2kj0lO%j3k0j1
3291C0317MRPOJ1J3Kj5j9rJL%LP%pnQJ0nk4TkK3K9J8Kqj3j6j5oJ1K0J2qj9j6ojJML
3335C0306%mkJ%LPJ1RKmTjkqTKJ6Tjk0ToRJ1LkMJ2J0Kqj0pjLJTMQ%j1j3nMNkj4k2j0
$$ plain form
3045 30739 30734 30742 30755 30759 30747 30728 30716 30719 30728 30730 30721 30713 30718 30735 30748 30743 30722 30700 30694 30711 30733 30741 30730 30716 30712 30714 30715 30715 30711 30705 30701 30707 30716 30713 30696 30682 30691 30717 30736 30730 30707 30689 30696
3088 30696 30719 30735 30726 30700 30674 30661 30657 30663 30677 30693 30694 30674 30648 30641 30655 30675 30684 30684 30682 30680 30673 30663 30657 30656 30655 30657 30667 30678 30679 30669 30664 30668 30661 30629 30590 30576 30596 30626 30636 30622
3128 30622 30603 30599 30608 30613 30599 30571 30549 30548 30570 30595 30604 30580 30531 30480 30450 30444 30441 30425 30396 30360 30332 30310 30286 30254 30222 30204 30203 30211 30217 30225 30241 30264 30285 30294 30299 30315 30345 30374
3166 30374 30395 30412 30436 30466 30488 30492 30485 30486 30504 30525 30528 30511 30498 30508 30530 30537 30513 30478 30463 30476 30502 30519 30522 30510 30488 30470 30469 30488 30510 30514 30501 30487 30484 30490 30491 30486 30480
3203 30480 30477 30471 30463 30462 30466 30467 30463 30462 30464 30464 30458 30455 30455 30448 30437 30433 30443 30452 30446 30431 30420 30414 30405 30392 30391 30408 30434 30450 30445 30429 30416 30413 30418 30425 30430 30428 30416 30401 30396 30402 30411 30411 30402 30394 30396 30403 30408 30405 30399
3252 30399 30397 30401 30400 30386 30363 30345 30349 30371 30391 30390 30373 30357 30358 30377 30401 30411 30400 30382 30377 30385 30389 30374 30350 30341 30354 30371 30371 30356 30349 30358 30370 30368 30358 30355 30361 30361 30348 30328 30317
3291 30317 30321 30330 30337 30343 30354 30367 30369 30354 30335 30326 30327 30330 30330 30333 30340 30340 30333 30328 30336 30346 30341 30317 30293 30291 30314 30343 30361 30363 30355 30342 30326 30311 30305 30316 30336 30348 30340 30321 30305 30299 30298 30299 30303 30306
3335 30306 30306 30302 30300 30301 30301 30304 30311 30322 30331 30333 30329 30325 30324 30322 30314 30306 30308 30324 30340 30339 30319 30299 30293 30302 30313 30316 30314 30318 30330 30340 30342 30334 30324 30317 30316 30319 30320 30321 30325 30333 30333 30322 30309 30304 30308 30313 30311 30297 30275 30265
3385C0265J4K6K2J3Qok2k3lJ4J5QPTmj7j6JJ7K1Oj7j9jJ7J6KmTlKJ3J9J0nj6j9j3K
3424C0333K3L2K0ol0l7k5oJ0J8J7Qjmklj0j4NL1L6Kl6TKL0J9nj0PK0J0monoj2T%J6
3464C0369K3J1noOJ1%j3j4mLPJ3J7J3ok4k2lJ4J6Nrj8j3J0K7K4Lj4TjJ0J4J7J6Oqj6
3503C0445j8j4%K3L6J8j7l0j4RJ7J3Mrj9j1J4L3J9rj3J0K1mk8k1NJ4RTJ3jk0j6RK6
3539C0503J9J6K5L7J9k5o7o2rM8N4Rl5l4pJ2J8K5K1jl1l5QP8J14O1o6j62j40k3P5Q5
3571C0530L5j7l6k3J2L9K3k7p0q0n9j9L9P6N3k1p1l4N7J16R3K2l5n6m3pM0O0K9k9n6
3602C0541k3L4P0N0j9q5p2J3O9K6m7l4N4J05N5m3j03q6j5N2O6M7O7J04L9j56k78j46
3630C0285J16K13Q6o1TK0N6L3RLj3k4RP2R3M7j2n0j02j69j45K6K08J99Oj65j55k0Q3
$$ plain form
3385 30265 30279 30305 30327 30340 30348 30342 30320 30297 30294 30308 30323 30331 30338 30345 30341 30324 30308 30309 30326 30347 30353 30336 30317 30316 30333 30349 30351 30347 30343 30340 30342 30355 30374 30384 30379 30363 30344 30331 30333
3424 30333 30356 30388 30408 30402 30372 30335 30310 30304 30314 30332 30349 30357 30356 30352 30350 30347 30337 30323 30328 30359 30395 30397 30361 30325 30327 30357 30376 30371 30361 30368 30388 30398 30394 30388 30383 30377 30365 30353 30353 30369
3464 30369 30392 30403 30398 30392 30398 30409 30409 30396 30382 30378 30381 30388 30401 30418 30431 30425 30401 30379 30376 30390 30406 30411 30402 30384 30371 30381 30408 30432 30435 30421 30407 30406 30416 30430 30447 30463 30469 30461 30445
3503 30445 30427 30413 30413 30436 30472 30490 30473 30443 30429 30438 30455 30468 30472 30463 30444 30433 30447 30480 30499 30490 30477 30487 30508 30504 30476 30455 30460 30474 30483 30492 30505 30504 30484 30468 30477 30503
3539 30503 30522 30538 30563 30600 30619 30594 30527 30465 30456 30504 30558 30567 30532 30498 30491 30503 30521 30546 30567 30566 30535 30500 30508 30586 30700 30761 30695 30533 30393 30370 30445 30530
3571 30530 30565 30548 30512 30489 30501 30540 30563 30536 30466 30386 30327 30308 30347 30423 30476 30455 30384 30350 30407 30523 30616 30638 30603 30547 30504 30497 30537 30597 30626 30597 30541
3602 30541 30518 30552 30622 30672 30653 30568 30496 30509 30578 30604 30557 30523 30577 30682 30737 30694 30591 30505 30490 30542 30608 30655 30722 30826 30865 30709 30431 30285
3630 30285 30401 30614 30700 30639 30578 30598 30654 30687 30696 30699 30686 30662 30671 30743 30836 30883 30871 30821 30719 30550 30405 30431 30639 30838 30844 30679 30524 30504 30587
3659C0587R1M8lm7m6K5J16J23rk08k83r0K48L70J02k75l48q3J62J49J8l4pRL1P8P4
3686C0798k5j25j17m8rQN3R3O0k4n4MO6L6n5r3m4L1O8TN1L4K2j2q8j57j17K4J30J13
3716C0691K8j4LJ2k7o9m2L1M4k8p5j5P7P3NLP1P0n7j79j50j4R4J60K09J30j70m53l43
3745C0065J06L86K42l8j34q9o2l5N0J25J14N1k8j02j21k9J01J31L3o6m3O0Q2l3j42
3770C0624j04K6Q9N3K0M2M8k5j15j06RJ07Q2k1q0n2NL8L5J8KNK7K9l9j18p5J01K06
3799C0831N6k17k88m5K32K23k9k11j43L8J16R8J11J31Mk37l04l5K99K85o7l29k08J15
3823C0426K54J13p9j05J1R2M7m6o8qN5O5J3o5j17r3mP1O1j3n7k3M5O9M5O0J35J18j07
3852C0895l84l92p4K43K79J32K8J7K2Kn6j34j15P5K52J50j50k75p5J64J43n0j24PJ59
$$ plain form
3659 30587 30678 30726 30723 30676 30630 30655 30771 30894 30885 30677 30394 30304 30552 30922 31024 30749 30401 30318 30480 30629 30647 30613 30606 30615 30646 30724 30798
3686 30798 30773 30648 30531 30483 30474 30482 30535 30628 30688 30664 30610 30614 30680 30716 30661 30568 30524 30555 30623 30691 30742 30776 30798 30786 30698 30541 30424 30448 30578 30691
3716 30691 30719 30705 30708 30720 30693 30624 30582 30613 30657 30629 30554 30539 30616 30689 30694 30697 30768 30838 30781 30602 30452 30438 30532 30692 30901 31031 30861 30408 30065
3745 30065 30171 30557 30799 30761 30627 30538 30476 30441 30491 30616 30730 30781 30753 30651 30530 30501 30602 30733 30766 30700 30657 30717 30799 30766 30624
3770 30624 30520 30546 30635 30688 30708 30750 30798 30773 30658 30552 30561 30668 30750 30729 30649 30597 30602 30640 30675 30693 30695 30700 30727 30756 30717 30599 30524 30625 30831
3799 30831 30887 30670 30382 30337 30569 30792 30763 30552 30409 30447 30563 30661 30772 30903 30907 30670 30366 30331 30630 30915 30848 30519 30311 30426
3823 30426 30680 30793 30714 30609 30620 30712 30759 30713 30645 30637 30692 30757 30770 30705 30588 30495 30491 30562 30623 30610 30553 30530 30575 30644 30689 30749 30884 31002 30895
3852 30895 30511 30119 30045 30288 30567 30699 30727 30744 30766 30768 30712 30578 30463 30538 30790 30940 30790 30515 30440 30604 30747 30697 30573 30580 30739
3877C0739J27o6k06j31Q8K01P6j51k27n9J68K06L6j36j40k0P4R9Q6M8k3q3p6k1K6K4
3903C0659j7n3l9K3P2O2J1k9j7K6N4K4l8p2n5k2J1N5Q7M7m3r2n7PM6N9N1oq4r9k1O7
3935C0617P0Ol3KM7K6m8p8j8O3P4J2m5n5k3J2K8K3Rqj8k5k0%K3L8L4Rk4m3l1JK1J6
3969C0662jqnmqp%PTJ0J5J0ql0l7k1J8M9L8ol7k4OJ7Kj2j0jkmlOJ6TLokMnk8l3qK2
4012C0598K6OrqMJ1Mj5k7j6J4K8J0j8k8j9j1j2qRK3K1Lj4j9pJ1J9RkTPJ1LnTKMjj2
4052C0585k0j7%K7L7K0j2j7OK5J5j2k2kJ8Qk6m1j5K1L1J4lj3k0TpJ0J3JrnJ1K0J0j3
4088C0598k6j8pJPK0K7K0jj6j4kKlkJ0K0J1qk0k2j4pKQJ0TOjnLK1L6L0lm2n6k8J1L1
4128C0589K4Lj8k0KK9J6k8n1k3K2L5J5npj0j7j2RK7TJ5Jqj5j7j0OJ4Orj9j5lJ5L5M3
$$ plain form
3877 30739 30866 30800 30594 30463 30551 30752 30828 30677 30450 30391 30559 30765 30801 30665 30525 30505 30579 30678 30764 30812 30789 30706 30630 30609 30635 30659
3903 30659 30642 30589 30550 30573 30645 30707 30718 30689 30672 30698 30752 30776 30738 30666 30611 30589 30600 30655 30742 30789 30746 30654 30597 30604 30650 30709 30760 30754 30670 30571 30550 30617
3935 30617 30687 30693 30660 30662 30709 30735 30687 30609 30591 30654 30728 30740 30695 30640 30617 30629 30657 30680 30689 30681 30663 30638 30618 30618 30641 30679 30713 30722 30698 30655 30624 30625 30646 30662
3969 30662 30661 30653 30648 30644 30636 30629 30629 30636 30643 30653 30668 30678 30670 30640 30603 30582 30600 30649 30687 30681 30644 30620 30626 30643 30645 30633 30623 30622 30620 30616 30613 30619 30635 30651 30654 30648 30646 30650 30645 30617 30584 30576 30598
4012 30598 30624 30630 30621 30613 30617 30628 30632 30617 30590 30574 30588 30616 30626 30608 30580 30561 30550 30538 30530 30539 30562 30583 30586 30572 30553 30546 30557 30576 30585 30583 30581 30588 30599 30602 30597 30592 30594 30598 30597 30585
4052 30585 30565 30548 30548 30575 30612 30632 30620 30603 30609 30634 30649 30637 30615 30613 30631 30639 30613 30572 30557 30578 30609 30623 30620 30607 30587 30567 30560 30570 30583 30584 30575 30570 30581 30601 30611 30598
4088 30598 30572 30554 30547 30548 30555 30575 30602 30622 30621 30605 30591 30589 30591 30588 30586 30596 30616 30627 30619 30599 30577 30563 30556 30558 30566 30576 30586 30592 30591 30586 30589 30610 30646 30676 30673 30631 30575 30547 30558 30589
4128 30589 30613 30616 30598 30578 30580 30609 30625 30597 30546 30523 30545 30580 30595 30590 30583 30573 30556 30544 30553 30580 30607 30622 30623 30615 30600 30583 30573 30579 30593 30599 30590 30571 30556 30553 30568 30603 30646
4165C0646J3l6n8k5K1K6mj8NK2%l6l9kM0M9K4nk8l3j8OJ5OJOJ2OPJ2Rj0l2l3pK7L6
4202C0605Rk5l2j1J1RnqOJ8J4krpkJ0J5Nj9l2j8LNKJ8L4J9k3n3m1JL7L9J2j7k3oJ1
4240C0550J1%pmlLJ7K5J8Jj7k6k4qJ4K4J4kpoTkQPj5l9m1j4J9L3K1rk6j6RK8L3J7j2
4279C0568k1%J9Ok8m3k7lJ3K1K6J4j2k7j2RNk4l2%M8N3J7rJJ5kl2m3k2J1L0K6Qpj2
4315C0534pkpj6j1J0K5J8ok4j7%MjKLmj1rokJ2J7Jk7m0l3j6JK6N5O8L7k3n7m3kL3L6
4354C0518Ll1l5j7%J5J7NkmpKJ8J2rnJ0Kprk6k7J1L2J8J1Oj1PK9l2q9l0L4L0O4M4j35
4392C0412j49R8N0j40o9j38M69m83
4400C0050
$$ plain form
4165 30646 30659 30623 30565 30540 30561 30587 30583 30565 30570 30592 30592 30556 30517 30515 30555 30604 30628 30623 30595 30562 30544 30550 30565 30571 30572 30578 30590 30596 30603 30615 30624 30614 30582 30549 30542 30569 30605
4202 30605 30614 30589 30557 30546 30557 30566 30561 30553 30559 30577 30591 30589 30580 30573 30571 30581 30596 30601 30582 30550 30532 30535 30540 30542 30560 30594 30613 30590 30537 30496 30497 30534 30573 30585 30568 30545 30539 30550
4240 30550 30561 30561 30554 30550 30547 30550 30567 30592 30610 30611 30594 30568 30544 30536 30550 30574 30588 30586 30579 30573 30567 30565 30573 30580 30565 30526 30485 30471 30490 30523 30544 30535 30509 30493 30502 30530 30563 30580 30568
4279 30568 30547 30547 30566 30572 30544 30501 30474 30471 30484 30505 30531 30545 30533 30506 30494 30503 30508 30484 30452 30452 30500 30553 30570 30561 30562 30577 30575 30543 30500 30478 30489 30519 30545 30553 30546 30534
4315 30534 30527 30525 30518 30502 30491 30501 30526 30544 30538 30514 30497 30497 30501 30500 30502 30505 30501 30490 30481 30475 30473 30485 30502 30503 30476 30436 30403 30387 30388 30414 30469 30537 30574 30551 30494 30451 30449 30482 30518
4354 30518 30521 30490 30455 30438 30438 30453 30470 30475 30473 30469 30462 30464 30482 30494 30485 30480 30490 30492 30485 30476 30450 30423 30434 30466 30484 30495 30501 30490 30497 30526 30494 30405 30375 30409 30439 30503 30547 30412
4392 30412 30263 30361 30411 30271 30202 30064 30533 30050
4400 30050
##END=$$ End of the data block
##TITLE=dichloromethane
##JCAMP-DX= 5.01
##DATA TYPE=INFRARED SPECTRUM
##DATA CLASS=XYDATA
##BLOCK ID=3
##ORIGIN=Department of Chemistry, UWI, Jamaica
##OWNER= PUBLIC DOMAIN
##NAMES=dichloromethane
##MOLFORM=CH2Cl2
##SPECTROMETER/DATA SYSTEM=PERKIN ELMER
##$MODELS=
<Models>
<ModelData id="ch2cl2" type="MOL">
CH2Cl2
RLDSViewer          3D                             0

  5  4  0  0  0  0  0  0  0  0999 V2000
    0.0000    0.0000    0.7926 C   0  0  0  0  0  0  0  0  0  1
    0.8900    0.0000    1.4219 H   0  0  0  0  0  0  0  0  0  2
    0.0000    1.4370   -0.2235 Cl  0  0  0  0  0  0  0  0  0  3
   -0.8900    0.0000    1.4219 H   0  0  0  0  0  0  0  0  0  4
    0.0000   -1.4370   -0.2235 Cl  0  0  0  0  0  0  0  0  0  5
  1  2  1  0  0  0
  1  4  1  0  0  0
  1  3  1  0  0  0
  1  5  1  0  0  0
M  END
</ModelData>
<ModelData id="1" type="XYZVIB" baseModel="ch2cl2" vibrationScale=".2">
5
Model[1]: Convg=0.2016D-08;-V/T=2.0004;Energy=NaN;Range=M.O.s;E(RHF)=-957.984015823 A.U.;PATH=Calculation 1;Input
C     0.00000    0.00000    0.00000
H     0.00000    0.00000    1.09000
Cl    1.65934    0.00000   -0.58667
H    -0.51383    0.88998   -0.36333
Cl   -0.82967   -1.43703   -0.58667
5
Model[2]: Convg=0.2016D-08;-V/T=2.0004;Energy=-957.9841;Range=M.O.s;E(RHF)=-957.984015823 A.U.;PATH=Calculation 1;Standard
C     0.00000    0.00000    0.79262
H     0.88998    0.00000    1.42193
Cl    0.00000    1.43703   -0.22352
H    -0.88998    0.00000    1.42193
Cl    0.00000   -1.43703   -0.22352
5
Model[3]: IRIntensity=0.8549 KM/Mole;ReducedMass=19.4874 AMU;ForceConstant=1.2400 mDyne/A;Frequency=328.6293 cm^-1;FrequencyLabel=A1;PATH=Calculation 1;FrequenciesFrequencies
C     0.00000    0.00000    0.79262    0.00000    0.00000   -0.42000
H     0.88998    0.00000    1.42193   -0.01000    0.00000   -0.41000
Cl    0.00000    1.43703   -0.22352    0.00000    0.49000    0.08000
H    -0.88998    0.00000    1.42193    0.01000    0.00000   -0.41000
Cl    0.00000   -1.43703   -0.22352    0.00000   -0.49000    0.08000
5
Model[4]: IRIntensity=22.3831 KM/Mole;ReducedMass=7.1242 AMU;ForceConstant=2.6393 mDyne/A;Frequency=792.9600 cm^-1;FrequencyLabel=A1;PATH=Calculation 1;FrequenciesFrequencies
C     0.00000    0.00000    0.79262    0.00000    0.00000    0.61000
H     0.88998    0.00000    1.42193    0.06000    0.00000    0.53000
Cl    0.00000    1.43703   -0.22352    0.00000    0.12000   -0.12000
H    -0.88998    0.00000    1.42193   -0.06000    0.00000    0.53000
Cl    0.00000   -1.43703   -0.22352    0.00000   -0.12000   -0.12000
5
Model[5]: IRIntensity=135.9554 KM/Mole;ReducedMass=6.9784 AMU;ForceConstant=2.9811 mDyne/A;Frequency=851.5017 cm^-1;FrequencyLabel=B2;PATH=Calculation 1;FrequenciesFrequencies
C     0.00000    0.00000    0.79262    0.00000    0.63000    0.00000
H     0.88998    0.00000    1.42193    0.00000    0.53000    0.00000
Cl    0.00000    1.43703   -0.22352    0.00000   -0.12000    0.09000
H    -0.88998    0.00000    1.42193    0.00000    0.53000    0.00000
Cl    0.00000   -1.43703   -0.22352    0.00000   -0.12000   -0.09000
5
Model[6]: IRIntensity=0.8961 KM/Mole;ReducedMass=1.3466 AMU;ForceConstant=0.8771 mDyne/A;Frequency=1051.4636 cm^-1;FrequencyLabel=B1;PATH=Calculation 1;FrequenciesFrequencies
C     0.00000    0.00000    0.79262    0.17000    0.00000    0.00000
H     0.88998    0.00000    1.42193   -0.27000    0.00000    0.64000
Cl    0.00000    1.43703   -0.22352   -0.02000    0.00000    0.00000
H    -0.88998    0.00000    1.42193   -0.27000    0.00000   -0.64000
Cl    0.00000   -1.43703   -0.22352   -0.02000    0.00000    0.00000
5
Model[7]: IRIntensity=0.0000 KM/Mole;ReducedMass=1.0186 AMU;ForceConstant=1.0551 mDyne/A;Frequency=1325.9201 cm^-1;FrequencyLabel=A2;PATH=Calculation 1;FrequenciesFrequencies
C     0.00000    0.00000    0.79262    0.00000    0.00000    0.00000
H     0.88998    0.00000    1.42193    0.00000    0.71000    0.00000
Cl    0.00000    1.43703   -0.22352    0.01000    0.00000    0.00000
H    -0.88998    0.00000    1.42193    0.00000   -0.71000    0.00000
Cl    0.00000   -1.43703   -0.22352   -0.01000    0.00000    0.00000
5
Model[8]: IRIntensity=70.1871 KM/Mole;ReducedMass=1.1462 AMU;ForceConstant=1.4791 mDyne/A;Frequency=1479.9284 cm^-1;FrequencyLabel=B2;PATH=Calculation 1;FrequenciesFrequencies
C     0.00000    0.00000    0.79262    0.00000   -0.11000    0.00000
H     0.88998    0.00000    1.42193    0.00000    0.70000    0.00000
Cl    0.00000    1.43703   -0.22352    0.00000    0.00000    0.01000
H    -0.88998    0.00000    1.42193    0.00000    0.70000    0.00000
Cl    0.00000   -1.43703   -0.22352    0.00000    0.00000   -0.01000
5
Model[9]: IRIntensity=0.9042 KM/Mole;ReducedMass=1.0790 AMU;ForceConstant=1.7283 mDyne/A;Frequency=1648.8226 cm^-1;FrequencyLabel=A1;PATH=Calculation 1;FrequenciesFrequencies
C     0.00000    0.00000    0.79262    0.00000    0.00000   -0.08000
H     0.88998    0.00000    1.42193   -0.42000    0.00000    0.56000
Cl    0.00000    1.43703   -0.22352    0.00000    0.00000    0.00000
H    -0.88998    0.00000    1.42193    0.42000    0.00000    0.56000
Cl    0.00000   -1.43703   -0.22352    0.00000    0.00000    0.00000
5
Model[10]: IRIntensity=15.1988 KM/Mole;ReducedMass=1.0560 AMU;ForceConstant=6.3458 mDyne/A;Frequency=3193.6506 cm^-1;FrequencyLabel=A1;PATH=Calculation 1;FrequenciesFrequencies
C     0.00000    0.00000    0.79262    0.00000    0.00000   -0.07000
H     0.88998    0.00000    1.42193    0.59000    0.00000    0.39000
Cl    0.00000    1.43703   -0.22352    0.00000    0.00000    0.00000
H    -0.88998    0.00000    1.42193   -0.59000    0.00000    0.39000
Cl    0.00000   -1.43703   -0.22352    0.00000    0.00000    0.00000
5
Model[11]: IRIntensity=1.4436 KM/Mole;ReducedMass=1.1167 AMU;ForceConstant=6.9841 mDyne/A;Frequency=3258.0311 cm^-1;FrequencyLabel=B1;PATH=Calculation 1;FrequenciesFrequencies
C     0.00000    0.00000    0.79262    0.10000    0.00000    0.00000
H     0.88998    0.00000    1.42193   -0.58000    0.00000   -0.40000
Cl    0.00000    1.43703   -0.22352    0.00000    0.00000    0.00000
H    -0.88998    0.00000    1.42193   -0.58000    0.00000    0.40000
Cl    0.00000   -1.43703   -0.22352    0.00000    0.00000    0.00000
</ModelData>
</Models>
##$PEAKS=
<Peaks type="IR" xUnitsExpected="1/cm"  >
<PeakData id="1" title="B1-asymm stretch of CH group (~3062 cm-1)" peakShape="broad" model="1.11" xMax="3090" xMin="3035"    />
<PeakData id="2" title="A1-symm stretch of CH group (~2984 cm-1)" peakShape="broad" model="1.10" xMax="3010" xMin="2950"    />
<PeakData id="3" title="A1- H-C-H scissors (~1276 cm-1)" peakShape="broad" model="1.9" xMax="1290" xMin="1270"    />
<PeakData id="4" title="B2- H-C-H wagging (~1260 cm-1)" peakShape="broad" model="1.8" xMax="1270" xMin="1250"    />
<PeakData id="5" title="B2-asymm stretch of CCl group (~745 cm-1)" peakShape="broad" model="1.5" xMax="780" xMin="730"    />
<PeakData id="6" title="A1-symm stretch of CCl group (~707 cm-1)" peakShape="broad" model="1.4" xMax="730" xMin="670"    />
</Peaks>
##XUNITS=1/CM
##YUNITS=TRANSMITTANCE
##XFACTOR=1.0000000000
##YFACTOR=0.0000305737
##FIRSTX=601.35095215
##LASTX=3893.25878906
##FIRSTY=0.56875855
##NPOINTS=4873
##XYDATA=(X++(Y..Y))
601.4A8603UJ32R9J33R9O6L3J32R8J32R9J32R8O6L3O6L3J31R8J32R8O5L3J31R8R9O5
620.3B1004J31R8J63J30O6L2R8O5L3L2L3%R8O5UJ30R7O5L3O5L2R7O5VL2L3L2TL3O5
642.6B3184L2%TL2L3%Zl3l2%Tl2l3%l2l3l2To5Ul2o5%To5Tr7r8k27k28l3o5l2l3l2
670.9B1755l3o5r8j96To5r8k29k62n58n60j64j65l64Tj99Tk99l33l34Tm03m36l03l38
687.8A5160l38l39n78n80n15n51p26p32m55m92q15q22k88l25r84r99m49m53%TL8L7
702.7D794L8%UL8T%TL8T%Xl8Vp5j14p6j15k30k31%l8p8p7%l9U%Tl9l8%m0%Tl9T%ZL9
738.5C525L9%TM0%L8L9V%L9L8L9TJ16P7L8TP7L8L9L8J14P7J14P5J52J13L01K61L72
760.1E993L70M77M74L99L96O45O05O71O31P33O93M48M47O16N79P47P42M71M36M68M33
$$ plain form
601.4 18603 18603 18603 18735 18834 18967 19066 19132 19165 19297 19395 19527 19626 19758 19856 19922 19955 20021 20054 20185 20283 20415 20513 20578 20611 20742 20840 20939 21004
620.3 21004 21135 21233 21396 21526 21592 21624 21722 21787 21820 21852 21885 21885 21983 22048 22113 22178 22308 22405 22470 22503 22568 22600 22697 22762 22827 22892 22957 22989 23022 23054 23086 23119 23184
642.6 23184 23216 23216 23216 23248 23281 23281 23281 23281 23281 23281 23281 23281 23281 23248 23216 23216 23216 23184 23151 23151 23119 23086 23054 23022 22957 22892 22827 22795 22730 22730 22730 22665 22600 22503 22405 22178 21950 21917 21852 21820 21787 21755
670.9 21755 21722 21657 21559 21363 21167 21102 21004 20775 20513 19955 19395 19231 19066 18702 18338 18139 17940 17641 17308 16974 16640 16237 15801 15498 15160
687.8 15160 14822 14483 13905 13325 12810 12259 11533 10801 10346 9854 9039 8217 7929 7604 6620 5621 5172 4719 4719 4719 4757 4794
702.7 4794 4832 4832 4832 4832 4870 4908 4908 4908 4946 4984 4984 4984 4984 4984 4984 4984 4946 4908 4870 4832 4757 4643 4567 4452 4222 3991 3991 3953 3875 3798 3798 3759 3720 3681 3681 3681 3642 3604 3604 3564 3564 3564 3525 3486 3486 3486 3486 3486 3486 3486 3486 3486 3525
738.5 3525 3564 3564 3564 3604 3604 3642 3681 3720 3759 3798 3798 3837 3875 3914 3953 4069 4146 4184 4222 4299 4337 4376 4414 4528 4605 4719 4794 4946 5059 5360 5621 5993
760.1 5993 6363 6840 7314 7713 8109 8754 9359 10030 10661 11394 12087 12535 12982 13598 14177 14924 15666 16137 16573 17041 17474
774.3A7474M66M64N30N27J32R9TR8L62L60M91M57K61K28K92K60L89TK91K58J61J62
789.2B4250K89K58L53L21K57K56TK55J92TJ91J59J91VJ59J26R6R5J27R5O3O4O3L2J26
807.4B9039R5TO3J58TJ27R4J27R4O3L2O3L2O3TR4O3TL2L1L2L1L2%VL1%R4O3UL2L1T%
$$ plain form
774.3 17474 17940 18404 18934 19461 19593 19692 19791 19889 20251 20611 21102 21559 21820 22048 22340 22600 22989 23378 23669 23927 24088 24250
789.2 24250 24539 24797 25150 25471 25728 25984 26240 26495 26687 26879 27070 27229 27420 27611 27802 27993 28152 28278 28374 28469 28596 28691 28754 28818 28881 28913 29039
807.4 29039 29134 29229 29292 29450 29608 29735 29829 29956 30050 30113 30145 30208 30240 30303 30366 30460 30523 30586 30618 30649 30681 30712 30744 30744 30744 30744 30744 30775 30775 30869 30932 30995 31058 31090 31121 31152 31152
832.4C1152%VL2L1%S40l1o3L1%L2L1O3L2%VL1T%Vl1T%TL1T%TL2L1%ZL2%S8l2%S8L2
981.7C1467%Vl2%ZL2%UL1T%TL2L1%VL2%Xl2%Tl1l2%Vl1T%S4L1T%Vl1T%T3l2%Vl1l2
1047.3C1372%S0l1T%S3l2%Vl1l2%T2l1l2%Wl1%T2l1l2%Tl1l2l1l2%l1l2l1%Tl1l2%
1115.5C0775%Xl1%Vl2l1%Tl2l1%l2%Tl1l2%T2l1l2r4j26o3r5o3r5%l1%Tl2T%TL2T%
1158.8B9893%L1%UL2L1L2L1%TL2%WL1L2%Tl2l1%S2L1L2%Xl2l1%Ul2l1l2l1l2%l1l2
1196.6B9861l2l1l2l1o3l2T%Zl1l2o3r5l1o4l1l2Tl1%l2o3Tl2o3o4r5j27j58o4r5o3
1222.3B8247r5%l2o4o3%Tj27j28o3r6o3r6o3o4Tr5k24k55Tk88j60Tj28j61j92k25l21
1241.2B4765l54k90k91j61j62l88l89l57l58j404j446p61p97q00q05p40p79p82p88
1254A2913n50n53r04r47q13q21j011j062j306j342j18j57%l9L9%J57J18J16P8J93J55
$$ plain form
981.7 31467 31467 31467 31467 31467 31435 31435 31435 31435 31435 31435 31435 31435 31435 31467 31467 31467 31467 31498 31529 31529 31529 31561 31592 31592 31592 31592 31592 31624 31624 31624 31624 31624 31624 31624 31592 31592 31592 31561 31529 31529 31529 31529 31529 31498 31467 31467 31467 31467 31467 31467 31467 31467 31467 31467 31467 31467 31467 31467 31467 31498 31529 31529 31529 31529 31529 31498 31467 31467 31467 31467 31467 31467 31467 31467 31467 31467 31467 31467 31467 31467 31467 31467 31467 31467 31467 31467 31467 31467 31467 31467 31435 31435 31435 31435 31435 31404 31372
1047.3 31372 31372 31372 31372 31372 31372 31372 31372 31372 31372 31372 31341 31310 31310 31310 31310 31310 31310 31310 31310 31310 31310 31310 31310 31310 31310 31278 31278 31278 31278 31278 31247 31215 31215 31215 31215 31215 31215 31215 31215 31215 31215 31215 31215 31215 31215 31215 31215 31215 31215 31215 31215 31215 31215 31215 31184 31152 31152 31152 31152 31152 31152 31121 31121 31121 31121 31121 31121 31121 31121 31121 31121 31121 31121 31121 31121 31121 31121 31121 31121 31121 31121 31121 31121 31121 31090 31058 31058 31058 31027 30995 30964 30932 30932 30901 30869 30838 30838 30838 30807 30775 30775
1115.5 30775 30775 30775 30775 30775 30775 30775 30744 30744 30744 30744 30744 30712 30681 30681 30681 30649 30618 30618 30586 30586 30586 30555 30523 30523 30523 30523 30523 30523 30523 30523 30523 30523 30523 30523 30523 30523 30523 30523 30523 30523 30523 30523 30523 30523 30523 30492 30460 30366 30240 30177 30082 30019 29924 29924 29893 29893 29893 29861 29829 29829 29829 29861 29893 29893
1158.8 29893 29893 29924 29924 29924 29924 29956 29987 30019 30050 30050 30050 30082 30082 30082 30082 30082 30082 30113 30145 30145 30145 30113 30082 30082 30082 30082 30082 30082 30082 30082 30082 30082 30082 30082 30082 30113 30145 30145 30145 30145 30145 30145 30145 30113 30082 30082 30082 30082 30050 30019 29987 29956 29924 29924 29893 29861
1196.6 29861 29829 29798 29766 29735 29672 29640 29608 29608 29608 29608 29608 29608 29608 29608 29608 29577 29545 29482 29387 29356 29292 29261 29229 29197 29166 29166 29134 29071 29008 28976 28913 28849 28754 28627 28469 28405 28310 28247
1222.3 28247 28152 28152 28120 28056 27993 27993 27993 27866 27738 27675 27579 27516 27420 27357 27293 27229 27134 26910 26655 26400 26112 25952 25792 25664 25503 25311 25086 24765
1241.2 24765 24411 24121 23830 23669 23507 23119 22730 22373 22015 20611 19165 18404 17607 16807 16002 15262 14483 13701 12913
1254 12913 12363 11810 10906 9959 9146 8325 7314 6252 4946 3604 3486 3329 3329 3290 3329 3329 3486 3604 3720 3798 3991 4146
1268.9D146J53J15N70N63L35K96M42M39J588J523K089K054L74L72J078J070J131J123
1281.1A9461L30L28UN56N21M23L90L89L88M85M84K57TL86L53J28R6L52L51R6O4K23
1296.6B6974K23R6O4J27UR6R5O4R5O4J58J59R5TJ27TO3L2O3UL2O3O4R4R5L2L1L2TL1
$$ plain form
1268.9 4146 4299 4414 4984 5547 5882 6178 6620 7059 8647 10170 12259 14313 14687 15059 16137 17207 18338 19461
1281.1 19461 19791 20119 20447 20775 21331 21852 22275 22665 23054 23442 23927 24411 24668 24925 25311 25664 25792 25888 26240 26591 26687 26751 26974
1296.6 26974 27197 27293 27357 27484 27611 27738 27834 27929 27993 28088 28152 28310 28469 28564 28659 28786 28913 28976 29008 29071 29134 29197 29229 29292 29356 29450 29545 29577 29608 29640 29672 29703
1318.2B9703%L2L1O3O4%TL1%L2L1L2L1L2%O3TL2%UL1L2L1L2%VL1%T2l1%V8O3T%U6J57
1412.8C0649J58%U2J57T%S02l1l2%S2l1l2%Zl1l2%Wl1%Tl2l1%Tl1l2%l1%Xl2l1%Vl2
1542.5C0649l1%l2l1l2%Tl1l2%XL2L1J26R5O3L1O3L1O3TL2L1%TL1%sL2L1%Tl1l2%Wl1
1577C1121%Tl1l2L2L1%T2L1%UL2L1%ZL2L1%TO3L1L2L1%VL2%UL1T%T2L2L1L2%S9L1T%
$$ plain form
1542.5 30649 30618 30618 30586 30555 30523 30523 30523 30492 30460 30460 30460 30460 30460 30460 30460 30492 30523 30649 30744 30807 30838 30901 30932 30995 31058 31090 31121 31121 31121 31152 31152 31152 31152 31152 31152 31152 31152 31152 31152 31184 31215 31215 31215 31184 31152 31152 31152 31152 31152 31152 31121
1577 31121 31121 31121 31090 31058 31090 31121 31121 31121 31121 31121 31121 31121 31121 31121 31121 31121 31121 31121 31121 31121 31121 31121 31121 31121 31121 31121 31121 31121 31152 31152 31152 31152 31184 31215 31215 31215 31215 31215 31215 31215 31215 31215 31247 31278 31278 31278 31341 31372 31404 31435 31435 31435 31435 31435 31467 31467 31467 31467 31498 31529 31529 31529 31529 31529 31529 31529 31529 31529 31529 31529 31529 31529 31529 31529 31529 31529 31529 31529 31529 31529 31529 31529 31561 31592 31624 31624 31624 31624 31624 31624 31624 31624 31624 31624 31624 31624 31624 31624 31624 31624 31624 31624 31624 31624 31655 31686 31686
1649.3C1686%l1T%S6L1T%S0l1T%Wl2%U0L2%Tl2%Vl1l2%Tl1T%S2L1T%T0L2L1l1l2%ZL2
1737.1C1561L1%Zl1l2%T0L2L1%ZL2%L1T%Tl1T%l2%ZL2%WL1T%ZL2L1%Zl1l2%XL2L1%
$$ plain form
1737.1 31561 31592 31592 31592 31592 31592 31592 31592 31592 31592 31561 31529 31529 31529 31529 31529 31529 31529 31529 31529 31529 31529 31529 31529 31529 31529 31529 31529 31529 31529 31529 31529 31561 31592 31592 31592 31592 31592 31592 31592 31592 31592 31624 31624 31655 31686 31686 31686 31655 31624 31624 31592 31592 31592 31592 31592 31592 31592 31592 31592 31624 31624 31624 31624 31624 31624 31655 31686 31686 31686 31686 31686 31686 31686 31686 31686 31718 31749 31749 31749 31749 31749 31749 31749 31749 31749 31718 31686 31686 31686 31686 31686 31686 31686 31718 31749 31749
1802C1749%U5L1L2%V0l2l1%U0l1l2%S8L2L1%Tl1l2%S4L2L1%S8l1l2%S2L2L1%U8L1L2
1954C1812%TL1%Xl1%Vl2l1%XL1L2%ZL1%S3L2L1%S0L1L2%sl2%l1%U7l1%l2%Yl1%Wl2
2039.2C1780%l1%T4L1%L2%L1%YL2%L1%Tl1%l2%Yl1%Wl2%l1%T9l1%l2%VL2%L1%Xl1%
$$ plain form
2039.2 31780 31780 31749 31749 31749 31749 31749 31749 31749 31749 31749 31749 31749 31749 31749 31749 31749 31749 31749 31749 31749 31749 31749 31749 31749 31749 31749 31780 31780 31812 31812 31843 31843 31843 31843 31843 31843 31843 31843 31875 31875 31906 31906 31906 31875 31875 31843 31843 31843 31843 31843 31843 31843 31843 31812 31812 31812 31812 31812 31812 31780 31780 31749 31749 31749 31749 31749 31749 31749 31749 31749 31749 31749 31749 31749 31749 31749 31749 31749 31749 31749 31749 31749 31749 31749 31749 31749 31749 31749 31749 31749 31749 31718 31718 31686 31686 31686 31686 31686 31718 31718 31749 31749 31749 31749 31749 31749 31749 31718 31718
2112.8C1718l2%U6L2%L1%L1%L2%S9L1%L2%L1%WL1%L2%Y4l2%l1%Wl1%l2%S1l1%l2%l1
2232.4C1749%sl1%l2%T5l1Tl2%l1l2l1Tl2l1l2l1Tl2l1l2l1%X6L1%J89J57R4O3L1%
2318.9C1749L1%L2%S1L1%V0l1%T1l2%l1%sl1%l2%l1%l1%l2l1o3%l1%l2%l1%l2%Wl1
2396C1341%l1%Ul2%l1%l2%l1%l2%VL2%L1%L2%L1%L2L1TL2L1L2L1%L1L2L1%L2L1T%L2
$$ plain form
2318.9 31749 31780 31780 31812 31812 31812 31812 31812 31812 31812 31812 31812 31812 31812 31812 31843 31843 31843 31843 31843 31843 31843 31843 31843 31843 31843 31843 31843 31843 31843 31843 31843 31843 31843 31843 31843 31843 31843 31843 31843 31843 31843 31843 31843 31843 31843 31843 31843 31843 31843 31843 31843 31843 31843 31843 31843 31812 31812 31812 31812 31812 31812 31812 31812 31812 31812 31812 31812 31812 31812 31812 31812 31812 31812 31812 31812 31812 31812 31780 31780 31749 31749 31749 31749 31749 31749 31749 31749 31749 31749 31718 31718 31686 31686 31655 31655 31624 31624 31592 31561 31498 31498 31467 31467 31435 31435 31404 31404 31372 31372 31372 31372 31372 31372 31341
2396 31341 31341 31310 31310 31310 31310 31278 31278 31247 31247 31215 31215 31184 31184 31152 31152 31152 31152 31152 31184 31184 31215 31215 31247 31247 31278 31278 31310 31341 31372 31404 31435 31467 31498 31498 31529 31561 31592 31592 31624 31655 31686 31686 31718
2425C1718%L1%WL1%L2%UL1%sL2%L1%T8l1%TL1%sL1%L2%YL1%Vl1%T6L1%Z8l1%W4L1%
2597.3C2000%Ul1%Y1l2%l1%sl1%l2%sl1%l2o2r4o3Tl1l2l1o3Vo2o3r5l1o3l1l2%l1
2679.8C0744L1%L2%O2O3TL2O3O2O3L2O3O2O3TL1L2O3L1TL2L1%L1L2L1%S8l1%Yl2%l1
$$ plain form
2679.8 30744 30775 30775 30807 30807 30869 30932 30995 31027 31090 31152 31215 31247 31310 31372 31435 31498 31529 31561 31624 31655 31686 31718 31749 31749 31780 31812 31843 31843 31843 31843 31843 31843 31843 31843 31843 31843 31843 31843 31843 31843 31843 31843 31843 31843 31843 31812 31812 31812 31812 31812 31812 31812 31812 31780 31780 31749
2717.6C1749%VL1%L2%U4l2%l1%sl1%l2%l1%l1%l2%Ul1%l2%T9l1%l1%ZL1%L1%Xl1%l1
2798.7C1467l2l1%l2%l1%l1l2o3l1l2%sl1%Yl1%l2%S2L2%L1%sL1%S1L2%L1%Xl1%l2
2852.8C1152%Wl1%Ul1%l2%S3l1%l2%Wl1%l2%l1%Ul2%l1%Wl1%l2%Ul1%Wl2%l1%l2%l1
2898.7C0618%Ul2%l1%l2%l1%l2%l1%l2%Ul1l2l1l2l1l2l1%l2%l2%l1%Ul2%l1%l2%sl1
2932.5B9956%l2%Vl1l2%l2l1o3l2l1l2Tl1l2l1o4l1o3l2o3l2o3l2o3l2o3l2o3l2l1
2955.5B8818r6r5o3r5l2o3l2Uo3l2o3r6j27r5j27o4o3o4Tj27j59j28j27j28Uj27j92
2975.1B6176k24j92j93k24k57k25Tj93Tj94Tj61j94j62j94%l2l3l2L2L3L2%K91K59
2992B3701K58UK57K58K57K88K57K88K56M15M14UR5O4O3TL2U%L1L2T%L2%L1%S4l1l2
3022.4B8469l2%Vl2l1l2o4r5j27r5j27o4r5o4r5j28j59Tj60k55Tk56k88k25k24j93
$$ plain form
2798.7 31467 31435 31404 31404 31372 31372 31341 31341 31310 31278 31215 31184 31152 31152 31152 31152 31152 31152 31152 31152 31152 31152 31121 31121 31121 31121 31121 31121 31121 31121 31090 31090 31058 31058 31058 31058 31058 31058 31058 31058 31058 31058 31058 31058 31058 31090 31090 31121 31121 31121 31121 31121 31121 31121 31121 31121 31121 31152 31152 31152 31152 31152 31152 31152 31152 31152 31152 31152 31152 31184 31184 31215 31215 31215 31215 31215 31215 31215 31184 31184 31152
2852.8 31152 31152 31152 31152 31152 31152 31121 31121 31121 31121 31090 31090 31058 31058 31058 31058 31058 31058 31058 31058 31058 31058 31058 31058 31058 31058 31027 31027 30995 30995 30995 30995 30995 30995 30964 30964 30932 30932 30901 30901 30901 30901 30869 30869 30838 30838 30838 30838 30838 30838 30807 30807 30775 30775 30775 30775 30744 30744 30744 30744 30744 30744 30712 30712 30681 30681 30649 30649 30618
2898.7 30618 30618 30618 30618 30586 30586 30555 30555 30523 30523 30492 30492 30460 30460 30429 30429 30397 30397 30397 30397 30366 30334 30303 30271 30240 30208 30177 30177 30145 30145 30113 30113 30082 30082 30082 30082 30050 30050 30019 30019 29987 29987 29987 29987 29987 29987 29987 29987 29987 29987 29956
2932.5 29956 29956 29924 29924 29924 29924 29924 29893 29861 29861 29829 29798 29735 29703 29672 29640 29608 29577 29545 29514 29450 29419 29356 29324 29261 29229 29166 29134 29071 29039 28976 28944 28881 28849 28818
2955.5 28818 28722 28627 28564 28469 28437 28374 28342 28310 28278 28215 28183 28120 28024 27897 27802 27675 27611 27548 27484 27420 27293 27134 27006 26879 26751 26623 26495 26368 26176
2975.1 26176 25952 25760 25567 25343 25086 24861 24636 24443 24250 24056 23862 23701 23507 23345 23151 23151 23119 23086 23054 23086 23119 23151 23151 23442 23701
2992 23701 23959 24217 24475 24732 24990 25247 25535 25792 26080 26336 26751 27165 27579 27993 28088 28152 28215 28278 28310 28342 28374 28374 28405 28437 28469 28469 28501 28501 28532 28532 28532 28532 28532 28532 28532 28532 28532 28532 28532 28532 28532 28532 28532 28501 28469
3022.4 28469 28437 28437 28437 28437 28437 28405 28374 28342 28278 28183 28056 27961 27834 27770 27675 27611 27516 27388 27229 27070 26910 26655 26400 26144 25856 25631 25407 25214
3041.3B5214k24k90l22Tl23l55l89Tl90r77j015j020j059j00r9l3l4L4L3UL98L64M30
3057.6A9198L95J98J97UJ96J97J96J64L91UL89TL56TL55M83M82N13M81K24K23J92J91
3074.4B6942J28J27J28R5J28R5J27R6O3O4O3O4L2L1O4L1R6O3R5O4L1%L2TL1%L2%O4
3094B8818L1O4O3L2L1O3L2O3L2O3O4L1%L2L1L2%L2%UL1%L2%L1%L2%L2%YL1%L2%L1%
3123.1B9766%VL2%L1%L2%L2%S9L1%O3L2O3TL2L1O3L2L1%L2%UL1%L2%L1%L2%L1%L2%
3162.3C0555L1%UL2%WL1L2L1L2%XL1%WL2%L1%L1%L2%sL1%L2L1L2%L1%S3L2%L1%U9L1
$$ plain form
3041.3 25214 24990 24700 24378 24056 23733 23378 22989 22600 22210 21233 20218 19198 18139 18039 17940 17907 17873 17907 17940 17973 18006 18404 18768 19198
3057.6 19198 19593 19791 19988 20185 20382 20578 20775 20971 21135 21526 21917 22308 22697 23086 23442 23798 24153 24636 25118 25631 26112 26336 26559 26751 26942
3074.4 26942 27070 27197 27325 27420 27548 27643 27770 27866 27929 27993 28056 28120 28152 28183 28247 28278 28374 28437 28532 28596 28627 28627 28659 28691 28722 28722 28754 28754 28818
3094 28818 28849 28913 28976 29008 29039 29102 29134 29197 29229 29292 29356 29387 29387 29419 29450 29482 29482 29514 29514 29514 29514 29545 29545 29577 29577 29608 29608 29640 29640 29672 29672 29672 29672 29672 29672 29672 29672 29703 29703 29735 29735 29766 29766
3123.1 29766 29766 29766 29766 29766 29798 29798 29829 29829 29861 29861 29893 29893 29893 29893 29893 29893 29893 29893 29893 29893 29893 29893 29893 29893 29893 29893 29893 29893 29893 29893 29924 29924 29987 30019 30082 30145 30177 30208 30271 30303 30334 30334 30366 30366 30366 30366 30397 30397 30429 30429 30460 30460 30492 30492 30523 30523 30555 30555
3162.3 30555 30586 30586 30586 30586 30618 30618 30618 30618 30618 30618 30649 30681 30712 30744 30744 30744 30744 30744 30744 30744 30775 30775 30775 30775 30775 30775 30807 30807 30838 30838 30869 30869 30901 30901 30901 30901 30901 30901 30901 30901 30901 30901 30932 30932 30964 30995 31027 31027 31058 31058 31058 31058 31058 31058 31058 31058 31058 31058 31058 31058 31058 31058 31090 31090 31121 31121 31121 31121 31121 31121 31121 31121 31121 31121 31121 31121 31121 31121 31121 31121 31121 31121 31121 31121 31121 31121 31121 31121 31121 31121 31121 31121 31121 31121 31121 31121 31121 31121 31121 31121 31121 31121 31121 31121 31152
3233.3C1152%T08l1%XL1%T5L2%L1%U8l1%l2%U2L2%L1%T8l1%l2%T5l1%Yl1%l2%T6L2
3513C1090%L1%S2l1%l2%T0L2%L1%L1%T3L2%L1%Xl1%l2%Wl1%T2L1%S9L2%L1%T6l1%l2
3619.1C1152%sl1%Ul1%l2%Wl1%l2%T1l1%l2%l1%Yl2%l1%sl1%l2%l1%l2o3Tl1o3l2l1
3674.5C0429%l2%l1%Ul2%l1l2l1%l2%l1%l2%VL2%L1L2L1%L2%L1L2L1L2L1L2L1%L2L1
$$ plain form
3619.1 31152 31152 31152 31152 31152 31152 31152 31152 31152 31152 31121 31121 31121 31121 31090 31090 31058 31058 31058 31058 31058 31058 31027 31027 30995 30995 30995 30995 30995 30995 30995 30995 30995 30995 30995 30995 30995 30995 30995 30995 30995 30995 30995 30995 30995 30995 30964 30964 30932 30932 30901 30901 30901 30901 30901 30901 30901 30901 30869 30869 30838 30838 30838 30838 30838 30838 30838 30838 30838 30838 30807 30807 30775 30775 30744 30744 30712 30649 30586 30555 30492 30460 30429
3674.5 30429 30429 30397 30397 30366 30366 30366 30366 30334 30334 30303 30271 30240 30240 30208 30208 30177 30177 30145 30145 30145 30145 30145 30177 30177 30208 30240 30271 30271 30303 30303 30334 30366 30397 30429 30460 30492 30523 30523 30555 30586
3701.6C0586L2L1L2L1L2%L1%S5L2%L1%Xl1%l2%S2L2%L1%U7L1%L2%S3L1%S2l1%XL1%
3785.4C0932%Y0L2%L1%WL2%L1%S7L2%L1%U0l1%l2%sl1%l2%Wl1%l2%Wl1
3893.5C0901
$$ plain form
3893.5 30901
##END=  $$ end of CH2Cl2
##TITLE= deuterated dichloromethane
##JCAMP-DX= 5.01
##DATA TYPE= INFRARED SPECTRUM
##DATA CLASS= XYDATA
##BLOCK ID=4
##ORIGIN=Department of Chemistry, UWI, Jamaica
##OWNER= PUBLIC DOMAIN
##LONGDATE= 2012/02/22 10:53:05.0243 -0500 $$ export date from JSpecView
##SPECTROMETER/DATASYSTEM= from scan
##NAMES= deuterated - dichloromethane
##MOLFORM=CD2Cl2
##SPECTROMETER/DATA SYSTEM=PERKIN ELMER
##$MODELS=
<Models>
<ModelData id="cd2cl2" type="MOL">
CH2Cl2
RLDSViewer          3D                             0

  5  4  0  0  0  0  0  0  0  0999 V2000
    0.0000    0.0000    0.7926 C   0  0  0  0  0  0  0  0  0  1
    0.8900    0.0000    1.4219 H   0  0  0  0  0  0  0  0  0  2
    0.0000    1.4370   -0.2235 Cl  0  0  0  0  0  0  0  0  0  3
   -0.8900    0.0000    1.4219 H   0  0  0  0  0  0  0  0  0  4
    0.0000   -1.4370   -0.2235 Cl  0  0  0  0  0  0  0  0  0  5
  1  2  1  0  0  0
  1  4  1  0  0  0
  1  3  1  0  0  0
  1  5  1  0  0  0
M  END
</ModelData>
<ModelData id="D2" type="XYZVIB" baseModel="cd2cl2" vibrationScale=".2">
5
Model[1]: Convg=0.2016D-08;-V/T=2.0004;Energy=NaN;Range=M.O.s;E(RHF)=-957.984015823 A.U.;PATH=Calculation 1;Input
C     0.00000    0.00000    0.00000
H     0.00000    0.00000    1.09000
Cl    1.65934    0.00000   -0.58667
H    -0.51383    0.88998   -0.36333
Cl   -0.82967   -1.43703   -0.58667
5
Model[2]: Convg=0.2016D-08;-V/T=2.0004;Energy=-957.9841;Range=M.O.s;E(RHF)=-957.984015823 A.U.;PATH=Calculation 1;Standard
C     0.00000    0.00000    0.79262
H     0.88998    0.00000    1.42193
Cl    0.00000    1.43703   -0.22352
H    -0.88998    0.00000    1.42193
Cl    0.00000   -1.43703   -0.22352
5
Model[3]: IRIntensity=0.8549 KM/Mole;ReducedMass=19.4874 AMU;ForceConstant=1.2400 mDyne/A;Frequency=328.6293 cm^-1;FrequencyLabel=A1;PATH=Calculation 1;FrequenciesFrequencies
C     0.00000    0.00000    0.79262    0.00000    0.00000   -0.42000
H     0.88998    0.00000    1.42193   -0.01000    0.00000   -0.41000
Cl    0.00000    1.43703   -0.22352    0.00000    0.49000    0.08000
H    -0.88998    0.00000    1.42193    0.01000    0.00000   -0.41000
Cl    0.00000   -1.43703   -0.22352    0.00000   -0.49000    0.08000
5
Model[4]: IRIntensity=22.3831 KM/Mole;ReducedMass=7.1242 AMU;ForceConstant=2.6393 mDyne/A;Frequency=792.9600 cm^-1;FrequencyLabel=A1;PATH=Calculation 1;FrequenciesFrequencies
C     0.00000    0.00000    0.79262    0.00000    0.00000    0.61000
H     0.88998    0.00000    1.42193    0.06000    0.00000    0.53000
Cl    0.00000    1.43703   -0.22352    0.00000    0.12000   -0.12000
H    -0.88998    0.00000    1.42193   -0.06000    0.00000    0.53000
Cl    0.00000   -1.43703   -0.22352    0.00000   -0.12000   -0.12000
5
Model[5]: IRIntensity=135.9554 KM/Mole;ReducedMass=6.9784 AMU;ForceConstant=2.9811 mDyne/A;Frequency=851.5017 cm^-1;FrequencyLabel=B2;PATH=Calculation 1;FrequenciesFrequencies
C     0.00000    0.00000    0.79262    0.00000    0.63000    0.00000
H     0.88998    0.00000    1.42193    0.00000    0.53000    0.00000
Cl    0.00000    1.43703   -0.22352    0.00000   -0.12000    0.09000
H    -0.88998    0.00000    1.42193    0.00000    0.53000    0.00000
Cl    0.00000   -1.43703   -0.22352    0.00000   -0.12000   -0.09000
5
Model[6]: IRIntensity=0.8961 KM/Mole;ReducedMass=1.3466 AMU;ForceConstant=0.8771 mDyne/A;Frequency=1051.4636 cm^-1;FrequencyLabel=B1;PATH=Calculation 1;FrequenciesFrequencies
C     0.00000    0.00000    0.79262    0.17000    0.00000    0.00000
H     0.88998    0.00000    1.42193   -0.27000    0.00000    0.64000
Cl    0.00000    1.43703   -0.22352   -0.02000    0.00000    0.00000
H    -0.88998    0.00000    1.42193   -0.27000    0.00000   -0.64000
Cl    0.00000   -1.43703   -0.22352   -0.02000    0.00000    0.00000
5
Model[7]: IRIntensity=0.0000 KM/Mole;ReducedMass=1.0186 AMU;ForceConstant=1.0551 mDyne/A;Frequency=1325.9201 cm^-1;FrequencyLabel=A2;PATH=Calculation 1;FrequenciesFrequencies
C     0.00000    0.00000    0.79262    0.00000    0.00000    0.00000
H     0.88998    0.00000    1.42193    0.00000    0.71000    0.00000
Cl    0.00000    1.43703   -0.22352    0.01000    0.00000    0.00000
H    -0.88998    0.00000    1.42193    0.00000   -0.71000    0.00000
Cl    0.00000   -1.43703   -0.22352   -0.01000    0.00000    0.00000
5
Model[8]: IRIntensity=70.1871 KM/Mole;ReducedMass=1.1462 AMU;ForceConstant=1.4791 mDyne/A;Frequency=1479.9284 cm^-1;FrequencyLabel=B2;PATH=Calculation 1;FrequenciesFrequencies
C     0.00000    0.00000    0.79262    0.00000   -0.11000    0.00000
H     0.88998    0.00000    1.42193    0.00000    0.70000    0.00000
Cl    0.00000    1.43703   -0.22352    0.00000    0.00000    0.01000
H    -0.88998    0.00000    1.42193    0.00000    0.70000    0.00000
Cl    0.00000   -1.43703   -0.22352    0.00000    0.00000   -0.01000
5
Model[9]: IRIntensity=0.9042 KM/Mole;ReducedMass=1.0790 AMU;ForceConstant=1.7283 mDyne/A;Frequency=1648.8226 cm^-1;FrequencyLabel=A1;PATH=Calculation 1;FrequenciesFrequencies
C     0.00000    0.00000    0.79262    0.00000    0.00000   -0.08000
H     0.88998    0.00000    1.42193   -0.42000    0.00000    0.56000
Cl    0.00000    1.43703   -0.22352    0.00000    0.00000    0.00000
H    -0.88998    0.00000    1.42193    0.42000    0.00000    0.56000
Cl    0.00000   -1.43703   -0.22352    0.00000    0.00000    0.00000
5
Model[10]: IRIntensity=15.1988 KM/Mole;ReducedMass=1.0560 AMU;ForceConstant=6.3458 mDyne/A;Frequency=3193.6506 cm^-1;FrequencyLabel=A1;PATH=Calculation 1;FrequenciesFrequencies
C     0.00000    0.00000    0.79262    0.00000    0.00000   -0.07000
H     0.88998    0.00000    1.42193    0.59000    0.00000    0.39000
Cl    0.00000    1.43703   -0.22352    0.00000    0.00000    0.00000
H    -0.88998    0.00000    1.42193   -0.59000    0.00000    0.39000
Cl    0.00000   -1.43703   -0.22352    0.00000    0.00000    0.00000
5
Model[11]: IRIntensity=1.4436 KM/Mole;ReducedMass=1.1167 AMU;ForceConstant=6.9841 mDyne/A;Frequency=3258.0311 cm^-1;FrequencyLabel=B1;PATH=Calculation 1;FrequenciesFrequencies
C     0.00000    0.00000    0.79262    0.10000    0.00000    0.00000
H     0.88998    0.00000    1.42193   -0.58000    0.00000   -0.40000
Cl    0.00000    1.43703   -0.22352    0.00000    0.00000    0.00000
H    -0.88998    0.00000    1.42193   -0.58000    0.00000    0.40000
Cl    0.00000   -1.43703   -0.22352    0.00000    0.00000    0.00000
</ModelData>
</Models>
##$PEAKS=
<Peaks type="IR" xUnitsExpected="1/cm"  >
<PeakData id="1" title="B1-asymm stretch of CD group (~2304 cm-1)" peakShape="broad" model="D2.11" xMax="2320" xMin="2280"    />
<PeakData id="2" title="A1-symm stretch of CD group (~2198 cm-1)" peakShape="broad" model="D2.10" xMax="2220" xMin="2180"    />
<PeakData id="3" title="B2- H-C-D wagging (~1000 cm-1)" peakShape="broad" model="D2.8" xMax="1015" xMin="985"    />
<PeakData id="4" title="A1- H-C-D scissors (~955 cm-1)" peakShape="broad" model="D2.9" xMax="975" xMin="935"    />
<PeakData id="5" title="B2-asymm stretch of CCl group (~714 cm-1)" peakShape="broad" model="D2.5" xMax="735" xMin="695"    />
<PeakData id="6" title="A1-symm stretch of CCl group (~680 cm-1)" peakShape="broad" model="D2.4" xMax="695" xMin="665"    />
</Peaks>
##XUNITS= 1/CM
##YUNITS= TRANSMITTANCE
##XFACTOR=1.0000000000
##YFACTOR=0.0000294938
##FIRSTX=408.85986328
##LASTX=3992.00000000
##FIRSTY=0.75159997
##NPOINTS= 393
##XYDATA= (X++(Y..Y))
408.9B5483J714TP75O48Q2r5R1J94K20K43J91J13M5j28j24j05j03q4q5j37j41k60k88
619.1B9963o94q76n656r223m675Q00k71k400j992n11K84P703TL377L278J254R20M60
783.6B9444K97J91J27M0m5j51l24k09J07J13J44J23o32Tl266l535p395q431L173Q899
966.4A8038L826l17J134L037K342Q21P10K55K47J69J67J15J12O2N3L6K9K6UK5J7%l
1185.8C0953j3j9n5n7j16j17L8N7J18J36O6K9Oj4k9n0r1j90k40m79m46J10J11M20M42
1414.3C0570J84J26R5Q2N1K9rn3o3q5o2J9K0K6K5N6TK3J7r1j28p6m4k3%Yjn6Tl94m25
1743.4B9813K96M83L33K61J46N4M3K9K8K6K5K6K3KT%Vjkj7k7l5m3m9n7l7K1J4j2j6
2035.9C1329j3Tj6j3KOJ5K3Kj3o1j28Uk52q26p60L36TM66M70J58R1J5j9m2o4o26j280
$$ plain form
408.9 25483 27197 28911 29686 30334 30416 30321 30412 30606 30826 31069 31260 31373 31418 31290 31166 31061 30958 30874 30789 30652 30511 30251 29963
619.1 29963 29269 28393 22737 13514 8839 9639 9368 6968 4976 4465 4749 12452 20155 23532 26810 28064 28984 29444
783.6 29444 29741 29932 30059 30099 30054 29903 29579 29370 29477 29590 29734 29857 29225 28593 25327 21792 14397 5966 9139 18038
966.4 18038 21864 21547 22681 25718 28060 28881 29591 29846 30093 30262 30429 30544 30656 30718 30771 30807 30836 30862 30888 30914 30939 30956 30956 30953
1185.8 30953 30940 30921 30866 30809 30693 30576 30614 30671 30789 30925 30991 31020 31026 31012 30983 30933 30842 30652 30412 29933 29487 29597 29708 30128 30570
1414.3 30570 30754 30880 30975 31057 31108 31137 31128 31075 31012 30927 30865 30884 30904 30930 30955 31011 31067 31090 31107 31016 30888 30812 30768 30745 30745 30745 30745 30745 30745 30745 30745 30744 30688 30632 30238 29813
1743.4 29813 30109 30592 30925 31186 31332 31386 31429 31458 31486 31512 31537 31563 31586 31588 31590 31590 31590 31590 31590 31589 31587 31570 31543 31508 31465 31416 31359 31322 31343 31357 31345 31329
2035.9 31329 31316 31303 31287 31274 31276 31282 31297 31320 31322 31309 31248 31120 30992 30864 30612 29786 29026 29362 29698 30164 30634 30792 30883 30898 30879 30837 30773 30147 28867
2301B8867p40K87L06L80L83M01M00K98L01J47J28TJ27M9LT%S2JKJ2J3J6J3J6J3J2N
2648.3C1571N%S2PRK9N6TN8N7N5N7J9TK%Uj2j6k0j9k7l9o5j28j22j00q9%Xo6r3j13
3087.1C1091j27j15j05q9o5n9l6l8l2VNRK4K9TK7K2J8nl5l6l8p4k75k50K17K21J94
3361.3C0411J95J41J26O5L8L3K9UK4J7J5%Xnrj4j6Uj5j1o%Xj3j0j5j4j3j4qnOJ6UJ4
3781.8C1020J0Pj5j3j6j3Tj5KPJ1J5TJ6J9K3K5K8K9VK8
3992C1257
$$ plain form
2301 28867 28127 28414 28720 29100 29483 29884 30284 30582 30883 31030 31158 31286 31413 31462 31465 31468 31468 31468 31468 31468 31468 31468 31468 31468 31468 31468 31468 31468 31469 31471 31483 31496 31512 31525 31541 31554 31566 31571
2648.3 31571 31576 31576 31576 31576 31576 31576 31576 31576 31576 31576 31576 31576 31576 31583 31592 31621 31677 31733 31791 31848 31903 31960 31979 31998 32000 32000 32000 32000 31988 31972 31952 31933 31906 31867 31802 31674 31552 31452 31363 31363 31363 31363 31363 31363 31363 31297 31204 31091
3087.1 31091 30964 30849 30744 30655 30590 30531 30495 30457 30425 30393 30361 30329 30334 30343 30367 30396 30425 30452 30474 30492 30487 30452 30416 30378 30304 30029 29779 29996 30217 30411
3361.3 30411 30606 30747 30873 30938 30976 31009 31038 31067 31096 31120 31137 31152 31152 31152 31152 31152 31152 31152 31147 31138 31124 31108 31092 31076 31061 31050 31044 31044 31044 31044 31044 31044 31044 31031 31021 31006 30992 30979 30965 30957 30952 30958 30974 30990 31006 31020
3781.8 31020 31030 31037 31022 31009 30993 30980 30967 30952 30954 30961 30972 30987 31002 31018 31037 31060 31085 31113 31142 31171 31200 31229 31257
3992 31257
##END= $$ end of CD2Cl2
##END= $$ end of file