##TITLE= Compound file, contains several data records
##JCAMP-DX= 5.0
##DATA TYPE= LINK
##BLOCKS=8
##ORIGIN= Department of Chemistry, UWI, JAMAICA
##OWNER= public domain
##TITLE= dichloromethane CH2Cl2
##JCAMP-DX= 5.01
##DATA TYPE= IR SPECTRUM
##DATA CLASS= XYDATA
##BLOCK ID=1
##ORIGIN= Department of Chemistry, UWI, JAMAICA
##OWNER= public domain
##LONGDATE= Fri, 22 Feb 2019 15:00:32 -0500 $$ export date from JSpecView
##SPECTROMETER/DATA SYSTEM= computed by Gaussian at WebMo.net
##$MODELS=
<Models>
<ModelData id="DCMI" type="MOL">
dichloromethane CH2Cl2
RLDSViewer          3D                             0

  5  4  0  0  0  0  0  0  0  0999 V2000
    0.0000    0.0000    0.7615 C   0  0  0  0  0  0  0  0  0  1
    0.8900    0.0000    1.3691 H   0  0  0  0  0  0  0  0  0  2
    0.0000    1.4729   -0.2149 Cl  0  0  0  0  0  0  0  0  0  3
   -0.8900    0.0000    1.3691 H   0  0  0  0  0  0  0  0  0  4
    0.0000   -1.4729   -0.2149 Cl  0  0  0  0  0  0  0  0  0  5
  1  2  1  0  0  0
  1  4  1  0  0  0
  1  3  1  0  0  0
  1  5  1  0  0  0
M  END
</ModelData>
<ModelData id="5" type="XYZVIB" baseModel="DCMI" vibrationScale=".2">
5
Model[1]: PATH=Calculation 1;Input;Energy=NaN;NFock==Conv=0.50D-08;E(RHF)=-957.984015823 A.U.;PATH=Calculation 1;Input
C       0.00000      0.00000      0.76151
H       0.88548      0.00000      1.36914
Cl      0.00000      1.47291     -0.21492
H      -0.88548      0.00000      1.36914
Cl     -0.00000     -1.47291     -0.21492
5
Model[2]: FrequencyLabel=A1;ForceConstant=1.1009 mDyne/A;ReducedMass=19.2176 AMU;FreqValue=311.8229;Frequency=311.8229 cm^-1;Mode=1;PATH=Calculation 2;FrequenciesFrequencies;IRIntensity=0.8638 KM/Mole;PATH=Calculation 2;FrequenciesFrequencies
C       0.00000     -0.00000      0.76151     -0.00000     -0.00000     -0.42000
H       0.88548     -0.00000      1.36914     -0.01000      0.00000     -0.42000
Cl      0.00000      1.47291     -0.21492      0.00000      0.48000      0.08000
H      -0.88548      0.00000      1.36914      0.01000     -0.00000     -0.42000
Cl     -0.00000     -1.47291     -0.21492     -0.00000     -0.48000      0.08000
5
Model[3]: FrequencyLabel=A1;ForceConstant=2.5838 mDyne/A;ReducedMass=7.2901 AMU;FreqValue=775.5988;Frequency=775.5988 cm^-1;Mode=2;PATH=Calculation 2;FrequenciesFrequencies;IRIntensity=21.4163 KM/Mole;PATH=Calculation 2;FrequenciesFrequencies
C       0.00000     -0.00000      0.76151      0.00000      0.00000      0.62000
H       0.88548     -0.00000      1.36914      0.07000     -0.00000      0.52000
Cl      0.00000      1.47291     -0.21492     -0.00000      0.13000     -0.12000
H      -0.88548      0.00000      1.36914     -0.07000      0.00000      0.52000
Cl     -0.00000     -1.47291     -0.21492      0.00000     -0.13000     -0.12000
5
$$ [...]
Cl      0.00000      1.47291     -0.21492      0.00000     -0.00000      0.01000
H      -0.88548      0.00000      1.36914      0.00000      0.70000      0.00000
Cl     -0.00000     -1.47291     -0.21492      0.00000     -0.00000     -0.01000
5
Model[8]: FrequencyLabel=A1;ForceConstant=1.6633 mDyne/A;ReducedMass=1.0770 AMU;FreqValue=1619.0406;Frequency=1619.0406 cm^-1;Mode=7;PATH=Calculation 2;FrequenciesFrequencies;IRIntensity=0.5552 KM/Mole;PATH=Calculation 2;FrequenciesFrequencies
C       0.00000     -0.00000      0.76151     -0.00000     -0.00000     -0.08000
H       0.88548     -0.00000      1.36914     -0.42000      0.00000      0.57000
Cl      0.00000      1.47291     -0.21492      0.00000      0.00000     -0.00000
H      -0.88548      0.00000      1.36914      0.42000     -0.00000      0.57000
Cl     -0.00000     -1.47291     -0.21492     -0.00000     -0.00000     -0.00000
5
Model[9]: FrequencyLabel=A1;ForceConstant=6.9271 mDyne/A;ReducedMass=1.0552 AMU;FreqValue=3338.0477;Frequency=3338.0477 cm^-1;Mode=8;PATH=Calculation 2;FrequenciesFrequencies;IRIntensity=12.3040 KM/Mole;PATH=Calculation 2;FrequenciesFrequencies
C       0.00000     -0.00000      0.76151     -0.00000     -0.00000     -0.07000
H       0.88548     -0.00000      1.36914      0.59000      0.00000      0.38000
Cl      0.00000      1.47291     -0.21492      0.00000      0.00000      0.00000
H      -0.88548      0.00000      1.36914     -0.59000     -0.00000      0.38000
Cl     -0.00000     -1.47291     -0.21492     -0.00000     -0.00000      0.00000
5
Model[10]: FrequencyLabel=B1;ForceConstant=7.6996 mDyne/A;ReducedMass=1.1171 AMU;FreqValue=3420.2274;Frequency=3420.2274 cm^-1;Mode=9;PATH=Calculation 2;FrequenciesFrequencies;IRIntensity=0.4589 KM/Mole;PATH=Calculation 2;FrequenciesFrequencies
C       0.00000     -0.00000      0.76151     -0.10000     -0.00000      0.00000
H       0.88548     -0.00000      1.36914      0.58000      0.00000      0.39000
Cl      0.00000      1.47291     -0.21492      0.00000      0.00000     -0.00000
H      -0.88548      0.00000      1.36914      0.58000      0.00000     -0.39000
Cl     -0.00000     -1.47291     -0.21492      0.00000      0.00000      0.00000
</ModelData>
</Models>
##$PEAKS=
<Peaks type="IR" xUnitsExpected="1/cm"  >
<PeakData id="1" title="A1-symm stretch of CH group (~3338 cm-1)" peakShape="broad" model="5.9" xMax="3370" xMin="3300"    />
<PeakData id="2" title="B2- H-C-H wagging (~1450 cm-1)" peakShape="broad" model="5.7" xMax="1470" xMin="1430"    />
<PeakData id="3" title="B2-asymm stretch of CCl group (~844 cm-1)" peakShape="broad" model="5.4" xMax="870" xMin="820"    />
<PeakData id="4" title="A1-symm stretch of CCl group (~775 cm-1)" peakShape="broad" model="5.3" xMax="795" xMin="755"    />
</Peaks>
##XUNITS= 1/CM
##YUNITS= TRANSMITTANCE
##XFACTOR= 1
##YFACTOR= 9.999000E-07
##FIRSTX= 3.618473E+03
##FIRSTY= 1
##LASTX= 1.118228E+02
##NPOINTS= 2000
##MINY= 1.000000E-04
##MAXY= 1
##XYDATA= (X++(Y..Y))
$$ [...]
702.7D794L8%UL8T%TL8T%Xl8Vp5j14p6j15k30k31%l8p8p7%l9U%Tl9l8%m0%Tl9T%ZL9
$$ 4794 4832 4832 4832 4832 4870 4908 4908 4908 4946 4984 4984 4984 4984 4984 4984 4984 4946 4908 4870 4832 4757 4643 4567 4452 4222 3991 3991 3953 3875 3798 3798 3759 3720 3681 3681 3681 3642 3604 3604 3564 3564 3564 3525 3486 3486 3486 3486 3486 3486 3486 3486 3486 3525
738.5C525L9%TM0%L8L9V%L9L8L9TJ16P7L8TP7L8L9L8J14P7J14P5J52J13L01K61L72
$$ 3525 3564 3564 3564 3604 3604 3642 3681 3720 3759 3798 3798 3837 3875 3914 3953 4069 4146 4184 4222 4299 4337 4376 4414 4528 4605 4719 4794 4946 5059 5360 5621 5993
760.1E993L70M77M74L99L96O45O05O71O31P33O93M48M47O16N79P47P42M71M36M68M33
$$ 5993 6363 6840 7314 7713 8109 8754 9359 10030 10661 11394 12087 12535 12982 13598 14177 14924 15666 16137 16573 17041 17474
774.3A7474M66M64N30N27J32R9TR8L62L60M91M57K61K28K92K60L89TK91K58J61J62
$$ 17474 17940 18404 18934 19461 19593 19692 19791 19889 20251 20611 21102 21559 21820 22048 22340 22600 22989 23378 23669 23927 24088 24250
789.2B4250K89K58L53L21K57K56TK55J92TJ91J59J91VJ59J26R6R5J27R5O3O4O3L2J26
$$ 24250 24539 24797 25150 25471 25728 25984 26240 26495 26687 26879 27070 27229 27420 27611 27802 27993 28152 28278 28374 28469 28596 28691 28754 28818 28881 28913 29039
807.4B9039R5TO3J58TJ27R4J27R4O3L2O3L2O3TR4O3TL2L1L2L1L2%VL1%R4O3UL2L1T%
$$ 29039 29134 29229 29292 29450 29608 29735 29829 29956 30050 30113 30145 30208 30240 30303 30366 30460 30523 30586 30618 30649 30681 30712 30744 30744 30744 30744 30744 30775 30775 30869 30932 30995 31058 31090 31121 31152 31152
832.4C1152%VL2L1%S40l1o3L1%L2L1O3L2%VL1T%Vl1T%TL1T%TL2L1%ZL2%S8l2%S8L2
981.7C1467%Vl2%ZL2%UL1T%TL2L1%VL2%Xl2%Tl1l2%Vl1T%S4L1T%Vl1T%T3l2%Vl1l2
$$ 31467 31467 31467 31467 31467 31435 31435 31435 31435 31435 31435 31435 31435 31435 31467 31467 31467 31467 31498 31529 31529 31529 31561 31592 31592 31592 31592 31592 31624 31624 31624 31624 31624 31624 31624 31592 31592 31592 31561 31529 31529 31529 31529 31529 31498 31467 31467 31467 31467 31467 31467 31467 31467 31467 31467 31467 31467 31467 31467 31467 31498 31529 31529 31529 31529 31529 31498 31467 31467 31467 31467 31467 31467 31467 31467 31467 31467 31467 31467 31467 31467 31467 31467 31467 31467 31467 31467 31467 31467 31467 31467 31435 31435 31435 31435 31435 31404 31372
1047.3C1372%S0l1T%S3l2%Vl1l2%T2l1l2%Wl1%T2l1l2%Tl1l2l1l2%l1l2l1%Tl1l2%
$$ 31372 31372 31372 31372 31372 31372 31372 31372 31372 31372 31372 31341 31310 31310 31310 31310 31310 31310 31310 31310 31310 31310 31310 31310 31310 31310 31278 31278 31278 31278 31278 31247 31215 31215 31215 31215 31215 31215 31215 31215 31215 31215 31215 31215 31215 31215 31215 31215 31215 31215 31215 31215 31215 31215 31215 31184 31152 31152 31152 31152 31152 31152 31121 31121 31121 31121 31121 31121 31121 31121 31121 31121 31121 31121 31121 31121 31121 31121 31121 31121 31121 31121 31121 31121 31121 31090 31058 31058 31058 31027 30995 30964 30932 30932 30901 30869 30838 30838 30838 30807 30775 30775
1115.5C0775%Xl1%Vl2l1%Tl2l1%l2%Tl1l2%T2l1l2r4j26o3r5o3r5%l1%Tl2T%TL2T%
$$ 30775 30775 30775 30775 30775 30775 30775 30744 30744 30744 30744 30744 30712 30681 30681 30681 30649 30618 30618 30586 30586 30586 30555 30523 30523 30523 30523 30523 30523 30523 30523 30523 30523 30523 30523 30523 30523 30523 30523 30523 30523 30523 30523 30523 30523 30523 30492 30460 30366 30240 30177 30082 30019 29924 29924 29893 29893 29893 29861 29829 29829 29829 29861 29893 29893
1158.8B9893%L1%UL2L1L2L1%TL2%WL1L2%Tl2l1%S2L1L2%Xl2l1%Ul2l1l2l1l2%l1l2
$$ 29893 29893 29924 29924 29924 29924 29956 29987 30019 30050 30050 30050 30082 30082 30082 30082 30082 30082 30113 30145 30145 30145 30113 30082 30082 30082 30082 30082 30082 30082 30082 30082 30082 30082 30082 30082 30113 30145 30145 30145 30145 30145 30145 30145 30113 30082 30082 30082 30082 30050 30019 29987 29956 29924 29924 29893 29861
1196.6B9861l2l1l2l1o3l2T%Zl1l2o3r5l1o4l1l2Tl1%l2o3Tl2o3o4r5j27j58o4r5o3
$$ 29861 29829 29798 29766 29735 29672 29640 29608 29608 29608 29608 29608 29608 29608 29608 29608 29577 29545 29482 29387 29356 29292 29261 29229 29197 29166 29166 29134 29071 29008 28976 28913 28849 28754 28627 28469 28405 28310 28247
1222.3B8247r5%l2o4o3%Tj27j28o3r6o3r6o3o4Tr5k24k55Tk88j60Tj28j61j92k25l21
$$ 28247 28152 28152 28120 28056 27993 27993 27993 27866 27738 27675 27579 27516 27420 27357 27293 27229 27134 26910 26655 26400 26112 25952 25792 25664 25503 25311 25086 24765
1241.2B4765l54k90k91j61j62l88l89l57l58j404j446p61p97q00q05p40p79p82p88
$$ 24765 24411 24121 23830 23669 23507 23119 22730 22373 22015 20611 19165 18404 17607 16807 16002 15262 14483 13701 12913
1254A2913n50n53r04r47q13q21j011j062j306j342j18j57%l9L9%J57J18J16P8J93J55
$$ 12913 12363 11810 10906 9959 9146 8325 7314 6252 4946 3604 3486 3329 3329 3290 3329 3329 3486 3604 3720 3798 3991 4146
1268.9D146J53J15N70N63L35K96M42M39J588J523K089K054L74L72J078J070J131J123
$$ 4146 4299 4414 4984 5547 5882 6178 6620 7059 8647 10170 12259 14313 14687 15059 16137 17207 18338 19461
1281.1A9461L30L28UN56N21M23L90L89L88M85M84K57TL86L53J28R6L52L51R6O4K23
$$ 19461 19791 20119 20447 20775 21331 21852 22275 22665 23054 23442 23927 24411 24668 24925 25311 25664 25792 25888 26240 26591 26687 26751 26974
1296.6B6974K23R6O4J27UR6R5O4R5O4J58J59R5TJ27TO3L2O3UL2O3O4R4R5L2L1L2TL1
$$ 26974 27197 27293 27357 27484 27611 27738 27834 27929 27993 28088 28152 28310 28469 28564 28659 28786 28913 28976 29008 29071 29134 29197 29229 29292 29356 29450 29545 29577 29608 29640 29672 29703
1318.2B9703%L2L1O3O4%TL1%L2L1L2L1L2%O3TL2%UL1L2L1L2%VL1%T2l1%V8O3T%U6J57
1412.8C0649J58%U2J57T%S02l1l2%S2l1l2%Zl1l2%Wl1%Tl2l1%Tl1l2%l1%Xl2l1%Vl2
1542.5C0649l1%l2l1l2%Tl1l2%XL2L1J26R5O3L1O3L1O3TL2L1%TL1%sL2L1%Tl1l2%Wl1
$$ 30649 30618 30618 30586 30555 30523 30523 30523 30492 30460 30460 30460 30460 30460 30460 30460 30492 30523 30649 30744 30807 30838 30901 30932 30995 31058 31090 31121 31121 31121 31152 31152 31152 31152 31152 31152 31152 31152 31152 31152 31184 31215 31215 31215 31184 31152 31152 31152 31152 31152 31152 31121
1577C1121%Tl1l2L2L1%T2L1%UL2L1%ZL2L1%TO3L1L2L1%VL2%UL1T%T2L2L1L2%S9L1T%
$$ 31121 31121 31121 31090 31058 31090 31121 31121 31121 31121 31121 31121 31121 31121 31121 31121 31121 31121 31121 31121 31121 31121 31121 31121 31121 31121 31121 31121 31121 31152 31152 31152 31152 31184 31215 31215 31215 31215 31215 31215 31215 31215 31215 31247 31278 31278 31278 31341 31372 31404 31435 31435 31435 31435 31435 31467 31467 31467 31467 31498 31529 31529 31529 31529 31529 31529 31529 31529 31529 31529 31529 31529 31529 31529 31529 31529 31529 31529 31529 31529 31529 31529 31529 31561 31592 31624 31624 31624 31624 31624 31624 31624 31624 31624 31624 31624 31624 31624 31624 31624 31624 31624 31624 31624 31624 31655 31686 31686
1649.3C1686%l1T%S6L1T%S0l1T%Wl2%U0L2%Tl2%Vl1l2%Tl1T%S2L1T%T0L2L1l1l2%ZL2
1737.1C1561L1%Zl1l2%T0L2L1%ZL2%L1T%Tl1T%l2%ZL2%WL1T%ZL2L1%Zl1l2%XL2L1%
$$ 31561 31592 31592 31592 31592 31592 31592 31592 31592 31592 31561 31529 31529 31529 31529 31529 31529 31529 31529 31529 31529 31529 31529 31529 31529 31529 31529 31529 31529 31529 31529 31529 31561 31592 31592 31592 31592 31592 31592 31592 31592 31592 31624 31624 31655 31686 31686 31686 31655 31624 31624 31592 31592 31592 31592 31592 31592 31592 31592 31592 31624 31624 31624 31624 31624 31624 31655 31686 31686 31686 31686 31686 31686 31686 31686 31686 31718 31749 31749 31749 31749 31749 31749 31749 31749 31749 31718 31686 31686 31686 31686 31686 31686 31686 31718 31749 31749
1802C1749%U5L1L2%V0l2l1%U0l1l2%S8L2L1%Tl1l2%S4L2L1%S8l1l2%S2L2L1%U8L1L2
1954C1812%TL1%Xl1%Vl2l1%XL1L2%ZL1%S3L2L1%S0L1L2%sl2%l1%U7l1%l2%Yl1%Wl2
2039.2C1780%l1%T4L1%L2%L1%YL2%L1%Tl1%l2%Yl1%Wl2%l1%T9l1%l2%VL2%L1%Xl1%
$$ 31780 31780 31749 31749 31749 31749 31749 31749 31749 31749 31749 31749 31749 31749 31749 31749 31749 31749 31749 31749 31749 31749 31749 31749 31749 31749 31749 31780 31780 31812 31812 31843 31843 31843 31843 31843 31843 31843 31843 31875 31875 31906 31906 31906 31875 31875 31843 31843 31843 31843 31843 31843 31843 31843 31812 31812 31812 31812 31812 31812 31780 31780 31749 31749 31749 31749 31749 31749 31749 31749 31749 31749 31749 31749 31749 31749 31749 31749 31749 31749 31749 31749 31749 31749 31749 31749 31749 31749 31749 31749 31749 31749 31718 31718 31686 31686 31686 31686 31686 31718 31718 31749 31749 31749 31749 31749 31749 31749 31718 31718
2112.8C1718l2%U6L2%L1%L1%L2%S9L1%L2%L1%WL1%L2%Y4l2%l1%Wl1%l2%S1l1%l2%l1
2232.4C1749%sl1%l2%T5l1Tl2%l1l2l1Tl2l1l2l1Tl2l1l2l1%X6L1%J89J57R4O3L1%
2318.9C1749L1%L2%S1L1%V0l1%T1l2%l1%sl1%l2%l1%l1%l2l1o3%l1%l2%l1%l2%Wl1
$$ 31749 31780 31780 31812 31812 31812 31812 31812 31812 31812 31812 31812 31812 31812 31812 31843 31843 31843 31843 31843 31843 31843 31843 31843 31843 31843 31843 31843 31843 31843 31843 31843 31843 31843 31843 31843 31843 31843 31843 31843 31843 31843 31843 31843 31843 31843 31843 31843 31843 31843 31843 31843 31843 31843 31843 31843 31812 31812 31812 31812 31812 31812 31812 31812 31812 31812 31812 31812 31812 31812 31812 31812 31812 31812 31812 31812 31812 31812 31780 31780 31749 31749 31749 31749 31749 31749 31749 31749 31749 31749 31718 31718 31686 31686 31655 31655 31624 31624 31592 31561 31498 31498 31467 31467 31435 31435 31404 31404 31372 31372 31372 31372 31372 31372 31341
2396C1341%l1%Ul2%l1%l2%l1%l2%VL2%L1%L2%L1%L2L1TL2L1L2L1%L1L2L1%L2L1T%L2
$$ 31341 31341 31310 31310 31310 31310 31278 31278 31247 31247 31215 31215 31184 31184 31152 31152 31152 31152 31152 31184 31184 31215 31215 31247 31247 31278 31278 31310 31341 31372 31404 31435 31467 31498 31498 31529 31561 31592 31592 31624 31655 31686 31686 31718
2425C1718%L1%WL1%L2%UL1%sL2%L1%T8l1%TL1%sL1%L2%YL1%Vl1%T6L1%Z8l1%W4L1%
2597.3C2000%Ul1%Y1l2%l1%sl1%l2%sl1%l2o2r4o3Tl1l2l1o3Vo2o3r5l1o3l1l2%l1
2679.8C0744L1%L2%O2O3TL2O3O2O3L2O3O2O3TL1L2O3L1TL2L1%L1L2L1%S8l1%Yl2%l1
$$ 30744 30775 30775 30807 30807 30869 30932 30995 31027 31090 31152 31215 31247 31310 31372 31435 31498 31529 31561 31624 31655 31686 31718 31749 31749 31780 31812 31843 31843 31843 31843 31843 31843 31843 31843 31843 31843 31843 31843 31843 31843 31843 31843 31843 31843 31843 31812 31812 31812 31812 31812 31812 31812 31812 31780 31780 31749
2717.6C1749%VL1%L2%U4l2%l1%sl1%l2%l1%l1%l2%Ul1%l2%T9l1%l1%ZL1%L1%Xl1%l1
2798.7C1467l2l1%l2%l1%l1l2o3l1l2%sl1%Yl1%l2%S2L2%L1%sL1%S1L2%L1%Xl1%l2
$$ 31467 31435 31404 31404 31372 31372 31341 31341 31310 31278 31215 31184 31152 31152 31152 31152 31152 31152 31152 31152 31152 31152 31121 31121 31121 31121 31121 31121 31121 31121 31090 31090 31058 31058 31058 31058 31058 31058 31058 31058 31058 31058 31058 31058 31058 31090 31090 31121 31121 31121 31121 31121 31121 31121 31121 31121 31121 31152 31152 31152 31152 31152 31152 31152 31152 31152 31152 31152 31152 31184 31184 31215 31215 31215 31215 31215 31215 31215 31184 31184 31152
2852.8C1152%Wl1%Ul1%l2%S3l1%l2%Wl1%l2%l1%Ul2%l1%Wl1%l2%Ul1%Wl2%l1%l2%l1
$$ 31152 31152 31152 31152 31152 31152 31121 31121 31121 31121 31090 31090 31058 31058 31058 31058 31058 31058 31058 31058 31058 31058 31058 31058 31058 31058 31027 31027 30995 30995 30995 30995 30995 30995 30964 30964 30932 30932 30901 30901 30901 30901 30869 30869 30838 30838 30838 30838 30838 30838 30807 30807 30775 30775 30775 30775 30744 30744 30744 30744 30744 30744 30712 30712 30681 30681 30649 30649 30618
2898.7C0618%Ul2%l1%l2%l1%l2%l1%l2%Ul1l2l1l2l1l2l1%l2%l2%l1%Ul2%l1%l2%sl1
$$ 30618 30618 30618 30618 30586 30586 30555 30555 30523 30523 30492 30492 30460 30460 30429 30429 30397 30397 30397 30397 30366 30334 30303 30271 30240 30208 30177 30177 30145 30145 30113 30113 30082 30082 30082 30082 30050 30050 30019 30019 29987 29987 29987 29987 29987 29987 29987 29987 29987 29987 29956
2932.5B9956%l2%Vl1l2%l2l1o3l2l1l2Tl1l2l1o4l1o3l2o3l2o3l2o3l2o3l2o3l2l1
$$ 29956 29956 29924 29924 29924 29924 29924 29893 29861 29861 29829 29798 29735 29703 29672 29640 29608 29577 29545 29514 29450 29419 29356 29324 29261 29229 29166 29134 29071 29039 28976 28944 28881 28849 28818
2955.5B8818r6r5o3r5l2o3l2Uo3l2o3r6j27r5j27o4o3o4Tj27j59j28j27j28Uj27j92
$$ 28818 28722 28627 28564 28469 28437 28374 28342 28310 28278 28215 28183 28120 28024 27897 27802 27675 27611 27548 27484 27420 27293 27134 27006 26879 26751 26623 26495 26368 26176
2975.1B6176k24j92j93k24k57k25Tj93Tj94Tj61j94j62j94%l2l3l2L2L3L2%K91K59
$$ 26176 25952 25760 25567 25343 25086 24861 24636 24443 24250 24056 23862 23701 23507 23345 23151 23151 23119 23086 23054 23086 23119 23151 23151 23442 23701
2992B3701K58UK57K58K57K88K57K88K56M15M14UR5O4O3TL2U%L1L2T%L2%L1%S4l1l2
$$ 23701 23959 24217 24475 24732 24990 25247 25535 25792 26080 26336 26751 27165 27579 27993 28088 28152 28215 28278 28310 28342 28374 28374 28405 28437 28469 28469 28501 28501 28532 28532 28532 28532 28532 28532 28532 28532 28532 28532 28532 28532 28532 28532 28532 28501 28469
3022.4B8469l2%Vl2l1l2o4r5j27r5j27o4r5o4r5j28j59Tj60k55Tk56k88k25k24j93
$$ 28469 28437 28437 28437 28437 28437 28405 28374 28342 28278 28183 28056 27961 27834 27770 27675 27611 27516 27388 27229 27070 26910 26655 26400 26144 25856 25631 25407 25214
3041.3B5214k24k90l22Tl23l55l89Tl90r77j015j020j059j00r9l3l4L4L3UL98L64M30
$$ 25214 24990 24700 24378 24056 23733 23378 22989 22600 22210 21233 20218 19198 18139 18039 17940 17907 17873 17907 17940 17973 18006 18404 18768 19198
3057.6A9198L95J98J97UJ96J97J96J64L91UL89TL56TL55M83M82N13M81K24K23J92J91
$$ 19198 19593 19791 19988 20185 20382 20578 20775 20971 21135 21526 21917 22308 22697 23086 23442 23798 24153 24636 25118 25631 26112 26336 26559 26751 26942
3074.4B6942J28J27J28R5J28R5J27R6O3O4O3O4L2L1O4L1R6O3R5O4L1%L2TL1%L2%O4
$$ 26942 27070 27197 27325 27420 27548 27643 27770 27866 27929 27993 28056 28120 28152 28183 28247 28278 28374 28437 28532 28596 28627 28627 28659 28691 28722 28722 28754 28754 28818
3094B8818L1O4O3L2L1O3L2O3L2O3O4L1%L2L1L2%L2%UL1%L2%L1%L2%L2%YL1%L2%L1%
$$ 28818 28849 28913 28976 29008 29039 29102 29134 29197 29229 29292 29356 29387 29387 29419 29450 29482 29482 29514 29514 29514 29514 29545 29545 29577 29577 29608 29608 29640 29640 29672 29672 29672 29672 29672 29672 29672 29672 29703 29703 29735 29735 29766 29766
3123.1B9766%VL2%L1%L2%L2%S9L1%O3L2O3TL2L1O3L2L1%L2%UL1%L2%L1%L2%L1%L2%
$$ 29766 29766 29766 29766 29766 29798 29798 29829 29829 29861 29861 29893 29893 29893 29893 29893 29893 29893 29893 29893 29893 29893 29893 29893 29893 29893 29893 29893 29893 29893 29893 29924 29924 29987 30019 30082 30145 30177 30208 30271 30303 30334 30334 30366 30366 30366 30366 30397 30397 30429 30429 30460 30460 30492 30492 30523 30523 30555 30555
3162.3C0555L1%UL2%WL1L2L1L2%XL1%WL2%L1%L1%L2%sL1%L2L1L2%L1%S3L2%L1%U9L1
$$ 30555 30586 30586 30586 30586 30618 30618 30618 30618 30618 30618 30649 30681 30712 30744 30744 30744 30744 30744 30744 30744 30775 30775 30775 30775 30775 30775 30807 30807 30838 30838 30869 30869 30901 30901 30901 30901 30901 30901 30901 30901 30901 30901 30932 30932 30964 30995 31027 31027 31058 31058 31058 31058 31058 31058 31058 31058 31058 31058 31058 31058 31058 31058 31090 31090 31121 31121 31121 31121 31121 31121 31121 31121 31121 31121 31121 31121 31121 31121 31121 31121 31121 31121 31121 31121 31121 31121 31121 31121 31121 31121 31121 31121 31121 31121 31121 31121 31121 31121 31121 31121 31121 31121 31121 31121 31152
3233.3C1152%T08l1%XL1%T5L2%L1%U8l1%l2%U2L2%L1%T8l1%l2%T5l1%Yl1%l2%T6L2
3513C1090%L1%S2l1%l2%T0L2%L1%L1%T3L2%L1%Xl1%l2%Wl1%T2L1%S9L2%L1%T6l1%l2
3619.1C1152%sl1%Ul1%l2%Wl1%l2%T1l1%l2%l1%Yl2%l1%sl1%l2%l1%l2o3Tl1o3l2l1
$$ 31152 31152 31152 31152 31152 31152 31152 31152 31152 31152 31121 31121 31121 31121 31090 31090 31058 31058 31058 31058 31058 31058 31027 31027 30995 30995 30995 30995 30995 30995 30995 30995 30995 30995 30995 30995 30995 30995 30995 30995 30995 30995 30995 30995 30995 30995 30964 30964 30932 30932 30901 30901 30901 30901 30901 30901 30901 30901 30869 30869 30838 30838 30838 30838 30838 30838 30838 30838 30838 30838 30807 30807 30775 30775 30744 30744 30712 30649 30586 30555 30492 30460 30429
3674.5C0429%l2%l1%Ul2%l1l2l1%l2%l1%l2%VL2%L1L2L1%L2%L1L2L1L2L1L2L1%L2L1
$$ 30429 30429 30397 30397 30366 30366 30366 30366 30334 30334 30303 30271 30240 30240 30208 30208 30177 30177 30145 30145 30145 30145 30145 30177 30177 30208 30240 30271 30271 30303 30303 30334 30366 30397 30429 30460 30492 30523 30523 30555 30586
3701.6C0586L2L1L2L1L2%L1%S5L2%L1%Xl1%l2%S2L2%L1%U7L1%L2%S3L1%S2l1%XL1%
3785.4C0932%Y0L2%L1%WL2%L1%S7L2%L1%U0l1%l2%sl1%l2%Wl1%l2%Wl1
3893.5C0901
$$ 30901
##END=  $$ end of CH2Cl2
##TITLE= deuterated dichloromethane
##JCAMP-DX= 5.01
##DATA TYPE= INFRARED SPECTRUM
##DATA CLASS= XYDATA
##BLOCK ID=6
##ORIGIN=Department of Chemistry, UWI, Jamaica
##OWNER= PUBLIC DOMAIN
##LONGDATE= 2012/02/22 10:53:05.0243 -0500 $$ export date from JSpecView
##SPECTROMETER/DATASYSTEM= from scan
##NAMES= deuterated - dichloromethane
##MOLFORM=CD2Cl2
##SPECTROMETER/DATA SYSTEM=PERKIN ELMER
##$MODELS=
<Models>
<ModelData id="cd2cl2" type="MOL">
CH2Cl2
RLDSViewer          3D                             0

  5  4  0  0  0  0  0  0  0  0999 V2000
    0.0000    0.0000    0.7926 C   0  0  0  0  0  0  0  0  0  1
    0.8900    0.0000    1.4219 H   0  0  0  0  0  0  0  0  0  2
    0.0000    1.4370   -0.2235 Cl  0  0  0  0  0  0  0  0  0  3
   -0.8900    0.0000    1.4219 H   0  0  0  0  0  0  0  0  0  4
    0.0000   -1.4370   -0.2235 Cl  0  0  0  0  0  0  0  0  0  5
  1  2  1  0  0  0
  1  4  1  0  0  0
  1  3  1  0  0  0
  1  5  1  0  0  0
M  END
</ModelData>
<ModelData id="2" type="XYZVIB" baseModel="cd2cl2" vibrationScale=".2">
5
Model[1]: Convg=0.2016D-08;-V/T=2.0004;Energy=NaN;Range=M.O.s;E(RHF)=-957.984015823 A.U.;PATH=Calculation 1;Input
C     0.00000    0.00000    0.00000
H     0.00000    0.00000    1.09000
Cl    1.65934    0.00000   -0.58667
H    -0.51383    0.88998   -0.36333
Cl   -0.82967   -1.43703   -0.58667
5
Model[2]: Convg=0.2016D-08;-V/T=2.0004;Energy=-957.9841;Range=M.O.s;E(RHF)=-957.984015823 A.U.;PATH=Calculation 1;Standard
C     0.00000    0.00000    0.79262
H     0.88998    0.00000    1.42193
Cl    0.00000    1.43703   -0.22352
H    -0.88998    0.00000    1.42193
Cl    0.00000   -1.43703   -0.22352
5
Model[3]: IRIntensity=0.8549 KM/Mole;ReducedMass=19.4874 AMU;ForceConstant=1.2400 mDyne/A;Frequency=328.6293 cm^-1;FrequencyLabel=A1;PATH=Calculation 1;FrequenciesFrequencies
C     0.00000    0.00000    0.79262    0.00000    0.00000   -0.42000
H     0.88998    0.00000    1.42193   -0.01000    0.00000   -0.41000
Cl    0.00000    1.43703   -0.22352    0.00000    0.49000    0.08000
H    -0.88998    0.00000    1.42193    0.01000    0.00000   -0.41000
Cl    0.00000   -1.43703   -0.22352    0.00000   -0.49000    0.08000
5
Model[4]: IRIntensity=22.3831 KM/Mole;ReducedMass=7.1242 AMU;ForceConstant=2.6393 mDyne/A;Frequency=792.9600 cm^-1;FrequencyLabel=A1;PATH=Calculation 1;FrequenciesFrequencies
C     0.00000    0.00000    0.79262    0.00000    0.00000    0.61000
H     0.88998    0.00000    1.42193    0.06000    0.00000    0.53000
Cl    0.00000    1.43703   -0.22352    0.00000    0.12000   -0.12000
H    -0.88998    0.00000    1.42193   -0.06000    0.00000    0.53000
Cl    0.00000   -1.43703   -0.22352    0.00000   -0.12000   -0.12000
5
Model[5]: IRIntensity=135.9554 KM/Mole;ReducedMass=6.9784 AMU;ForceConstant=2.9811 mDyne/A;Frequency=851.5017 cm^-1;FrequencyLabel=B2;PATH=Calculation 1;FrequenciesFrequencies
C     0.00000    0.00000    0.79262    0.00000    0.63000    0.00000
H     0.88998    0.00000    1.42193    0.00000    0.53000    0.00000
Cl    0.00000    1.43703   -0.22352    0.00000   -0.12000    0.09000
H    -0.88998    0.00000    1.42193    0.00000    0.53000    0.00000
Cl    0.00000   -1.43703   -0.22352    0.00000   -0.12000   -0.09000
5
Model[6]: IRIntensity=0.8961 KM/Mole;ReducedMass=1.3466 AMU;ForceConstant=0.8771 mDyne/A;Frequency=1051.4636 cm^-1;FrequencyLabel=B1;PATH=Calculation 1;FrequenciesFrequencies
C     0.00000    0.00000    0.79262    0.17000    0.00000    0.00000
H     0.88998    0.00000    1.42193   -0.27000    0.00000    0.64000
Cl    0.00000    1.43703   -0.22352   -0.02000    0.00000    0.00000
H    -0.88998    0.00000    1.42193   -0.27000    0.00000   -0.64000
Cl    0.00000   -1.43703   -0.22352   -0.02000    0.00000    0.00000
5
Model[7]: IRIntensity=0.0000 KM/Mole;ReducedMass=1.0186 AMU;ForceConstant=1.0551 mDyne/A;Frequency=1325.9201 cm^-1;FrequencyLabel=A2;PATH=Calculation 1;FrequenciesFrequencies
C     0.00000    0.00000    0.79262    0.00000    0.00000    0.00000
H     0.88998    0.00000    1.42193    0.00000    0.71000    0.00000
Cl    0.00000    1.43703   -0.22352    0.01000    0.00000    0.00000
H    -0.88998    0.00000    1.42193    0.00000   -0.71000    0.00000
Cl    0.00000   -1.43703   -0.22352   -0.01000    0.00000    0.00000
5
Model[8]: IRIntensity=70.1871 KM/Mole;ReducedMass=1.1462 AMU;ForceConstant=1.4791 mDyne/A;Frequency=1479.9284 cm^-1;FrequencyLabel=B2;PATH=Calculation 1;FrequenciesFrequencies
C     0.00000    0.00000    0.79262    0.00000   -0.11000    0.00000
H     0.88998    0.00000    1.42193    0.00000    0.70000    0.00000
Cl    0.00000    1.43703   -0.22352    0.00000    0.00000    0.01000
H    -0.88998    0.00000    1.42193    0.00000    0.70000    0.00000
Cl    0.00000   -1.43703   -0.22352    0.00000    0.00000   -0.01000
5
Model[9]: IRIntensity=0.9042 KM/Mole;ReducedMass=1.0790 AMU;ForceConstant=1.7283 mDyne/A;Frequency=1648.8226 cm^-1;FrequencyLabel=A1;PATH=Calculation 1;FrequenciesFrequencies
C     0.00000    0.00000    0.79262    0.00000    0.00000   -0.08000
H     0.88998    0.00000    1.42193   -0.42000    0.00000    0.56000
Cl    0.00000    1.43703   -0.22352    0.00000    0.00000    0.00000
H    -0.88998    0.00000    1.42193    0.42000    0.00000    0.56000
Cl    0.00000   -1.43703   -0.22352    0.00000    0.00000    0.00000
5
Model[10]: IRIntensity=15.1988 KM/Mole;ReducedMass=1.0560 AMU;ForceConstant=6.3458 mDyne/A;Frequency=3193.6506 cm^-1;FrequencyLabel=A1;PATH=Calculation 1;FrequenciesFrequencies
C     0.00000    0.00000    0.79262    0.00000    0.00000   -0.07000
H     0.88998    0.00000    1.42193    0.59000    0.00000    0.39000
Cl    0.00000    1.43703   -0.22352    0.00000    0.00000    0.00000
H    -0.88998    0.00000    1.42193   -0.59000    0.00000    0.39000
Cl    0.00000   -1.43703   -0.22352    0.00000    0.00000    0.00000
5
Model[11]: IRIntensity=1.4436 KM/Mole;ReducedMass=1.1167 AMU;ForceConstant=6.9841 mDyne/A;Frequency=3258.0311 cm^-1;FrequencyLabel=B1;PATH=Calculation 1;FrequenciesFrequencies
C     0.00000    0.00000    0.79262    0.10000    0.00000    0.00000
H     0.88998    0.00000    1.42193   -0.58000    0.00000   -0.40000
Cl    0.00000    1.43703   -0.22352    0.00000    0.00000    0.00000
H    -0.88998    0.00000    1.42193   -0.58000    0.00000    0.40000
Cl    0.00000   -1.43703   -0.22352    0.00000    0.00000    0.00000
</ModelData>
</Models>
##$PEAKS=
<Peaks type="IR" xUnitsExpected="1/cm"  >
<PeakData id="1" title="B1-asymm stretch of CD group (~2304 cm-1)" peakShape="broad" model="2.11" xMax="2320" xMin="2280"    />
<PeakData id="2" title="A1-symm stretch of CD group (~2198 cm-1)" peakShape="broad" model="2.10" xMax="2220" xMin="2180"    />
<PeakData id="3" title="B2- H-C-D wagging (~1000 cm-1)" peakShape="broad" model="2.8" xMax="1015" xMin="985"    />
<PeakData id="4" title="A1- H-C-D scissors (~955 cm-1)" peakShape="broad" model="2.9" xMax="975" xMin="935"    />
<PeakData id="5" title="B2-asymm stretch of CCl group (~714 cm-1)" peakShape="broad" model="2.5" xMax="735" xMin="695"    />
<PeakData id="6" title="A1-symm stretch of CCl group (~680 cm-1)" peakShape="broad" model="2.4" xMax="695" xMin="665"    />
</Peaks>
##XUNITS= 1/CM
##YUNITS= TRANSMITTANCE
##XFACTOR=1.0000000000
##YFACTOR=0.0000294938
##FIRSTX=408.85986328
##LASTX=3992.00000000
##FIRSTY=0.75159997
##NPOINTS= 393
##XYDATA= (X++(Y..Y))
408.9B5483J714TP75O48Q2r5R1J94K20K43J91J13M5j28j24j05j03q4q5j37j41k60k88
$$ 25483 27197 28911 29686 30334 30416 30321 30412 30606 30826 31069 31260 31373 31418 31290 31166 31061 30958 30874 30789 30652 30511 30251 29963
619.1B9963o94q76n656r223m675Q00k71k400j992n11K84P703TL377L278J254R20M60
$$ 29963 29269 28393 22737 13514 8839 9639 9368 6968 4976 4465 4749 12452 20155 23532 26810 28064 28984 29444
783.6B9444K97J91J27M0m5j51l24k09J07J13J44J23o32Tl266l535p395q431L173Q899
$$ 29444 29741 29932 30059 30099 30054 29903 29579 29370 29477 29590 29734 29857 29225 28593 25327 21792 14397 5966 9139 18038
966.4A8038L826l17J134L037K342Q21P10K55K47J69J67J15J12O2N3L6K9K6UK5J7%l
$$ 18038 21864 21547 22681 25718 28060 28881 29591 29846 30093 30262 30429 30544 30656 30718 30771 30807 30836 30862 30888 30914 30939 30956 30956 30953
1185.8C0953j3j9n5n7j16j17L8N7J18J36O6K9Oj4k9n0r1j90k40m79m46J10J11M20M42
$$ 30953 30940 30921 30866 30809 30693 30576 30614 30671 30789 30925 30991 31020 31026 31012 30983 30933 30842 30652 30412 29933 29487 29597 29708 30128 30570
1414.3C0570J84J26R5Q2N1K9rn3o3q5o2J9K0K6K5N6TK3J7r1j28p6m4k3%Yjn6Tl94m25
$$ 30570 30754 30880 30975 31057 31108 31137 31128 31075 31012 30927 30865 30884 30904 30930 30955 31011 31067 31090 31107 31016 30888 30812 30768 30745 30745 30745 30745 30745 30745 30745 30745 30744 30688 30632 30238 29813
1743.4B9813K96M83L33K61J46N4M3K9K8K6K5K6K3KT%Vjkj7k7l5m3m9n7l7K1J4j2j6
$$ 29813 30109 30592 30925 31186 31332 31386 31429 31458 31486 31512 31537 31563 31586 31588 31590 31590 31590 31590 31590 31589 31587 31570 31543 31508 31465 31416 31359 31322 31343 31357 31345 31329
2035.9C1329j3Tj6j3KOJ5K3Kj3o1j28Uk52q26p60L36TM66M70J58R1J5j9m2o4o26j280
$$ 31329 31316 31303 31287 31274 31276 31282 31297 31320 31322 31309 31248 31120 30992 30864 30612 29786 29026 29362 29698 30164 30634 30792 30883 30898 30879 30837 30773 30147 28867
2301B8867p40K87L06L80L83M01M00K98L01J47J28TJ27M9LT%S2JKJ2J3J6J3J6J3J2N
$$ 28867 28127 28414 28720 29100 29483 29884 30284 30582 30883 31030 31158 31286 31413 31462 31465 31468 31468 31468 31468 31468 31468 31468 31468 31468 31468 31468 31468 31468 31469 31471 31483 31496 31512 31525 31541 31554 31566 31571
2648.3C1571N%S2PRK9N6TN8N7N5N7J9TK%Uj2j6k0j9k7l9o5j28j22j00q9%Xo6r3j13
$$ 31571 31576 31576 31576 31576 31576 31576 31576 31576 31576 31576 31576 31576 31576 31583 31592 31621 31677 31733 31791 31848 31903 31960 31979 31998 32000 32000 32000 32000 31988 31972 31952 31933 31906 31867 31802 31674 31552 31452 31363 31363 31363 31363 31363 31363 31363 31297 31204 31091
3087.1C1091j27j15j05q9o5n9l6l8l2VNRK4K9TK7K2J8nl5l6l8p4k75k50K17K21J94
$$ 31091 30964 30849 30744 30655 30590 30531 30495 30457 30425 30393 30361 30329 30334 30343 30367 30396 30425 30452 30474 30492 30487 30452 30416 30378 30304 30029 29779 29996 30217 30411
3361.3C0411J95J41J26O5L8L3K9UK4J7J5%Xnrj4j6Uj5j1o%Xj3j0j5j4j3j4qnOJ6UJ4
$$ 30411 30606 30747 30873 30938 30976 31009 31038 31067 31096 31120 31137 31152 31152 31152 31152 31152 31152 31152 31147 31138 31124 31108 31092 31076 31061 31050 31044 31044 31044 31044 31044 31044 31044 31031 31021 31006 30992 30979 30965 30957 30952 30958 30974 30990 31006 31020
3781.8C1020J0Pj5j3j6j3Tj5KPJ1J5TJ6J9K3K5K8K9VK8
$$ 31020 31030 31037 31022 31009 30993 30980 30967 30952 30954 30961 30972 30987 31002 31018 31037 31060 31085 31113 31142 31171 31200 31229 31257
3992C1257
$$ 31257
##END= $$ end of CD2Cl2
##TITLE= chloroform $$ Begin of the data block
##JCAMP-DX=5.01 $$
##DATA TYPE=INFRARED SPECTRUM
##DATA CLASS=XYDATA
##BLOCK ID=7
##ORIGIN= Department of Chemistry, UWI, Mona, Jamaica
##OWNER= public domain
##LONGDATE= 2007/10/17 19:21:58.0937 -0500 $$ export date from JSpecView
##SPECTROMETER/DATA SYSTEM= PERKIN-ELMER 1000 FT-IR
##$MODELS=
<Models>
<ModelData id="chcl3" type="MOL">
CHCl3
RLDSViewer          3D                             0

  5  4  0  0  0  0  0  0  0  0999 V2000
    0.0000    0.0000    0.4971 C   0  0  0  0  0  0  0  0  0  1
    0.0000    0.0000    1.5871 H   0  0  0  0  0  0  0  0  0  2
    0.0000    1.6593   -0.0896 Cl  0  0  0  0  0  0  0  0  0  3
   -1.4370   -0.8297   -0.0896 Cl  0  0  0  0  0  0  0  0  0  4
    1.4370   -0.8297   -0.0896 Cl  0  0  0  0  0  0  0  0  0  5
  1  2  1  0  0  0
  1  3  1  0  0  0
  1  5  1  0  0  0
  1  4  1  0  0  0
M  END
</ModelData>
<ModelData id="3" type="XYZVIB" baseModel="chcl3" vibrationScale=".2">
5
Model[1]: Convg=0.7033D-08;-V/T=2.0004;Energy=NaN;Range=M.O.s;E(RHF)=-1416.86840659 A.U.;PATH=Calculation 1;Input
C     0.00000    0.00000    0.00000
H     0.00000    0.00000    1.09000
Cl    1.65934    0.00000   -0.58667
Cl   -0.82967    1.43703   -0.58667
Cl   -0.82967   -1.43703   -0.58667
5
Model[2]: Convg=0.7033D-08;-V/T=2.0004;Energy=-1416.8685;Range=M.O.s;E(RHF)=-1416.86840659 A.U.;PATH=Calculation 1;Standard
C     0.00000    0.00000    0.49707
H     0.00000    0.00000    1.58707
Cl    0.00000    1.65934   -0.08960
Cl   -1.43703   -0.82967   -0.08960
Cl    1.43703   -0.82967   -0.08960
5
Model[3]: IRIntensity=0.3557 KM/Mole;ReducedMass=26.2449 AMU;ForceConstant=1.3644 mDyne/A;Frequency=297.0416 cm^-1;FrequencyLabel=E;PATH=Calculation 1;FrequenciesFrequencies
C     0.00000    0.00000    0.49707   -0.31000    0.00000    0.00000
H     0.00000    0.00000    1.58707   -0.44000    0.00000    0.00000
Cl    0.00000    1.65934   -0.08960    0.52000    0.00000    0.00000
Cl   -1.43703   -0.82967   -0.08960   -0.20000   -0.42000    0.03000
Cl    1.43703   -0.82967   -0.08960   -0.20000    0.42000   -0.03000
5
Model[4]: IRIntensity=0.3557 KM/Mole;ReducedMass=26.2449 AMU;ForceConstant=1.3644 mDyne/A;Frequency=297.0416 cm^-1;FrequencyLabel=E;PATH=Calculation 1;FrequenciesFrequencies
C     0.00000    0.00000    0.49707    0.00000    0.31000    0.00000
H     0.00000    0.00000    1.58707    0.00000    0.44000    0.00000
Cl    0.00000    1.65934   -0.08960    0.00000    0.44000    0.03000
Cl   -1.43703   -0.82967   -0.08960    0.42000   -0.28000   -0.02000
Cl    1.43703   -0.82967   -0.08960   -0.42000   -0.28000   -0.02000
5
Model[5]: IRIntensity=0.8827 KM/Mole;ReducedMass=20.8013 AMU;ForceConstant=2.0780 mDyne/A;Frequency=411.7711 cm^-1;FrequencyLabel=A1;PATH=Calculation 1;FrequenciesFrequencies
C     0.00000    0.00000    0.49707    0.00000    0.00000   -0.49000
H     0.00000    0.00000    1.58707    0.00000    0.00000   -0.50000
Cl    0.00000    1.65934   -0.08960    0.00000    0.41000    0.06000
Cl   -1.43703   -0.82967   -0.08960   -0.35000   -0.20000    0.06000
Cl    1.43703   -0.82967   -0.08960    0.35000   -0.20000    0.06000
5
Model[6]: IRIntensity=11.7197 KM/Mole;ReducedMass=8.0233 AMU;ForceConstant=2.6203 mDyne/A;Frequency=744.5117 cm^-1;FrequencyLabel=A1;PATH=Calculation 1;FrequenciesFrequencies
C     0.00000    0.00000    0.49707    0.00000    0.00000    0.67000
H     0.00000    0.00000    1.58707    0.00000    0.00000    0.70000
Cl    0.00000    1.65934   -0.08960    0.00000    0.11000   -0.08000
Cl   -1.43703   -0.82967   -0.08960   -0.10000   -0.06000   -0.08000
Cl    1.43703   -0.82967   -0.08960    0.10000   -0.06000   -0.08000
5
Model[7]: IRIntensity=150.8250 KM/Mole;ReducedMass=7.7939 AMU;ForceConstant=3.4807 mDyne/A;Frequency=870.6255 cm^-1;FrequencyLabel=E;PATH=Calculation 1;FrequenciesFrequencies
C     0.00000    0.00000    0.49707    0.00000    0.70000    0.00000
H     0.00000    0.00000    1.58707    0.00000    0.69000    0.00000
Cl    0.00000    1.65934   -0.08960    0.00000   -0.15000    0.07000
Cl   -1.43703   -0.82967   -0.08960   -0.06000   -0.05000   -0.03000
Cl    1.43703   -0.82967   -0.08960    0.06000   -0.05000   -0.03000
5
Model[8]: IRIntensity=150.8250 KM/Mole;ReducedMass=7.7939 AMU;ForceConstant=3.4807 mDyne/A;Frequency=870.6255 cm^-1;FrequencyLabel=E;PATH=Calculation 1;FrequenciesFrequencies
C     0.00000    0.00000    0.49707    0.70000    0.00000    0.00000
H     0.00000    0.00000    1.58707    0.69000    0.00000    0.00000
Cl    0.00000    1.65934   -0.08960   -0.02000    0.00000    0.00000
Cl   -1.43703   -0.82967   -0.08960   -0.12000   -0.06000   -0.06000
Cl    1.43703   -0.82967   -0.08960   -0.12000    0.06000    0.06000
5
Model[9]: IRIntensity=40.5189 KM/Mole;ReducedMass=1.1034 AMU;ForceConstant=1.3066 mDyne/A;Frequency=1417.6560 cm^-1;FrequencyLabel=E;PATH=Calculation 1;FrequenciesFrequencies
C     0.00000    0.00000    0.49707    0.00000   -0.09000    0.00000
H     0.00000    0.00000    1.58707    0.00000    1.00000    0.00000
Cl    0.00000    1.65934   -0.08960    0.00000    0.00000    0.01000
Cl   -1.43703   -0.82967   -0.08960    0.00000    0.00000   -0.01000
Cl    1.43703   -0.82967   -0.08960    0.00000    0.00000   -0.01000
5
Model[10]: IRIntensity=40.5189 KM/Mole;ReducedMass=1.1034 AMU;ForceConstant=1.3066 mDyne/A;Frequency=1417.6560 cm^-1;FrequencyLabel=E;PATH=Calculation 1;FrequenciesFrequencies
C     0.00000    0.00000    0.49707   -0.09000    0.00000    0.00000
H     0.00000    0.00000    1.58707    1.00000    0.00000    0.00000
Cl    0.00000    1.65934   -0.08960    0.00000    0.00000    0.00000
Cl   -1.43703   -0.82967   -0.08960    0.00000    0.00000   -0.01000
Cl    1.43703   -0.82967   -0.08960    0.00000    0.00000    0.01000
5
Model[11]: IRIntensity=0.0972 KM/Mole;ReducedMass=1.0897 AMU;ForceConstant=6.7234 mDyne/A;Frequency=3236.0024 cm^-1;FrequencyLabel=A1;PATH=Calculation 1;FrequenciesFrequencies
C     0.00000    0.00000    0.49707    0.00000    0.00000   -0.09000
H     0.00000    0.00000    1.58707    0.00000    0.00000    1.00000
Cl    0.00000    1.65934   -0.08960    0.00000    0.00000    0.00000
Cl   -1.43703   -0.82967   -0.08960    0.00000    0.00000    0.00000
Cl    1.43703   -0.82967   -0.08960    0.00000    0.00000    0.00000
</ModelData>
</Models>
##$PEAKS=
<Peaks type="IR" xUnitsExpected="1/cm"  >
<PeakData id="1" title="A1- C-H stretch (~3020 cm-1)" peakShape="broad" model="3.11" xMax="3050" xMin="3000"    />
<PeakData id="2" title="E- C-H bend (~1220 cm-1)" peakShape="broad" model="3.10" xMax="1240" xMin="1200"    />
<PeakData id="3" title="E-asymm stretch of CCl group (~773 cm-1)" peakShape="broad" model="3.8" xMax="780" xMin="730"    />
<PeakData id="4" title="A1-symm stretch of CCl group (~671 cm-1)" peakShape="broad" model="3.6" xMax="680" xMin="660"    />
</Peaks>
##XUNITS=1/CM
##YUNITS=TRANSMITTANCE
##XFACTOR= 1
##YFACTOR= 8.465879E-07
##FIRSTX= 3.522999E+03
##FIRSTY= 8.635527E-01
##LASTX= 550
##NPOINTS= 5947
##MINY= 1.210790E-01
##MAXY= 9.676668E-01
##XYDATA= (X++(Y..Y))
3522.9988A020039J750J607M65o43r65k50P50J179M29r29k143k251j393A017360
$$ 1020039 1021789 1023396 1023861 1023218 1022253 1022003 1022753 1023932 1024361 1023432 1021289 1019038 1017645 1017360
3515.5015A017753M28P2k15l21k14j43l6P1K86O43J107J358J107K86r29A019431
$$ 1017753 1018181 1018253 1018038 1017717 1017503 1017360 1017324 1017395 1017681 1018324 1019431 1020789 1021896 1022182 1021253 1019431
3507.A017645j000%O07N36J79P1K86O79P50N71K50%j07l21o43r29A017645
$$ 1017645 1016645 1016645 1017252 1017788 1017967 1018038 1018324 1019003 1019753 1020324 1020574 1020574 1020467 1020146 1019503 1018574 1017645
3497.9988A017145J07N36O43O07N36M29J43l22q21j036r29n71k15P2K50A016717
$$ 1017145 1017252 1017788 1018431 1019038 1019574 1020003 1020146 1019824 1019003 1017967 1017038 1016467 1016252 1016324 1016574 1016717
3489.502A016681p1K14O79J035P50L6p14r29q57p50r29Tm64N36J393A017181
$$ 1016681 1016610 1016824 1017503 1018538 1019288 1019324 1018610 1017681 1016824 1016074 1015145 1014216 1013752 1014288 1015681 1017181
3481.0007A018074p1o43p86o79Tp50o78m29j07J78L22N00P86Q93Q21M65A017395
$$ 1018074 1018003 1017360 1016574 1015895 1015216 1014466 1013788 1013359 1013252 1013430 1013752 1014252 1015038 1015931 1016752 1017217 1017395
3471.9993A017645N36Tk86j714k644k214n36J179J607O43p14j215o78A012252
$$ 1017645 1018181 1018717 1018431 1016717 1014073 1011859 1011323 1012502 1014109 1014752 1014038 1012823 1012145 1012252
3464.502A012538p2l21j79J07Tj78l57J42R29J465J035j78j572k179A009751
$$ 1012538 1012466 1012145 1011966 1012073 1012180 1012002 1011645 1011787 1012716 1014181 1015216 1015038 1013466 1011287 1009751
3456.5005A009537R65J107M28l92m29L93J179J107L57l93m29j07l5n72A011466
$$ 1009537 1010502 1011609 1012037 1011645 1011216 1011609 1012788 1013895 1014252 1013859 1013430 1013323 1013288 1012716 1011466
3448.4993A010144n00N72J178J036M65l6j43l6p1j43p1J43M28M64J43A013180
$$ 1010144 1009644 1010216 1011394 1012430 1012895 1012859 1012716 1012680 1012609 1012466 1012395 1012538 1012966 1013430 1013573 1013180
3439.9985A012466o07j79J43K50K14J79K50Tl6l92o08l57J43M64L58j08A012073
$$ 1012466 1011859 1011680 1011823 1012073 1012287 1012466 1012716 1012966 1012930 1012538 1011930 1011573 1011716 1012180 1012538 1012430 1012073
3431.0012A012002N36R64P50P1o42j001j000p50n36j78K50M64K50k86A010180
$$ 1012002 1012538 1013502 1014252 1014323 1013681 1012680 1011680 1010930 1010394 1010216 1010466 1010930 1011180 1010894 1010180
3423.A009537%O07Q93O43K50p1j07J78M29N36L57j43p14j036j143A009180
$$ 1009537 1009537 1010144 1011037 1011680 1011930 1011859 1011752 1011930 1012359 1012895 1013252 1013109 1012395 1011359 1010216 1009180
3414.5024A008323m29L93J357J929J750R29J07l57l21j79j07%J43P1k86A012502
$$ 1008323 1007894 1008287 1009644 1011573 1013323 1014252 1014359 1014002 1013681 1013502 1013395 1013395 1013538 1013609 1013323 1012502
3406.0012A011430o78K14Q93P86j07r65q57K14J465J928J143l21j464A012073
$$ 1011430 1010752 1010966 1011859 1012645 1012538 1011573 1010716 1010930 1012395 1014323 1015466 1015145 1013681 1012073
3398.4998A011037l21j07j43k15p1K50L93K50J07K14N72P86N71j07q93A011109
$$ 1011037 1010716 1010609 1010466 1010251 1010180 1010430 1010823 1011073 1011180 1011394 1011966 1012752 1013323 1013216 1012323 1011109
3390.0024A010394J08Q57J000O43J78p1k50n72j000j143o43L58J214J393A013180
$$ 1010394 1010502 1011359 1012359 1013002 1013180 1013109 1012859 1012287 1011287 1010144 1009501 1009859 1011073 1012466 1013180
3382.0017A012930q93Tn00p1J43K50L93P14P86L93l93j000j107n01K15A011073
$$ 1012930 1012037 1011144 1010644 1010573 1010716 1010966 1011359 1012073 1012859 1013252 1012859 1011859 1010752 1010251 1010466 1011073
3373.5005A011502J78P2K85M65L57J07j07p1J78L93M29K50l6k86m64m29A012538
$$ 1011502 1011680 1011752 1012037 1012502 1012859 1012966 1012859 1012788 1012966 1013359 1013788 1014038 1014002 1013716 1013252 1012823 1012538
3364.4993A012395j08j42p2J07K15J07k86o07o43l22l5L5%J79O79J250A014145
$$ 1012395 1012287 1012145 1012073 1012180 1012395 1012502 1012216 1011609 1010966 1010644 1010609 1010644 1010644 1010823 1011502 1012752 1014145
3355.5017A014895j79r64j143q57l93L5L58N00O07TL57L6l57n36l93l5A012895
$$ 1014895 1014716 1013752 1012609 1011752 1011359 1011394 1011752 1012252 1012859 1013466 1013823 1013859 1013502 1012966 1012573 1012538 1012895
3346.5005A013323K86L6%P1J43TK14L58M28K86%m29o43o78n36m29k50A012430
$$ 1013323 1013609 1013645 1013645 1013716 1013859 1014002 1014216 1014574 1015002 1015288 1015288 1014859 1014216 1013538 1013002 1012573 1012323 1012430
3336.999A012930P86TO07K50j07k86l21k14l6Tk14n00n36k14K50O07A014323
$$ 1012930 1013716 1014502 1015109 1015359 1015252 1014966 1014645 1014431 1014395 1014359 1014145 1013645 1013109 1012895 1013145 1013752 1014323
3328.0017A014645J43K14L57M65K50%p2l5%k86r29j536j643r64K85J429A014359
$$ 1014645 1014788 1015002 1015359 1015824 1016074 1016074 1016002 1015967 1015967 1015681 1014752 1013216 1011573 1010609 1010894 1012323 1014359
3319.0002A016145J000p1q57j286Tj036p14p2O43J322J428Q93%n35m29A015002
$$ 1016145 1017145 1017074 1016217 1014931 1013645 1012609 1011895 1011823 1012466 1013788 1015216 1016109 1016109 1015574 1015145 1015002
3310.499A014824n72q22n00K86P50P15K85J08K14K50l6l57l21P1N00A015895
$$ 1014824 1014252 1013430 1012930 1013216 1013966 1014681 1014966 1015074 1015288 1015538 1015502 1015145 1014824 1014895 1015395 1015895
3302.0017A016252L58N35M29k14r65j250o43L93J072J071M65k51p85q22A015431
$$ 1016252 1016610 1017145 1017574 1017360 1016395 1015145 1014502 1014895 1015967 1017038 1017503 1017252 1016467 1015645 1015431
3294.0002A016145J500J465L57j107j858j393k14P14O08j08p14n71J42A015788
$$ 1016145 1017645 1019110 1019467 1018360 1016502 1015109 1014895 1015609 1016217 1016109 1015395 1014824 1014966 1015788
3286.499A016860Q57N36K50j08m28o79n71p2O43R65O78p1p86j000p86A015967
$$ 1016860 1017717 1018253 1018503 1018395 1017967 1017288 1016717 1016645 1017288 1018253 1018931 1018860 1018074 1017074 1016288 1015967
3278.0022A015967P1J43L57N72O43K85j43l21j07K14L93K14k14n00Tk14A016967
$$ 1015967 1016038 1016181 1016538 1017110 1017753 1018038 1017895 1017574 1017467 1017681 1018074 1018288 1018074 1017574 1017074 1016860 1016967
3269.001A017360N00L93K50P1%P2J42J08l6k14m29m64l93l6M29Q93R64A020074
$$ 1017360 1017860 1018253 1018503 1018574 1018574 1018646 1018788 1018896 1018860 1018646 1018217 1017753 1017360 1017324 1017753 1018646 1019610 1020074
3259.499A019681j071j250q58j07N00P86P50N72M28J43l5%J07K85J08A019824
$$ 1019681 1018610 1017360 1016502 1016395 1016895 1017681 1018431 1019003 1019431 1019574 1019539 1019539 1019646 1019931 1020039 1019824
3251.0022A019396k15M29Q57P86J07n36p50l93J08M28L93J07j78k86j43A020289
$$ 1019396 1019181 1019610 1020467 1021253 1021360 1020824 1020074 1019681 1019789 1020217 1020610 1020717 1020539 1020253 1020110 1020289
3242.5007A020824O08K85l21p86q21l58J43L93K86J78K51N35P50O43K86A022860
$$ 1020824 1021432 1021717 1021396 1020610 1019789 1019431 1019574 1019967 1020253 1020431 1020682 1021217 1021967 1022610 1022896 1022860
3233.9995A022718l6J07K14K50J07j07n71r29j000n72J79R29J143Q57A023611
$$ 1022718 1022682 1022789 1023003 1023253 1023360 1023253 1022682 1021753 1020753 1020181 1020360 1021289 1022432 1023289 1023611
3226.0022A023468k86j43K14N00TJ79n36j357j786j429m28P85J465J393A023075
$$ 1023468 1023182 1023039 1023253 1023753 1024253 1024432 1023896 1022539 1020753 1019324 1018896 1019681 1021146 1022539 1023075
3218.0007A022646q93o79P2Q57J215J035N72J07j07j79k14j79j42p2l6A023861
$$ 1022646 1021753 1021074 1021146 1022003 1023218 1024253 1024825 1024932 1024825 1024646 1024432 1024253 1024111 1024039 1024003 1023861
3209.4995A023611l22k86l21l22j78K14O79Q93O43L21J43TP1k85o79q22A023003
$$ 1023611 1023289 1023003 1022682 1022360 1022182 1022396 1023075 1023968 1024611 1024932 1025075 1025218 1025289 1025004 1024325 1023503 1023003
3200.502A022932J07l6j78j07J42N00P86R29Q93L21n00j178j108l57A023646
$$ 1022932 1023039 1023003 1022825 1022718 1022860 1023360 1024146 1025075 1025968 1026289 1025789 1024611 1023503 1023146 1023646
3192.5015A024361L21k50l93j07K50L22L5l5K14P86J178J036L57m64q21A026325
$$ 1024361 1024682 1024432 1024039 1023932 1024182 1024504 1024539 1024504 1024718 1025504 1026682 1027718 1028075 1027611 1026790 1026325
3184.A026682J036R65J07j072j929j857r29L93J393J643J108J78A027147
$$ 1026682 1027718 1028683 1028790 1027718 1025789 1023932 1023003 1023396 1024789 1026432 1027540 1027718 1027147
3176.9988A026182j214j179j000l93N00J322J500J107L93k86o07Tm29A025218
$$ 1026182 1024968 1023789 1022789 1022396 1022896 1024218 1025718 1026825 1027218 1026932 1026325 1025718 1025289 1025218
3169.5015A025504L93J78j78l22p1M28P86P14L22k14m65m64k50l6J07A026611
$$ 1025504 1025897 1026075 1025897 1025575 1025504 1025932 1026718 1027432 1027754 1027540 1027075 1026611 1026361 1026325 1026432 1026611
3161.0007A026861L21L58L93M28M65N00K85j43p85j143q93j43N71O79A027897
$$ 1026861 1027182 1027540 1027933 1028361 1028826 1029326 1029611 1029468 1028683 1027540 1026647 1026504 1027075 1027754 1027897
3152.9995A027325p50l21K86L21j43o79n35K50J107J286O07n00j286j321A024968
$$ 1027325 1026575 1026254 1026540 1026861 1026718 1026039 1025504 1025754 1026861 1028147 1028754 1028254 1026968 1025647 1024968
3145.002A025075O07N72L21K15L57N00K50k86r29j035o08%K50l5n00A024146
$$ 1025075 1025682 1026254 1026575 1026790 1027147 1027647 1027897 1027611 1026682 1025647 1025039 1025039 1025289 1025254 1024754 1024146
3136.5007A023896L57O79N00P2k15j43J79M64M65J78j07l21m65m28k50A024789
$$ 1023896 1024253 1024932 1025432 1025504 1025289 1025146 1025325 1025789 1026254 1026432 1026325 1026004 1025539 1025111 1024861 1024789
3127.9993A024754k15m64l57L5M29L57j07o43q21n72j79K15N00P50Q57A025075
$$ 1024754 1024539 1024075 1023718 1023753 1024182 1024539 1024432 1023789 1022968 1022396 1022217 1022432 1022932 1023682 1024539 1025075
3119.502A024968o43o07L5O43P15J43o08q93n35J78O79N36j43q57j179A021539
$$ 1024968 1024325 1023718 1023753 1024396 1025111 1025254 1024646 1023753 1023218 1023396 1024075 1024611 1024468 1023611 1022432 1021539
3111.0005A021253K50L93L6n36r29q57k86N00R65Q57K14n71r65q21l57A019253
$$ 1021253 1021503 1021896 1021932 1021396 1020467 1019610 1019324 1019824 1020789 1021646 1021860 1021289 1020324 1019503 1019146 1019253
3102.5A019646L57j07p15j071p86j07N00M64%l93l21J07L21K15p2A017895
$$ 1019646 1020003 1019896 1019181 1018110 1017324 1017217 1017717 1018181 1018181 1017788 1017467 1017574 1017895 1018110 1018038 1017895
3093.9985A017860p2l21n72n71l22l93p50j214j179n71J78N36K86l57A011573
$$ 1017860 1017788 1017467 1016895 1016324 1016002 1015609 1014859 1013645 1012466 1011895 1012073 1012609 1012895 1012538 1011573
3086.0012A010430q21j43L93O78N36K50P1%j42n72j107j429j322j000A005215
$$ 1010430 1009609 1009466 1009859 1010537 1011073 1011323 1011394 1011394 1011252 1010680 1009573 1008144 1006822 1005822 1005215
3078.A004965L6K14P1m28q93j179j036o78k50J42M29M64J79n36j071I99321
$$ 1004965 1005001 1005215 1005286 1004858 1003965 1002786 1001750 1001072 1000822 1000964 1001393 1001857 1002036 1001500 1000429 999321
3069.502I98893L93Q93O78l5o79p86k86M29O79L57m29j107j250r29m29I96285
$$ 998893 999286 1000179 1000857 1000822 1000143 999357 999071 999500 1000179 1000536 1000107 999000 997750 996821 996392 996285
3061.0007I96285J07K50L93L57J08k50n72p86r64r29p86n71n00o43q93I89534
$$ 996285 996392 996642 997035 997392 997500 997250 996678 995892 994928 993999 993213 992642 992142 991499 990606 989534
3052.5024I88677l93P1K51%m65q57j143j429j679j786j500r29m64l57I77247
$$ 988677 988284 988355 988606 988606 988141 987284 986141 984712 983033 981247 979747 978818 978354 977997 977247
3044.5I76032j500j429j428j572j965k286k321k108j857j715j750I54315
$$ 976032 974532 973103 971675 970103 968138 965852 963531 961423 959566 957851 956101 954315
3037.9988I52529j965k321k858l393l679Tl608l679m037m500m822n001I03986
$$ 952529 950564 948243 945385 941992 938313 934634 931026 927347 923310 918810 913988 908987 903986
3031.0017H98843n573o322p108p823q358q715q930r180r394r823j0466G95971
$$ 898843 893270 886948 879840 872017 863659 854944 846014 836834 827440 817617 807151 795971
3024.4993G84148j2288j2537j2609j2252j1430j0180q466o572m358j679F93349
$$ 784148 771860 759323 746714 734462 723032 712852 704386 697814 693456 691777 693349
3018.502F98564Q644J1609J3823J5503J6931J8038J8610J8395J7431H53622
$$ 698564 707208 718817 732640 748143 765074 783112 801722 820117 837548 853622
3013.0007H68374J3681J2823J1859J0573R251Q037P287O858O501O108I66924
$$ 868374 882055 894878 906737 917310 926561 934598 941885 948743 955244 961352 966924
3006.9998I71960M608M144L571K894K393K357K679K965K822K215J535A005322
$$ 971960 976568 980712 984283 987177 989570 991927 994606 997571 1000393 1002608 1004143 1005322
3000.5017A006394Q93O07L57P15J500K179TJ321K86m29n00l21l6L21J036A018145
$$ 1006394 1007287 1007894 1008251 1008966 1010466 1012645 1014824 1016145 1016431 1016002 1015502 1015181 1015145 1015466 1016502 1018145
2992.0012A019896R64m64j608j821j108l5O78O79J43l93o43n71m29Tm64A014038
$$ 1019896 1020860 1020396 1018788 1016967 1015859 1015824 1016502 1017181 1017324 1016931 1016288 1015717 1015288 1014859 1014395 1014038
2983.4998A014002K14%n71j179j464j322j036p50n00j79J07P2k14m29A006537
$$ 1014002 1014216 1014216 1013645 1012466 1011002 1009680 1008644 1007894 1007394 1007215 1007322 1007394 1007180 1006751 1006537
2975.5024A007001J036J000L93m29p14k50O07J465J750J464P86P2k50A013752
$$ 1007001 1008037 1009037 1009430 1009001 1008287 1008037 1008644 1010109 1011859 1013323 1014109 1014181 1013931 1013752
2968.001A013931P14J250J500J393J036O79N00P14Q22O43J07n00p14A021789
$$ 1013931 1014645 1015895 1017395 1018788 1019824 1020503 1021003 1021717 1022539 1023182 1023289 1022789 1022075 1021789
2960.5005A022325J428J786J465N36n00j143q93L5J108J750J571P51j79A029218
$$ 1022325 1023753 1025539 1027004 1027540 1027040 1025897 1025004 1025039 1026147 1027897 1029468 1030219 1030040 1029218
2952.999A028325n00J08O07P50O79L57l6l57m65k85P1L22J43m65j107A026790
$$ 1028325 1027825 1027933 1028540 1029290 1029969 1030326 1030290 1029933 1029468 1029183 1029254 1029576 1029719 1029254 1028147 1026790
2944.5017A025861k14L57M64K50P2J78M29L21k50j143j750j643q57l6A022467
$$ 1025861 1025647 1026004 1026468 1026718 1026790 1026968 1027397 1027718 1027468 1026325 1024575 1022932 1022075 1022039 1022467
2936.5002A022825L5j07j78l22o07j000j107o79%O07Q57P86N36J79k86A020789
$$ 1022825 1022860 1022753 1022575 1022253 1021646 1020646 1019539 1018860 1018860 1019467 1020324 1021110 1021646 1021825 1021539 1020789
2927.999A019789r65n00p1J42J08L5K15M28M65K14l6%L22N36M64J78A021289
$$ 1019789 1018824 1018324 1018253 1018395 1018503 1018538 1018753 1019181 1019646 1019860 1019824 1019824 1020146 1020682 1021146 1021324 1021289
2919.0017A021396K86M28N00P50J144J428J358R64O07L57J43p1j43J43A030004
$$ 1021396 1021682 1022110 1022610 1023360 1024504 1025932 1027290 1028254 1028861 1029218 1029361 1029290 1029147 1029290 1030004
2911.001A030933N72k15o78n72p1L21L93M64O08P50O78M29P1p1k50o43A031647
$$ 1030933 1031505 1031290 1030612 1030040 1029969 1030290 1030683 1031147 1031755 1032505 1033183 1033612 1033683 1033612 1033362 1032719 1031647
2901.9998A030469o08L58R64Q57J43n71p86l57K85P15N71%o78r65o78A029897
$$ 1030469 1029861 1030219 1031183 1032040 1032183 1031612 1030826 1030469 1030754 1031469 1032040 1032040 1031362 1030397 1029719 1029897
2893.5022A030969J393J000K50k86j43M29P14N00j78o79p86n35j43L21A033755
$$ 1030969 1032362 1033362 1033612 1033326 1033183 1033612 1034326 1034826 1034648 1033969 1033183 1032648 1032505 1032826 1033755
2885.501A035434K071J608L93q22j286q57%O43O79K14m29p86o78j07A036827
$$ 1035434 1037505 1039113 1039506 1038684 1037398 1036541 1036541 1037184 1037863 1038077 1037648 1036862 1036184 1036077 1036827
2877.4995A038077J071K86m64o07j43O43J143J071N00k14q93j179j000A037755
$$ 1038077 1039148 1039434 1038970 1038363 1038220 1038863 1040006 1041077 1041577 1041363 1040470 1039291 1038291 1037755
2870.0022A037791N36Q93J036Q57N00L6j79j07J79J78j07n36p86p85n72A038720
$$ 1037791 1038327 1039220 1040256 1041113 1041613 1041649 1041470 1041363 1041542 1041720 1041613 1041077 1040291 1039506 1038934 1038720
2861.5015A038970P50J072J000L93l93j036j250r65k14O07J000P86P2A040256
$$ 1038970 1039720 1040792 1041792 1042185 1041792 1040756 1039506 1038541 1038327 1038934 1039934 1040720 1040792 1040256
2854.0002A039756L5N36N00J07p1J07L93K14k50m64%R64J715J714J143A046971
$$ 1039756 1039791 1040327 1040827 1040934 1040863 1040970 1041363 1041577 1041327 1040863 1040863 1041827 1043542 1045256 1046399 1046971
2845.4988A047400O43O78K86l21p51n35L21J250J715J393O07k14o43q22A050114
$$ 1047400 1048043 1048721 1049007 1048686 1047935 1047400 1047721 1048971 1050686 1052079 1052686 1052472 1051829 1051007 1050114
2837.5015A049186o08%Q93J536J643J251N71L6k15l21m29n00m64k50J79A053043
$$ 1049186 1048578 1048578 1049471 1051007 1052650 1053901 1054472 1054508 1054293 1053972 1053543 1053043 1052579 1052329 1052508 1053043
2829.0002A053829P15M64%m29o43Tl93p1J07J79J07L6%K50O07Q57TL93A055901
$$ 1053829 1054544 1055008 1055008 1054579 1053936 1053293 1052900 1052829 1052936 1053115 1053222 1053258 1053258 1053508 1054115 1054972 1055829 1056222 1055901
2818.9988A055044r29m64J07N00L57p1n01n35k50L5J43J07K15N00P14A055651
$$ 1055044 1054115 1053651 1053758 1054258 1054615 1054544 1054043 1053508 1053258 1053293 1053436 1053543 1053758 1054258 1054972 1055651
2810.5015A055829l21n36l21P1K86K50L6j08j78j43p1J42K86L93K50%A055651
$$ 1055829 1055508 1054972 1054651 1054722 1055008 1055258 1055294 1055186 1055008 1054865 1054794 1054936 1055222 1055615 1055865 1055865 1055651
2801.5A055472K15P14R64O43j07q93j214r65m64k86l21l58l5O78J179A056401
$$ 1055472 1055687 1056401 1057365 1058008 1057901 1057008 1055794 1054829 1054365 1054079 1053758 1053400 1053365 1054043 1055222 1056401
2792.9988A057044p2m64m29j07K15K85J43J79M28P15O79J07o79j036o07A056687
$$ 1057044 1056972 1056508 1056079 1055972 1056187 1056472 1056615 1056794 1057222 1057937 1058616 1058723 1058044 1057008 1056401 1056687
2784.5015A057580P50J43l22l21l6P1k14n36n71j43N00R64Q93L22m29A057758
$$ 1057580 1058330 1058473 1058151 1057830 1057794 1057865 1057651 1057115 1056544 1056401 1056901 1057865 1058758 1059080 1058651 1057758
2776.0007A057080l6O07Q22O07K50P1L6%p1j79T%J08J07j79n36p50Tn36A056187
$$ 1057080 1057044 1057651 1058473 1059080 1059330 1059401 1059437 1059437 1059366 1059187 1059008 1059008 1059116 1059223 1059044 1058508 1057758 1057008 1056472 1056187
2765.4988A056222M29Q93J250J286Q22L5p14j036r29n71j43K14N00M65A058937
$$ 1056222 1056651 1057544 1058794 1060080 1060902 1060937 1060223 1059187 1058258 1057687 1057544 1057758 1058258 1058723 1058937
2757.5012A058758m64l93j07P1J08%TP1T%J08L57O07M64j07p14p50j79A058294
$$ 1058758 1058294 1057901 1057794 1057865 1057973 1057973 1057973 1058044 1058115 1058115 1058223 1058580 1059187 1059651 1059544 1058830 1058080 1057901 1058294
2747.5A058794J43j79L6M29O07K86k15l21%J79%n01p14k50N72J071A060866
$$ 1058794 1058937 1058758 1058794 1059223 1059830 1060116 1059901 1059580 1059580 1059759 1059759 1059258 1058544 1058294 1058866 1059937 1060866
2738.4988A061152k86m65k85%P1L6l6p1p2j43k85m29l93p1M28O79O07A060437
$$ 1061152 1060866 1060401 1060116 1060116 1060187 1060223 1060187 1060116 1060044 1059901 1059616 1059187 1058794 1058723 1059151 1059830 1060437 1060437
2729.0012A059794q57o07L5N01N35K86p1k86k50p2J43L58L92K15j79m64A058973
$$ 1059794 1058937 1058330 1058365 1058866 1059401 1059687 1059616 1059330 1059080 1059008 1059151 1059509 1059901 1060116 1059937 1059473 1058973
2720.A058758L22P50R64Q58K50n72j071q93p2R65J607J464P86P2A063723
$$ 1058758 1059080 1059830 1060794 1061652 1061902 1061330 1060259 1059366 1059294 1060259 1061866 1063330 1064116 1064188 1063723
2711.9985A063080l92L5N36O07J43o79j250j214n72P2N71P50O08L57L6A062473
$$ 1063080 1062688 1062723 1063259 1063866 1064009 1063330 1062080 1060866 1060294 1060366 1060937 1061687 1062295 1062652 1062688 1062473
2703.5012A062330L6J43%k14k86j07%p2l57m29p1N00R29Q93L93l22r29A061330
$$ 1062330 1062366 1062509 1062509 1062295 1062009 1061902 1061902 1061830 1061473 1061044 1060973 1061473 1062402 1063295 1063688 1063366 1062437 1061330
2694.A060544j78L21M29K14P2J78L93L22l6m29l93%L22K50l6k14A061545
$$ 1060544 1060366 1060687 1061116 1061330 1061402 1061580 1061973 1062295 1062259 1061830 1061437 1061437 1061759 1062009 1061973 1061759 1061545
2685.0024A061473l6j07l6L58P50Q93O07J43k14k86j79l6L6J43K50L93A064438
$$ 1061473 1061437 1061330 1061294 1061652 1062402 1063295 1063902 1064045 1063831 1063545 1063366 1063330 1063366 1063509 1063759 1064152 1064438
2676.0012A064331o08p85l58L58Q57O43l6n36n00P2L93K50k50n36j79A063545
$$ 1064331 1063723 1062938 1062580 1062938 1063795 1064438 1064402 1063866 1063366 1063438 1063831 1064081 1063831 1063295 1063116 1063545
2667.4998A064366O08l6o07q58p50m64j07J78M29M64L58J42%j07l5J42A064045
$$ 1064366 1064974 1064938 1064331 1063473 1062723 1062259 1062152 1062330 1062759 1063223 1063581 1063723 1063723 1063616 1063581 1063723 1064045
2658.5024A064473M65N00N36O43N71K50m28j072j322q57j43L93N36L57A065081
$$ 1064473 1064938 1065438 1065974 1066617 1067188 1067438 1067010 1065938 1064616 1063759 1063616 1064009 1064545 1064902 1065081
2650.5017A065366L22J43l22n71l93L6M28L93P2p2J07L93M29P1m28n36A065188
$$ 1065366 1065688 1065831 1065509 1064938 1064545 1064581 1065009 1065402 1065474 1065402 1065509 1065902 1066331 1066402 1065974 1065438 1065188
2641.5005A065366N01M64K50P1J43L93N00K86l21r29j143q22j78L57M28A065545
$$ 1065366 1065867 1066331 1066581 1066652 1066795 1067188 1067688 1067974 1067653 1066724 1065581 1064759 1064581 1064938 1065366 1065545
2632.9993A065509J08N35Q93P86L22k15n00m28k86l22o07p86o78j08N72A065902
$$ 1065509 1065617 1066152 1067045 1067831 1068153 1067938 1067438 1067010 1066724 1066402 1065795 1065009 1064331 1064223 1064795 1065902
2624.5017A066974O43l6m64l93J07N00TJ07l93n71m64l22l21l22j07L57A066545
$$ 1066974 1067617 1067581 1067117 1066724 1066831 1067331 1067831 1067938 1067545 1066974 1066510 1066188 1065867 1065545 1065438 1065795 1066545
2615.5005A067260M28K15K14K86J43l93q58r64o43j43K50M29N00M64K14A067260
$$ 1067260 1067688 1067903 1068117 1068403 1068546 1068153 1067295 1066331 1065688 1065545 1065795 1066224 1066724 1067188 1067402 1067260
2606.999A066760m29l6M65O42M65P1k14l93l57k50J07L57M65K50j08A067581
$$ 1066760 1066331 1066295 1066760 1067402 1067867 1067938 1067724 1067331 1066974 1066724 1066831 1067188 1067653 1067903 1067795 1067581
2598.5017A067545K15J43j08k50P2O78R29O07p1n72o07k50l6j42l58l21A067367
$$ 1067545 1067760 1067903 1067795 1067545 1067617 1068295 1069224 1069831 1069760 1069188 1068581 1068331 1068295 1068153 1067795 1067474 1067367
2589.5002A067367j43l93T%N72Q93P85M65J07%p2p1j07p2l5j07l58n00A067545
$$ 1067367 1067224 1066831 1066438 1066438 1067010 1067903 1068688 1069153 1069260 1069260 1069188 1069117 1069010 1068938 1068903 1068796 1068438 1067938 1067545
2579.499A067474L21M29L57J43L6l6j07k50l93k14J43N00TK85j42l58A068331
$$ 1067474 1067795 1068224 1068581 1068724 1068760 1068724 1068617 1068367 1067974 1067760 1067903 1068403 1068903 1069188 1069046 1068688 1068331
2570.5017A068260L57N71L93p1m29l57J79Q57J036O07p1m65k85L5J07A070403
$$ 1068260 1068617 1069188 1069581 1069510 1069081 1068724 1068903 1069760 1070796 1071403 1071332 1070867 1070582 1070617 1070724 1070403
2562.0002A069581p50j07O43R29M64k86q57q93p14n00k50%M64Q93J036A070403
$$ 1069581 1068831 1068724 1069367 1070296 1070760 1070474 1069617 1068724 1068010 1067510 1067260 1067260 1067724 1068617 1069653 1070403
2553.499A070617k14l93j43J43K86J43j08j42L57Q93J107N72m29j215A070189
$$ 1070617 1070403 1070010 1069867 1070010 1070296 1070439 1070331 1070189 1070546 1071439 1072546 1073118 1072689 1071474 1070189
2545.5015A069438j42J07l6j79j42K14N36P14O79M28P2k15n00n71n72A069367
$$ 1069438 1069296 1069403 1069367 1069188 1069046 1069260 1069796 1070510 1071189 1071617 1071689 1071474 1070974 1070403 1069831 1069367
2537.0002A069117P1N36Q58Q57N00p2m28m29k86j07j78k86j43K50N72A071332
$$ 1069117 1069188 1069724 1070582 1071439 1071939 1071867 1071439 1071010 1070724 1070617 1070439 1070153 1070010 1070260 1070832 1071332
2528.4995A071403n00o43l93P2L92L93K15j07l22n71n72k50K50O07N72A070760
$$ 1071403 1070903 1070260 1069867 1069939 1070331 1070724 1070939 1070832 1070510 1069939 1069367 1069117 1069367 1069974 1070546 1070760
2520.0022A070510n36m64k14K14O07P50O07J43j78k50j07p2k50m64l93A069867
$$ 1070510 1069974 1069510 1069296 1069510 1070117 1070867 1071474 1071617 1071439 1071189 1071082 1071010 1070760 1070296 1069903 1069867
2511.5007A070260N72L21j07m64o79m29P2P14J072P50p2q21q58k50N01A071260
$$ 1070260 1070832 1071153 1071046 1070582 1069903 1069474 1069546 1070260 1071332 1072082 1072010 1071189 1070331 1070081 1070582 1071260
2502.9995A071510k14l93j07P1%k50l57k86p1l6j78k86j43J43M64O07A070974
$$ 1071510 1071296 1070903 1070796 1070867 1070867 1070617 1070260 1069974 1069903 1069867 1069689 1069403 1069260 1069403 1069867 1070474 1070974
2494.0022A071260P2j08k85l93l22j43J08L21M29L93K85J79P1j42l58A070796
$$ 1071260 1071332 1071224 1070939 1070546 1070224 1070081 1070189 1070510 1070939 1071332 1071617 1071796 1071867 1071725 1071367 1070796
2485.5007A070153n36j07L21N00L58L5k85k86j79p1j79l93n00m64l22A067831
$$ 1070153 1069617 1069510 1069831 1070331 1070689 1070724 1070439 1070153 1069974 1069903 1069724 1069331 1068831 1068367 1068045 1067831
2476.9995A067831J43K50J43p2k50l5L93P14M64k14p86Tj78L57M64P2A068117
$$ 1067831 1067974 1068224 1068367 1068295 1068045 1068010 1068403 1069117 1069581 1069367 1068581 1067795 1067617 1067974 1068438 1068510 1068117
2468.002A067724j07J07L6l22n71n36j79J79L57TJ07j78m64n36k86J79A066438
$$ 1067724 1067617 1067724 1067760 1067438 1066867 1066331 1066152 1066331 1066688 1067045 1067152 1066974 1066510 1065974 1065688 1065867 1066438
2459.0007A067117L21k86p85r29p14l22J07L93M64K51p2n00q22q57o43A062330
$$ 1067117 1067438 1067152 1066367 1065438 1064724 1064402 1064509 1064902 1065366 1065617 1065545 1065045 1064223 1063366 1062723 1062330
2450.4995A062045l22l21j43K14O07O79L93j07p15j071j000o08j07P2A059509
$$ 1062045 1061723 1061402 1061259 1061473 1062080 1062759 1063152 1063045 1062330 1061259 1060259 1059651 1059544 1059616 1059509
2442.502A058937q57p50l93j07j08k50l21l22k85k86j43J07M65N71K86A056365
$$ 1058937 1058080 1057330 1056937 1056830 1056722 1056472 1056151 1055829 1055544 1055258 1055115 1055222 1055687 1056258 1056544 1056365
2434.0015A055687p15m28J07N71O79N00J43%J07L57M29J78j07k14l6J07A057472
$$ 1055687 1054972 1054544 1054651 1055222 1055901 1056401 1056544 1056544 1056651 1057008 1057437 1057615 1057508 1057294 1057258 1057365 1057472
2425.A057508L6K14K86p1n36o79j78N71Q57K86o43j179p85P1P14A057151
$$ 1057508 1057544 1057758 1058044 1057973 1057437 1056758 1056580 1057151 1058008 1058294 1057651 1056472 1055687 1055758 1056472 1057151
2416.4988A057151p14j036r65n35j08J79K14k14j000j822k322k250j679A043899
$$ 1057151 1056437 1055401 1054436 1053901 1053793 1053972 1054186 1053972 1052972 1051150 1048828 1046578 1044899 1043899
2409.0012A043328p15j214j858k357k465k357k215k143k286k500k751A017610
$$ 1043328 1042613 1041399 1039541 1037184 1034719 1032362 1030147 1028004 1025718 1023218 1020467 1017610
2402.5007A014716k643k107j286m29K86O79R28J322K036K857L608L965A027933
$$ 1014716 1012073 1009966 1008680 1008251 1008537 1009216 1010144 1011466 1013502 1016359 1019967 1023932 1027933
2395.4993A031862L893L751L393K786K322K107K108K071J751J393J179A059866
$$ 1031862 1035755 1039506 1042899 1045685 1048007 1050114 1052222 1054293 1056044 1057437 1058616 1059866
2388.9988A061294J322Q93L93J43L57R64J572J715J250N00l6%N36J179A073511
$$ 1061294 1062616 1063509 1063902 1064045 1064402 1065366 1066938 1068653 1069903 1070403 1070367 1070367 1070903 1072082 1073511
2381.0012A074582J07j000j679j393j07J357K108J786Q93L93N00O43L21A078154
$$ 1074582 1074689 1073689 1072010 1070617 1070510 1071867 1073975 1075761 1076654 1077047 1077547 1078190 1078511 1078154
2373.5A077654J79Q93R28J43p14p15l5N35N36P2l22l21K14J000J822A084083
$$ 1077654 1077833 1078726 1079654 1079797 1079083 1078368 1078333 1078868 1079404 1079476 1079154 1078833 1079047 1080047 1081869 1084083
2364.9985A085941P50m64j072q57l93L6K14T%n36j143Tj78J357K250J751A087012
$$ 1085941 1086691 1086227 1085155 1084298 1083905 1083941 1084155 1084369 1084369 1083833 1082690 1081547 1081369 1082726 1084976 1086727 1087012
2356.0012A086155p50M29J679J821P15p86j750j465l57N00J78j143k393A080512
$$ 1086155 1085405 1085834 1087513 1089334 1090049 1089263 1087513 1086048 1085691 1086191 1086369 1085226 1082833 1080512
2348.5005A079726J286K393J893M29q58j250p14L5O79R29R64P15K14k14A086048
$$ 1079726 1081012 1083405 1085298 1085727 1084869 1083619 1082905 1082940 1083619 1084548 1085512 1086227 1086441 1086227 1086048
2340.4993A086405J072Q93k86k000k715j786L93K393K715J286q22k214A083190
$$ 1086405 1087477 1088370 1088084 1086084 1083369 1081583 1081976 1084369 1087084 1088370 1087548 1085334 1083190
2333.5017A081940l93m28j036j465r64P14K751L786K929N71j928k894A081512
$$ 1081940 1081547 1081119 1080083 1078618 1077654 1078368 1081119 1084905 1087834 1088405 1086477 1083583 1081512
2326.5012A081119O78O08P1l6O08J321J322O07l57q57q93p86q93p86l93A081619
$$ 1081119 1081797 1082405 1082476 1082440 1083048 1084369 1085691 1086298 1085941 1085084 1084191 1083405 1082512 1081726 1081333 1081619
2317.9998A082405P14L21l5P1M29P50N36k15j107j500r65K15J321J536A085298
$$ 1082405 1083119 1083440 1083405 1083476 1083905 1084655 1085191 1084976 1083869 1082369 1081404 1081619 1082940 1084476 1085298
2310.0024A085119p14o43k86j07L6K50O07O79J78o07j143j036o07k86A081047
$$ 1085119 1084405 1083762 1083476 1083369 1083405 1083655 1084262 1084941 1085119 1084512 1083369 1082333 1081726 1081440 1081047
2302.0012A080476l93J43O78Q93Q58O43N00K85k50p50j000n71K50Q21A083333
$$ 1080476 1080083 1080226 1080904 1081797 1082655 1083298 1083798 1084083 1083833 1083083 1082083 1081512 1081762 1082583 1083333
2293.9998A083476n36p14l21L5J07j42k86%N71Q58N71j43q21r29o43j43A081119
$$ 1083476 1082940 1082226 1081905 1081940 1082047 1081905 1081619 1081619 1082190 1083048 1083619 1083476 1082655 1081726 1081083 1080940 1081119
2285.0024A081440L22J43j43m29Tp1L93O43M28j07m64m29p1J43J78p1A081333
$$ 1081440 1081762 1081905 1081762 1081333 1080904 1080833 1081226 1081869 1082297 1082190 1081726 1081297 1081226 1081369 1081547 1081476 1081333
2276.001A081404M29N72L21j78n72Tj78J78K86J07j07Tl6L6%p1l6J07A081762
$$ 1081404 1081833 1082405 1082726 1082548 1081976 1081404 1081226 1081404 1081690 1081797 1081690 1081583 1081547 1081583 1081583 1081512 1081476 1081583 1081762
2265.9998A081940L6j43k86l21j43L6J78J43p1j79%L93O43L93l6m64n36A081119
$$ 1081940 1081976 1081833 1081547 1081226 1081083 1081119 1081297 1081440 1081369 1081190 1081190 1081583 1082226 1082619 1082583 1082119 1081583 1081119
2256.5022A080797k50%N00Q58P85J43n71q22l93K15M64K86l6k50j79k50A080869
$$ 1080797 1080547 1080547 1081047 1081905 1082690 1082833 1082262 1081440 1081047 1081262 1081726 1082012 1081976 1081726 1081547 1081297 1080869
2247.501A080369l58p1J07L6p2J43O43J072R29K85m28o43m29%K50K86A082333
$$ 1080369 1080011 1079940 1080047 1080083 1080011 1080154 1080797 1081869 1082798 1083083 1082655 1082012 1081583 1081583 1081833 1082119 1082333
2238.4998A082405l6j43l21l93k86P1L93N00M65K50J07%j07l57n01m28A081512
$$ 1082405 1082369 1082226 1081905 1081512 1081226 1081297 1081690 1082190 1082655 1082905 1083012 1083012 1082905 1082548 1082047 1081619 1081512
2229.5022A081833M64L93J43l5j08k14m29m64k14K14M64K50j42k86p2A082155
$$ 1081833 1082297 1082690 1082833 1082798 1082690 1082476 1082047 1081583 1081369 1081583 1082047 1082297 1082155 1081869 1081797 1082155
2221.001A082762N71M29K86J78L6j07j79k50Tl93l21%N36Q93P85J43A084655
$$ 1082762 1083333 1083762 1084048 1084226 1084262 1084155 1083976 1083726 1083476 1083083 1082762 1082762 1083298 1084191 1084976 1085119 1084655
2211.9998A083976l57J07K86P1l21m29j43L22N36L21p1k86Tj43k14k86A082976
$$ 1083976 1083619 1083726 1084012 1084083 1083762 1083333 1083190 1083512 1084048 1084369 1084298 1084012 1083726 1083583 1083369 1083083 1082976
2203.0022A083298Q21P86J79n36q57n01J43O43O79L57p1l57l58L6N00A085512
$$ 1083298 1084119 1084905 1085084 1084548 1083691 1083190 1083333 1083976 1084655 1085012 1084941 1084584 1084226 1084262 1084762 1085512
2194.501A086084j07p51j071p86k14K14L93K50J79P1L6%j07j08J08L57A085119
$$ 1086084 1085977 1085226 1084155 1083369 1083155 1083369 1083762 1084012 1084191 1084262 1084298 1084298 1084191 1084083 1084191 1084548 1085119
2185.4995A085727K85j43l93l57P2M28N36J07m28q22o79j78N00P86O43A086262
$$ 1085727 1086012 1085869 1085476 1085119 1085191 1085619 1086155 1086262 1085834 1085012 1084333 1084155 1084655 1085441 1086084 1086262
2177.0022A086048l21j79%Tj07p2J07L22K86L5l5J78N36O07P2o07q22A085655
$$ 1086048 1085727 1085548 1085548 1085548 1085441 1085369 1085476 1085798 1086084 1086119 1086084 1086262 1086798 1087405 1087477 1086870 1086048 1085655
2167.5007A085869L93J79j07p2J43J07j78k86l6N72Q93O78L6m64o79n00A086298
$$ 1085869 1086262 1086441 1086334 1086262 1086405 1086512 1086334 1086048 1086012 1086584 1087477 1088155 1088191 1087727 1087048 1086548 1086298
2158.4995A086155L6P1L6j79j42J07O07Q57N72%n36n72l21l6P2l6%K50A087548
$$ 1086155 1086191 1086262 1086298 1086119 1085977 1086084 1086691 1087548 1088120 1088120 1087584 1087012 1086691 1086655 1086727 1086691 1086691 1086941 1087548
2148.5022A088334O07P2n72r64q57m65%J43P1P2L57O79P50L93j43m64A087727
$$ 1088334 1088941 1089013 1088441 1087477 1086620 1086155 1086155 1086298 1086369 1086441 1086798 1087477 1088227 1088620 1088477 1088013 1087727
2139.5007A087763K50J78L6p2p1Tl6J07L57TJ43k50l21%N00O43K14l57A088763
$$ 1087763 1088013 1088191 1088227 1088155 1088084 1088013 1087977 1088084 1088441 1088798 1088941 1088691 1088370 1088370 1088870 1089513 1089727 1089370 1088763
2129.4995A088441J07L93L22L5j78l22l57l93l21j07J43M28N72O07M64A090084
$$ 1088441 1088548 1088941 1089263 1089298 1089120 1088798 1088441 1088048 1087727 1087620 1087763 1088191 1088763 1089370 1089834 1090084
2121.002A090013l22l21j79L6J07TJ08J42J43P2%P1L22M64J79l93q22A089084
$$ 1090013 1089691 1089370 1089191 1089227 1089334 1089441 1089549 1089691 1089834 1089906 1089906 1089977 1090299 1090763 1090942 1090549 1089727 1089084
2111.5007A089156Q21R65K50p15j107o07L93J107R29P1q93j322r64j07A088620
$$ 1089156 1089977 1090942 1091192 1090477 1089370 1088763 1089156 1090263 1091192 1091263 1090370 1089048 1088084 1087977 1088620
2103.4995A089584P15K50j43k86j43%L6p2j07J43L22L93J78j43l93Tk85A089549
$$ 1089584 1090299 1090549 1090406 1090120 1089977 1089977 1090013 1089941 1089834 1089977 1090299 1090692 1090870 1090727 1090334 1089941 1089656 1089549
2094.002A089727N00N72M64L6l22k85p2K14J79%p1%J07Tp2k14j43J43A091334
$$ 1089727 1090227 1090799 1091263 1091299 1090977 1090692 1090620 1090834 1091013 1091013 1090942 1090942 1091049 1091156 1091084 1090870 1090727 1090870 1091334
2084.0007A091906M64J43j43k50Tj78j43P1L22O07O43K86k50p15o78k50A091906
$$ 1091906 1092370 1092513 1092370 1092120 1091870 1091692 1091549 1091620 1091942 1092549 1093192 1093478 1093228 1092513 1091835 1091585 1091906
2074.9995A092406J79l58p85p50l22J79L21K14p1j43J43L93Tl6n00p86A089977
$$ 1092406 1092585 1092227 1091442 1090692 1090370 1090549 1090870 1091084 1091013 1090870 1091013 1091406 1091799 1091763 1091263 1090477 1089977
2066.002A090084O79J000Q93N72K14P1%j07l57o07p15m64%K14L6l93A090441
$$ 1090084 1090763 1091763 1092656 1093228 1093442 1093513 1093513 1093406 1093049 1092442 1091727 1091263 1091263 1091477 1091513 1091120 1090441
2057.0007A090084L93J000TM29l21n72l21J78N00L93J43j43k14j79j07A092192
$$ 1090084 1090477 1091477 1092477 1092906 1092585 1092013 1091692 1091870 1092370 1092763 1092906 1092763 1092549 1092370 1092263 1092192
2048.4993A092120p1j07%K14M64M65P1l21m29%N72R64P14J43m28o79o43A092620
$$ 1092120 1092049 1091942 1091942 1092156 1092620 1093085 1093156 1092835 1092406 1092406 1092978 1093942 1094656 1094799 1094371 1093692 1093049 1092620
2039.002A092513J79M64N36L57l6l21m29k50P2K85L22K50K14K50K86A094871
$$ 1092513 1092692 1093156 1093692 1094049 1094013 1093692 1093263 1093013 1093085 1093370 1093692 1093942 1094156 1094406 1094692 1094871
2030.5006A094728m29n71n00k86p2L6J79L57M64N00L22%m29p50o43j07A093370
$$ 1094728 1094299 1093728 1093228 1092942 1092870 1092906 1093085 1093442 1093906 1094406 1094728 1094728 1094299 1093549 1092906 1092799 1093370
2021.4993A094335P86L21j07l93n36p14Tk86N00J214J143L22o79j143A093192
$$ 1094335 1095121 1095442 1095335 1094942 1094406 1093692 1092978 1092692 1093192 1094406 1095549 1095871 1095192 1094049 1093192
2013.5018A093013M65P14N72L21J43K14K86L6m29q57Tk86L21O79O07L57A095549
$$ 1093013 1093478 1094192 1094764 1095085 1095228 1095442 1095728 1095764 1095335 1094478 1093621 1093335 1093656 1094335 1094942 1095299 1095549
2004.5006A095799J43k50o78q22n36p1J78J08j08k14%M29N71K86m64j143A092049
$$ 1095799 1095942 1095692 1095014 1094192 1093656 1093585 1093763 1093871 1093763 1093549 1093549 1093978 1094549 1094835 1094371 1093228 1092049
1995.4993A091549N36J214J107M29k14l93J07O79P50K85l92n72k14M28A095907
$$ 1091549 1092085 1093299 1094406 1094835 1094621 1094228 1094335 1095014 1095764 1096049 1095657 1095085 1094871 1095299 1095907
1987.5018A096014o79j107q22j43N72P50N71L6l93n71l93J78P51R64O79A096442
$$ 1096014 1095335 1094228 1093406 1093263 1093835 1094585 1095156 1095192 1094799 1094228 1093835 1094013 1094764 1095728 1096407 1096442
1979.0005A095978o07k86K14N72N71K50l21o79o78l22J43N00N72L92J79A096478
$$ 1095978 1095371 1095085 1095299 1095871 1096442 1096692 1096371 1095692 1095014 1094692 1094835 1095335 1095907 1096299 1096478 1096478
1970.4999A096371k14l93o43Tl57J78O43Q57P51L57p2l21m65k85p2J43A096085
$$ 1096371 1096157 1095764 1095121 1094478 1094121 1094299 1094942 1095799 1096550 1096907 1096835 1096514 1096049 1095764 1095692 1095835 1096085
1961.5024A096264L5%L6J43K50L93M29K50j07n01n71j79L93P50N00j07A097478
$$ 1096264 1096299 1096299 1096335 1096478 1096728 1097121 1097550 1097800 1097693 1097192 1096621 1096442 1096835 1097585 1098085 1097978 1097478
1952.5011A097050J07M64L22l58r64j072o07J07N00L58P1J07N72Q93P14A098371
$$ 1097050 1097157 1097621 1097943 1097585 1096621 1095549 1094942 1095049 1095549 1095907 1095978 1096085 1096657 1097550 1098264 1098371
1943.9998A098014j79N72J214J143L93o07j179j214q93l93P1M65N00L57A098300
$$ 1098014 1097835 1098407 1099621 1100764 1101157 1100550 1099371 1098157 1097264 1096871 1096942 1097407 1097907 1098264 1098300
1936.0023A098193L5L93M65K50k50o43p50m29p2J79TL5l5J43K50J78l6A097871
$$ 1098193 1098228 1098621 1099086 1099336 1099086 1098443 1097693 1097264 1097192 1097371 1097550 1097585 1097550 1097693 1097943 1098121 1098085 1097871
1926.5011A097800L57N36L57L6P1N72J035J036L93n36j107j214j108r64A096657
$$ 1097800 1098157 1098693 1099050 1099086 1099157 1099729 1100764 1101800 1102193 1101657 1100550 1099336 1098228 1097264 1096657
1918.4998A096764R29J357J036J78o78j036r65p14k86K86R29J143O07A099228
$$ 1096764 1097693 1099050 1100086 1100264 1099586 1098550 1097585 1096871 1096585 1096871 1097800 1098943 1099550 1099228
1911.0023A098264q22%O79P86M29J42L6p1m29p14o07L5P15Q21K86l22A098764
$$ 1098264 1097442 1097442 1098121 1098907 1099336 1099478 1099514 1099443 1099014 1098300 1097693 1097728 1098443 1099264 1099550 1099228 1098764
1902.001A098657L21M29K86J43l6k86n71o43l22J43M29J78l21n72k85A097800
$$ 1098657 1098978 1099407 1099693 1099836 1099800 1099514 1098943 1098300 1097978 1098121 1098550 1098728 1098407 1097835 1097550 1097800
1893.4998A098443P50O43L93p2n00n36J07R65J357O07q21j786j715o43A097550
$$ 1098443 1099193 1099836 1100229 1100157 1099657 1099121 1099228 1100193 1101550 1102157 1101336 1099550 1097835 1097192 1097550
1885.499A098371O43L93K50%l93p14p50m29l6K86L93M29M64L57K14J79A099979
$$ 1098371 1099014 1099407 1099657 1099657 1099264 1098550 1097800 1097371 1097335 1097621 1098014 1098443 1098907 1099264 1099478 1099657 1099979
1876.5016A100264l5n36q93o43p2M29N72M28J79P1P2K85O79J036J143A103693
$$ 1100264 1100229 1099693 1098800 1098157 1098085 1098514 1099086 1099514 1099693 1099764 1099836 1100121 1100800 1101836 1102979 1103693
1868.0002A103872j43k14k15m64q93j000n36K86Q22P50K85j07l21l22A101443
$$ 1103872 1103729 1103515 1103300 1102836 1101943 1100943 1100407 1100693 1101515 1102265 1102550 1102443 1102122 1101800 1101443
1859.999A101050l57j07l6Tj43k50j42%J42L58O43Q21O43L6o79j036A100050
$$ 1101050 1100693 1100586 1100550 1100514 1100371 1100121 1099979 1099979 1100121 1100479 1101122 1101943 1102586 1102622 1101943 1100907 1100050
1851.0016A099943O79J000P50J43j08K15Q21J000J08j143j572m29J608A105872
$$ 1099943 1100622 1101622 1102372 1102515 1102407 1102622 1103443 1104443 1104551 1103408 1101836 1101407 1103015 1105872
1843.5002A108015P2j786k108j214j43J07l21o43l93J79N71L57j78o08A101193
$$ 1108015 1108087 1106301 1104193 1102979 1102836 1102943 1102622 1101979 1101586 1101765 1102336 1102693 1102515 1101907 1101193
1835.4996A100622k86l6K50M64N01K14l22m64P1J108J964J965J071j07A105944
$$ 1100622 1100336 1100300 1100550 1101014 1101515 1101729 1101407 1100943 1101014 1102122 1104086 1106051 1107122 1107015 1105944
1827.5022A104265j858j607p14O43J678J751R28l5m65l21j07k86o43q22A101800
$$ 1104265 1102407 1100800 1100086 1100729 1102407 1104158 1105086 1105051 1104586 1104265 1104158 1103872 1103229 1102407 1101800
1819.5009A101622J07L57N00O43N36J78k50n00n35m65m64l93k14J42N36A102693
$$ 1101622 1101729 1102086 1102586 1103229 1103765 1103943 1103693 1103193 1102658 1102193 1101729 1101336 1101122 1101264 1101800 1102693
1810.9995A103729Q57L22m65r28p50L5O43N36k14j072j250q21k86P1K86A101229
$$ 1103729 1104586 1104908 1104443 1103515 1102765 1102800 1103443 1103979 1103765 1102693 1101443 1100622 1100336 1100407 1100693 1101229
1802.5021A101943M29k50r65q57L6J179J750J214K15o79T%P50P86j43A103336
$$ 1101943 1102372 1102122 1101157 1100300 1100336 1101515 1103265 1104479 1104694 1104015 1103336 1103336 1104086 1104872 1104729 1103336
1794.0009A101372j215N00J929K143J215L5n71o43o79q93j000q21l93A100836
$$ 1101372 1100157 1100657 1102586 1104729 1105944 1105979 1105408 1104765 1104086 1103193 1102193 1101372 1100979 1100836
1786.5001A100836J78N72J036J000M29l22j000j214r65j79Q58J571J572A105229
$$ 1100836 1101014 1101586 1102622 1103622 1104051 1103729 1102729 1101515 1100550 1100371 1101229 1102800 1104372 1105229
1778.9989A105301n00p50j072Tm64Q93J929J714P2j608j893n71J179K107A107051
$$ 1105301 1104801 1104051 1102979 1101907 1101443 1102336 1104265 1105979 1106051 1104443 1102550 1101979 1103158 1105265 1107051
1771.0013A107623p15j750k179j607j43J607K500J822J43j429j786j178A102372
$$ 1107623 1106908 1105158 1102979 1101372 1101229 1102836 1105336 1107158 1107301 1105872 1104086 1102908 1102372
1764.0007A101800j036j035P1J679K679K107M29j179j750j465j000o07A100479
$$ 1101800 1100764 1099729 1099800 1101479 1104158 1106265 1106694 1105515 1103765 1102300 1101300 1100693 1100479
1756.9994A100907R65Q93K85k14Tj07n00j286j608p50Q57J929J786P86A103693
$$ 1100907 1101872 1102765 1103050 1102836 1102622 1102515 1102015 1100729 1099121 1098371 1099228 1101157 1102943 1103729 1103693
1749.002A103479%Tk14l22j78j43m29p86o78P1J036J286N00j036k107A098871
$$ 1103479 1103479 1103479 1103265 1102943 1102765 1102622 1102193 1101407 1100729 1100800 1101836 1103122 1103622 1102586 1100479 1098871
1740.5007A099300K536L143J429j179k679k071n36P1j036k607k715o78A095228
$$ 1099300 1101836 1104979 1106408 1105229 1102550 1100479 1099943 1100014 1098978 1096371 1093656 1092978 1095228
1733.5A099157L322J072j108j929j321j07P50TL6p15j000p14j08K86A098657
$$ 1099157 1102479 1103551 1102443 1100514 1099193 1099086 1099836 1100586 1100622 1099907 1098907 1098193 1098085 1098371 1098657
1725.4988A098657k50k86j07K14L22L21J43j43p14j357j644n71K072N215A108337
$$ 1098657 1098407 1098121 1098014 1098228 1098550 1098871 1099014 1098871 1098157 1096800 1095156 1094585 1096657 1101872 1108337
1717.5013A112873J07l929n250l680j107N36P86N00K86J42p1k86j78L5A100800
$$ 1112873 1112980 1109051 1103801 1100121 1099014 1099550 1100336 1100836 1101122 1101264 1101193 1100907 1100729 1100764 1100800
1709.5006A100443q57r29n72%M65P50O79J42l92j08J072J607k85m251A091049
$$ 1100443 1099586 1098657 1098085 1098085 1098550 1099300 1099979 1100121 1099729 1099621 1100693 1102300 1102015 1097764 1091049
1701.4994A086941L250J0466J1966O501j643o679o823m358k214q93O78A099871
$$ 1086941 1090191 1100657 1112623 1119124 1117481 1110802 1103979 1099621 1097407 1096514 1097192 1099871
1695.002A103193J572j357l037k250n00K14n00j178p86K86R28Q57Q58A099550
$$ 1103193 1104765 1103408 1100371 1098121 1097621 1097835 1097335 1096157 1095371 1095657 1096585 1097442 1098300 1099550
1687.5012A100586j072m179n715l251K608Q073R429N644n36n143o001A096550
$$ 1100586 1099514 1095335 1089620 1086369 1088977 1097050 1106479 1112123 1111587 1106444 1100443 1096550
1681.A095299J43J79l57n00j79%o79j964k894k071N36L536M643K858A097978
$$ 1095299 1095442 1095621 1095264 1094764 1094585 1094585 1093906 1091942 1089048 1086977 1087513 1091049 1095692 1098550 1097978
1672.9987A095121k465n00O79l22k429l250j608J465L715L572J393j072A092120
$$ 1095121 1092656 1092156 1092835 1092513 1090084 1086834 1085226 1086691 1090406 1093978 1095371 1094299 1092120
1666.0018A090513m29L6k86n36L93K144K964J786p14k536k465j286l93A089013
$$ 1090513 1090084 1090120 1089834 1089298 1089691 1091835 1094799 1096585 1095871 1093335 1090870 1089584 1089191 1089013
1658.5006A089013O43Q57J07n00N00K429K000l286j0501j3109p001M715A079726
$$ 1089013 1089656 1090513 1090620 1090120 1090620 1093049 1095049 1091763 1081262 1068153 1061152 1065867 1079726
1651.4999A093942O537k322n965l787M29L036TJ501j08j107j071n00j08A092942
$$ 1093942 1100479 1098157 1092192 1088405 1088834 1091870 1094906 1096407 1096299 1095192 1094121 1093621 1093513 1092942
1644.0024A091406k143j572l57N71P51M28j78j001j643j143Q93K786K179A089334
$$ 1091406 1089263 1087691 1087334 1087905 1088656 1089084 1088906 1087905 1086262 1085119 1086012 1088798 1090977 1089334
1636.5011A083440o536k572L072O036M394L57k536k607q93N71Q22J78A083333
$$ 1083440 1076904 1074332 1077404 1083440 1087834 1088191 1085655 1083048 1082155 1082726 1083548 1083726 1083333
1629.5005A082798j43N71J215J286M64q57k072k536k179j215K15J607A081690
$$ 1082798 1082655 1083226 1084441 1085727 1086191 1085334 1083262 1080726 1078547 1077332 1077547 1079154 1081690
1622.4991A083941Q57j000k036j751o43l5q22k464l251j964R28L536L822A080762
$$ 1083941 1084798 1083798 1081762 1080011 1079368 1079333 1078511 1076047 1072796 1070832 1071760 1075296 1079118 1080762
1615.0024A079297l322l072j643l93L6j79l93n00m28k86k14l57p86j108A065545
$$ 1079297 1075975 1072903 1071260 1070867 1070903 1070724 1070331 1069831 1069403 1069117 1068903 1068546 1067760 1066652 1065545
1607.0011A064974%P1m29j107j286r64l22L6P1k14o43q57o79j43M29O79A060080
$$ 1064974 1064974 1065045 1064616 1063509 1062223 1061259 1060937 1060973 1061044 1060830 1060187 1059330 1058651 1058508 1058937 1059616 1060080
1597.9998A060116j43P1M65O43K85k50o43n71j43J43J07l21p86Tk86L22A058866
$$ 1060116 1059973 1060044 1060509 1061152 1061437 1061187 1060544 1059973 1059830 1059973 1060080 1059759 1058973 1058187 1057901 1058223 1058866
1589.0023A059223j07k86L6O07O78L6r29j464r64J42J143J322R29N71A061509
$$ 1059223 1059116 1058830 1058866 1059473 1060151 1060187 1059258 1057794 1056830 1056972 1058115 1059437 1060366 1060937 1061509
1581.0011A062259P14L93K50L22O07N36K14J79P50J857K608K179P85o07A071903
$$ 1062259 1062973 1063366 1063616 1063938 1064545 1065081 1065295 1065474 1066224 1068081 1070689 1072868 1073653 1073046 1071903
1572.9998A071082k86j79k50N36K536M751N286L215m64l537m250k822A074975
$$ 1071082 1070796 1070617 1070367 1070903 1073439 1078190 1083476 1086691 1086227 1082690 1078440 1075618 1074975
1565.9991A076011J857J965J643J036M64p1r29k465l786k786K250J0109A101622
$$ 1076011 1077868 1079833 1081476 1082512 1082976 1082905 1081976 1079511 1075725 1072939 1075189 1085298 1101622
1559.0017A117731Q287k786j0895j2644r573n429k608j107P1J250J858A085441
$$ 1117731 1126018 1123232 1112337 1099693 1090120 1084691 1082083 1080976 1081047 1082297 1084155 1085441
1552.501A085476r28r29k50L93N00J07n00r64j286j358j071l57J000A082155
$$ 1085476 1084548 1083619 1083369 1083762 1084262 1084369 1083869 1082905 1081619 1080261 1079190 1078833 1079833 1082155
1544.9998A084762J357q93k607k572j107M28J072TJ428K394L000J929A089441
$$ 1084762 1086119 1085226 1082619 1080047 1078940 1079368 1080440 1081512 1082940 1085334 1088334 1090263 1089441
1538.0022A085619n322n036l822k501j214L57K036K965K286K86j893k858A068295
$$ 1085619 1080297 1075261 1071439 1068938 1067724 1068081 1070117 1073082 1075368 1075654 1073761 1070903 1068295
1531.0016A066295j857k322k250q58J286K608J857n00k357k143k15J500A062580
$$ 1066295 1064438 1062116 1059866 1059008 1060294 1062902 1064759 1064259 1061902 1059759 1059544 1061044 1062580
1524.0002A062973j07Q57K465L108K250Q21k50j071k429m215n108l679A055258
$$ 1062973 1062866 1063723 1066188 1069296 1071546 1072367 1072117 1071046 1068617 1064402 1059294 1055615 1055258
1516.9996A058151M072L108J321%n71r65j178n36J000K679L108J964M29A072546
$$ 1058151 1062223 1065331 1066652 1066652 1066081 1065116 1063938 1063402 1064402 1067081 1070189 1072153 1072582 1072546
1509.5022A073189J214P51j08M65L107O251P037M215n72m357n180l607A081047
$$ 1073189 1074403 1075154 1075046 1075511 1078618 1084869 1091906 1096121 1095549 1091192 1086012 1082405 1081047
1502.5016A081226P86Q21M29L6L5O43J429J322J07j143j000O78K536K751A091870
$$ 1081226 1082012 1082833 1083262 1083298 1083333 1083976 1085405 1086727 1086834 1085691 1084691 1085369 1087905 1090656 1091870
1494.5002A091049j751j178j43L21K15%K85Q93J215R29K85k85l58J43A092227
$$ 1091049 1089298 1088120 1087977 1088298 1088513 1088513 1088798 1089691 1090906 1091835 1092120 1091835 1091477 1091620 1092227
1486.4989A092620q93k536l429k786j036N36Q93L6j072j714j679j393A076368
$$ 1092620 1091727 1089191 1085762 1082976 1081940 1082476 1083369 1083405 1082333 1080619 1078940 1077547 1076368
1479.5015A075261j143j286j215o07N00J572J714P51m65o07P50K643L572A084441
$$ 1075261 1074118 1072832 1071617 1071010 1071510 1073082 1074796 1075547 1075082 1074475 1075225 1077868 1081440 1084441
1472.0009A085869%p50q93p86o07k14N00J143J072K50p86j000J78K108A089584
$$ 1085869 1085869 1085119 1084226 1083440 1082833 1082619 1083119 1084262 1085334 1085584 1084798 1083798 1083976 1086084 1089584
1463.9995A092799J393p14j751j464o79j43l5P1N72J607L000M251M679A107230
$$ 1092799 1094192 1093478 1091727 1090263 1089584 1089441 1089406 1089477 1090049 1091656 1094656 1098907 1103586 1107230
1456.5021A108230k215m465m786l608k036j143r64j036p86l93j78l93A085441
$$ 1108230 1106015 1101550 1096764 1093156 1091120 1089977 1089013 1087977 1087191 1086798 1086620 1086227 1085441
1449.5015A084726j07Q57J394Q57p15k286k964k322j143m29n00q93p50A075725
$$ 1084726 1084619 1085476 1086870 1087727 1087012 1084726 1081762 1079440 1078297 1077868 1077368 1076475 1075725 1075725
1442.0001A076261M29k86p50o43l22n00j250j857j429%J250J214k14j857A067581
$$ 1076261 1076690 1076404 1075654 1075011 1074689 1074189 1072939 1071082 1069653 1069653 1070903 1072117 1071903 1070046 1067581
1433.9989A065652q93m64o43q57o08P2N36K85o43j750k464k429j643n00A054043
$$ 1065652 1064759 1064295 1063652 1062795 1062187 1062259 1062795 1063080 1062437 1060687 1058223 1055794 1054151 1053651 1054043
1426.0021A054615K14j07TJ07J79p2l93p50j321j965k143r29J429L822A057187
$$ 1054615 1054829 1054722 1054615 1054722 1054901 1054829 1054436 1053686 1052365 1050400 1048257 1047328 1048757 1052579 1057187
1418.0007A060652J571K86J43L57K14k14l57J43Q57J286J321J215J357A070224
$$ 1060652 1062223 1062509 1062652 1063009 1063223 1063009 1062652 1062795 1063652 1064938 1066259 1067474 1068831 1070224
1410.4994A071367N72J07K86J107K000K358J822P85p1k50K50Q57J179A083333
$$ 1071367 1071939 1072046 1072332 1073439 1075439 1077797 1079619 1080404 1080333 1080083 1080333 1081190 1082369 1083333
1403.002A083905K86L5l57p50T%J179J964J750P15l57q22n36J07O08A087798
$$ 1083905 1084191 1084226 1083869 1083119 1082369 1082369 1083548 1085512 1087262 1087977 1087620 1086798 1086262 1086369 1086977 1087798
1394.5013A088513K85k50r64j643j822j321p2J215J678J036k14q22j78A086620
$$ 1088513 1088798 1088548 1087584 1085941 1084119 1082798 1082726 1083941 1085619 1086655 1086441 1085619 1085441 1086620
1387.A088584J357j78j322j214k15O43P15L57K14M29O43L93p2p1A090870
$$ 1088584 1089941 1089763 1088441 1087227 1087012 1087655 1088370 1088727 1088941 1089370 1090013 1090406 1090334 1090263 1090870
1378.9988A092442J964J429L93n71r65r64p50l22L22J035J358J036L21A096335
$$ 1092442 1094406 1095835 1096228 1095657 1094692 1093728 1092978 1092656 1092978 1094013 1095371 1096407 1096728 1096335
1371.5013A095657n72l57j07L21Q57J143P86L6o07Tj79J79K50TO07J286A100514
$$ 1095657 1095085 1094728 1094621 1094942 1095799 1096942 1097728 1097764 1097157 1096550 1096371 1096550 1096800 1097050 1097657 1098943 1100514
1362.5A101622J43n01n35l58m64j000j214o79L57J072R64M64K15N36A101550
$$ 1101622 1101765 1101264 1100729 1100371 1099907 1098907 1097693 1097014 1097371 1098443 1099407 1099871 1100086 1100622 1101550
1354.4994A102265j08r28j143o43J07N36M64K86L57N36N71J79m64q58A100479
$$ 1102265 1102157 1101229 1100086 1099443 1099550 1100086 1100550 1100836 1101193 1101729 1102300 1102479 1102015 1101157 1100479
1346.502A100479O07O79K85j07%L57O08L57l93j036j322r64l6J036J643A103443
$$ 1100479 1101086 1101765 1102050 1101943 1101943 1102300 1102908 1103265 1102872 1101836 1100514 1099550 1099514 1100550 1102193 1103443
1338.0006A103372j465j928j108J79Q93M64n00j036o78J78Q22Q93N36A100764
$$ 1103372 1101907 1099979 1098871 1099050 1099943 1100407 1099907 1098871 1098193 1098371 1099193 1100086 1100622 1100764
1330.4993A100800J79K85K86J43j78m29o07n72l93j78J07K50L57K50%A100014
$$ 1100800 1100979 1101264 1101550 1101693 1101515 1101086 1100479 1099907 1099514 1099336 1099443 1099693 1100050 1100300 1100300 1100014
1322.0018A099657k50P1L93N36N00L22K50TJ43j07o08j071j143o43K14A099407
$$ 1099657 1099407 1099478 1099871 1100407 1100907 1101229 1101479 1101729 1101872 1101765 1101157 1100086 1098943 1098300 1098514 1099407
1313.5012A100407P15K50l6j07k50n72p86n71P1O79P14L6p14q58k85O43A100550
$$ 1100407 1101122 1101372 1101336 1101229 1100979 1100407 1099621 1099050 1099121 1099800 1100514 1100550 1099836 1098978 1098693 1099336 1100550
1304.4999A101693O43J43k50m64n01n00k85L5L22K86p2n36o43k14N72A101336
$$ 1101693 1102336 1102479 1102229 1101765 1101264 1100764 1100479 1100514 1100836 1101122 1101050 1100514 1099871 1099657 1100229 1101336
1296.0024A102265L5j036j571j393o79P2N00N35K50j42l93k86J07N00A099336
$$ 1102265 1102300 1101264 1099693 1098300 1097621 1097693 1098193 1098728 1098978 1098836 1098443 1098157 1098264 1098764 1099336
1288.0011A099550l93q22j000q21n00l22l21n00o08n35k86k14m29p14A091263
$$ 1099550 1099157 1098335 1097335 1096514 1096014 1095692 1095371 1094871 1094263 1093728 1093442 1093228 1092799 1092085 1091263
1279.9999A090656k15J43L58L92K86p1o79j286j607j429q93k14K86M64A086441
$$ 1090656 1090441 1090584 1090942 1091334 1091620 1091549 1090870 1089584 1087977 1086548 1085655 1085441 1085727 1086191 1086441
1272.0024A086155p50q21m65j43To07r64r29o43m64p50j215j500j357A074475
$$ 1086155 1085405 1084584 1084119 1083976 1083833 1083226 1082262 1081333 1080690 1080226 1079476 1078261 1076761 1075404 1074475
1264.0017A073903n00n71p15p14o43n71n72q57j143j215q93l93j78n72A063188
$$ 1073903 1073403 1072832 1072117 1071403 1070760 1070189 1069617 1068760 1067617 1066402 1065509 1065116 1064938 1064366 1063188
1256.0005A061652j251n71l6j43p85j501j929j928j536j108q57Tj215A046257
$$ 1061652 1060401 1059830 1059794 1059651 1058866 1057365 1055436 1053508 1051972 1050864 1050007 1049150 1047935 1046257
1248.4991A044221k072j607j001l21p2l57j107j857k251k071j608j500A026575
$$ 1044221 1042149 1040542 1039541 1039220 1039148 1038791 1037684 1035827 1033576 1031505 1029897 1028397 1026575
1241.5023A024111k965l143k965k751k678k787l107l536m072m572n001I81390
$$ 1024111 1021146 1018003 1015038 1012287 1009609 1006822 1003715 1000179 996107 991535 986534 981390
1235.0006I76211n287n643o144o822p537q359r322j0252j0894j1323j1788H70267
$$ 976211 970924 965281 959137 952315 944778 936419 927097 916845 905951 894628 882840 870267
1228.4994H56301j5895j7967k0074k2004k3717k5254k6932k9076l1933F08480
$$ 856301 840406 822439 802365 780361 756644 731390 704458 675382 643449 608480
1223.0021E70760l9648m0685m0791l9899l7934l4826l0862k6182k1253B42356
$$ 570760 531112 490427 449636 409737 371803 336977 306115 279933 258680 242356
1217.501B30640p751m608k107j43J714L858O644J0216J4823K0182K5896C30690
$$ 230640 222889 218281 216174 216031 217745 221603 228247 238463 253286 273468 299364 330690
1210.9987C66695L9720M2328M3684M3542M2006L9756L7327L4969L2433G52107
$$ 366695 406415 448743 492427 535969 577975 617731 655058 690027 722460 752107
1205.5013G79004K4575K2718K0895J8967J6896J5073J3717J2608J1609I46600
$$ 779004 803579 826297 847192 866159 883055 898128 911845 924453 936062 946600
1200.0002I56137Q715Q144P787P430O858O036N144M429M215M108L893A026361
$$ 956137 964852 972996 980783 988213 995071 1001107 1006251 1010680 1014895 1019003 1022896 1026361
1193.4995A029504L108L143TL001K929L215L321K894J893R64O79J036A060044
$$ 1029504 1032612 1035755 1038898 1041899 1044828 1048043 1051364 1054258 1056151 1057115 1057794 1058830 1060044
1186.5021A061044N01N71J322K250K572K179J536J178J322J500J393J143A079440
$$ 1061044 1061545 1062116 1063438 1065688 1068260 1070439 1071975 1073153 1074475 1075975 1077368 1078511 1079440
1179.5015A080369J035J179J250J251J071P86M64L22N00Q57J072J000A091763
$$ 1080369 1081404 1082583 1083833 1085084 1086155 1086941 1087405 1087727 1088227 1089084 1090156 1091156 1091763
1172.5001A092085L57O07J000J072Q21M29J07%J43M29P14P50N72K50j08A098943
$$ 1092085 1092442 1093049 1094049 1095121 1095942 1096371 1096478 1096478 1096621 1097050 1097764 1098514 1099086 1099336 1099228 1098943
1163.9989A098550l57j43K50P50J107TO43%l92m65j78J78M65O78P86Q57A104586
$$ 1098550 1098193 1098050 1098300 1099050 1100157 1101264 1101907 1101907 1101515 1101050 1100872 1101050 1101515 1102193 1102979 1103836 1104586
1155.0013A105051J43p2j43j07%K50N00P15O78N72L93K14J43J79J42L6A108623
$$ 1105051 1105194 1105122 1104979 1104872 1104872 1105122 1105622 1106337 1107015 1107587 1107980 1108194 1108337 1108516 1108658 1108694 1108623
1146.0001A108444k14l6K14O08Q21O43J43l57TJ07M64M29j43p15q21n00A108623
$$ 1108444 1108230 1108194 1108408 1109016 1109837 1110480 1110623 1110266 1109909 1110016 1110480 1110909 1110766 1110051 1109230 1108730 1108623
1136.9988A108730J78K86L22p2p14j286j143m29L22M28j07o78p15l21A104908
$$ 1108730 1108908 1109194 1109516 1109444 1108730 1107444 1106301 1105872 1106194 1106622 1106515 1105837 1105122 1104801 1104908
1129.0013A104836o78j286j465j143o43j78J43M28P50Q58O78L22j07l58A101622
$$ 1104836 1104158 1102872 1101407 1100264 1099621 1099443 1099586 1100014 1100764 1101622 1102300 1102622 1102515 1102157 1101622
1121.0007A101157j78L21O79M28l57j143j036p1Q57R29K14m64k50O43A103086
$$ 1101157 1100979 1101300 1101979 1102407 1102050 1100907 1099871 1099800 1100657 1101586 1101800 1101336 1101086 1101729 1103086
1112.9994A104265M29j08p1M29R64J250J215R64N00l6l93n00m28m29m64A107265
$$ 1104265 1104694 1104586 1104515 1104944 1105908 1107158 1108373 1109337 1109837 1109801 1109408 1108908 1108480 1108051 1107587 1107265
1104.502A107265M65P50TN36L57J78J08K14M64O08K50n36j465j750j214A106872
$$ 1107265 1107730 1108480 1109230 1109766 1110123 1110301 1110409 1110623 1111087 1111695 1111945 1111409 1109944 1108194 1106980 1106872
1096.0006A107873J607J464R65K86k15n71o07n36l22k14j79j43L6K50A110123
$$ 1107873 1109480 1110944 1111909 1112195 1111980 1111409 1110802 1110266 1109944 1109730 1109551 1109408 1109444 1109694 1110123
1087.9994A110373k50p86j036r29q57r28j001q21k14L21N00K50P2K50A105479
$$ 1110373 1110123 1109337 1108301 1107372 1106515 1105587 1104586 1103765 1103551 1103872 1104372 1104622 1104694 1104944 1105479
1079.9987A105979%o43q93o78l57k50j43P1M29N36J78n36j107j143o43A100800
$$ 1105979 1105979 1105336 1104443 1103765 1103408 1103158 1103015 1103086 1103515 1104051 1104229 1103693 1102586 1101443 1100800 1100800
1071.5012A101122K14k86p50p14j08N72Q22M28l21o79o07l57l22n36m28A098085
$$ 1101122 1101336 1101050 1100300 1099586 1099478 1100050 1100872 1101300 1100979 1100300 1099693 1099336 1099014 1098478 1098050 1098085
1063.A098586K50o08j607j822j393o78m65n00Tj79K15K86%k86l22A090584
$$ 1098586 1098836 1098228 1096621 1094799 1093406 1092728 1092263 1091763 1091263 1091084 1091299 1091585 1091585 1091299 1090977 1090584
1054.4987A089763j822k750k894j964o07K50%j072k000Tj036K14P86N00A075082
$$ 1089763 1087941 1085191 1082297 1080333 1079726 1079976 1079976 1078904 1076904 1074904 1073868 1074082 1074868 1075368 1075082
1046.5012A074189q57k86L22P14O07K86p1j43J78P15J071R29L21j78k50A077833
$$ 1074189 1073332 1073046 1073368 1074082 1074689 1074975 1074904 1074761 1074939 1075654 1076725 1077654 1077975 1077797 1077547 1077833
1037.9999A078904J572J500P86j07q22j000l93P50J822K179J571K86q93A084762
$$ 1078904 1080476 1081976 1082762 1082655 1081833 1080833 1080440 1081190 1083012 1085191 1086762 1087048 1086155 1084762
1030.4993A083548p15p1O43J536K179K214J536P15L21M64P15P14O79J000A096907
$$ 1083548 1082833 1082762 1083405 1084941 1087120 1089334 1090870 1091585 1091906 1092370 1093085 1093799 1094478 1095478 1096907
1022.5018A098407Q57p1l57L21J357J929J536O07l5j79J43O79J178J572A109516
$$ 1098407 1099264 1099193 1098836 1099157 1100514 1102443 1103979 1104586 1104551 1104372 1104515 1105194 1106372 1107944 1109516
1014.5005A110552K50l58m28%M64P14N72K14k14l93l6J036K286K965K286A120589
$$ 1110552 1110802 1110444 1110016 1110016 1110480 1111194 1111766 1111980 1111766 1111373 1111337 1112373 1114659 1117624 1119910 1120589
1005.9992A119696j322m29Q93J643J358O79J78J79K14J43j07L5N36J000A125768
$$ 1119696 1118374 1117945 1118838 1120481 1121839 1122518 1122696 1122875 1123089 1123232 1123125 1123160 1123696 1124696 1125768
998.0018A126447L21K86T%o43j072q57J07J143J679J393N36l93r29o79A127911
$$ 1126447 1126768 1127054 1127340 1127340 1126697 1125625 1124768 1124875 1126018 1127697 1129090 1129626 1129233 1128304 1127625 1127911
989.5004A129340J786J143j79q93o43K15O78M65l6TN36J072Q21L6n72A133340
$$ 1129340 1131126 1132269 1132090 1131197 1130554 1130769 1131447 1131912 1131876 1131840 1132376 1133448 1134269 1134305 1133733 1133340
980.9998A133733J001Q21J07p14r65p50j07N00R29TO78J43l21n36Tk50A134734
$$ 1133733 1134734 1135555 1135662 1134948 1133983 1133233 1133126 1133626 1134555 1135484 1136162 1136305 1135984 1135448 1134912 1134662 1134734
972.0024A135198P50O07J07o78j000p86j07L21J79k15m64j79K86N36A134876
$$ 1135198 1135948 1136555 1136662 1135984 1134984 1134198 1134091 1134412 1134591 1134376 1133912 1133733 1134019 1134555 1134876
964.00104A134912j43p1J07K14J07j42m29o79o07j43L93P50M65j43o43A133305
$$ 1134912 1134769 1134698 1134805 1135019 1135126 1134984 1134555 1133876 1133269 1133126 1133519 1134269 1134734 1134591 1133948 1133305
955.49976A133233P50J215J107M65l93j108j428j251o78J07P14Q22L21A133591
$$ 1133233 1133983 1135198 1136305 1136770 1136377 1135269 1133841 1132590 1131912 1132019 1132733 1133555 1133876 1133591
948.0023A132948n36k86m29q93j214p14L57J357J322K14j429k429k250A124839
$$ 1132948 1132412 1132126 1131697 1130804 1129590 1128876 1129233 1130590 1131912 1132126 1130697 1128268 1126018 1124839
940.50165A124804L21l57j429k322k679k714k858l143l322l108k714k465A095514
$$ 1124804 1125125 1124768 1123339 1121017 1118338 1115624 1112766 1109623 1106301 1103193 1100479 1098014 1095514
933.50037A092728l144l465l571l430k929k214j572j000m29M29J322J786A076011
$$ 1092728 1089584 1086119 1082548 1079118 1076189 1073975 1072403 1071403 1070974 1071403 1072725 1074511 1076011
926.499A076940Q93J821L322M215M072L072K286K143K322TJ928J786A109480
$$ 1076940 1077833 1079654 1082976 1087191 1091263 1094335 1096621 1098764 1101086 1103408 1105336 1107122 1109480
919.50226A113123M465M001K286K86o43l58L93O79L57J43P14J751K429A131626
$$ 1113123 1117588 1121589 1123875 1124161 1123518 1123160 1123553 1124232 1124589 1124732 1125446 1127197 1129626 1131626
912.001A132376m64r65q57o79n71k86O07J751K464K251J357M28j42A136984
$$ 1132376 1131912 1130947 1130090 1129411 1128840 1128554 1129161 1130912 1133376 1135627 1136984 1137412 1137270 1136984
904.5003A136734j79j78k50o08j071j215p50K15J107J357R29M29K85A137484
$$ 1136734 1136555 1136377 1136127 1135519 1134448 1133233 1132483 1132698 1133805 1135162 1136091 1136520 1136805 1137484
896.999A138698J501J357R29N00L5n71j429k214k465j858p85J07K86A134055
$$ 1138698 1140199 1141556 1142485 1142985 1143020 1142449 1141020 1138806 1136341 1134483 1133698 1133805 1134091 1134055
889.5015A133983M65J000R64J08q22j107p15j43j78q22j643k036j643A126697
$$ 1133983 1134448 1135448 1136412 1136520 1135698 1134591 1133876 1133733 1133555 1132733 1131090 1129054 1127411 1126697
882.0009A127125J179J250M65o79j786k322k214j679p86K14J000J429A124554
$$ 1127125 1128304 1129554 1130019 1129340 1127554 1125232 1123018 1121339 1120553 1120767 1121767 1123196 1124554
874.9996A125518L21j78j43O43J964K894K572P85j393k536j857j43J464A131769
$$ 1125518 1125839 1125661 1125518 1126161 1128125 1131019 1133591 1134376 1132983 1130447 1128590 1128447 1129911 1131769
867.50214A133019L93k14m29n00Um65o07p14o79Tq21j500k429k822k286A117302
$$ 1133019 1133412 1133198 1132769 1132269 1131769 1131269 1130804 1130197 1129483 1128804 1128125 1127304 1125804 1123375 1120553 1118267 1117302
858.50085A117660Q21O07P2m64j072j929k715k821k215j357j108j464A102086
$$ 1117660 1118481 1119088 1119160 1118696 1117624 1115695 1112980 1110159 1107944 1106587 1105479 1104015 1102086
851.5002A100264j107k14L21O43Q57R65P86L57P1M65J393K429K821K322A113480
$$ 1100264 1099157 1098943 1099264 1099907 1100764 1101729 1102515 1102872 1102943 1103408 1104801 1107230 1110051 1112373 1113480
843.4989A113338q22m64N36J643J893J357M64j42l22n36j000j429j250A112766
$$ 1113338 1112516 1112052 1112588 1114231 1116124 1117481 1117945 1117803 1117481 1116945 1115945 1114516 1113266 1112766
836.00146A112588p51j857k393j679j79R29J036N00j43p50j357j893j894A101229
$$ 1112588 1111837 1109980 1107587 1105908 1105729 1106658 1107694 1108194 1108051 1107301 1105944 1104051 1102157 1101229
828.5008A101657R65P1j821l215l143j786l58p1j179k786l643l215j893A078654
$$ 1101657 1102622 1102693 1100872 1097657 1094514 1092728 1092370 1092299 1091120 1088334 1084691 1081476 1079583 1078654
820.9995A077940r65r64o07n36j393k608l393l286l001l357m072m001A047435
$$ 1077940 1076975 1076011 1075404 1074868 1073475 1070867 1067474 1064188 1061187 1057830 1053758 1049757 1047435
814.0021A047400J035j78k929n072n358l965k179j322j607k607l715A014895
$$ 1047400 1048435 1048257 1045328 1040256 1034898 1030933 1028754 1027432 1025825 1023218 1019503 1014895
807.5009A009716n644o001o286o359o000n358m572l965l858m536n858I43992
$$ 1009716 1004072 998071 991785 985426 979426 974068 969496 965531 961673 957137 951279 943992
800.99976I35848q251p930p894q251q716q787q679q859r644j0894j1966H23546
$$ 935848 927597 919667 911773 903522 894806 886019 877340 868481 858837 847943 835977 823546
794.5013H11009j2895j3788j5038j6002j6466j6717j7145j8110j9289F45342
$$ 811009 798114 784326 769288 753286 736820 720103 702958 684848 665559 645342
789.0001F24518k1075k1110k0967k1039k1932k3717k5504k5861k4467C96521
$$ 624518 603443 582333 561366 540327 518395 494678 469174 443313 418846 396521
783.499C75411k1182k1646k1146j9788j8324j7288j5788j3038r323B11745
$$ 375411 354229 332583 311437 291649 273325 256037 240249 227211 217888 211745
778.0017B06815n679o680o251m107j429L93P86P1q21j322j179o07%L93A80669
$$ 206815 201136 194456 188205 184098 182669 183062 183848 183919 183098 181776 180597 179990 179990 180383 180669
770.00055A80597k14L21J572L036L786L287J678k14j321j358o43j78l22A89456
$$ 180597 180383 180704 182276 185312 189098 192385 194063 193849 192528 191170 190527 190349 190027 189456
762.5021A89277J072K429K929K143O78n71j072j143r64o79j07O07R29A96171
$$ 189277 190349 192778 195707 197850 198528 197957 196885 195742 194778 194099 193992 194599 195528 196171
755.001A96278l6M65J286J786J714J215P14J07n00j107j358q57K50B01529
$$ 196278 196242 196707 197993 199779 201493 202708 203422 203529 203029 201922 200564 199707 199957 201529
747.49866B04172L250L322K715J465K14L6J571M537P644R751J0287R859B68181
$$ 204172 207422 210744 213459 214924 215138 215174 216745 221282 228926 238677 248964 258823 268181
740.50134B77361R394J0002J1251J2859J3895J3466J1716J0252J0787C94413
$$ 277361 286755 296757 308008 320867 334762 348228 359944 370196 380983 394413
735.0002D11094J8753J8860J7395J5324J3288J1894J1716J2823J4752E62330
$$ 411094 429847 448707 466102 481426 494714 506608 518324 531147 545899 562330
729.5018E79297J6324J5109J3895J2752J1751J1359J1680J2359J2681G09173
$$ 579297 595621 610730 624625 637377 649128 660487 672167 684526 697207 709173
724.0006G19710R108Q109P608P394P572Q073Q501Q287P323O322O036H10437
$$ 719710 728818 736927 744535 751929 759501 767574 776075 784362 791685 798007 804043 810437
717.49945H16974N858M679M036M251M929M965M001K643J750J786K572H61873
$$ 816974 822832 827511 831547 835798 840727 845692 849693 852336 854086 855872 858444 861873
711.00214H65552L036K036J536K179L679M965M715K894N71p86n36P15H92306
$$ 865552 868588 870624 872160 874339 878018 882983 887698 890592 891163 890377 889841 890556 892306
703.9999H94056Q93L6l6O79J393J286L57o43p14K50J571K251K071J429I05629
$$ 894056 894949 894985 894949 895628 897021 898307 898664 898021 897307 897557 899128 901379 903450 904879 905629
695.9987I05737q22j893k893l144k607j572m29M65Q93R29P50L93m29H93485
$$ 905737 904915 903022 900129 896985 894378 892806 892377 892842 893735 894664 895414 895807 895378 893485
688.50024H89699n144m965l072m64J214Q22j322l965n608n536l822j536H56301
$$ 889699 884555 879590 876518 876054 877268 878090 876768 872803 867195 861659 857837 856301 856301
681.4991H55979k643n751p965q358p287o144o215p858j0752j4109j7002G43142
$$ 855979 853336 847585 839620 831262 823975 817831 811616 803758 793006 778897 761895 743142
675.0018G23496k0967k4504l0647l7327m1434m1256l7827l3112k7968D06630
$$ 723496 702529 678025 647378 610051 568617 527361 489534 456422 428454 406630
669.4995C93306k607R037J9502K7183L1826L4719L7077L8684L8363L5255F92420
$$ 393306 390699 399736 419238 446421 478247 512966 550043 588727 627090 662345 692420
663.5022G17388K1289J8860J6395J3180R645O786N073M036L000J750H18153
$$ 717388 738677 757537 773932 787112 796757 803543 808616 812652 815652 817402 818153
657.50104H18688O79O43j79j428k501k929k822k607k608k607k286j536G97935
$$ 818688 819367 820010 819831 818403 815902 812973 810151 807544 804936 802329 800043 798507 797935
650.4999G98007K14p1o43j500k787m036m536l858k536j536j750k822G68503
$$ 798007 798221 798150 797507 796007 793220 789184 784648 780790 778254 776718 774968 772146 768503
643.50146G65109k179j071j143k429m179n072m608l251k179k357l822G27390
$$ 765109 762930 761859 760716 758287 754108 749036 744428 741177 738998 736641 732819 727390
637.0003G21210n715m679l715l000k286j751j821k929m787o358o894F71096
$$ 721210 715495 710816 707101 704101 701815 700064 698243 695314 690527 684169 677275 671096
630.49915F66417l251k357k394l143m179m644m214l144k429k786m143F24303
$$ 666417 663166 660809 658415 655272 651093 646449 642235 639091 636662 633876 629733 624303
624.0007F18803m251k679j964k429l251l036j429P15J857J143j072l821E92585
$$ 618803 614552 611873 609909 607480 604229 601193 599764 600479 602336 603479 602407 598586 592585
616.9996E85727o180m143j536M28P15r65l536n751o358n215l143j322E47721
$$ 585727 579547 575404 573868 574296 575011 574046 570510 564759 558401 553186 550043 548721 547721
610.00226E45364m251n251m465k679j678k536m608o144n822m072k501D98643
$$ 545364 541113 535862 531397 528718 527040 524504 519896 513752 507930 503858 501357 498643
603.49994D94071o501o573m608j857k86r28l179n394o322o073n358m750D38205
$$ 494071 487570 480997 476389 474532 474246 473318 470139 464745 458423 452350 446992 442242 438205
596.4988D35384j322n36j107k786m144m322l429k893l322m358m786m144C94914
$$ 435384 434062 433526 432419 429633 425489 421167 417738 414845 411523 407165 402379 398235 394914
589.50037C91234n572p787q608p215m429j572K14R29J071N36p86l179C48943
$$ 391234 385662 377875 369267 362052 357623 356051 356265 357194 358265 358801 358015 354836 348943
582.4992C41442p216n393l251k107k429l715m929m894l072l57J429M64C02829
$$ 341442 334226 328833 325582 323475 321046 317331 312402 307508 304436 304079 305508 305972 302829
575.5019B95828q144o144l036j357j858k893k786j393l22j178l787o250B49964
$$ 295828 287684 281540 278504 277147 275289 272396 269610 268217 267895 266717 262930 256680 249964
568.4996B45321j500M64k50k965n143m930k964j786l001n465o215m072B06851
$$ 245321 243821 244285 244035 241070 235927 230997 228033 226247 223246 217781 211566 207494 206851
561.5023B08315O08k501n500o537n215k572j43M65j072l143m108m036A70239
$$ 208315 208923 206422 200922 194385 189170 186598 186455 186920 185848 182705 178597 174561 170239
554.5A65166m214j001J501j536Tk501l500A48057
$$ 165166 160952 159951 161452 159916 158380 155879 152379 148057
550A43020  $$checkpoint
##END=  $$ end of CHCl3
##TITLE= deuterochloroform
##JCAMP-DX= 5.01
##DATA TYPE= INFRARED SPECTRUM
##DATA CLASS= XYDATA
##BLOCK ID=8
##ORIGIN= Department of Chemistry, UWI, JAMAICA
##OWNER= public domain
##LONGDATE= 2012/02/20 19:49:53.0481 -0500 $$ export date from JSpecView
##$MODELS=
<Models>
<ModelData id="cdcl3" type="MOL">
CDCl3
RLDSViewer          3D                             0

  5  4  0  0  0  0  0  0  0  0999 V2000
    0.0000    0.0000    0.4971 C   0  0  0  0  0  0  0  0  0  1
    0.0000    0.0000    1.5871 H   0  0  0  0  0  0  0  0  0  2
    0.0000    1.6593   -0.0896 Cl  0  0  0  0  0  0  0  0  0  3
   -1.4370   -0.8297   -0.0896 Cl  0  0  0  0  0  0  0  0  0  4
    1.4370   -0.8297   -0.0896 Cl  0  0  0  0  0  0  0  0  0  5
  1  2  1  0  0  0
  1  3  1  0  0  0
  1  5  1  0  0  0
  1  4  1  0  0  0
M  END
</ModelData>
<ModelData id="4" type="XYZVIB" baseModel="cdcl3" vibrationScale=".2">
5
Model[1]: Convg=0.7033D-08;-V/T=2.0004;Energy=NaN;Range=M.O.s;E(RHF)=-1416.86840659 A.U.;PATH=Calculation 1;Input
C     0.00000    0.00000    0.00000
H     0.00000    0.00000    1.09000
Cl    1.65934    0.00000   -0.58667
Cl   -0.82967    1.43703   -0.58667
Cl   -0.82967   -1.43703   -0.58667
5
Model[2]: Convg=0.7033D-08;-V/T=2.0004;Energy=-1416.8685;Range=M.O.s;E(RHF)=-1416.86840659 A.U.;PATH=Calculation 1;Standard
C     0.00000    0.00000    0.49707
H     0.00000    0.00000    1.58707
Cl    0.00000    1.65934   -0.08960
Cl   -1.43703   -0.82967   -0.08960
Cl    1.43703   -0.82967   -0.08960
5
Model[3]: IRIntensity=0.3557 KM/Mole;ReducedMass=26.2449 AMU;ForceConstant=1.3644 mDyne/A;Frequency=297.0416 cm^-1;FrequencyLabel=E;PATH=Calculation 1;FrequenciesFrequencies
C     0.00000    0.00000    0.49707   -0.31000    0.00000    0.00000
H     0.00000    0.00000    1.58707   -0.44000    0.00000    0.00000
Cl    0.00000    1.65934   -0.08960    0.52000    0.00000    0.00000
Cl   -1.43703   -0.82967   -0.08960   -0.20000   -0.42000    0.03000
Cl    1.43703   -0.82967   -0.08960   -0.20000    0.42000   -0.03000
5
Model[4]: IRIntensity=0.3557 KM/Mole;ReducedMass=26.2449 AMU;ForceConstant=1.3644 mDyne/A;Frequency=297.0416 cm^-1;FrequencyLabel=E;PATH=Calculation 1;FrequenciesFrequencies
C     0.00000    0.00000    0.49707    0.00000    0.31000    0.00000
H     0.00000    0.00000    1.58707    0.00000    0.44000    0.00000
Cl    0.00000    1.65934   -0.08960    0.00000    0.44000    0.03000
Cl   -1.43703   -0.82967   -0.08960    0.42000   -0.28000   -0.02000
Cl    1.43703   -0.82967   -0.08960   -0.42000   -0.28000   -0.02000
5
Model[5]: IRIntensity=0.8827 KM/Mole;ReducedMass=20.8013 AMU;ForceConstant=2.0780 mDyne/A;Frequency=411.7711 cm^-1;FrequencyLabel=A1;PATH=Calculation 1;FrequenciesFrequencies
C     0.00000    0.00000    0.49707    0.00000    0.00000   -0.49000
H     0.00000    0.00000    1.58707    0.00000    0.00000   -0.50000
Cl    0.00000    1.65934   -0.08960    0.00000    0.41000    0.06000
Cl   -1.43703   -0.82967   -0.08960   -0.35000   -0.20000    0.06000
Cl    1.43703   -0.82967   -0.08960    0.35000   -0.20000    0.06000
5
Model[6]: IRIntensity=11.7197 KM/Mole;ReducedMass=8.0233 AMU;ForceConstant=2.6203 mDyne/A;Frequency=744.5117 cm^-1;FrequencyLabel=A1;PATH=Calculation 1;FrequenciesFrequencies
C     0.00000    0.00000    0.49707    0.00000    0.00000    0.67000
H     0.00000    0.00000    1.58707    0.00000    0.00000    0.70000
Cl    0.00000    1.65934   -0.08960    0.00000    0.11000   -0.08000
Cl   -1.43703   -0.82967   -0.08960   -0.10000   -0.06000   -0.08000
Cl    1.43703   -0.82967   -0.08960    0.10000   -0.06000   -0.08000
5
Model[7]: IRIntensity=150.8250 KM/Mole;ReducedMass=7.7939 AMU;ForceConstant=3.4807 mDyne/A;Frequency=870.6255 cm^-1;FrequencyLabel=E;PATH=Calculation 1;FrequenciesFrequencies
C     0.00000    0.00000    0.49707    0.00000    0.70000    0.00000
H     0.00000    0.00000    1.58707    0.00000    0.69000    0.00000
Cl    0.00000    1.65934   -0.08960    0.00000   -0.15000    0.07000
Cl   -1.43703   -0.82967   -0.08960   -0.06000   -0.05000   -0.03000
Cl    1.43703   -0.82967   -0.08960    0.06000   -0.05000   -0.03000
5
Model[8]: IRIntensity=150.8250 KM/Mole;ReducedMass=7.7939 AMU;ForceConstant=3.4807 mDyne/A;Frequency=870.6255 cm^-1;FrequencyLabel=E;PATH=Calculation 1;FrequenciesFrequencies
C     0.00000    0.00000    0.49707    0.70000    0.00000    0.00000
H     0.00000    0.00000    1.58707    0.69000    0.00000    0.00000
Cl    0.00000    1.65934   -0.08960   -0.02000    0.00000    0.00000
Cl   -1.43703   -0.82967   -0.08960   -0.12000   -0.06000   -0.06000
Cl    1.43703   -0.82967   -0.08960   -0.12000    0.06000    0.06000
5
Model[9]: IRIntensity=40.5189 KM/Mole;ReducedMass=1.1034 AMU;ForceConstant=1.3066 mDyne/A;Frequency=1417.6560 cm^-1;FrequencyLabel=E;PATH=Calculation 1;FrequenciesFrequencies
C     0.00000    0.00000    0.49707    0.00000   -0.09000    0.00000
H     0.00000    0.00000    1.58707    0.00000    1.00000    0.00000
Cl    0.00000    1.65934   -0.08960    0.00000    0.00000    0.01000
Cl   -1.43703   -0.82967   -0.08960    0.00000    0.00000   -0.01000
Cl    1.43703   -0.82967   -0.08960    0.00000    0.00000   -0.01000
5
Model[10]: IRIntensity=40.5189 KM/Mole;ReducedMass=1.1034 AMU;ForceConstant=1.3066 mDyne/A;Frequency=1417.6560 cm^-1;FrequencyLabel=E;PATH=Calculation 1;FrequenciesFrequencies
C     0.00000    0.00000    0.49707   -0.09000    0.00000    0.00000
H     0.00000    0.00000    1.58707    1.00000    0.00000    0.00000
Cl    0.00000    1.65934   -0.08960    0.00000    0.00000    0.00000
Cl   -1.43703   -0.82967   -0.08960    0.00000    0.00000   -0.01000
Cl    1.43703   -0.82967   -0.08960    0.00000    0.00000    0.01000
5
Model[11]: IRIntensity=0.0972 KM/Mole;ReducedMass=1.0897 AMU;ForceConstant=6.7234 mDyne/A;Frequency=3236.0024 cm^-1;FrequencyLabel=A1;PATH=Calculation 1;FrequenciesFrequencies
C     0.00000    0.00000    0.49707    0.00000    0.00000   -0.09000
H     0.00000    0.00000    1.58707    0.00000    0.00000    1.00000
Cl    0.00000    1.65934   -0.08960    0.00000    0.00000    0.00000
Cl   -1.43703   -0.82967   -0.08960    0.00000    0.00000    0.00000
Cl    1.43703   -0.82967   -0.08960    0.00000    0.00000    0.00000
</ModelData>
</Models>
##$PEAKS=
<Peaks type="IR" xUnitsExpected="1/cm"  >
<PeakData id="1" title="A1- C-D stretch (~2254 cm-1)" peakShape="broad" model="4.11" xMax="2285" xMin="2225"    />
<PeakData id="2" title="E- C-D bend (~915 cm-1)" peakShape="broad" model="4.10" xMax="935" xMin="895"    />
<PeakData id="3" title="E-asymm stretch of CCl group (~730 cm-1)" peakShape="broad" model="4.8" xMax="750" xMin="710"    />
<PeakData id="4" title="A1-symm stretch of CCl group (~650 cm-1)" peakShape="broad" model="4.6" xMax="670" xMin="630"    />
</Peaks>
##XUNITS= 1/CM
##YUNITS= TRANSMITTANCE
##XFACTOR= 1
##YFACTOR= 9.460440E-07
##FIRSTX= 3.561002E+03
##FIRSTY= 9.005449E-01
##LASTX= 550
##NPOINTS= 3012
##MINY= 3.546530E-02
##MAXY= 9.815093E-01
##XYDATA= (X++(Y..Y))
3561.0022I51906L3p78m22r7L3l89r8O6K59T%K27K59L89N84J61K59K28I53299
$$ 951906 951939 951161 950739 950642 950675 950286 950188 950254 950513 950772 950772 950999 951258 951647 952231 952392 952651 952879 953299
3540.9966I54110R7L24J94K27N51O16M21L56N84R08M20N51L89TN51j95I60980
$$ 954110 954207 954531 954725 954952 955503 956119 956540 956896 957480 958388 958808 959359 959748 960137 960688 960493 960980
3522.9966I61369K27J94k27L89M54K60R7N18L24N83M86J63j95R40Q75I66845
$$ 961369 961596 961790 961563 961952 962406 962666 962763 963281 963605 964188 964674 964837 964642 965582 966457 966845
3505.9988I67008M86M54O15L24R8K59O16L23o4K26N52L89L56O4J95M86I73100
$$ 967008 967494 967948 968563 968887 968985 969244 969860 970183 970119 970345 970897 971286 971642 971706 971901 972387 973100
3487.9993I73360J61l2N83P45r7M22K26O16L56l1L88j29O48J61J30N51I78512
$$ 973360 973521 973489 974072 974817 974720 975142 975368 975984 976340 976309 976697 976568 977216 977377 977507 978058 978512
3469.9995I78414J30N51M54L2L25O4R8L89M20J30K27J62M54J94l3o4K92I82887
$$ 978414 978544 979095 979549 979581 979906 979970 980068 980457 980877 981007 981234 981396 981850 982044 982011 981947 982239 982887
3451.0017I82757R7K27TM21k59J95K91L57K27r7n84L24K91j29j94R7L2I84118
$$ 982757 982854 983081 983308 983729 983470 983665 983956 984313 984540 984443 983859 984183 984474 984345 984151 984248 984280 984118
3432.002I83729J30K26j29m21L24L56j94j95k26o5L24N18l89O6K26K60I84702
$$ 983729 983859 984085 983956 983535 983859 984215 984021 983826 983600 983535 983859 984377 983988 984054 984280 984540 984702
3414.002I84702k28K60L57J29J30L89M53L3R7L89J94R8J61L25M85o4I87942
$$ 984702 984474 984734 985091 985220 985350 985739 986192 986225 986322 986711 986905 987003 987164 987489 987974 987910 987942
3396.0024I88071L58L89J61j61N18L2L57r8L3M21J94k26L24j62J62L2I90211
$$ 988071 988429 988818 988979 988818 989336 989368 989725 989627 989660 990081 990275 990049 990373 990211 990373 990405 990211
3377.9995I90114J94K26k91l2%K59%k27o5L3K92m54j63%Tl23k92J29j29I89141
$$ 990114 990308 990534 990243 990211 990211 990470 990470 990243 990178 990211 990503 990049 989886 989886 989886 989563 989271 989400 989271 989141
3356.998I88720r7Tk92l89Tl24K60p78k59m86l3l56n19l57l56K59p12I83470
$$ 988720 988623 988526 988234 987845 987456 987132 987392 986614 986355 985869 985836 985480 984961 984604 984248 984507 983795 983470
3338.002I83178M54l89m54R8K1407L2K65M63M95L97O5k31l63k31R9M62A006408
$$ 983178 983632 983243 982789 982887 1004294 1004326 1004591 1005054 1005549 1005946 1006011 1005780 1005417 1005186 1005285 1005747 1006408
3320.0042A006969J32l96p93q26n61r9K97M96M63K64O5o5j32Tj99j65A005219
$$ 1006969 1007101 1006705 1005912 1005086 1004525 1004426 1004723 1005219 1005682 1005946 1006011 1005946 1005814 1005682 1005483 1005318 1005219
3302.0044A005251K65M30N27L64O6k31n29o27m95k64O5L31M95TL97K31A006837
$$ 1005251 1005516 1005946 1006473 1006837 1006903 1006672 1006143 1005516 1005021 1004757 1004822 1005153 1005648 1006143 1006540 1006771 1006837
3284.0044A006804o6Tr9o6j32r9o6L3J65K64M29TM63K65O5j65l96l97A007036
$$ 1006804 1006738 1006672 1006573 1006507 1006375 1006276 1006210 1006243 1006408 1006672 1007101 1007530 1007993 1008258 1008323 1008158 1007762 1007365 1007036
3264.005A006870o6l3j32k31j98o7K32M95N95N28L30O7o7j65o5l4L4A008093
$$ 1006870 1006804 1006771 1006639 1006408 1006210 1006143 1006375 1006870 1007465 1007993 1008323 1008390 1008323 1008158 1008093 1008059 1008093 1008093
3245.0002A008059l3%J32K32K64J98R9%l3O6K31K64J33j33m63o26n95A007465
$$ 1008059 1008026 1008026 1008158 1008390 1008654 1008852 1008951 1008951 1008918 1008984 1009215 1009479 1009612 1009479 1009016 1008390 1007795 1007465
3226.0022A007564M62O28N94L64J65l3TO6J32J98K31J66J32R8L4l4l3A010669
$$ 1007564 1008026 1008654 1009248 1009612 1009777 1009744 1009711 1009777 1009909 1010107 1010338 1010504 1010636 1010734 1010768 1010734 1010701 1010669
3207.0027A010669J32J97K65J98J65J00J65J97K32J32j00k97l29j99R9A011956
$$ 1010669 1010801 1010998 1011263 1011461 1011626 1011726 1011891 1012088 1012320 1012452 1012352 1012055 1011726 1011527 1011626 1011956
3189.997A012352J99j32l96l97j32J98M96M95L64J31r8j65j99j65k31A011990
$$ 1012352 1012551 1012419 1012023 1011626 1011494 1011692 1012188 1012683 1013047 1013178 1013080 1012915 1012716 1012551 1012320 1011990
3172.997A011594m96o61q92j090j321j420j453j354j189r91q92q58r25I97094
$$ 1011594 1011098 1010437 1009545 1008455 1007134 1005714 1004261 1002907 1001718 1000727 999835 998977 998052 997094
3158.0024I96169p92m63o6L96Q26J222J486J685J750J586J354J090R25A008258
$$ 996169 995377 994914 994848 995244 996070 997292 998778 1000463 1002213 1003799 1005153 1006243 1007168 1008258
3143.002A009612J651J750J486Q92K32k64l64j32J99N27O95O26M31J97A017473
$$ 1009612 1011263 1013013 1014499 1015391 1015623 1015359 1014995 1014863 1015062 1015589 1016284 1016910 1017341 1017538 1017473
3127.0042A017209l64k97o7L64P60R90R58P26K98l4k97l63l30j98r9R9A019652
$$ 1017209 1016845 1016548 1016481 1016845 1017605 1018595 1019553 1020279 1020577 1020543 1020246 1019883 1019553 1019355 1019256 1019355 1019652
3108.9966A020049L96K31r9l63m96m29j32K31L96L30L3k64k97j32K64A020346
$$ 1020049 1020445 1020676 1020577 1020214 1019718 1019289 1019157 1019388 1019784 1020114 1020147 1019883 1019586 1019454 1019718 1020346
3092.0032A021139O27K97L3j32r9%L4o7j65k97k98j32L4J65J64J00%l3A021336
$$ 1021139 1021766 1022063 1022096 1021964 1021865 1021865 1021899 1021832 1021667 1021370 1021072 1020940 1020974 1021139 1021303 1021403 1021403 1021370 1021336
3072.0032A021436J98K65J97O6j31k65k64j32R8K98L30K32%j66k97k65A021436
$$ 1021436 1021634 1021899 1022096 1022162 1022031 1021766 1021502 1021370 1021468 1021766 1022096 1022328 1022328 1022162 1021865 1021600 1021436
3054.002A021436J64K99L62K97K32R9%Tl3j32k98m95n95m94j33K31N62A022063
$$ 1021436 1021600 1021899 1022261 1022558 1022790 1022889 1022889 1022889 1022856 1022724 1022426 1021931 1021336 1020842 1020709 1020940 1021502 1022063
3034.996A022328j00m29m63k30R8L96N29M96L30J65l3k31m30n27m96A021106
$$ 1022328 1022228 1021799 1021336 1021106 1021204 1021600 1022129 1022625 1022955 1023120 1023087 1022856 1022426 1021899 1021403 1021106
3017.9983A021139K97L63K32j00l96n29m63k30o7l2j99l95n63n61l96A017935
$$ 1021139 1021436 1021799 1022031 1021931 1021535 1021006 1020543 1020313 1020246 1020214 1020015 1019620 1019057 1018496 1018100 1017935
3000.9988A017868l3j97l64n28n95o27o28o27n95m96l30j32R9J98J65A013277
$$ 1017868 1017835 1017638 1017274 1016746 1016151 1015524 1014896 1014269 1013674 1013178 1012848 1012716 1012815 1013013 1013178 1013277
2983.9988A013212j99k30k32j32O6K98M62O60O28N29K30%j65To6J66K97A015755
$$ 1013212 1013013 1012783 1012551 1012419 1012485 1012783 1013245 1013905 1014533 1015062 1015292 1015292 1015127 1014962 1014896 1015062 1015359 1015755
2965.0007A016184L30J99%j99l63m30l30o5K30M63M62J32j97n63n61l30A015028
$$ 1016184 1016514 1016713 1016713 1016514 1016151 1015721 1015391 1015326 1015556 1016019 1016481 1016613 1016416 1015853 1015292 1014962 1015028
2947.003A015457O61N62K64j66m94q60j023j156j190j155j057r59q25A007365
$$ 1015457 1016118 1016680 1016944 1016778 1016284 1015424 1014401 1013245 1012055 1010900 1009843 1008884 1008059 1007365
2931.9973A006870l30j65l3l4o5j32j65j00L3K32L62M63N29N94O93O95A010173
$$ 1006870 1006540 1006375 1006342 1006308 1006243 1006111 1005946 1005846 1005879 1006111 1006473 1006936 1007465 1008059 1008752 1009447 1010173
2913.9993A010834O27N29M95L96K97O7j33l63m95m63l63o6K64N94Q60A014103
$$ 1010834 1011461 1011990 1012485 1012881 1013178 1013245 1013112 1012749 1012254 1011791 1011428 1011362 1011626 1012220 1013080 1014103
2897.0015A015160R58Q92Q58Q59TP60M96J32j32j99%L63O61TL62o5l64A021832
$$ 1015160 1016118 1017010 1017868 1018727 1019586 1020346 1020842 1020974 1020842 1020643 1020643 1021006 1021667 1022328 1022690 1022625 1022261 1021832
2878.0037A021667J98M63M62J98j66l96m95m29k98k64j98j99o5l3%j32A019949
$$ 1021667 1021865 1022328 1022790 1022988 1022822 1022426 1021931 1021502 1021204 1020940 1020742 1020543 1020478 1020445 1020445 1020313 1019949
2860.0037A019322o94n94l31j32l3j97l97n95m96j32L97R91J420J585A021600
$$ 1019322 1018628 1018034 1017703 1017571 1017538 1017341 1016944 1016349 1015853 1015721 1016118 1017109 1018529 1020114 1021600
2843.9995A022790P60M29K31J00R8J65J66J32O5l2j32k32k30l4K64O93A026291
$$ 1022790 1023550 1023979 1024210 1024310 1024408 1024573 1024739 1024871 1024936 1024904 1024772 1024540 1024310 1024276 1024540 1025233 1026291
2826.0034A027480R91M95j32n62o93m96j32J99L62J99j32m29n95m62j65A026158
$$ 1027480 1028471 1028966 1028834 1028272 1027579 1027083 1026951 1027150 1027512 1027711 1027579 1027150 1026555 1026093 1025928 1026158
2808.996A026687N95L96R9k31l31k64L3K98M29L30O7j65l64Tl29j99A026654
$$ 1026687 1027282 1027678 1027777 1027546 1027215 1026951 1026984 1027282 1027711 1028041 1028108 1027943 1027579 1027215 1026886 1026687 1026654
2790.998A026786K32L30TJ98%j98k31o7J66L97L62J00l30o95q91o93A025465
$$ 1026786 1027018 1027348 1027678 1027876 1027876 1027678 1027447 1027380 1027546 1027943 1028305 1028405 1028075 1027380 1026489 1025796 1025465
2772.9985A025564N29P26P27N62K97l3k64l31k31%K97M96M62K64l3k31A028471
$$ 1025564 1026093 1026819 1027546 1028108 1028405 1028372 1028108 1027777 1027546 1027546 1027843 1028339 1028801 1029065 1029032 1028801 1028471
2754.9973A028207j32j00j32r9l3J32K65K97J64r8l63m30k64%K64L63A028339
$$ 1028207 1028075 1027975 1027843 1027744 1027711 1027843 1028108 1028405 1028569 1028471 1028108 1027678 1027414 1027414 1027678 1028041 1028339
2736.9973A028537O6L3%o7j97l64l96k97l3K97M96M29K64o6k97l30j99A027876
$$ 1028537 1028603 1028636 1028636 1028569 1028372 1028008 1027612 1027315 1027282 1027579 1028075 1028504 1028768 1028702 1028405 1028075 1027876 1027876
2717.9976A028075J97J00o7k64k97j98O6L31N28N94N62L63J98%r8j33A029791
$$ 1028075 1028272 1028372 1028305 1028041 1027744 1027546 1027612 1027943 1028471 1029065 1029627 1029990 1030188 1030188 1030090 1029957 1029791
2699.9963A029659r8r9j32j00r9o6L3R9J33J32TJ97J99K64K97J99L3j32A030354
$$ 1029659 1029561 1029462 1029330 1029230 1029131 1029065 1029098 1029197 1029330 1029462 1029594 1029791 1029990 1030254 1030551 1030750 1030783 1030651 1030354
2679.9985A029990k31o6J32K65K97K64J97J00O6o6j00j64j65l3J32K97A031212
$$ 1029990 1029759 1029693 1029825 1030090 1030387 1030651 1030848 1030948 1031014 1030948 1030848 1030684 1030519 1030486 1030618 1030915 1031212
2661.9988A031344r9l30m29l64o6J66L96M29L97K97J64L3o5j32j33r9A031576
$$ 1031344 1031245 1030915 1030486 1030122 1030056 1030222 1030618 1031047 1031444 1031741 1031905 1031938 1031873 1031741 1031608 1031509 1031576
2643.9993A031806L31K64J00o7k31k65j97j65j00r9o6L3J98K98L63K98A032599
$$ 1031806 1032137 1032401 1032501 1032434 1032203 1031938 1031741 1031576 1031476 1031377 1031311 1031344 1031542 1031840 1032203 1032501 1032599
2625.9993A032501j99k97Tk98k65j64%K31L96M62K65%k65m62l63j32R9A031509
$$ 1032501 1032302 1032005 1031708 1031410 1031145 1030981 1030981 1031212 1031608 1032070 1032335 1032335 1032070 1031608 1031245 1031113 1031212 1031509
2606.998A031773J99R8L4%l4j32l30m95n94n29k97l4K65L30K97J99J32A031047
$$ 1031773 1031972 1032070 1032104 1032104 1032070 1031938 1031608 1031113 1030519 1029990 1029693 1029659 1029924 1030254 1030551 1030750 1030882 1031047
2588.A031377L96L64J32j32l96m96l30r9J32J97O7r9k97l30k32o6A030222
$$ 1031377 1031773 1032137 1032269 1032137 1031741 1031245 1030915 1030816 1030948 1031145 1031212 1031113 1030816 1030486 1030254 1030188 1030222
2569.997A030222o7r9Tl3Uj65k98k97j98O6K97L96L31J32r9j98k64j32A029429
$$ 1030222 1030155 1030056 1029957 1029924 1029891 1029858 1029693 1029395 1029098 1028900 1028966 1029263 1029659 1029990 1030122 1030023 1029825 1029561 1029429 1029429
2549.0051A029527J32O7%j32k32k64k31o6J32K32K97J32l3k64l64l96A028272
$$ 1029527 1029659 1029726 1029726 1029594 1029362 1029098 1028867 1028801 1028933 1029165 1029462 1029594 1029561 1029297 1028933 1028537 1028272
2530.9978A028041j98Tj65o6J65M29N95N62L62l3l63n62o26m96k64j00A027183
$$ 1028041 1027843 1027645 1027480 1027414 1027579 1028008 1028603 1029165 1029527 1029494 1029131 1028569 1027943 1027447 1027183 1027083 1027183
2512.9978A027414L30L64L29K32O6l3j33l2O6J65K64K98K64TK32J32%A030122
$$ 1027414 1027744 1028108 1028437 1028669 1028735 1028702 1028569 1028537 1028603 1028768 1029032 1029330 1029594 1029858 1030090 1030222 1030222 1030122
2493.9983A029858k64Tj00O7J32O5l2j99k31Tr9J32K64L31K30L4j99k64A028999
$$ 1029858 1029594 1029330 1029230 1029297 1029429 1029494 1029462 1029263 1029032 1028801 1028702 1028834 1029098 1029429 1029659 1029693 1029494 1029230 1028999
2474.0002A029032K65L96L30O7j66l30k64l3J65K64J65o6k98l30k31L3A029263
$$ 1029032 1029297 1029693 1030023 1030090 1029924 1029594 1029330 1029297 1029462 1029726 1029891 1029825 1029527 1029197 1028966 1028999 1029263
2456.0024A029726M62L63J65o5k64l64Tk30L3K64M29N29M61L31J32o6A031311
$$ 1029726 1030188 1030551 1030716 1030651 1030387 1030023 1029659 1029429 1029462 1029726 1030155 1030684 1031145 1031476 1031608 1031542 1031311
2438.0046A030981l63k31l3K64M95N28M29J00j98m30l97k63l4J33J64A031278
$$ 1030981 1030618 1030387 1030354 1030618 1031113 1031641 1032070 1032170 1031972 1031542 1031145 1030882 1030848 1030981 1031145 1031278
2421.005A031410J32J99J97J66O6l3o7L4J65K32J97L3j65l30m30m29A031080
$$ 1031410 1031542 1031741 1031938 1032104 1032170 1032137 1032070 1032104 1032269 1032501 1032698 1032731 1032566 1032236 1031806 1031377 1031080
2402.9976A030882l4L4J65TJ98J66J32R8L4o7j97k98k97j65o6l4k64o93A028603
$$ 1030882 1030848 1030882 1031047 1031212 1031410 1031576 1031708 1031806 1031840 1031773 1031576 1031278 1030981 1030816 1030750 1030716 1030452 1029759 1028603
2382.9976A026984j883j948j982k047k147k213k180k047j883j916k113A002114
$$ 1026984 1025101 1023153 1021171 1019124 1016977 1014764 1012584 1010537 1008654 1006738 1004625 1002114
2369.9988I99307k841k444j817j156p26o61p93j023j057p60j97N94J486I90356
$$ 999307 996466 994022 992205 991049 990323 989662 988869 987846 986789 986029 985832 986426 987912 990356
2354.9983I93758M095M393L964K774R57r25k543l368l369k774k015j321I92701
$$ 993758 997853 1002246 1006210 1008984 1009941 1009016 1006473 1003105 999736 996962 994947 993626 992701
2341.0037I92008l64O6N95R90J057O94J66l31m96k30M29J155J685J783A000595
$$ 992008 991644 991710 992305 993295 994352 995046 995212 994881 994385 994155 994584 995739 997424 999207 1000595
2324.9998A001388J98j33%L97R57J289J354J057O94L96K31J65J32L3l3A008093
$$ 1001388 1001586 1001453 1001453 1001850 1002807 1004096 1005450 1006507 1007201 1007597 1007828 1007993 1008125 1008158 1008125 1008093
2308.002A008258N28Q58R92Q25M95R9j32TO7J65J97l2l30n95o61m95A009876
$$ 1008258 1008786 1009644 1010636 1011461 1011956 1012055 1011923 1011791 1011858 1012023 1012220 1012188 1011858 1011263 1010602 1010107 1009876
2289.9995A009909J32R9r9k64m62n63p26q92j123j254j354j256j156r91I98977
$$ 1009909 1010041 1010140 1010041 1009777 1009315 1008752 1008026 1007134 1006011 1004757 1003403 1002147 1000991 1000000 998977
2273.9995I97754j552j949k345k675k907l038l270l666m228m921n846I54256
$$ 997754 996202 994253 991908 989233 986326 983288 980018 976352 972124 967203 961357 954256
2261.0024I45008j2485j6943k1634k4970k4804j9651r447M062J7638K8008H97678
$$ 945008 932523 915580 893946 868976 844172 824521 815074 819136 836774 864782 897678
2248.9976I29616K6721J9619J2913P894M790L104K213J784J618J751K047A016217
$$ 929616 956337 975956 988869 996763 1001553 1004657 1006870 1008654 1010272 1012023 1014070 1016217
2236.003A018264J553R25L30l3r9L4K30L31M29L96L30K32K31K65K97A024012
$$ 1018264 1019817 1020742 1021072 1021039 1020940 1020974 1021204 1021535 1021964 1022360 1022690 1022922 1023153 1023418 1023715 1024012
2218.9966A024243R9%o6%R9K64K97L31K31J66R8R9O7l4l3r9o6%L3J32A026026
$$ 1024243 1024342 1024342 1024276 1024276 1024375 1024639 1024936 1025267 1025498 1025664 1025762 1025861 1025928 1025894 1025861 1025762 1025696 1025696 1025729 1025861 1026026
2196.997A026357L97M61M30K64l3k64l97l96k64j32%O6J32R9J66J65A027215
$$ 1026357 1026754 1027215 1027645 1027909 1027876 1027612 1027215 1026819 1026555 1026423 1026423 1026489 1026621 1026720 1026886 1027051 1027215
2178.997A027414K97L97M95N62N28L30O7j33k64k31j00O7J98K31K32A030254
$$ 1027414 1027711 1028108 1028603 1029165 1029693 1030023 1030090 1029957 1029693 1029462 1029362 1029429 1029627 1029858 1030090 1030254
2162.0051A030320L4l4%L4R8R9J65J32J00L3o6r9j00o5O5J66J98TR9L3A031410
$$ 1030320 1030354 1030320 1030320 1030354 1030452 1030551 1030716 1030848 1030948 1030981 1030915 1030816 1030716 1030651 1030716 1030882 1031080 1031278 1031377 1031410 1031410
2140.0022A031509K32L29L64K31J00l4r8o7o5j00k31l64l62k99o5J65A031542
$$ 1031509 1031741 1032070 1032434 1032665 1032765 1032731 1032633 1032566 1032501 1032401 1032170 1031806 1031444 1031145 1031080 1031245 1031542
2122.0027A031905L64K32J97J32J00%j00j97k32k31o6R9K31K97J66l4A032599
$$ 1031905 1032269 1032501 1032698 1032830 1032930 1032930 1032830 1032633 1032401 1032170 1032104 1032203 1032434 1032731 1032897 1032863 1032599
2104.0046A032137m63k30J32M29N94N28K65o6l31m62l63j98O6K97M63A033227
$$ 1032137 1031674 1031444 1031576 1032005 1032599 1033127 1033392 1033326 1032995 1032533 1032170 1031972 1032038 1032335 1032798 1033227
2087.0046A033590J33l4k31k64Tj65o7L3L4%o7o5j00r9j32j98k64k98A031278
$$ 1033590 1033723 1033689 1033458 1033194 1032930 1032765 1032698 1032731 1032765 1032765 1032698 1032633 1032533 1032434 1032302 1032104 1031840 1031542 1031278
2067.0034A031179O6K31K65K64J65J32R9J65TJ66%j32k32k31j98o6Tr9A031708
$$ 1031179 1031245 1031476 1031741 1032005 1032170 1032302 1032401 1032566 1032731 1032897 1032897 1032765 1032533 1032302 1032104 1032038 1031972 1031873 1031708
2047.0021A031509o5J64K65K64O6k98n94o60n29j32K97O28O93N29J98A032170
$$ 1031509 1031444 1031608 1031873 1032137 1032203 1031905 1031311 1030651 1030122 1029990 1030287 1030915 1031608 1032137 1032335 1032170
2030.0024A031773n28m29k32%J66K31R9l3r9j00L4J65K31J66L2o6j32A031212
$$ 1031773 1031245 1030816 1030584 1030584 1030750 1030981 1031080 1031047 1030948 1030848 1030882 1031047 1031278 1031444 1031476 1031410 1031278 1031212
2011.0029A031278J66K30J32l3j97k98l63l31k64Tk65k97l29l64k32%A028834
$$ 1031278 1031444 1031674 1031806 1031773 1031576 1031278 1030915 1030584 1030320 1030056 1029791 1029494 1029165 1028801 1028569 1028569 1028834
1992.9965A029297N61M96K64O6l3o7o5%L2%l2l3o7o5j32j00l2O5J32J00A030387
$$ 1029297 1029858 1030354 1030618 1030684 1030651 1030584 1030519 1030519 1030551 1030551 1030519 1030486 1030419 1030354 1030222 1030122 1030090 1030155 1030287 1030387 1030387
1970.9965A030222j99l3K64N94O61M96R9l31n61Tl31%K31L64L30K31J32A031674
$$ 1030222 1030023 1029990 1030254 1030848 1031509 1032005 1032104 1031773 1031212 1030651 1030320 1030320 1030551 1030915 1031245 1031476 1031608 1031674
1951.997A031708%j00k31l63l96l31o5K97N61O28M29O6l30m96m62k64A030651
$$ 1031708 1031708 1031608 1031377 1031014 1030618 1030287 1030222 1030519 1031080 1031708 1032137 1032203 1031873 1031377 1030915 1030651 1030651
1933.9973A030848K32K31J33L2o6j32j65j32l3%Tj00j64j65l3J65K97A031245
$$ 1030848 1031080 1031311 1031444 1031476 1031410 1031278 1031113 1030981 1030948 1030948 1030948 1030848 1030684 1030519 1030486 1030651 1030948 1031245
1914.9977A031278k31m29l96j66J32L96M63L97K30O7L2l2o7j32j98k31A030948
$$ 1031278 1031047 1030618 1030222 1030056 1030188 1030584 1031047 1031444 1031674 1031741 1031773 1031741 1031674 1031542 1031344 1031113 1030948
1896.9965A030882l4l2j32j33l2J65L63M62L96J65r8j66j32%R9J32O7A032038
$$ 1030882 1030848 1030816 1030684 1030551 1030519 1030684 1031047 1031509 1031905 1032070 1031972 1031806 1031674 1031674 1031773 1031905 1031972 1032038
1877.9985A032104O6l3l31o93q26n28J32Q59J387J321P93R8m62o27n29A032401
$$ 1032104 1032170 1032137 1031806 1031113 1030287 1029759 1029891 1030750 1032137 1033458 1034251 1034349 1033887 1033260 1032731 1032401
1860.9985A032104l31m29l96k64o6O6Ul3j65m30p59r58q59k97M96J122A030188
$$ 1032104 1031773 1031344 1030948 1030684 1030618 1030684 1030750 1030816 1030783 1030618 1030188 1029429 1028471 1027612 1027315 1027811 1028933 1030188
1842.0006A030948j65r58j321j189r58q25r59j123j090o93j32J65O6k98A020709
$$ 1030948 1030783 1029825 1028504 1027315 1026357 1025532 1024573 1023450 1022360 1021667 1021535 1021700 1021766 1021468 1020709
1826.0044A019817o93m29l31n29q58r25p60k97R9J98R9l2O5M29Q60J122A018793
$$ 1019817 1019124 1018695 1018364 1017835 1016977 1016052 1015292 1014995 1015094 1015292 1015391 1015359 1015424 1015853 1016713 1017835 1018793
1807.9971A019256j65o61r24q93o27k98r9k97r25j849k741l105k477r91A004063
$$ 1019256 1019091 1018430 1017506 1016613 1015986 1015688 1015589 1015292 1014367 1012518 1009777 1006672 1004195 1003204 1004063
1791.9982A006473L171L007K279J551J157J155J289J386J354J256J155A026258
$$ 1006473 1009644 1012651 1014930 1016481 1017638 1018793 1020082 1021468 1022822 1024078 1025233 1026258
1778.996A026918l2q26j355j222l63R25K081K477J948P27n62j453j552A026687
$$ 1026918 1026886 1026060 1024705 1023483 1023120 1024045 1026126 1028603 1030551 1031278 1030716 1029263 1027711 1026687
1764.0032A026456L96O60O28M29J99O6j65n94j057j486j421q26K32J320A026754
$$ 1026456 1026852 1027512 1028140 1028569 1028768 1028834 1028669 1028075 1027018 1025532 1024111 1023285 1023517 1024837 1026754
1748.0032A028405O93o27j553j750j222k64L63K97m63j419j917j519k97A019982
$$ 1028405 1029098 1028471 1026918 1025168 1023946 1023682 1024045 1024342 1023879 1022460 1020543 1019024 1018727 1019982
1733.0026A022261K312J453J66o94q59l63K64N29%q91j818k146j718n61A018727
$$ 1022261 1024573 1026026 1026192 1025498 1024639 1024276 1024540 1025069 1025069 1024178 1022360 1020214 1018496 1017935 1018727
1717.0004A020709K576K345J421L2j222j783j486l96O60J023J66j585A019057
$$ 1020709 1023285 1025630 1027051 1027083 1025861 1024078 1022592 1022196 1022856 1023879 1024045 1022460 1019057
1703.0015A014797l468j222J453L402L963L106J584L64o6J32K97j32j321A020181
$$ 1014797 1011329 1010107 1011560 1014962 1018925 1022031 1023615 1023979 1023913 1024045 1024342 1024210 1022889 1020181
1688.001A016878k544m61K014L798L832K147m63k643l501k807j156L97A016581
$$ 1016878 1014334 1013873 1015887 1019685 1023517 1025664 1025201 1022558 1019057 1016250 1015094 1015491 1016581
1673.997A017307j65r25r58m62K31M63L3p60j322j188l63O60R91J65A011956
$$ 1017307 1017142 1016217 1015259 1014797 1015028 1015491 1015524 1014764 1013442 1012254 1011891 1012551 1013542 1013707 1011956
1657.9982A008191m788m096j751J189L336L633K180j65k015k477j420A002180
$$ 1008191 1003403 999307 997556 998745 1002081 1005714 1007894 1007729 1005714 1003237 1001817 1002180
1644.9982A004029K082J090p28k311l038k544j057P59K114K610K113R59A005747
$$ 1004029 1006111 1007201 1006473 1004162 1001124 998580 997523 998282 1000396 1003006 1005119 1006078 1005747
1630.9976A004525j519j222o94o6L64O93P93N61o6r25j618j751j090J00I99241
$$ 1004525 1003006 1001784 1001090 1001024 1001388 1002081 1002874 1003435 1003369 1002444 1000826 999075 997985 998085 999241
1615.0048A000661P60m30j486j883j619j056p92r25j354j619j388q91I87615
$$ 1000661 1001421 1000991 999505 997622 996003 994947 994155 993230 991876 990257 988869 987978 987615
1600.9974I87483j00j32%K97N62N28K31j32l29k65o6J66K97M94P28J057I92041
$$ 987483 987383 987251 987251 987548 988110 988638 988869 988737 988408 988143 988077 988243 988540 989034 989762 990819 992041
1583.0046I93031J99p28j386j222k97J057K147K608K180J288L97O5L97A000859
$$ 993031 993230 992502 991116 989894 989597 990654 992801 995409 997589 998877 999274 999339 999736 1000859
1568.0042A002510J487L29j320k742k972j618R24L534N119M922L303J155A014103
$$ 1002510 1003997 1004326 1003006 1000264 997292 995674 996598 1000132 1005251 1010173 1013476 1014631 1014103
1554.0042A013080n29L97J057J287R92L29l63j056j321p93N94K576M261A025233
$$ 1013080 1012551 1012948 1014005 1015292 1016284 1016613 1016250 1015194 1013873 1013080 1013674 1016250 1020511 1025233
1539.0035A028669R25j718l237l071j619J00J057Q91O6p27r57o27L2N62A021238
$$ 1028669 1029594 1027876 1024639 1021568 1019949 1020049 1021106 1021997 1022063 1021336 1020379 1019752 1019784 1020346 1021238
1522.9979A022228J025Q91N61L4m63o94n61l31l62p60j421j684j189J32A019091
$$ 1022228 1023253 1024144 1024705 1024739 1024276 1023582 1023021 1022690 1022328 1021568 1020147 1018463 1017274 1017406 1019091
1506.999A021766K444J090q59k510l303k972j883o61J65L31k64j256A009843
$$ 1021766 1024210 1025300 1024441 1021931 1018628 1015656 1013773 1013112 1013277 1013608 1013344 1012088 1009843
1492.9985A006936k873k279j420p27m95q92j519k147k379k279k114k047I83453
$$ 1006936 1004063 1001784 1000364 999637 999142 998250 996731 994584 992205 989926 987812 985765 983453
1478.9962I80711l038k906k180j090O6Q92J023N28l29r91Tk97Q92K015I76682
$$ 980711 977673 974767 972587 971497 971563 972455 973478 974006 973677 972686 971695 971398 972290 974305 976682
1463.0034I78532Q25l3l2J023K742M161M624L864K312P60o5l4N62J188A001916
$$ 978532 979357 979324 979292 980315 983057 987218 991842 995706 998018 998778 998713 998679 999241 1000429 1001916
1447.0034A003336J222J090J057R91P59M29J00O6J98N29P27O93N29L29A012254
$$ 1003336 1004558 1005648 1006705 1007696 1008455 1008884 1008984 1009050 1009248 1009777 1010504 1011197 1011726 1012055 1012254
1430.9961A012452J65L4j33l63m96o61q91j057j024n61K64J155J718J652A013245
$$ 1012452 1012617 1012651 1012518 1012155 1011659 1010998 1010107 1009050 1008026 1007465 1007729 1008884 1010602 1012254 1013245
1414.9999A013212p93j124q58m62l4O7l3k31l97n95p91j157j651k181A000264
$$ 1013212 1012419 1011295 1010437 1009975 1009941 1010008 1009975 1009744 1009347 1008752 1007961 1006804 1005153 1002972 1000264
1399.0011I97292k972k676k279j882j685j751k114k509k808k742k476I69350
$$ 997292 994320 991644 989365 987483 985798 984047 981933 979424 976616 973874 971398 969350
1386.0005I67797j189q91n95k64J32N95J155J817K544L236L699L799L600I88638
$$ 967797 966608 965717 965122 964858 964990 965585 966740 968557 971101 974337 978036 981835 985435 988638
1371.0017I91380K378K015J750J454J254J322J585J948K180K015J585A011858
$$ 991380 993758 995773 997523 998977 1000231 1001553 1003138 1005086 1007266 1009281 1010866 1011858
1358.0017A012419N29Q25J157J287J057N61J00j32o7K64M96N61L97J66A019685
$$ 1012419 1012948 1013773 1014930 1016217 1017274 1017835 1017935 1017803 1017736 1018000 1018496 1019057 1019454 1019620 1019685
1341.9977A019917O26J057J355J321R57M96J00j00o5R8K32K31J32r9k97A025498
$$ 1019917 1020543 1021600 1022955 1024276 1025233 1025729 1025829 1025729 1025664 1025762 1025994 1026225 1026357 1026258 1025961 1025498
1324.9998A025003l64j64J32K97L96K97J32l3r9l3O6J66J65%j32k97m31A024705
$$ 1025003 1024639 1024475 1024607 1024904 1025300 1025597 1025729 1025696 1025597 1025564 1025630 1025796 1025961 1025961 1025829 1025532 1025101 1024705
1306.002A024310l31k97l64m29n61n62l96o7L64O27O61M95J65r8r9J32A024012
$$ 1024310 1023979 1023682 1023318 1022889 1022328 1021766 1021370 1021303 1021667 1022294 1022955 1023450 1023615 1023517 1023418 1023550 1024012
1288.0006A024739P26M96R9j99k97k31o6O6J65O6%o6r9j32Uj99j97k65A024144
$$ 1024739 1025465 1025961 1026060 1025861 1025564 1025333 1025267 1025333 1025498 1025564 1025564 1025498 1025399 1025267 1025135 1025003 1024804 1024607 1024342 1024144
1267.001A024045R9L31M94N63N28K97R9j32j66j32o5o7r8k32l31l29A024607
$$ 1024045 1024144 1024475 1024969 1025532 1026060 1026357 1026456 1026324 1026158 1026026 1025961 1025894 1025796 1025564 1025233 1024904 1024607
1249.0013A024375j32%K32M61O94P60O93L97R9o7l2J65L63M96M29L64A029594
$$ 1024375 1024243 1024243 1024475 1024936 1025630 1026390 1027083 1027480 1027579 1027512 1027480 1027645 1028008 1028504 1028933 1029297 1029594
1231.0013A029891K31O6j65m29n95m30r8J98K31l3n62r90j157p92j33A025796
$$ 1029891 1030122 1030188 1030023 1029594 1028999 1028569 1028471 1028669 1028900 1028867 1028305 1027315 1026158 1025366 1025233 1025796
1214.0052A026852J156Q92M30o7k97k64o6K64M30N28L96K65O5o5o7r8A030222
$$ 1026852 1028008 1028900 1029330 1029263 1028966 1028702 1028636 1028900 1029330 1029858 1030254 1030519 1030584 1030519 1030452 1030354 1030222
1195.9961A030122j32r9l3R9J65K32J97J00j32l31n61p60p59o61m96l63A026225
$$ 1030122 1029990 1029891 1029858 1029957 1030122 1030354 1030551 1030651 1030519 1030188 1029627 1028867 1028108 1027447 1026951 1026588 1026225
1178.0017A025630r58j287j520j454j188p60m29j32l4o5j00o5J32L62A018760
$$ 1025630 1024672 1023385 1021865 1020411 1019223 1018463 1018034 1017902 1017868 1017803 1017703 1017638 1017770 1018132 1018760
1161.996A019520P59O28M29K64K32L30N28Q27R90J025Q58N28O6l30n28A025630
$$ 1019520 1020279 1020907 1021336 1021600 1021832 1022162 1022690 1023517 1024507 1025532 1026390 1026918 1026984 1026654 1026126 1025630
1145.0015A025399J65N29O61M29L2n28r25j090j023p93n95n61o94q92A019024
$$ 1025399 1025564 1026093 1026754 1027183 1027215 1026687 1025762 1024672 1023649 1022856 1022261 1021700 1021006 1020114 1019024
1129.0015A017868j090r57r25Tr91r57q26n28j65R8R9j64n96j023j321A006210
$$ 1017868 1016778 1015821 1014896 1013971 1012980 1012023 1011197 1010669 1010504 1010602 1010701 1010537 1009941 1008918 1007597 1006210
1111.9976A004855j255j321j453j684j982k147k279k312k246k180j982I82330
$$ 1004855 1003600 1002279 1000826 999142 997160 995013 992734 990422 988176 985996 984014 982330
1098.997I81141n95O7O27J024J222J321J454J717K113K445K708K741A000561
$$ 981141 980546 980613 981240 982264 983486 984807 986261 987978 990091 992536 995244 997985 1000561
1084.9982A003006K312TK345K213J982J618J321J057Q91O28K97l3k64A019421
$$ 1003006 1005318 1007630 1009975 1012188 1014170 1015788 1017109 1018166 1019057 1019685 1019982 1019949 1019685 1019421
1069.9985A019487M62P93Q26N94J98r9j32%J65J99L2j97l97m63l29l3A021303
$$ 1019487 1019949 1020742 1021568 1022162 1022360 1022261 1022129 1022129 1022294 1022493 1022525 1022328 1021931 1021468 1021139 1021106 1021303
1052.0006A021600J99j32m96q58r58q26l97L4M29N29M29J32r9j32L3L30A020411
$$ 1021600 1021799 1021667 1021171 1020313 1019355 1018529 1018132 1018166 1018595 1019124 1019553 1019685 1019586 1019454 1019487 1019817 1020411
1034.0006A021139O93M96L30J98J65J98J66R8o5k32k97Tj32%O5L3r8j99A022063
$$ 1021139 1021832 1022328 1022658 1022856 1023021 1023219 1023385 1023483 1023418 1023186 1022889 1022592 1022460 1022460 1022525 1022558 1022460 1022261 1022063
1013.9976A021964L3O6To6j98k31Tk64k97m31n94o28o26n29m29m63o61A015589
$$ 1021964 1021997 1022063 1022129 1022063 1021865 1021634 1021403 1021139 1020842 1020411 1019817 1019189 1018563 1018034 1017605 1017142 1016481 1015589
995.0032A014499j155j090q26m95o7K32M29N61M63L97L62M30O61Q91A016284
$$ 1014499 1013344 1012254 1011428 1010933 1010866 1011098 1011527 1012088 1012551 1012948 1013310 1013740 1014401 1015292 1016284
979.00525A017109M62%l96o27o28n61m96n61o61p26p93q92r91j223j486A005747
$$ 1017109 1017571 1017571 1017175 1016548 1015920 1015359 1014863 1014302 1013641 1012915 1012122 1011230 1010239 1009016 1007530 1005747
961.99695A003865j883j718j651Tj850k213k642l039l269l370l401l402I70241
$$ 1003865 1001982 1000264 998613 996962 995112 992899 990257 987218 983949 980579 977178 973776 970241
947.9981I66576l865m194m525n120n812o607p365p927q323q752r545H83675
$$ 966576 962711 958517 953992 948872 943060 936453 929088 921161 912838 904086 894541 883675
935.00433H71091j4533j6415j8298k0378k3054k6423l0584l5406m0889E97814
$$ 871091 856558 840143 821845 801467 778413 751990 721406 686000 645111 597814
923.99945E42954o3118p0813p5932p6163p0317n8725m3499k7744j4300C7488
$$ 542954 479836 409023 333091 256928 186611 127886 84387 56643 42343 37488
912.99945C7785K147K146J519P60J00p28j618k047j222K147Q817J8959A00539
$$ 37785 39932 42078 43597 44357 44457 43729 42111 40064 38842 40989 49806 68765 100539
899.0023A45986N7667O6420P0351O9425O4471N6942M8485M0493L3755F82829
$$ 145986 203653 270073 340424 409849 474320 531262 579747 620240 653995 682829
887.9991G08326K3550K2459K1766K1270K0643J9949J9025J7703J5919I04350
$$ 708326 731876 754335 776101 797371 818014 837963 856988 874691 890610 904350
877.00195I15976R909Q950Q687Q620Q225P199N516L732K378J784J949I85468
$$ 915976 925885 934835 943522 952142 960367 967566 973082 976814 979192 980976 982925 985468
864.0031I88572L469L533L403L137K873K511K146J916J850K047K313A020214
$$ 988572 992041 995574 998977 1002114 1004987 1007498 1009644 1011560 1013410 1015457 1017770 1020214
850.99915A022525J850J321Q92P60R57J354J718J883J717J189N29r9m96A035638
$$ 1022525 1024375 1025696 1026588 1027348 1028305 1029659 1031377 1033260 1034977 1036166 1036695 1036596 1036100 1035638
835.99915A035571M30P27N95J65l97p27p26l97o5J32l4j97l31j98L3J65A034746
$$ 1035571 1036001 1036728 1037323 1037488 1037091 1036364 1035638 1035241 1035176 1035308 1035274 1035077 1034746 1034548 1034581 1034746 1034746
818.0029A034284j057j519j751j652j387j057o60l64j32j65o27j321A020379
$$ 1034284 1033227 1031708 1029957 1028305 1026918 1025861 1025201 1024837 1024705 1024540 1023913 1022592 1020379
804.0024A017506l105k907k478k047j915j949k180k411k676k939l270I85996
$$ 1017506 1014401 1011494 1009016 1006969 1005054 1003105 1000925 998514 995838 992899 989629 985996
791.00354I82132l997m062m161m493m920n351n615n714Tn846o176o705I12112
$$ 982132 978135 974073 969912 965419 960499 955148 949533 943819 938105 932259 926083 919378 912112
776.99866I04350q158q819r710j1065j2517j3872j5061j6118j7240j8760G52519
$$ 904350 896192 887373 877663 866598 854081 840209 825148 809030 791790 773030 752519
765.0049G30126k4243k5994k8041l0816l4713l9600m5051n0335n4629C39432
$$ 730126 705883 679889 651848 621032 586319 546719 501668 451333 396704 339432
754.0049B81633n5785n1194m3994l4911k4969j5656q223l369j157p60D0526
$$ 281633 225848 174654 130660 95749 70780 55124 46901 43532 42375 41615 40526
742.00433C9238r25r9O61J024Q25L63r8j99j00O7R9j32l31j64N61J882D6273
$$ 39238 38313 38214 38875 39899 40724 41087 40989 40790 40690 40757 40856 40724 40393 40229 40790 42672 46273
724.0038E1855P860J0602J4202J8628K3616K8668L3128L6496L8710L9700C43264
$$ 51855 59715 70317 84519 103147 126763 155431 188559 225055 263765 303465 343264
712.0006C82336L7620L5472L2830K9891K6951K4276K1997K0049J8330F46432
$$ 382336 419956 455428 488258 518149 545100 569376 591373 611422 629752 646432
701.0035F61492J3410J1956J0702R743Q950Q158P069N812M393L171K378G49282
$$ 661492 674902 686858 697560 707303 716253 724411 731480 737292 741685 744856 747234 749282
688.0029G51363K179K147J982J750J553J387J123P92K32l30p27j057G60941
$$ 751363 753542 755689 757671 759421 760974 762361 763484 764276 764508 764178 763451 762394 760941
674.0029G58728l435m921o143o507n780m327k939k511l534n879q752F92638
$$ 758728 755293 750372 744229 737722 731942 727615 724676 722165 718631 712752 704000 692638
660.9963F79129j5919k0181k7446l7884m9509n8659o1366n4860l9106B97288
$$ 679129 663210 643029 615583 577699 528190 469531 408165 353305 314199 297288
650.00256C04225K7644M1715M8188M8023M3334L6199K8306K0708J4004F21032
$$ 304225 331869 373584 421772 469795 513129 549328 577634 598342 612346 621032
639.0037F25887K346P60l96j520k544l401m062m625n383o474p629q620E75388
$$ 625887 628233 628993 628597 627077 624533 621132 617070 612445 607062 600588 592959 584339 575388
625.0048E66965p233n681m228l071k345k180k510l270m162m954n384E16564
$$ 566965 559732 554051 549823 546752 544407 542227 539717 536447 532285 527331 521947 516564
611.9965E11412n021n252n912o737p498p761p465o705n680m888m592D38947
$$ 511412 506391 501139 495227 488490 480992 473231 465766 459061 453381 448493 443901 438947
598.9965D32969p233q357q884q687p893o804n846n252n152n417n845C51224
$$ 432969 425736 417379 408495 399808 391915 385111 379265 374013 368861 363444 357599 351224
585.9977C44419p133p332p333p266p068o870o738o573o341n845n286B65977
$$ 344419 337286 329954 322621 315355 308287 301417 294679 288106 281765 275920 270634 265977
572.99884B61683m458n119o111p101p531p298o276m954l733l104l302A98534
$$ 261683 257225 252106 245995 238894 231363 224065 217789 212835 209102 205998 202696 198534
560A93348n978o177n747n019m558Tn219n978A43740
$$ 193348 187370 181193 175446 170427 165869 161311 156092 150114 143740
550A37728  $$checkpoint
##END=$$ End of the data block
##END= $$ end of file