##TITLE= tetrachloroethene
##JCAMP-DX=5.01
##DATA TYPE= LINK
##BLOCKS= 2
##TITLE= C2Cl4
##JCAMP-DX= 5.01
##DATA TYPE= IR SPECTRUM
##DATA CLASS= XYDATA
##ORIGIN= JSpecView Converted
##OWNER= JSpecView Generated
##LONGDATE= Sat, 23 Feb 2019 17:26:06 -0500 $$ export date from JSpecView
##SPECTROMETER/DATA SYSTEM= computed
##$MODELS=
<Models>
<ModelData id="IRP" type="MOL">
C2Cl4
__Jmol-14_02281919183D 1   1.00000     0.00000     0
Jmol version 14.29.31  2019-01-29 15:30 EXTRACT: ({0:5})
  6  5  0  0  0  0            999 V2000
   -0.0000    0.0000    0.6610 C   0  0  0  0  0  0
    0.0000   -0.0000   -0.6610 C   0  0  0  0  0  0
    0.0000    1.4435   -1.5915 Cl  0  0  0  0  0  0
   -0.0000   -1.4435   -1.5915 Cl  0  0  0  0  0  0
   -0.0000   -1.4435    1.5915 Cl  0  0  0  0  0  0
   -0.0000    1.4435    1.5915 Cl  0  0  0  0  0  0
  1  6  1  0  0  0
  1  5  1  0  0  0
  1  2  2  0  0  0
  2  3  1  0  0  0
  2  4  1  0  0  0
M  END
</ModelData>
<ModelData id="Mi" type="XYZVIB" baseModel="IRP" vibrationScale=".5">
6
Model[1]: PATH=Calculation 2;Standard;Energy=-1913.6038;Range=M.O.s;NFock==Conv=0.89D-09;E(RHF)=-1913.60370036 A.U.;PATH=Calculation 2;Standard
C      -0.00000      0.00000      0.66095
C       0.00000     -0.00000     -0.66095
Cl      0.00000      1.44353     -1.59145
Cl     -0.00000     -1.44353     -1.59145
Cl     -0.00000     -1.44353      1.59145
Cl     -0.00000      1.44353      1.59145
6
Model[2]: FrequencyLabel=AU;ForceConstant=0.2496 mDyne/A;ReducedMass=34.9689 AMU;FreqValue=110.0584;Frequency=110.0584 cm^-1;Mode=1;PATH=Calculation 2;FrequenciesFrequencies;IRIntensity=0.0000 KM/Mole;PATH=Calculation 2;FrequenciesFrequencies
C      -0.00000      0.00000      0.66095      0.00000      0.00000      0.00000
C       0.00000     -0.00000     -0.66095     -0.00000      0.00000      0.00000
Cl      0.00000      1.44353     -1.59145      0.50000     -0.00000     -0.00000
Cl     -0.00000     -1.44353     -1.59145     -0.50000     -0.00000     -0.00000
Cl     -0.00000     -1.44353      1.59145      0.50000      0.00000     -0.00000
Cl     -0.00000      1.44353      1.59145     -0.50000      0.00000      0.00000
6
Model[3]: FrequencyLabel=B2U;ForceConstant=0.7369 mDyne/A;ReducedMass=31.8894 AMU;FreqValue=198.0353;Frequency=198.0353 cm^-1;Mode=2;PATH=Calculation 2;FrequenciesFrequencies;IRIntensity=1.1375 KM/Mole;PATH=Calculation 2;FrequenciesFrequencies
C      -0.00000      0.00000      0.66095     -0.00000     -0.26000     -0.00000
C       0.00000     -0.00000     -0.66095      0.00000     -0.26000      0.00000
Cl      0.00000      1.44353     -1.59145      0.00000      0.04000      0.46001
Cl     -0.00000     -1.44353     -1.59145     -0.00000      0.04000     -0.46001
Cl     -0.00000     -1.44353      1.59145      0.00000      0.04000      0.46001
Cl     -0.00000      1.44353      1.59145     -0.00000      0.04000     -0.46001
6
$$ [...]
Cl     -0.00000     -1.44353      1.59145     -0.00000      0.12000     -0.11000
Cl     -0.00000      1.44353      1.59145     -0.00000     -0.12000     -0.11000
6
Model[11]: FrequencyLabel=B2U;ForceConstant=8.1178 mDyne/A;ReducedMass=13.7825 AMU;FreqValue=999.8384;Frequency=999.8384 cm^-1;Mode=10;PATH=Calculation 2;FrequenciesFrequencies;IRIntensity=174.7927 KM/Mole;PATH=Calculation 2;FrequenciesFrequencies
C      -0.00000      0.00000      0.66095      0.00000      0.68000     -0.00000
C       0.00000     -0.00000     -0.66095     -0.00000      0.68000      0.00000
Cl      0.00000      1.44353     -1.59145      0.00000     -0.12000      0.08000
Cl     -0.00000     -1.44353     -1.59145      0.00000     -0.12000     -0.08000
Cl     -0.00000     -1.44353      1.59145      0.00000     -0.12000      0.08000
Cl     -0.00000      1.44353      1.59145     -0.00000     -0.12000     -0.08000
6
Model[12]: FrequencyLabel=B3G;ForceConstant=9.2383 mDyne/A;ReducedMass=12.5653 AMU;FreqValue=1117.0823;Frequency=1117.0823 cm^-1;Mode=11;PATH=Calculation 2;FrequenciesFrequencies;IRIntensity=0.0000 KM/Mole;PATH=Calculation 2;FrequenciesFrequencies
C      -0.00000      0.00000      0.66095     -0.00000      0.70000     -0.00000
C       0.00000     -0.00000     -0.66095      0.00000     -0.70000     -0.00000
Cl      0.00000      1.44353     -1.59145     -0.00000      0.07000     -0.03000
Cl     -0.00000     -1.44353     -1.59145     -0.00000      0.07000      0.03000
Cl     -0.00000     -1.44353      1.59145      0.00000     -0.07000      0.03000
Cl     -0.00000      1.44353      1.59145     -0.00000     -0.07000     -0.03000
6
Model[13]: FrequencyLabel=AG;ForceConstant=23.6149 mDyne/A;ReducedMass=12.0405 AMU;FreqValue=1824.5088;Frequency=1824.5088 cm^-1;Mode=12;PATH=Calculation 2;FrequenciesFrequencies;IRIntensity=0.0000 KM/Mole;PATH=Calculation 2;FrequenciesFrequencies
C      -0.00000      0.00000      0.66095      0.00000      0.00000      0.71000
C       0.00000     -0.00000     -0.66095      0.00000      0.00000     -0.71000
Cl      0.00000      1.44353     -1.59145     -0.00000     -0.02000      0.01000
Cl     -0.00000     -1.44353     -1.59145     -0.00000      0.02000      0.01000
Cl     -0.00000     -1.44353      1.59145     -0.00000      0.02000     -0.01000
Cl     -0.00000      1.44353      1.59145     -0.00000     -0.02000     -0.01000
</ModelData>
</Models>
##$PEAKS=
<Peaks type="IR" xUnitsExpected="1/cm"  >
<PeakData id="1" title="1 (1000 cm-1)" peakShape="broad" model="Mi.11" xMax="1020" xMin="980"    />
<PeakData id="2" title="2 (850 cm-1)" peakShape="broad" model="Mi.10" xMax="870" xMin="830"    />
<PeakData id="3" title="3 (200 cm-1)" peakShape="broad" model="Mi.3" xMax="220" xMin="180"    />
</Peaks>
##XUNITS= 1/CM
##YUNITS= TRANSMITTANCE
##XFACTOR= 1
##YFACTOR= 9.999000E-07
##FIRSTX= 2.024509E+03
##FIRSTY= 1
##LASTX= 1.003589E+02
##NPOINTS= 1821
##MINY= 1.000000E-04
##MAXY= 1
##XYDATA= (X++(Y..Y))
2024.5088A000100%Y79p90Xp91p90S2p91p90S1p91p90S2p91p90S2p91I53485
$$ plain form
1137.4968 952695 951905 951115 950325 949535 948745 947955 947165 946375 945585 944794 944004 943214 942424 941634 940844 940054 939264 937317 936230 935116 933972 932799 931594 930358 929088 927783 926443
1107.8945 925066 923651 922196 920700 919161 917578 915949 914272 912545 910767 908935 907048 905103
1094.1506 903098 901030 898896 896695 894423 892077 889655 887152 884565 881892 879127 876267 873307
1080.4067 870244 867072 863786 860382 856853 853193 849398 845459 841370 837123 832712 828128 823361
1066.6627 818403 813245 807875 802284 796459 790389 784060 777459 770571 763381 755874 748031 739835
1052.9188 731267 722307 712934 703126 692859 682110 670852 659061 646708 633766 620206 605999
1040.2322 591117 575530 559211 542134 524274 505610 486127 465812 444665 422691 399910
1028.6027 376356 352083 327166 301706 275834 249716 223553 197587 172098 147398 123832
$$ packed form
1137.4968I52695p90sp91p90Yj947j087j114j144j173j205j236j270j305I26443
1107.8945I25066j415j455j496j539j583j629j677j727j778j832j887I05103
1094.1506I03098k068k134k201k272k346k422k503k587k673k765k860H73307
1080.4067H70244l172l286l404l529l660l795l939m089m247m411m584H23361
1066.6627H18403n158n370n591n825o070o329o601o888p190p507p843G39835
1052.9188G31267q960r373r808j0267j0749j1258j1791j2353j2942j3560F05999
1040.2322E91117j5587j6319j7077j7860j8664j9483k0315k1147k1974C99910
1028.6027C76356k4273k4917k5460k5872k6118k6163k5966k5489k4700A23832
$$ plain form
1016.9732 101752 81509 63417 47726 34588 24030 15936 10053 6025 3437 1881 1003
1004.2865 535 296 178 122 100 100 122 179 297 538 1009 1892 3456 6055 10099 16000 24117 34699
985.2564 47861 63575 81689 101951 124046 147625 172333 197828 223797 249960 276077
973.62695 301946 327401 352313 365568 388222 410096 431158 451389 470783 489342 507078
961.9975 524006 540146 555524 570163 584091 597336 609926 621889 633252 644041 654283
950.368 664003 673225 681971 690263 698123 705569 712619 719292 725603 731569 737202 742517 747526
936.6241 752241 756672 760830 764723 768359 771747 774894 777805 780487 782943 785180 787200 789006
922.8801 790601 791987 793165 794136 794899 795455 795802 795939 795862 795569 795055 794317 793348 792143 790694 788993
$$ packed form
1016.9732A01752k0243j8092j5691j3138j0558q094n883m028k588j556A003
1004.2865E35k39j18n6k2%K2N7J18K41M71Q83J564K599M044N901Q117C4699
985.2564D7861J5714J8114K0262K2095K3579K4708K5495K5969K6163B76077
973.62695C01946K5455K4912J3255K2654K1874K1062K0231J9394J8559E07078
961.9975E24006J6140J5378J4639J3928J3245J2590J1963J1363J0789F54283
950.368F64003R222Q746Q292P860P446P050O673O311N966N633N315G47526
936.6241G52241M431M158L893L636L388L147K911K682K456K237K020G89006
922.8801G90601J386J178R71P63N56L47J37p7k93n14p38r69j205j449G88993
$$ plain form
905.96454 787032 784800 782285 779476 776359 772919 769139 765001 760485 755569 750230 744442 738176
892.2206 731402 724086 716192 707681 698510 688634 678003 666564 654262 641036 626825 611562
879.53394 595182 614926 594255 572245 548837 523983 497652 469835 440556 409880 377928
867.9044 344888 311026 276705 242385 208625 176068 145404 117321 92425 71161 53736
856.27496 40090 29907 22698 17909 15033 13696 13702 15053 17944 22754 29988 40201 53881 71342
841.4738 92642 117570 145680 176364 208936 242704 277027 311345 345201 378232 410173
829.8443 440836 470102 497905 524222 549062 572457 594454 615113 634500 652683 669733
818.21484 685721 700713 714775 727971 740359 751995 762931 773216 782895 792010 800601 808703
$$ packed form
905.96454G87032k232k515k809l117l440l780m138m516m916n339n788G38176
892.2206G31402p316p894q511r171r876j0631j1439j2302j3226j4211F11562
879.53394E95182J9744k0671k2010k3408k4854k6331k7817k9279l0676C77928
867.9044C44888l3862l4321l4320l3760l2557l0664k8083k4896k1264E3736
856.27496D0090j0183p209m789k876j337OJ351K891M810P234J0213J3680G1342
841.4738I2642K4928K8110L0684L2572L3768L4323L4318L3856L3031D10173
829.8443D40836K9266K7803K6317K4840K3395K1997K0659J9387J8183F69733
818.21484F85721J4992J4062J3196J2388J1636J0936J0285R679R115Q591H08703
$$ plain form
805.52814 816350 823573 830401 836860 842975 848768 854260 859471 864419 869120 873590 877843 881892
791.78424 885749 889427 892936 896285 899484 902541 905465 908262 910940 913506 915964 918322 920585
778.0403 922756 924842 926846 928772 930625 932408 934124 935777 937370 938905 940386 941814 943192
764.2964 944523 945808 947050 948250 949410 950532 951619 952670 953687 954673 955628 956553 957451 958321
749.49524 959165 959984 960779 961550 962300 963028 963735 964422 965091 965741 966373 966988 967586 968169 968736 969288 969826
$$ packed form
805.52814H16350P223O828O459O115N793N492N211M948M701M470M253H81892
791.78424H85749L678L509L349L199L057K924K797K678K566K458K358I20585
778.0403I22756K086K004J926J853J783J716J653J593J535J481J428I43192
764.2964I44523J285J242J200J160J122J087J051J017R86R55R25Q98I58321
749.49524I59165Q19P95P71P50P28P07O87O69O50O32O15N98N83N67N52I69826
731.5224I70426O00sO01O00S5O01O00S6O01O00WQ71%T02q%Wj%Ur%j%A000081
$$ plain form
449.24326 1000080 1000080 1000080 1000079 1000079 1000078 1000078 1000077 1000077 1000076 1000076 1000075 1000075 1000074 1000074 1000073 1000072 1000072 1000071 1000071 1000070 1000069 1000068 1000068 1000067 1000066 1000065 1000064 1000063 1000062 1000061 1000060 1000059 1000058 1000057 1000055 1000054 1000053 1000051 1000050 1000048 1000046 1000045 1000043 1000041 1000039 1000037 1000034 1000032 1000030 1000027 1000024 1000021 1000018 1000015 1000011 1000008 1000004 999999
386.86697 999995 999990 999985 999979 999974 999967 999960 999953 999945 999937 999927 999917 999906 999894 999881 999866 999851 999833 999814 999793 999769 999742 999713 999680 999643 999601 999554 999502 999442 999375
355.1502 999300 999217 999125 999025 998918 998808 998697 998591 998497 998417 998355 998311 998282 998264 998252 998244 998241 998247 998265 998301 998357 998434 998529
330.834 998637 998751 998866 998978 999083 999180 999267 999346 999416 999479 999534 999583 999212 999244 999271 999294 999313 999330 999344 999355 999364 999372
307.57507 999377 999381 999384 999385 999385 999384 999381 999378 999374 999368 999362 999355 999347 999339 999329 999319 999308 999296 999283 999270 999255 999240 999224 999207 999190 999171 999152 999131 999109 999087 999063 999038 999012 998985
271.62943 998956 998926 998895 998862 998827 998791 998753 998713 998671 998627 998581 998532 998481 998427 998370 998310 998247 998180 998109 998034 997955 997870 997781 997686
246.25601 997585 997478 997364 997241 997111 996971 996821 996660 996487 996301 996101 995884 995650 995395 995119 994819 994491
228.28319 994133 993741 993310 992836 992321 991742 991100 990387 989592 988703 987707 986588 985328 983907 982309 980494
$$ packed form
449.24326A000080%Tj%j%j%j%j%j%jT%j%jU%jS1kjTkjkTjkVlkTlWmlmI99999
386.86697I99995nTonpUqTj0Tj1j2j3j5Tj8j9k1k4k7k9l3l7m2m7n2o0I99375
355.1502I99300q3r2j00j07j10j11j06r4q0o2m4k9j8j2qlOJ8L6N6P7I98529
330.834I98637J14J15J12J05R7Q7P9P0O3N5M9l71L2K7K3J9J7J4J1RI99372
307.57507I99377MLJ%jlTmoTpqTj0Tj1j2j3Tj5Tj6j7Tj9Tk1k2Tk4k5k6I98985
271.62943I98956l0l1l3l5l6l8m0m2m4m6m9n1n4n7o0o3o7p1p5p9q5q9I97686
246.25601I97585j07j14j23j30j40j50j61j73j86k00k17k34k55k76l00I94491
228.28319I94133l92m31m74n15n79o42p13p95q89r96j119j260j421j598I80494
$$ plain form
211.36758 978442 976125 973520 970605 967377 963850 960076 956155 952249 948587 945452 943143 941917
197.62366 941923 943160 945478 948620 952285 956192 960112 963884 967409 970634 973545 976148 978462
183.87973 980512 982325 983929 985349 986608 987726 988721 989609 990404 991116 991758 992336 992859 993333 993763
168.02135 994156 994514 994842 995142 995418 995673 995908 996125 996325 996512 996685 996846 996996 997137 997268 997391 997506
150.04852 997614 997715 997810 997900 997985 998065 998141 998212 998280 998344 998405 998463 998518 998570 998620 998667 998712 998755 998796 998836 998873 998909 998943 998976
124.67512 999008 999038 999067 999095 999121 999147 999172 999195 999218 999240 999261 999282 999302 999321 999339 999357 999374 999390 999406 999421 999436 999451 999465
$$ packed form
211.36758I78442k317k605k915l228l527l774l921l906l662l135k309I41917
197.62366I41923J237K318L142L665L907L920L772L525L225K911K603I78462
183.87973I80512J813J604J420J259J118R95Q88P95P12O42N78N23M74I93763
168.02135I94156L58L28L00K76K55K35K17K00J87J73J61J50J41J31J23I97506
150.04852I97614J01R5R0Q5Q0P6P1O8O4O1N8N5N2N0M7M5M3M1M0L7L6L4I98976
124.67512I99008L0K9K8K6TK5K3TK2K1TK0J9J8TJ7J6TJ5UI99465
100.35893A000100  $$checkpoint
##END= $$ end of IR
##TITLE= C2Cl4
##JCAMP-DX= 5.01
##DATA TYPE= RAMAN SPECTRUM
##DATA CLASS= XYDATA
##ORIGIN= WebMO
##OWNER= public domain
##LONGDATE= Sat, 23 Feb 2019 15:56:21 -0500 $$ export date from JSpecView
##SPECTROMETER/DATA SYSTEM= computed
##$MODELS=
<Models>
<ModelData id="RP" type="MOL">
C2Cl4
__Jmol-14_02281919183D 1   1.00000     0.00000     0
Jmol version 14.29.31  2019-01-29 15:30 EXTRACT: ({0:5})
  6  5  0  0  0  0            999 V2000
   -0.0000    0.0000    0.6610 C   0  0  0  0  0  0
    0.0000   -0.0000   -0.6610 C   0  0  0  0  0  0
    0.0000    1.4435   -1.5915 Cl  0  0  0  0  0  0
   -0.0000   -1.4435   -1.5915 Cl  0  0  0  0  0  0
   -0.0000   -1.4435    1.5915 Cl  0  0  0  0  0  0
   -0.0000    1.4435    1.5915 Cl  0  0  0  0  0  0
  1  6  1  0  0  0
  1  5  1  0  0  0
  1  2  2  0  0  0
  2  3  1  0  0  0
  2  4  1  0  0  0
M  END
</ModelData>
<ModelData id="MR" type="XYZVIB" baseModel="RP" vibrationScale=".5">
6
Model[1]: PATH=Calculation 2;Standard;Energy=-1913.6038;Range=M.O.s;NFock==Conv=0.89D-09;E(RHF)=-1913.60370036 A.U.;PATH=Calculation 2;Standard
C      -0.00000      0.00000      0.66095
C       0.00000     -0.00000     -0.66095
Cl      0.00000      1.44353     -1.59145
Cl     -0.00000     -1.44353     -1.59145
Cl     -0.00000     -1.44353      1.59145
Cl     -0.00000      1.44353      1.59145
6
Model[2]: FrequencyLabel=AU;ForceConstant=0.2496 mDyne/A;ReducedMass=34.9689 AMU;FreqValue=110.0584;Frequency=110.0584 cm^-1;Mode=1;PATH=Calculation 2;FrequenciesFrequencies;IRIntensity=0.0000 KM/Mole;PATH=Calculation 2;FrequenciesFrequencies
C      -0.00000      0.00000      0.66095      0.00000      0.00000      0.00000
C       0.00000     -0.00000     -0.66095     -0.00000      0.00000      0.00000
Cl      0.00000      1.44353     -1.59145      0.50000     -0.00000     -0.00000
Cl     -0.00000     -1.44353     -1.59145     -0.50000     -0.00000     -0.00000
Cl     -0.00000     -1.44353      1.59145      0.50000      0.00000     -0.00000
Cl     -0.00000      1.44353      1.59145     -0.50000      0.00000      0.00000
6
Model[3]: FrequencyLabel=B2U;ForceConstant=0.7369 mDyne/A;ReducedMass=31.8894 AMU;FreqValue=198.0353;Frequency=198.0353 cm^-1;Mode=2;PATH=Calculation 2;FrequenciesFrequencies;IRIntensity=1.1375 KM/Mole;PATH=Calculation 2;FrequenciesFrequencies
C      -0.00000      0.00000      0.66095     -0.00000     -0.26000     -0.00000
C       0.00000     -0.00000     -0.66095      0.00000     -0.26000      0.00000
Cl      0.00000      1.44353     -1.59145      0.00000      0.04000      0.46001
Cl     -0.00000     -1.44353     -1.59145     -0.00000      0.04000     -0.46001
Cl     -0.00000     -1.44353      1.59145      0.00000      0.04000      0.46001
Cl     -0.00000      1.44353      1.59145     -0.00000      0.04000     -0.46001
6
Model[4]: FrequencyLabel=AG;ForceConstant=1.4234 mDyne/A;ReducedMass=34.9431 AMU;FreqValue=262.9360;Frequency=262.9360 cm^-1;Mode=3;PATH=Calculation 2;FrequenciesFrequencies;IRIntensity=0.0000 KM/Mole;PATH=Calculation 2;FrequenciesFrequencies
C      -0.00000      0.00000      0.66095     -0.00000      0.00000     -0.02000
C       0.00000     -0.00000     -0.66095     -0.00000      0.00000      0.02000
Cl      0.00000      1.44353     -1.59145      0.00000      0.23001      0.44000
Cl     -0.00000     -1.44353     -1.59145     -0.00000     -0.23001      0.44000
Cl     -0.00000     -1.44353      1.59145      0.00000     -0.23001     -0.44000
Cl     -0.00000      1.44353      1.59145     -0.00000      0.23001     -0.44000
6
Model[5]: FrequencyLabel=B3U;ForceConstant=0.8773 mDyne/A;ReducedMass=13.2772 AMU;FreqValue=334.8769;Frequency=334.8769 cm^-1;Mode=4;PATH=Calculation 2;FrequenciesFrequencies;IRIntensity=0.0235 KM/Mole;PATH=Calculation 2;FrequenciesFrequencies
C      -0.00000      0.00000      0.66095      0.69000      0.00000      0.00000
C       0.00000     -0.00000     -0.66095      0.69000      0.00000      0.00000
Cl      0.00000      1.44353     -1.59145     -0.12000     -0.00000     -0.00000
Cl     -0.00000     -1.44353     -1.59145     -0.12000      0.00000     -0.00000
Cl     -0.00000     -1.44353      1.59145     -0.12000     -0.00000     -0.00000
Cl     -0.00000      1.44353      1.59145     -0.12000      0.00000      0.00000
6
Model[6]: FrequencyLabel=B1U;ForceConstant=1.9955 mDyne/A;ReducedMass=28.5124 AMU;FreqValue=344.6574;Frequency=344.6574 cm^-1;Mode=5;PATH=Calculation 2;FrequenciesFrequencies;IRIntensity=0.0214 KM/Mole;PATH=Calculation 2;FrequenciesFrequencies
C      -0.00000      0.00000      0.66095      0.00000     -0.00000     -0.37000
C       0.00000     -0.00000     -0.66095      0.00000      0.00000     -0.37000
Cl      0.00000      1.44353     -1.59145     -0.00000      0.42000      0.06000
Cl     -0.00000     -1.44353     -1.59145     -0.00000     -0.42000      0.06000
Cl     -0.00000     -1.44353      1.59145     -0.00000      0.42000      0.06000
Cl     -0.00000      1.44353      1.59145     -0.00000     -0.42000      0.06000
6
Model[7]: FrequencyLabel=B3G;ForceConstant=2.6890 mDyne/A;ReducedMass=31.7751 AMU;FreqValue=378.9908;Frequency=378.9908 cm^-1;Mode=6;PATH=Calculation 2;FrequenciesFrequencies;IRIntensity=0.0000 KM/Mole;PATH=Calculation 2;FrequenciesFrequencies
C      -0.00000      0.00000      0.66095     -0.00000      0.26000     -0.00000
C       0.00000     -0.00000     -0.66095     -0.00000     -0.26000     -0.00000
Cl      0.00000      1.44353     -1.59145      0.00000     -0.30001      0.35000
Cl     -0.00000     -1.44353     -1.59145      0.00000     -0.30001     -0.35000
Cl     -0.00000     -1.44353      1.59145      0.00000      0.30001     -0.35000
Cl     -0.00000      1.44353      1.59145      0.00000      0.30001      0.35000
6
Model[8]: FrequencyLabel=AG;ForceConstant=4.8639 mDyne/A;ReducedMass=34.6547 AMU;FreqValue=488.0722;Frequency=488.0722 cm^-1;Mode=7;PATH=Calculation 2;FrequenciesFrequencies;IRIntensity=0.0000 KM/Mole;PATH=Calculation 2;FrequenciesFrequencies
C      -0.00000      0.00000      0.66095     -0.00000     -0.00000      0.08000
C       0.00000     -0.00000     -0.66095     -0.00000     -0.00000     -0.08000
Cl      0.00000      1.44353     -1.59145      0.00000      0.44000     -0.23001
Cl     -0.00000     -1.44353     -1.59145      0.00000     -0.44000     -0.23001
Cl     -0.00000     -1.44353      1.59145      0.00000     -0.44000      0.23001
Cl     -0.00000      1.44353      1.59145      0.00000      0.44000      0.23001
6
Model[9]: FrequencyLabel=B2G;ForceConstant=2.9806 mDyne/A;ReducedMass=12.2309 AMU;FreqValue=643.1261;Frequency=643.1261 cm^-1;Mode=8;PATH=Calculation 2;FrequenciesFrequencies;IRIntensity=0.0000 KM/Mole;PATH=Calculation 2;FrequenciesFrequencies
C      -0.00000      0.00000      0.66095      0.70000     -0.00000     -0.00000
C       0.00000     -0.00000     -0.66095     -0.70000     -0.00000     -0.00000
Cl      0.00000      1.44353     -1.59145      0.05000     -0.00000      0.00000
Cl     -0.00000     -1.44353     -1.59145      0.05000      0.00000      0.00000
Cl     -0.00000     -1.44353      1.59145     -0.05000     -0.00000      0.00000
Cl     -0.00000      1.44353      1.59145     -0.05000      0.00000      0.00000
6
Model[10]: FrequencyLabel=B1U;ForceConstant=6.1903 mDyne/A;ReducedMass=14.5261 AMU;FreqValue=850.4668;Frequency=850.4668 cm^-1;Mode=9;PATH=Calculation 2;FrequenciesFrequencies;IRIntensity=81.4290 KM/Mole;PATH=Calculation 2;FrequenciesFrequencies
C      -0.00000      0.00000      0.66095      0.00000      0.00000      0.67000
C       0.00000     -0.00000     -0.66095     -0.00000     -0.00000      0.67000
Cl      0.00000      1.44353     -1.59145      0.00000      0.12000     -0.11000
Cl     -0.00000     -1.44353     -1.59145      0.00000     -0.12000     -0.11000
Cl     -0.00000     -1.44353      1.59145     -0.00000      0.12000     -0.11000
Cl     -0.00000      1.44353      1.59145     -0.00000     -0.12000     -0.11000
6
Model[11]: FrequencyLabel=B2U;ForceConstant=8.1178 mDyne/A;ReducedMass=13.7825 AMU;FreqValue=999.8384;Frequency=999.8384 cm^-1;Mode=10;PATH=Calculation 2;FrequenciesFrequencies;IRIntensity=174.7927 KM/Mole;PATH=Calculation 2;FrequenciesFrequencies
C      -0.00000      0.00000      0.66095      0.00000      0.68000     -0.00000
C       0.00000     -0.00000     -0.66095     -0.00000      0.68000      0.00000
Cl      0.00000      1.44353     -1.59145      0.00000     -0.12000      0.08000
Cl     -0.00000     -1.44353     -1.59145      0.00000     -0.12000     -0.08000
Cl     -0.00000     -1.44353      1.59145      0.00000     -0.12000      0.08000
Cl     -0.00000      1.44353      1.59145     -0.00000     -0.12000     -0.08000
6
Model[12]: FrequencyLabel=B3G;ForceConstant=9.2383 mDyne/A;ReducedMass=12.5653 AMU;FreqValue=1117.0823;Frequency=1117.0823 cm^-1;Mode=11;PATH=Calculation 2;FrequenciesFrequencies;IRIntensity=0.0000 KM/Mole;PATH=Calculation 2;FrequenciesFrequencies
C      -0.00000      0.00000      0.66095     -0.00000      0.70000     -0.00000
C       0.00000     -0.00000     -0.66095      0.00000     -0.70000     -0.00000
Cl      0.00000      1.44353     -1.59145     -0.00000      0.07000     -0.03000
Cl     -0.00000     -1.44353     -1.59145     -0.00000      0.07000      0.03000
Cl     -0.00000     -1.44353      1.59145      0.00000     -0.07000      0.03000
Cl     -0.00000      1.44353      1.59145     -0.00000     -0.07000     -0.03000
6
Model[13]: FrequencyLabel=AG;ForceConstant=23.6149 mDyne/A;ReducedMass=12.0405 AMU;FreqValue=1824.5088;Frequency=1824.5088 cm^-1;Mode=12;PATH=Calculation 2;FrequenciesFrequencies;IRIntensity=0.0000 KM/Mole;PATH=Calculation 2;FrequenciesFrequencies
C      -0.00000      0.00000      0.66095      0.00000      0.00000      0.71000
C       0.00000     -0.00000     -0.66095      0.00000      0.00000     -0.71000
Cl      0.00000      1.44353     -1.59145     -0.00000     -0.02000      0.01000
Cl     -0.00000     -1.44353     -1.59145     -0.00000      0.02000      0.01000
Cl     -0.00000     -1.44353      1.59145     -0.00000      0.02000     -0.01000
Cl     -0.00000      1.44353      1.59145     -0.00000     -0.02000     -0.01000
</ModelData>
</Models>
##$PEAKS=
<Peaks type="RAMAN" xUnitsExpected="1/cm"  >
<PeakData id="1" title="1 (1825 cm-1)" peakShape="broad" model="MR.13" xMax="1840" xMin="1810"    />
<PeakData id="2" title="2 (1120 cm-1)" peakShape="broad" model="MR.12" xMax="1140" xMin="1100"    />
<PeakData id="3" title="3 (645 cm-1)" peakShape="broad" model="MR.9" xMax="660" xMin="630"    />
<PeakData id="4" title="4 (490 cm-1)" peakShape="broad" model="MR.8" xMax="505" xMin="475"    />
<PeakData id="5" title="5 (380 cm-1)" peakShape="broad" model="MR.7" xMax="395" xMin="365"    />
<PeakData id="6" title="6 (265 cm-1)" peakShape="broad" model="MR.4" xMax="280" xMin="250"    />
</Peaks>
##XUNITS= 1/CM
##YUNITS=RAMAN INTENSITY
##XFACTOR= 1
##YFACTOR= 8.238599E-07
##FIRSTX= 2.024509E+03
##FIRSTY= 0
##LASTX= -8.994160E+01
##NPOINTS= 2001
##MINY= 0
##MAXY= 8.238599E-01
##XYDATA= (X++(Y..Y))
$$ plain form
2024.5088 0 0 0 0 0 0 0 0 0 0 0 0 0 0 0 0 0 0 0 0 0 0 0 0 0 0 0 0 0 0 0 0 0 0 0 0 0 0 0 0 0 0 0 0 0 0 0 0 0 0 0 0 0 0 0 0 0 0 0 0 0 0 0 0 0 0 0 0 0 0 0 0 0 0 0 0 6917 7039 7165 7295 7427 7564 7704 7848 7997 8149 8306 8468 8634 8805 8981 9163
1927.2441 9350 9543 9742 9947 10159 10378 10603 10836 11077 11326 11583 11850 12125 12410 12706 13011 13328 13657
1908.214 13998 14352 14719 15101 15497 15909 16338 16784 17249 17733 18238 18764 19313 19887 20487 21113 21769
1890.2412 22456 23175 23929 24720 25551 26424 27342 28308 29325 30399 31531 32727 33992 35330 36748
1874.3828 38253 39850 41547 43354 45280 47334 49529 51877 54393 57093 59994 63117 66484 70121
1859.5817 74057 78323 82958 88003 93505 99520 106111 113350 121319 130115 139849 150649 162666
1845.8378 176071 191067 207888 226803 248125 272209 299460 330323 365279 404823 449419
1834.2083 499435 555023 615959 681414 749693 817985 882264 937496 978292 1000000 999896
$$ packed form
2024.5088@%Y5O917J22J26J30J32J37J40J44J49J52J57J62J66J71J76I163
1927.2441I350J93J99K05K12K19K25K33K41K49K57K67K75K85K96L05L17A3657
1908.214A3998L54L67L82L96M12M29M46M65M84N05N26N49N74O00O26B1769
1890.2412B2456P19P54P91Q31Q73R18R66J017J074J132J196J265J338C6748
1874.3828C8253J597J697J807J926K054K195K348K516K700K901L123L367G0121
1859.5817G4057M266M635N045N502O015O591P239P969Q796R734J0800A62666
1845.8378A76071J4996J6821J8915K1322K4084K7251L0863L4956L9544D49419
1834.2083D99435N5588O0936O5455O8279O8292O4279N5232M0796K1708I99896
$$ plain form
1822.5787 977993 937038 881697 817358 749049 680786 615367 554478 498941 448978 404431
1810.9493 364932 330016 299189 271970 247913 226616 207721 190919 175939 162547 150543
1799.3198 139753 130029 121241 113279 106047 99462 93451 87953 82913 78282 74019 70086 66451
1785.5759 63087 59966 57066 54369 51854 49507 47314 45261 43337 41531 39834 38238 36735 35317
1770.7748 33980 32716 31520 30388 29316 28298 27333 26415 25543 24712 23922 23168 22449 21763 21107 20481
1753.8591 19882 19308 18759 18233 17728 17245 16780 16334 15905 15493 15097 14716 14348 13995 13654 13325 13008
1735.8864 12703 12408 12123 11847 11581 11324 11075 10834 10601 10376 10157 9945 9740 9541 9348 9161 8980
$$ packed form
1822.5787I77993m0955n5341o4339o8309o8263o5419o0889n5537m9963D04431
1810.9493C64932l4916l0827k7219k4057k1297j8895j6802j4980j3392A50543
1799.3198A39753r724q788p962p232o585o011n498n040m631m263l933F6451
1785.5759F3087l121k900k697k515k347k193k053j924j806j697j596j503C5317
1770.7748C3980j264j196j132j072j018r65r18q72q31p90p54p19o86o56B0481
1753.8591A9882n74n49n26n05m83m65m46m29m12l96l81l68l53l41l29A3008
1735.8864A2703k95k85k76k66k57k49k41k33k25k19k12k05j99j93j87H980
1717.9135H803j71j66j61j57j53j48j44j40j37j33j29j26j23o915%V40Q8H9
$$ plain form
1234.7616 91 93 94 96 98 100 101 103 105 107 110 112 114 116 119 121 124 126 129 132 134 137 141 144 147 150 154 157 161 165 169 173 178 182 187 192 197 202 207 213 219 225 231 238 245 252 260 268 276 285 294 304 314 324 335 347 359 372 386 400
1171.328 415 431 448 466 485 505 527 550 574 600 628 658 690 724 761 801 843 889 939 993 1052 1116 1186 1262 1346 1438
1143.8402 1539 1650 1774 1911 2063 2233 2423 2637 2877 3147 3453 3798 4190 4633 5135 5700 6335 7040
1124.8102 7813 8643 9509 10375 11191 11891 12409 12684 12683 12405 11885 11183 10367 9501 8635 7805 7033 6329 5695 5130
1103.6656 4629 4186 3795 3450 3145 2874 2635 2422 2232 2062 1909 1773 1649 1538 1437 1345 1262 1185
1084.6356 1116 1052 993 939 889 843 800 761 724 690 658 628 600 574 550 527 505 485 466 448 431 415 400 385 372 359
1057.1477 347 335 324 313 303 294 285 276 268 260 252 245 238 231 225 219 213 207 202 197 191 187 182 178 173 169 165 161 157 154 150 147 144 140 137 134 132 129 126 124 121 119 116 114 112 109 107 105 103 101 100 98 96 94 93 91
$$ packed form
1234.7616I1KJKUJKULKULKLKLTKLMLUMLMVNMNWOVPUQURTJ0UJ1J2TJ3J4D00
1171.328D15J6J7J8J9K0K2K3K4K6K8L0L2L4L7M0M2M6N0N4N9O4P0P6Q4A438
1143.8402A539J11J24J37J52J70J90K14K40K70L06L45L92M43N02N65O35G040
1124.8102G813Q30Q66TQ16P00N18K75jk78n20p02q16q66Tq30p72p04o34E130
1103.6656D629m43l91l45l05k71k39k13j90j70j53j36j24j11j01r2q3A185
1084.6356A116o4n9n4n0m6m3l9l7l4l2l0k8k6k4k3k2k0j9j8j7j6j5Tj3C59
1057.1477C47j2j1Tj0rUqUpUoVnTomnmnmVlmlTmlTklTklklkTlkVjkUjI1
997.9431H9jq8%T19M67QRQRTJ0VJ1J0J2J1J2TJ3UJ4J5J4J6J5J7J6J8H00
$$ plain form
733.63684 818 837 857 878 899 922 945 968 993 1019 1046 1074 1103 1133 1164 1197 1231 1266 1303 1342 1382 1425 1469 1515 1564 1615 1668 1724
704.03455 1783 1845 1910 1979 2051 2128 2208 2294 2384 2480 2581 2689 2804 2926 3056 3194 3342 3501 3671 3853 4048
681.8328 4259 4486 4732 4997 5285 5598 5939 6310 6716 7161 7649 8187 8780 9437 10166 10977 11882 12894
662.80273 14029 15305 16744 18369 20208 22291 24650 27318 30328 33703 37454 41566 45983 50591
648.0016 55199 59537 63264 66017 67482 67475 65997 63233 59498 55157 50547 45941 41526 37417
633.20044 33669 30298 27292 24626 22270 20190 18353 16730 15292 14017 12884 11873 10969 10159
618.3993 9431 8775 8182 7644 7156 6712 6306 5935 5595 5283 6128 5883 5658 5452 5263 5090 4931 4785
599.3692 4651 4528 4415 4312 4217 4131 4052 3980 3915 3856 3804 3757 3715 3678 3647 3620 3597 3579 3565 3555 3550 3548 3550 3556 3566 3579
$$ packed form
733.63684H18J9K0K1TK3UK5K6K7K8K9L0L1L3L4L5L7L9M0M3M4M6M9N1N3A724
704.03455A783O2O5O9P2P7Q0Q6R0R6J01J08J15J22J30J38J48J59J70J82D048
681.8328D259K27K46K65K88L13L41L71M06M45M88N38N93O57P29Q11R05A2894
662.80273A4029J276J439J625J839K083K359K668L010L375L751M112M417E0591
648.0016E5199M338L727K753J465pj478k764l735m341m610m606m415C7417
633.20044C3669l371l006k666k356k080j837j623j438j275j133j011r04A0159
618.3993I431o56n93n38m88m44m06l71l40l12Q45k45k25k06j89j73j59D785
599.3692D651j23j13j03r5q6p9p2o5n9n2m7m2l7l1k7k3j8j4j0nkKOJ0C579
$$ plain form
571.88135 3596 3617 3642 3670 3702 3739 3779 3823 3871 3924 3981 4042 4108 4179 4255 4337 4423 4516 4615 4719 4831 4950 5076 5210
546.508 5353 5504 5665 5836 6019 6212 6419 6638 6872 7122 7389 7674 7978 8304 8653 9028 9430 9863
527.4779 10329 10832 11375 11962 12599 12831 13590 14416 15318 16303 17383 18569 19874 21315 22910 24679
510.56232 26648 28844 31300 34056 37155 40647 44593 49057 54113 59839 66317 73992 82192 91305
495.76117 101294 112024 123217 134412 144950 154005 160697 164261 164253 160674 153974 144917 134387
482.01724 123207 112034 101328 91364 82278 74104 66819 60360 54653 49617 45171 41245 37770
468.27332 34690 31954 29516 27339 25390 23641 22066 20646 19362 18199 17142 16180 15303 14502
453.47217 13770 13098 12482 11916 11395 10916 10474 10067 9692 9346 9027 8733 8462 8212 7983 7773 7581
$$ packed form
571.88135C596K1K5K8L2L7M0M4M8N3N7O1O6P1P6Q2Q6R3R9J04J12J19J26E210
546.508E353J51J61J71J83J93K07K19K34K50K67K85L04L26L49L75M02I863
527.4779A0329N03N43N87O37K32P59Q26R02R85J080J186J305J441J595B4679
510.56232B6648K196K456K756L099L492L946M464N056N726O478P675Q200I1305
495.76117A01294J0730J1193J1195J0538R055O692L564ql579o700r057A34387
482.01724A23207j1173j0706r964r086q174p285o459n707n036m446l926C7770
468.27332C4690k736k438k177j949j749j575j420j284j163j057r62q77A4502
453.47217A3770o72o16n66n21m79m42m07l75l46l19k94k71k50k29k10G581
$$ plain form
435.49933 7407 7248 7104 6976 6862 6762 6675 6602 6543 6496 6463 6443 6436 6444 6465 6502 6554 6622 6708 6812 6936 7080 7248
411.18314 7441 7662 7912 8196 8517 8879 9288 9749 10269 10856 11519 12269 13117 14079 15171 16411 17822
393.21033 19427 21252 23322 25663 28294 31223 34439 37896 41505 45116 48850 51772 53925 55062
378.40915 55036 53849 51647 48679 45232 41574 37920 34418 31158 28184 25509 22010 19913 18060
363.608 16426 14985 13712 12587 11591 10706 9919 9217 8590 8027 7522 7068 6657 6287 5951 5646
346.6924 5370 5118 4889 4680 4490 4316 4158 4013 3881 3761 3651 3552 3461 3380 3306 3240 3182 3130 3085 3046
325.5479 3013 2986 2965 2949 2939 2934 2934 2941 2952 2969 2992 3021 3056 3097 3144 3199 3260 3329 3407 3493 3588 3694 3810 3938 4079
299.11728 4233 4403 4590 4796 5022 5272 5546 5850 6185 6557 6969 7427 7938 8508 9146 9862 10667 11574
$$ packed form
435.49933G407j59j44j28j14j00q7p3n9m7l3k0pQK1L7N2O8Q6J04J24J44G248
411.18314G441K21K50K84L21L62M09M61N20N87O63P50Q48R62J092J240A7822
393.21033A9427J825K070K341K631K929L216L457L609L611L734K922K153E5062
378.40915E5036j187k202k968l447l658l654l502l260k974k675l499k097A8060
363.608A6426j441j273j125r96q85p87p02o27n63n05m54m11l70l36E646
346.6924E370k52k29k09j90j74j58j45j32j20j10r9r1q1p4o6n8n2m5C046
325.5479C013k7k1j6j0n%PJ1J7K3K9L5M1M7N5O1O9P8Q6R5J06J16J28D079
299.11728D233J70J87K06K26K50K74L04L35L72M12M58N11N70O38P16Q05A1574
$$ plain form
280.08722 12598 13757 15070 16559 18248 20159 22316 24737 27429 30381 33553 36862 40173 43288
265.28607 45964 47939 48987 48974 47903 45906 43211 39716 36397 33080 29901 26942 24244 21816
250.48491 19652 17732 16036 14538 13215 12046 11011 10093 9277 8549 7898 7315 6791 6318 5891
234.62654 5504 5153 4833 4541 4274 4029 3804 3597 3406 3229 3065 2914 2773 2642 2520 2406 2299 2199
215.59648 2106 2018 1936 1858 1785 1716 1651 1590 1532 1477 1424 1375 1328 1284 1241 1201 1162 1126 1091 1057 1026 995 966 938 912 886
188.10863 861 838 815 794 773 753 734 715 697 680 663 647 632 617 603 589 576 563 550 538 526 515 504 494 483 473 464 454 445 436 428 419 411 404
$$ packed form
280.08722A2598J159J313J489J689J911K157K421K692K952L172L309L311D3288
265.28607D5964J975J048j3j071j997k695l495l319l317l179k959k698B1816
250.48491A9652j920j696j498j323j169j035r18q16p28o51n83n24m73E891
234.62654E504l51l20k92k67k45k25k07j91j77j64j51j41j31j22j14j07B199
215.59648B106q8q2p8p3o9o5o1n8n5n3m9m7m4m3m0l9l6l5l4l1Tk9k8k6H86
188.10863H61k3Tk1Tk0j9Tj8j7Tj6j5Tj4Tj3Uj2Tj1Tj0j1j0rj0rTqrqD04
152.16296C96qpUopoUl36%T17@
-89.9416@  $$checkpoint
##END=$$ End of the RAMAN for C2Cl4
##END= $$ end of file