##TITLE= Boron species
##JCAMP-DX=5.01
##DATA TYPE= LINK
##BLOCKS= 8
##TITLE= trifluoroboron BF3
##JCAMP-DX= 5.01
##DATA TYPE= INFRARED SPECTRUM
##DATA CLASS= XYDATA
##BLOCK ID=1
##ORIGIN= Department of Chemistry, UWI, JAMAICA
##OWNER= public domain
##LONGDATE= 2012/02/18 12:31:56.0440 -0500 $$ export date from JSpecView
##SPECTROMETER/DATA SYSTEM= from scan
##$MODELS=
<Models>
<ModelData id="IBF3" type="MOL">
boron trifluoride BF3
__Jmol-14_02271910533D 1   1.00000     0.00000     0
Jmol version 14.29.31  2019-01-29 15:30 EXTRACT: ({0:3})
  4  3  0  0  0  0            999 V2000
    0.0000    0.0000    0.0000 B   0  0  0  0  0  0
    0.0000    1.3011    0.0000 F   0  0  0  0  0  0
    1.1268   -0.6506    0.0000 F   0  0  0  0  0  0
   -1.1268   -0.6506   -0.0000 F   0  0  0  0  0  0
  1  3  1  0  0  0
  1  2  1  0  0  0
  4  1  1  0  0  0
M  END
</ModelData>
<ModelData id="1" type="XYZVIB" baseModel="IBF3" vibrationScale=".5">
4
Model[1]: PATH=Calculation 2;Standard;Energy=-323.1955;Range=M.O.s;NFock==Conv=0.33D-09;E(RHF)=-323.195485125 A.U.;PATH=Calculation 2;Standard
B       0.00000      0.00000      0.00000
F       0.00000      1.30111      0.00000
F       1.12679     -0.65055      0.00000
F      -1.12679     -0.65055     -0.00000
4
Model[2]: FrequencyLabel=E';ForceConstant=2.7199 mDyne/A;ReducedMass=17.8986 AMU;FreqValue=507.8578;Frequency=507.8578 cm^-1;Mode=1;PATH=Calculation 2;FrequenciesFrequencies;IRIntensity=16.4808 KM/Mole;PATH=Calculation 2;FrequenciesFrequencies
B       0.00000      0.00000      0.00000     -0.37000      0.00000      0.00000
F       0.00000      1.30111      0.00000      0.60001      0.00000     -0.00000
F       1.12679     -0.65055      0.00000     -0.19000      0.46001     -0.00000
F      -1.12679     -0.65055     -0.00000     -0.19000     -0.46001     -0.00000
4
Model[3]: FrequencyLabel=E';ForceConstant=2.7199 mDyne/A;ReducedMass=17.8986 AMU;FreqValue=507.8578;Frequency=507.8578 cm^-1;Mode=2;PATH=Calculation 2;FrequenciesFrequencies;IRIntensity=16.4808 KM/Mole;PATH=Calculation 2;FrequenciesFrequencies
B       0.00000      0.00000      0.00000      0.00000      0.37000      0.00000
F       0.00000      1.30111      0.00000     -0.00000      0.46001     -0.00000
F       1.12679     -0.65055      0.00000     -0.46001     -0.34000     -0.00000
F      -1.12679     -0.65055     -0.00000      0.46001     -0.34000     -0.00000
4
Model[4]: FrequencyLabel=A2";ForceConstant=3.7896 mDyne/A;ReducedMass=11.8135 AMU;FreqValue=737.8691;Frequency=737.8691 cm^-1;Mode=3;PATH=Calculation 2;FrequenciesFrequencies;IRIntensity=148.7445 KM/Mole;PATH=Calculation 2;FrequenciesFrequencies
B       0.00000      0.00000      0.00000      0.00000     -0.00000      0.95000
F       0.00000      1.30111      0.00000     -0.00000      0.00000     -0.18001
F       1.12679     -0.65055      0.00000      0.00000     -0.00000     -0.18001
F      -1.12679     -0.65055     -0.00000      0.00000      0.00000     -0.18001
4
Model[5]: FrequencyLabel=A1';ForceConstant=9.9439 mDyne/A;ReducedMass=18.9984 AMU;FreqValue=942.5271;Frequency=942.5271 cm^-1;Mode=4;PATH=Calculation 2;FrequenciesFrequencies;IRIntensity=0.0000 KM/Mole;PATH=Calculation 2;FrequenciesFrequencies
B       0.00000      0.00000      0.00000     -0.00000      0.00000     -0.00000
F       0.00000      1.30111      0.00000      0.00000      0.58000      0.00000
F       1.12679     -0.65055      0.00000      0.50000     -0.29000      0.00000
F      -1.12679     -0.65055     -0.00000     -0.50000     -0.29000      0.00000
4
Model[6]: FrequencyLabel=E';ForceConstant=17.9423 mDyne/A;ReducedMass=12.2829 AMU;FreqValue=1574.5787;Frequency=1574.5787 cm^-1;Mode=5;PATH=Calculation 2;FrequenciesFrequencies;IRIntensity=484.5663 KM/Mole;PATH=Calculation 2;FrequenciesFrequencies
B       0.00000      0.00000      0.00000     -0.00000      0.92000      0.00000
F       0.00000      1.30111      0.00000      0.00000     -0.32000     -0.00000
F       1.12679     -0.65055      0.00000      0.13000     -0.10000     -0.00000
F      -1.12679     -0.65055     -0.00000     -0.13000     -0.10000     -0.00000
4
Model[7]: FrequencyLabel=E';ForceConstant=17.9423 mDyne/A;ReducedMass=12.2829 AMU;FreqValue=1574.5787;Frequency=1574.5787 cm^-1;Mode=6;PATH=Calculation 2;FrequenciesFrequencies;IRIntensity=484.5663 KM/Mole;PATH=Calculation 2;FrequenciesFrequencies
B       0.00000      0.00000      0.00000      0.92000      0.00000      0.00000
F       0.00000      1.30111      0.00000     -0.03000     -0.00000     -0.00000
F       1.12679     -0.65055      0.00000     -0.25000      0.13000     -0.00000
F      -1.12679     -0.65055     -0.00000     -0.25000     -0.13000     -0.00000
</ModelData>
</Models>
##$PEAKS=
<Peaks type="IR" xUnitsExpected="1/cm"  >
<PeakData id="1" title="1 (~1575 cm-1)" peakShape="broad" model="1.7" xMax="1590" xMin="1560"    />
<PeakData id="2" title="2 inactive (~940 cm-1)" peakShape="broad" model="1.6" xMax="960" xMin="920"    />
<PeakData id="3" title="3 (~740 cm-1)" peakShape="broad" model="1.5" xMax="760" xMin="720"    />
<PeakData id="4" title="4 (~510 cm-1)" peakShape="broad" model="1.4" xMax="530" xMin="490"    />
</Peaks>
##XUNITS= 1/CM
##YUNITS= TRANSMITTANCE
##XFACTOR= 1
##YFACTOR= 9.999000E-07
##FIRSTX= 1.774579E+03
##FIRSTY= 1
##LASTX= 3.078581E+02
##NPOINTS= 2001
##MINY= 1.000000E-04
##MAXY= 1
##XYDATA= (X++(Y..Y))
1774.579 1000100 999580 999060 998540 998020 997500 996980 996460 995940 995420 994899 994379 993859 993339 992819 992299 991779 991259 990739 990219 989699 989179 988659 988139 987619 987099 986579 986059 985539 985019 984498 983978 983458 982938 982418 981898 981378 980858 980338 979818 979298 978778 978258 977738 977218 976698 976178 975658 975138 974617 974097 973577 973057 972537 972017 971497 970977 970457 969937 969417 968897 968377 967857 967337 966817 966297 965777 965257 964736 964216 963696 963176 962656 962136 961616 961096 960576 960056 959536 959016 958496 957976 957456 956936 956416 955896 955376 954855 954335 953815 953295 952775 952255 951735 951215 950695 950175 949655 949135 948615 948095 947575 947055 946535 946015 945495 944974 944454
1695.376 943934 943414 942894 942374 936076 935302 934515 933713 932897 932065 931219 930357 929479 928584 927672 926744 925797 924833
1682.1757 923850 922848 921826 920784 919722 918639 917534 916407 915257 914084 912886 911664 910417
1672.6418 909144 907844 906516 905161 903776 902362 900916 899440 897931 896388 894812 893199 891551
1663.1082 889865 888141 886377 884572 882725 880835 878900 876919 874891 872814 870686 868506 866273
1653.5745 863984 861638 859233 856767 854238 851644 848983 846253 843451 840575 837623 834591 831478
1644.0408 828280 824994 821618 818148 814581 810914 807142 803263 799273 795166 790940 786590 782112
1634.5071 777500 772750 767857 762816 757620 752265 746745 741053 735183 729128 722882 716437 709787
1624.9734 702923 695838 688524 680972 673174 665121 656804 648214 639342 630178 620712 610935 600837
1615.4398 590408 579640 568522 557045 545201 532981 520379 507387 494001 480216 466029
1607.3729 451440 436452 421067 405295 389145 372632 355778 338606 321149 303443 285533
1599.3058 267472 249321 231149 213036 195069 177346 159970 143054 126715 111071 96241
1591.2389 82339 69469 57721 47163 37841 29767 22924 17258 12688 9102 6370 4353 2910
1581.7053 1910 1237 798 518 342 234 169 130 109 100 101 113 138 183 258 380 579 895 1387 2134 3238
1566.3046 4818 7007 9949 13779 18625 24591 31751 40150 49797 60670 72718 85867 100021
1556.7709 115074 130911 147412 164459 181936 199732 217746 235883 254056 272190 290217
1548.704 308079 325724 343111 360202 376970 393389 409442 425115 440397 455281 469765
1540.637 483847 497528 510811 523701 536202 548323 560071 571453 582480 593159 603500
1532.57 613513 623208 632595 641682 650480 658997 667245 675230 682963 690452 697706 704733 711540
1523.0363 718136 724529 730724 736730 742553 748200 753677 758990 764144 769147 774002 778715 783292
1513.5026 787736 792054 796248 800324 804285 808136 811880 815520 819062 822507 825859 829122 832297
1503.9691 835389 838400 841332 844189 846971 849683 852327 854903 857416 859865 862255 864586 866860
1494.4353 869079 871246 873360 875424 877440 879409 881332 883211 885047 886841 888594 890308 891984
1484.9017 893623 895226 896794 898327 899828 901296 902733 904140 905517 906865 908185 909478 910745
1475.368 911985 913201 914392 915559 916703 917824 918923 920001 921058 922094 923111 924108 925086 926046
1465.101 926987 927912 928819 929709 930583 931441 932284 933111 933923 934721 935505 936275 937032 937432 937832 938232 938632 939032 939432 939832 940232 940632 941032 941432 941832 942232 942632 943033 943433
1443.8334I43833M00T2M01M00T4M01M00T4M01M00T4M01M00T4M01M00VN462A000100
1348.4966A000100%W83j00W0j01j00U5j258j21j24j25j28j31j33j35j38I89065
849.81146 988922 988776 988627 988475 988320 988162 988001 987836 987668 987497 987322 987143 986961 986775 986585 986390 986192
837.34436 985989 985782 985570 985354 985133 984906 984675 984438 984196 983948 983695 983435 983170 982898 982619 982333 982041
824.8772 981741 981434 981120 980797 980466 980126 979778 979421 979054 978677 978291 977893 977485 977066 976635 976192 975737
812.4101 975268 974786 974290 973780 973254 972712 972155 971580 970987 970376 969746 969096 968425 967732 967017 966278 965515
799.943 964725 963909 963065 962191 961286 960350 959379 958373 957331 956249 955127 953961 952751 951494 950187
788.94257 948828 947414 945942 944409 942812 941147 939410 937597 935705 933728 931661 929499 927237
779.4089 924868 922386 919784 917054 914188 911177 908013 904684 901180 897490 893600 889496 885165
769.8752 880589 875753 870636 865219 859480 853396 846941 840088 832808 825068 816835 808072 798740
760.3415 788799 778204 766910 754868 742030 728344 713762 698233 681713 664160 645540
752.27454 625833 605033 583153 560234 536349 511612 486182 460268 434138 408114 382569
744.2076 357923 334622 313121 293864 277255 263647 253323 246491 243285 243766 247926 255684
735.4072 266888 281308 298643 318526 340540 364235 389158 414866 440952 467055 492866
727.3403 518134 542662 566304 588958 610559 631075 650497 668836 686116 702374 717652
719.2733 731995 745455 758081 769923 781031 791451 801229 810409 819030 827131 834748 841914
710.473 848661 855017 861008 866661 871998 877039 881806 886316 890587 894633 898470 902111 905568
700.9393 908853 911976 914948 917778 920474 923044 925496 927837 930072 932209 934252 936206 938077
691.40564 939870 941587 943235 944815 946332 947788 949188 950533 951826 953071 954269 955423 956535
681.87195 957606 958639 959635 960597 961525 962422 963288 964124 964934 965716 966473 967206 967915 968602 969267 969912 970537
669.4048 971143 971731 972302 972855 973392 973914 974421 974913 975392 975857 976309 976749 977177 977593 977998 978392 978776
656.9377 979150 979515 979870 980216 980553 980882 981202 981515 981820 982118 982409 982692 982969 983239 983503 983761 984014
644.4706 984260 984500 984736 984966 985191 985411 985626 985836 986042 986244 986441 986635 986824 987009 987190 987368 987542
632.0034 987712 987879 988043 988203 988361 988515 986524 986646 986764 986879 986991 987100 987205 987308 987407 987504 987597
619.5363 987688 987776 987861 987861 987861 987861 987861 987861 987861 987861 987861 987861 987861 987861 987861 987861 987861 987861 987861 987861 987861 987861 987861 987861 987861 987861 987861 987861 987861 987861 987861 987861 987861 987861 987861 987861 987861 987861 987861 987861 987861 987861 987861 987861 987861 987861 987861 987861 987861 987861 987861 987861 987861 987861 987861 987861 987861 987861 987861 987861 987861 987861 987861 987861 987861 987861 987861 987861 987861 987861 987861 987861 987861 987861 987861 987861 987861 987861 987861 987861 987861 987861 987861 987861 987861 987837 987482 987112 986725 986322 985900 985458 984996 984513 984006 983475 982918 982333 981718
546.9336 981071 980391 979675 978920 978123 977283 976394 975455 974460 973407 972290 971104 969844 968503 967076
535.9332 965555 963932 962198 960344 958359 956231 953948 951496 948859 946020 942960 939659 936094
526.39954 932240 928071 923559 918671 913376 907639 901424 894698 887425 879575 871124 862056 852371
516.86584 842088 831252 819942 808282 796442 784649 773187 762387 752622 744275 737715 733259
508.06552 731135 731456 734203 739234 746292 755046 765118 776125 787704 799533 811346 822930
499.2652 834126 844824 854954 864479 873385 881678 889375 896502 903092 909179 914797 919983 924770
489.7315 929190 933274 937050 940544 943780 946780 949565 952152 954559 956800 958889 960839 962661
480.1978 964365 965961 967457 968861 970179 971420 972587 973687 974725 975705 976630 977506 978335 979120
469.93076 979865 980572 981243 981881 982488 983066 983616 984141 984641 985119 985575 986011 986429 986828 987210 987576 987927
457.46362 988264 988587 988898 989196 989482 989758 990023 990278 990524 990760 990988 991208 991421 991625 991823 992014 992198
444.99652 992376 992549 992716 992877 993033 993184 993330 993472 993610 993743 993872 993997 994119 994237 994352 994463 994571
432.5294 994676 994778 994878 994974 995068 995160 995248 995335 995419 995501 995581 995659 995735 995809 995881 995952 996020 996087 996152 996216 996278 996339 996398
415.66208 996456 996513 996568 996622 996675 996726 996777 996826 996874 996921 996968 997013 997057 997100 997143 997184 997225 997264 997303 997342 997379 997416 997451 997487 997521 997555 997588 997621 997652 997684
393.6613 997714 997744 997774 997803 997831 997859 997887 997914 997940 1000100 1000100 1000100 1000100 1000100 1000100 1000100 1000100 1000100 1000100 1000100 1000100 1000100 1000100 1000100 1000100 1000100 1000100 1000100 1000100 1000100 1000100 1000100 1000100 1000100 1000100 1000100 1000100 1000100 1000100 1000100 1000100 1000100 1000100 1000100 1000100 1000100 1000100 1000100 1000100 1000100 1000100 1000100 1000100 1000100 1000100 1000100 1000100 1000100 1000100 1000100 1000100 1000100 1000100 1000100 1000100 1000100 1000100 1000100 1000100 1000100 1000100 1000100 1000100 1000100 1000100 1000100 1000100 1000100 1000100 1000100 1000100 1000100 1000100 1000100 1000100 1000100 1000100 1000100 1000100 1000100 1000100 1000100 1000100 1000100 1000100 1000100 1000100 1000100 1000100 1000100 1000100 1000100 1000100 1000100 1000100 1000100 1000100 1000100 1000100 1000100 1000100 1000100 1000100 1000100 1000100 1000100 1000100
307.8581A000100  $$checkpoint
##END= $$ end of IR BF3 Block
##TITLE=Raman of cis-1,2-dichloroethylene (Z) $$ Begin of the data block
##JCAMP-DX=5.00 $$ ACD/DocManager Library v 5.00
##DATA TYPE=RAMAN SPECTRUM
##DATA CLASS=XYDATA
##BLOCK ID=2
##DATE=19 Feb 2012 10:29:22
##ORIGIN= Department of Chemistry, UWI, Jamaica
##OWNER= public domain
##SPECTROMETER/DATA SYSTEM=from scan
##$MODELS=
<Models>
<ModelData id="RBF3" type="MOL">
boron trifluoride BF3
__Jmol-14_02271910533D 1   1.00000     0.00000     0
Jmol version 14.29.31  2019-01-29 15:30 EXTRACT: ({0:3})
  4  3  0  0  0  0            999 V2000
    0.0000    0.0000    0.0000 B   0  0  0  0  0  0
    0.0000    1.3011    0.0000 F   0  0  0  0  0  0
    1.1268   -0.6506    0.0000 F   0  0  0  0  0  0
   -1.1268   -0.6506   -0.0000 F   0  0  0  0  0  0
  1  3  1  0  0  0
  1  2  1  0  0  0
  4  1  1  0  0  0
M  END
</ModelData>
<ModelData id="2" type="XYZVIB" baseModel="RBF3" vibrationScale=".5">
4
Model[1]: PATH=Calculation 2;Standard;Energy=-323.1955;Range=M.O.s;NFock==Conv=0.33D-09;E(RHF)=-323.195485125 A.U.;PATH=Calculation 2;Standard
B       0.00000      0.00000      0.00000
F       0.00000      1.30111      0.00000
F       1.12679     -0.65055      0.00000
F      -1.12679     -0.65055     -0.00000
4
Model[2]: FrequencyLabel=E';ForceConstant=2.7199 mDyne/A;ReducedMass=17.8986 AMU;FreqValue=507.8578;Frequency=507.8578 cm^-1;Mode=1;PATH=Calculation 2;FrequenciesFrequencies;IRIntensity=16.4808 KM/Mole;PATH=Calculation 2;FrequenciesFrequencies
B       0.00000      0.00000      0.00000     -0.37000      0.00000      0.00000
F       0.00000      1.30111      0.00000      0.60001      0.00000     -0.00000
F       1.12679     -0.65055      0.00000     -0.19000      0.46001     -0.00000
F      -1.12679     -0.65055     -0.00000     -0.19000     -0.46001     -0.00000
4
Model[3]: FrequencyLabel=E';ForceConstant=2.7199 mDyne/A;ReducedMass=17.8986 AMU;FreqValue=507.8578;Frequency=507.8578 cm^-1;Mode=2;PATH=Calculation 2;FrequenciesFrequencies;IRIntensity=16.4808 KM/Mole;PATH=Calculation 2;FrequenciesFrequencies
B       0.00000      0.00000      0.00000      0.00000      0.37000      0.00000
F       0.00000      1.30111      0.00000     -0.00000      0.46001     -0.00000
F       1.12679     -0.65055      0.00000     -0.46001     -0.34000     -0.00000
F      -1.12679     -0.65055     -0.00000      0.46001     -0.34000     -0.00000
4
Model[4]: FrequencyLabel=A2";ForceConstant=3.7896 mDyne/A;ReducedMass=11.8135 AMU;FreqValue=737.8691;Frequency=737.8691 cm^-1;Mode=3;PATH=Calculation 2;FrequenciesFrequencies;IRIntensity=148.7445 KM/Mole;PATH=Calculation 2;FrequenciesFrequencies
B       0.00000      0.00000      0.00000      0.00000     -0.00000      0.95000
F       0.00000      1.30111      0.00000     -0.00000      0.00000     -0.18001
F       1.12679     -0.65055      0.00000      0.00000     -0.00000     -0.18001
F      -1.12679     -0.65055     -0.00000      0.00000      0.00000     -0.18001
4
Model[5]: FrequencyLabel=A1';ForceConstant=9.9439 mDyne/A;ReducedMass=18.9984 AMU;FreqValue=942.5271;Frequency=942.5271 cm^-1;Mode=4;PATH=Calculation 2;FrequenciesFrequencies;IRIntensity=0.0000 KM/Mole;PATH=Calculation 2;FrequenciesFrequencies
B       0.00000      0.00000      0.00000     -0.00000      0.00000     -0.00000
F       0.00000      1.30111      0.00000      0.00000      0.58000      0.00000
F       1.12679     -0.65055      0.00000      0.50000     -0.29000      0.00000
F      -1.12679     -0.65055     -0.00000     -0.50000     -0.29000      0.00000
4
Model[6]: FrequencyLabel=E';ForceConstant=17.9423 mDyne/A;ReducedMass=12.2829 AMU;FreqValue=1574.5787;Frequency=1574.5787 cm^-1;Mode=5;PATH=Calculation 2;FrequenciesFrequencies;IRIntensity=484.5663 KM/Mole;PATH=Calculation 2;FrequenciesFrequencies
B       0.00000      0.00000      0.00000     -0.00000      0.92000      0.00000
F       0.00000      1.30111      0.00000      0.00000     -0.32000     -0.00000
F       1.12679     -0.65055      0.00000      0.13000     -0.10000     -0.00000
F      -1.12679     -0.65055     -0.00000     -0.13000     -0.10000     -0.00000
4
Model[7]: FrequencyLabel=E';ForceConstant=17.9423 mDyne/A;ReducedMass=12.2829 AMU;FreqValue=1574.5787;Frequency=1574.5787 cm^-1;Mode=6;PATH=Calculation 2;FrequenciesFrequencies;IRIntensity=484.5663 KM/Mole;PATH=Calculation 2;FrequenciesFrequencies
B       0.00000      0.00000      0.00000      0.92000      0.00000      0.00000
F       0.00000      1.30111      0.00000     -0.03000     -0.00000     -0.00000
F       1.12679     -0.65055      0.00000     -0.25000      0.13000     -0.00000
F      -1.12679     -0.65055     -0.00000     -0.25000     -0.13000     -0.00000
</ModelData>
</Models>
##$PEAKS=
<Peaks type="RAMAN" xUnitsExpected="1/cm"  >
<PeakData id="1" title="1 (~1575 cm-1)" peakShape="broad" model="2.7" xMax="1590" xMin="1560"    />
<PeakData id="2" title="2 (~940 cm-1)" peakShape="broad" model="2.6" xMax="960" xMin="920"    />
<PeakData id="3" title="3 inactive (~740 cm-1)" peakShape="broad" model="2.5" xMax="760" xMin="720"    />
<PeakData id="4" title="4 (~510 cm-1)" peakShape="broad" model="2.4" xMax="530" xMin="490"    />
</Peaks>
##XUNITS=1/CM
##YUNITS=RAMAN INTENSITY
##XFACTOR= 1
##YFACTOR= 8.001319E-07
##FIRSTX= 1.774579E+03
##FIRSTY= 0
##LASTX= 3.078578E+02
##NPOINTS= 2001
##MINY= 0
##MAXY= 8.001319E-01
##XYDATA= (X++(Y..Y))
1774.5787@%S08O09PQTPQRQRQRUJ0RJ0VJ1VJ2J1J2TJ3VJ4UJ5UJ6UJ7TJ8A115
1662.3745 1133 1152 1172 1192 1212 1233 1255 1277 1300 1323 1347 1371 1397 1423 1449 1477 1505 1534 1564 1595 1626 1659 1692 1727 1763 1799 1837 1877 1917 1959 2002 2046
1638.907 2092 2140 2189 2240 2292 2347 2403 2462 2523 2585 2651 2718 2789 2862 2938 3017 3099 3184 3273 3366 3463 3564 3669 3779
1621.3064 3894 4014 4139 4271 4409 4553 4705 4864 5031 5207 5392 5586 5792 6008 6236 6478 6733 7003
1608.1058 7289 7593 7915 8258 8622 9010 9424 9866 10338 10844 11385 11966 12590 13260 13983 14762 15603 16512
1594.9054 17496 18563 19721 20979 22347 23836 25459 27227 29155 31258 33549 36042 38752 41689
1584.6383 44860 48267 51902 55746 59766 63908 68095 72225 76173 79792 82922 85406 87107 87921
1574.3713 87798 86745 84829 82162 78889 75170 71161 67005 62821 58704 54726 50933 47356 44011
1564.1042 40901 38024 35372 32933 30692 28637 26751 25022 23436 21979 20641 19410 18277 17232
1553.8372 16268 15377 14553 13789 13081 12423 11810 11240 10709 10212 9748 9314 8907 8525 8166 7829 7512
1541.3701 7213 6931 6665 6413 6176 5950 5737 5535 5343 5160 4987 4822 4665 4515 4372 4236 4106 3982
1528.1696 3863 3750 3641 3537 3437 3341 3250 3162 3077 2996 2918 2842 2770 2700 2633 2569 2506 2446 2388 2333 2279 2226 2176
1511.3022 2127 2080 2034 1990 1948 1906 1866 1827 1790 1753 1718 1684 1650 1618 1586 1556 1526 1497 1469 1442 1416 1390 1365 1340 1317 1294 1271 1249 1228 1207
1489.3015 1186 1167 1147 1128 1110 1092 1075 1057 1041 1024 1009 993 978 963 948 934 920 907 893 880 868 855 843 831 820 808 797 786
1468.7673G75j0j1j0Trj0rWqTrqpqTpo07%W33O924Q4Q7Q8R0R1R4TR7R9G848
1054.4187 7951 8056 8162 8271 8382 8495 8611 8728 8849 8971 9097 9225 9355 9489 9625 9764 9907 10052
1041.2183 10201 10353 10508 10667 10829 10996 11166 11340 11518 11700 11887 12078 12274 12474 12680 12890 13106
1028.7511 13328 13554 13787 14026 14271 14522 14780 15045 15318 15597 15884 16180 16483 16795 17116 17446 17786
1016.284 18136 18496 18867 19249 19642 20048 20467 20898 21343 21803 22277 22767 23273 23796 24337 24896 25475
1003.8169 26074 26694 27336 28001 28691 29406 30148 30918 31718 32549 33412 34310 35244 36216 37229 38284 39384
991.34973 40531 41729 42979 44286 45652 47081 48578 50145 51788 53512 55322 57223 59221 61324
981.0827 63538 65872 68333 70931 73676 76579 79652 82908 86361 90027 93923 98068 102483 107191
970.8157 112216 117587 123334 129492 136097 143191 150821 159038 167898 177464 187806 199001 211136
961.282 224304 238611 254171 271110 289563 309678 331610 355521 381577 409940 440761
953.21497 474163 510230 548977 590322 634052 679775 726882 774502 821481 866383 907538
945.148 943139 971398 990739 1000000 998601 986631 964834 934498 897273 854971 809374 762101
936.3477 714515 667696 622443 579305 538623 500571 465203 432484 402317 374570 349089
928.28076 325710 304267 284600 266555 249988 234766 220767 207878 195996 185031 174899
920.2138 165523 156837 148778 141293 134330 127845 121798 116152 110874 105934 101305 96963 92884
910.6801 89050 85441 82041 78834 75806 72946 70240 67679 65252 62950 60766 58691 56718 54842
900.413 53055 51353 49729 48181 46702 45290 43940 42648 41412 40227 39093 38005 36961 35959
890.146 34997 34073 33184 32329 31506 30715 29952 29217 28509 27825 27166 26530 25916 25322 24749 24194 23658
877.6789 23140 22638 22152 21682 21226 20784 20356 19941 19539 19148 18769 18401 18044 17697 17359 17032 16713
865.21173 16403 16102 15809 15524 15246 14976 14713 14456 14206 13963 13726 13495 13269 13049 12835 12626 12422
852.7446 12222 12028 11838 11652 11471 11294 11121 10952 10787 10625 10467 10313 10162 10014 9869 9728 9589
840.27747 9454 9321 9191 9064 8939 8817 8697 8580 8465 8353 8242 8134 8028 7924 7822 7722 7624 7528
827.077G433r3r1q9q8q6q4o902%T64K954L6L7TL9UM1TM2M3M4M5TM7C576
615.8692 3624 3673 3724 3775 3827 3881 3935 3991 4048 4106 4166 4226 4288 4352 4417 4483 4551 4620 4691 4763 4838 4914 4991 5071 5153 5236 5322
596.0685 5409 5499 5591 5686 5783 5882 5984 6088 6195 6306 6419 6535 6654 6777 6903 7032 7165 7302 7443
582.1346 7588 7737 7891 8049 8212 8380 8553 8731 8915 9105 9301 9504 9713 9929 10152 10383 10621 10868
568.93414 11123 11388 11662 11946 12240 12545 12862 13190 13531 13886 14254 14637 15036 15450 15882 16333 16802
556.467 17291 17802 18336 18893 19476 20086 20724 21393 22094 22829 23601 24412 25265 26162 27106 28102 29152
543.9999 30260 31431 32670 33981 35370 36843 38407 40069 41837 43721 45729 47873 50165 52616
533.7328 55243 58061 61088 64343 67848 71628 75709 80121 84897 90074 95692 101795 108433 115660
523.46576 123532 132114 141470 151671 162787 174887 188036 202286 217672 234202 251841 270497
514.66547 290003 310100 330415 350457 369613 387170 402358 414414 422665 426616 426019 420913
505.8651 411614 398672 382791 364744 345292 325125 304824 284850 265544 247141 229785
497.79816 213552 198463 184505 171635 159798 148927 138953 129805 121415 113717 106649 100155
488.99783 94183 88684 83615 78937 74615 70615 66909 63471 60278 57307 54541 51961 49552 47301
478.73077 45193 43218 41366 39626 37990 36450 35000 33632 32340 31120 29966 28873 27837 26856
468.46375 25924 25038 24197 23396 22634 21908 21215 20555 19924 19321 18745 18194 17667 17162 16678 16213 15768
455.9966 15341 14930 14536 14157 13792 13441 13103 12778 12464 12162 11871 11590 11318 11056 10803 10558 10322
443.52948 10093 9872 9658 9450 9250 9055 8867 8684 8507 8335 8169 8007 7850 7698 7550 7406 7266
431.06235 7130 6998 6869 6744 6623 6504 6389 6277 6167 6061 5957 5856 5757 5661 5567 5476 5386 5299 5214 5131
416.39514 5050 4971 4894 4818 4744 4672 4602 4533 4465 4400 4335 4272 4210 4150 4091 4033 3976 3921 3867 3814 3761 3710 3660 3611 3563 3516
397.3278C470m5m4Tm3m2m1m0Tl8Ul7l6k944%S06@
307.8578@  $$checkpoint
##END=$$ End of the RAMAN BF3 BLOCK
##TITLE= B(OH)3
##JCAMP-DX= 5.01
##DATA TYPE= INFRARED SPECTRUM
##DATA CLASS= XYDATA
##BLOCK ID=3
##ORIGIN= Department of Chemistry, UWI, JAMAICA
##OWNER= public domain
##LONGDATE= 2012/02/18 12:32:26.0301 -0500 $$ export date from JSpecView
##SPECTROMETER/DATA SYSTEM= from scan
##$MODELS=
<Models>
<ModelData id="IB(OH)3" type="MOL">
B(OH)3.mol
__Jmol-14_02271911103D 1   1.00000     0.00000     0
Jmol version 14.29.31  2019-01-29 15:30 EXTRACT: ({0:6})
  7  6  0  0  0  0            999 V2000
    0.0000    0.0000    0.0000 B   0  0  0  0  0  0
    0.0000    1.5300    0.0000 O   0  0  0  0  0  0
   -0.9093    2.0550    0.0000 H   0  0  0  0  0  0
   -1.3250   -0.7650    0.0000 O   0  0  0  0  0  0
   -1.3250   -1.8150    0.0000 H   0  0  0  0  0  0
    1.3250   -0.7650    0.0000 O   0  0  0  0  0  0
    2.2344   -0.2400   -0.0000 H   0  0  0  0  0  0
  1  6  1  0  0  0
  1  2  1  0  0  0
  3  2  1  0  0  0
  4  5  1  0  0  0
  4  1  1  0  0  0
  6  7  1  0  0  0
M  END
</ModelData>
<ModelData id="3" type="XYZVIB" baseModel="IB(OH)3" vibrationScale=".5">
7
Model[1]: PATH=Calculation 1;Standard;Energy=-251.08131;Range=M.O.s;NFock==Conv=0.41D-08;E(RHF)=-251.081320805 A.U.;PATH=Calculation 1;Standard
B       0.00000      0.00000      0.00000
O       0.00000      1.53000      0.00000
H      -0.90933      2.05500      0.00000
O      -1.32502     -0.76500      0.00000
H      -1.32502     -1.81500      0.00000
O       1.32502     -0.76500      0.00000
H       2.23435     -0.24000     -0.00000
7
Model[2]: FrequencyLabel=E';ForceConstant=0.8211 mDyne/A;ReducedMass=7.0847 AMU;FreqValue=443.5276;Frequency=443.5276 cm^-1;Mode=1;PATH=Calculation 1;FrequenciesFrequencies;IRIntensity=13.8494 KM/Mole;PATH=Calculation 1;FrequenciesFrequencies
B       0.00000      0.00000      0.00000     -0.04000      0.04000      0.00000
O       0.00000      1.53000      0.00000     -0.09000      0.35000     -0.00000
H      -0.90933      2.05500      0.00000     -0.12000      0.31000     -0.00000
O      -1.32502     -0.76500      0.00000      0.36001     -0.10000     -0.00000
H      -1.32502     -1.81500      0.00000      0.51000     -0.09000      0.00000
O       1.32502     -0.76500      0.00000     -0.26000     -0.26000     -0.00000
H       2.23435     -0.24000     -0.00000     -0.16000     -0.43000     -0.00000
7
Model[3]: FrequencyLabel=E';ForceConstant=0.8211 mDyne/A;ReducedMass=7.0847 AMU;FreqValue=443.5276;Frequency=443.5276 cm^-1;Mode=2;PATH=Calculation 1;FrequenciesFrequencies;IRIntensity=13.8494 KM/Mole;PATH=Calculation 1;FrequenciesFrequencies
B       0.00000      0.00000      0.00000     -0.04000     -0.04000     -0.00000
O       0.00000      1.53000      0.00000      0.36001      0.10000      0.00000
H      -0.90933      2.05500      0.00000      0.45000      0.28000      0.00000
O      -1.32502     -0.76500      0.00000     -0.09000     -0.35000      0.00000
H      -1.32502     -1.81500      0.00000      0.05000     -0.35000      0.00000
O       1.32502     -0.76500      0.00000     -0.25000      0.26000      0.00000
H       2.23435     -0.24000     -0.00000     -0.29000      0.31000      0.00000
7
Model[4]: FrequencyLabel=A';ForceConstant=1.5118 mDyne/A;ReducedMass=8.6443 AMU;FreqValue=544.8204;Frequency=544.8204 cm^-1;Mode=3;PATH=Calculation 1;FrequenciesFrequencies;IRIntensity=0.0000 KM/Mole;PATH=Calculation 1;FrequenciesFrequencies
B       0.00000      0.00000      0.00000     -0.00000     -0.00000     -0.00000
O       0.00000      1.53000      0.00000     -0.01000      0.41000      0.00000
H      -0.90933      2.05500      0.00000     -0.04000      0.40000     -0.00000
O      -1.32502     -0.76500      0.00000     -0.35000     -0.22000      0.00000
H      -1.32502     -1.81500      0.00000     -0.33001     -0.24000     -0.00000
O       1.32502     -0.76500      0.00000      0.36001     -0.20001      0.00000
H       2.23435     -0.24000     -0.00000      0.37000     -0.17000     -0.00000
7
Model[5]: FrequencyLabel=A";ForceConstant=4.1118 mDyne/A;ReducedMass=11.1285 AMU;FreqValue=791.9002;Frequency=791.9002 cm^-1;Mode=4;PATH=Calculation 1;FrequenciesFrequencies;IRIntensity=114.9670 KM/Mole;PATH=Calculation 1;FrequenciesFrequencies
B       0.00000      0.00000      0.00000     -0.00000     -0.00000      0.91001
O       0.00000      1.53000      0.00000      0.00000     -0.00000     -0.20001
H      -0.90933      2.05500      0.00000      0.00000      0.00000     -0.13000
O      -1.32502     -0.76500      0.00000      0.00000      0.00000     -0.20001
H      -1.32502     -1.81500      0.00000      0.00000      0.00000     -0.13000
O       1.32502     -0.76500      0.00000      0.00000      0.00000     -0.20001
H       2.23435     -0.24000     -0.00000     -0.00000      0.00000     -0.13000
7
Model[6]: FrequencyLabel=E';ForceConstant=3.0219 mDyne/A;ReducedMass=6.6251 AMU;FreqValue=879.8615;Frequency=879.8615 cm^-1;Mode=5;PATH=Calculation 1;FrequenciesFrequencies;IRIntensity=418.6156 KM/Mole;PATH=Calculation 1;FrequenciesFrequencies
B       0.00000      0.00000      0.00000      0.59000      0.34000      0.00000
O       0.00000      1.53000      0.00000     -0.09000     -0.04000     -0.00000
H      -0.90933      2.05500      0.00000     -0.27001     -0.39000     -0.00000
O      -1.32502     -0.76500      0.00000     -0.14000     -0.10000     -0.00000
H      -1.32502     -1.81500      0.00000     -0.02000     -0.11000     -0.00000
O       1.32502     -0.76500      0.00000     -0.16000     -0.03000     -0.00000
H       2.23435     -0.24000     -0.00000      0.10000     -0.47000     -0.00000
7
Model[7]: FrequencyLabel=E';ForceConstant=3.0219 mDyne/A;ReducedMass=6.6251 AMU;FreqValue=879.8615;Frequency=879.8615 cm^-1;Mode=6;PATH=Calculation 1;FrequenciesFrequencies;IRIntensity=418.6154 KM/Mole;PATH=Calculation 1;FrequenciesFrequencies
B       0.00000      0.00000      0.00000     -0.34000      0.59000     -0.00000
O       0.00000      1.53000      0.00000      0.07000     -0.17000      0.00000
H      -0.90933      2.05500      0.00000      0.25000      0.14000      0.00000
O      -1.32502     -0.76500      0.00000      0.01000     -0.12000     -0.00000
H      -1.32502     -1.81500      0.00000      0.54000     -0.11000      0.00000
O       1.32502     -0.76500      0.00000      0.09000     -0.10000      0.00000
H       2.23435     -0.24000     -0.00000      0.18001     -0.23001     -0.00000
7
Model[8]: FrequencyLabel=E";ForceConstant=0.8293 mDyne/A;ReducedMass=1.1351 AMU;FreqValue=1113.5696;Frequency=1113.5696 cm^-1;Mode=7;PATH=Calculation 1;FrequenciesFrequencies;IRIntensity=0.0000 KM/Mole;PATH=Calculation 1;FrequenciesFrequencies
B       0.00000      0.00000      0.00000      0.00000      0.00000      0.00000
O       0.00000      1.53000      0.00000     -0.00000     -0.00000     -0.02000
H      -0.90933      2.05500      0.00000     -0.00000     -0.00000     -0.08000
O      -1.32502     -0.76500      0.00000      0.00000     -0.00000      0.07000
H      -1.32502     -1.81500      0.00000     -0.00000     -0.00000     -0.66001
O       1.32502     -0.76500      0.00000      0.00000     -0.00000     -0.05000
H       2.23435     -0.24000     -0.00000     -0.00000      0.00000      0.74000
7
Model[9]: FrequencyLabel=E";ForceConstant=0.8293 mDyne/A;ReducedMass=1.1351 AMU;FreqValue=1113.5696;Frequency=1113.5696 cm^-1;Mode=8;PATH=Calculation 1;FrequenciesFrequencies;IRIntensity=0.0000 KM/Mole;PATH=Calculation 1;FrequenciesFrequencies
B       0.00000      0.00000      0.00000     -0.00000      0.00000     -0.00000
O       0.00000      1.53000      0.00000     -0.00000     -0.00000     -0.07000
H      -0.90933      2.05500      0.00000      0.00000      0.00000      0.81000
O      -1.32502     -0.76500      0.00000      0.00000     -0.00000      0.02000
H      -1.32502     -1.81500      0.00000     -0.00000     -0.00000     -0.48000
O       1.32502     -0.76500      0.00000     -0.00000      0.00000      0.06000
H       2.23435     -0.24000     -0.00000      0.00000     -0.00000     -0.33001
7
Model[10]: FrequencyLabel=A";ForceConstant=0.7785 mDyne/A;ReducedMass=1.0606 AMU;FreqValue=1116.1386;Frequency=1116.1386 cm^-1;Mode=9;PATH=Calculation 1;FrequenciesFrequencies;IRIntensity=475.2508 KM/Mole;PATH=Calculation 1;FrequenciesFrequencies
B       0.00000      0.00000      0.00000      0.00000     -0.00000     -0.01000
O       0.00000      1.53000      0.00000     -0.00000      0.00000     -0.03000
H      -0.90933      2.05500      0.00000     -0.00000     -0.00000      0.58000
O      -1.32502     -0.76500      0.00000     -0.00000      0.00000     -0.03000
H      -1.32502     -1.81500      0.00000      0.00000      0.00000      0.58000
O       1.32502     -0.76500      0.00000     -0.00000     -0.00000     -0.03000
H       2.23435     -0.24000     -0.00000     -0.00000      0.00000      0.58000
7
Model[11]: FrequencyLabel=A';ForceConstant=1.2940 mDyne/A;ReducedMass=1.1297 AMU;FreqValue=1394.3227;Frequency=1394.3227 cm^-1;Mode=10;PATH=Calculation 1;FrequenciesFrequencies;IRIntensity=0.0000 KM/Mole;PATH=Calculation 1;FrequenciesFrequencies
B       0.00000      0.00000      0.00000     -0.00000      0.00000     -0.00000
O       0.00000      1.53000      0.00000      0.04000      0.03000     -0.00000
H      -0.90933      2.05500      0.00000     -0.27001     -0.51000      0.00000
O      -1.32502     -0.76500      0.00000     -0.05000      0.02000      0.00000
H      -1.32502     -1.81500      0.00000      0.57000      0.02000     -0.00000
O       1.32502     -0.76500      0.00000      0.01000     -0.05000      0.00000
H       2.23435     -0.24000     -0.00000     -0.30001      0.49001     -0.00000
7
Model[12]: FrequencyLabel=E';ForceConstant=1.4128 mDyne/A;ReducedMass=1.1657 AMU;FreqValue=1434.2137;Frequency=1434.2137 cm^-1;Mode=11;PATH=Calculation 1;FrequenciesFrequencies;IRIntensity=312.1214 KM/Mole;PATH=Calculation 1;FrequenciesFrequencies
B       0.00000      0.00000      0.00000      0.07000      0.03000      0.00000
O       0.00000      1.53000      0.00000     -0.05000     -0.04000      0.00000
H      -0.90933      2.05500      0.00000      0.33001      0.60001     -0.00000
O      -1.32502     -0.76500      0.00000     -0.00000     -0.00000     -0.00000
H      -1.32502     -1.81500      0.00000     -0.04000     -0.00000      0.00000
O       1.32502     -0.76500      0.00000      0.01000     -0.06000      0.00000
H       2.23435     -0.24000     -0.00000     -0.38000      0.61000     -0.00000
7
Model[13]: FrequencyLabel=E';ForceConstant=1.4128 mDyne/A;ReducedMass=1.1657 AMU;FreqValue=1434.2137;Frequency=1434.2137 cm^-1;Mode=12;PATH=Calculation 1;FrequenciesFrequencies;IRIntensity=312.1214 KM/Mole;PATH=Calculation 1;FrequenciesFrequencies
B       0.00000      0.00000      0.00000      0.03000     -0.07000      0.00000
O       0.00000      1.53000      0.00000     -0.03000     -0.02000     -0.00000
H      -0.90933      2.05500      0.00000      0.21000      0.38000     -0.00000
O      -1.32502     -0.76500      0.00000     -0.06000      0.03000      0.00000
H      -1.32502     -1.81500      0.00000      0.81000      0.02000     -0.00000
O       1.32502     -0.76500      0.00000     -0.01000      0.03000     -0.00000
H       2.23435     -0.24000     -0.00000      0.20001     -0.32000      0.00000
7
Model[14]: FrequencyLabel=E';ForceConstant=5.1444 mDyne/A;ReducedMass=1.0666 AMU;FreqValue=2861.1435;Frequency=2861.1435 cm^-1;Mode=13;PATH=Calculation 1;FrequenciesFrequencies;IRIntensity=143.8248 KM/Mole;PATH=Calculation 1;FrequenciesFrequencies
B       0.00000      0.00000      0.00000     -0.00000     -0.00000     -0.00000
O       0.00000      1.53000      0.00000     -0.02000      0.01000     -0.00000
H      -0.90933      2.05500      0.00000      0.31000     -0.18001      0.00000
O      -1.32502     -0.76500      0.00000     -0.00000     -0.03000      0.00000
H      -1.32502     -1.81500      0.00000      0.00000      0.45000     -0.00000
O       1.32502     -0.76500      0.00000     -0.04000     -0.02000     -0.00000
H       2.23435     -0.24000     -0.00000      0.71000      0.40000      0.00000
7
Model[15]: FrequencyLabel=E';ForceConstant=5.1444 mDyne/A;ReducedMass=1.0666 AMU;FreqValue=2861.1435;Frequency=2861.1435 cm^-1;Mode=14;PATH=Calculation 1;FrequenciesFrequencies;IRIntensity=143.8248 KM/Mole;PATH=Calculation 1;FrequenciesFrequencies
B       0.00000      0.00000      0.00000      0.00000     -0.00000      0.00000
O       0.00000      1.53000      0.00000      0.04000     -0.02000      0.00000
H      -0.90933      2.05500      0.00000     -0.63000      0.37000     -0.00000
O      -1.32502     -0.76500      0.00000     -0.00000     -0.04000      0.00000
H      -1.32502     -1.81500      0.00000      0.00000      0.68000     -0.00000
O       1.32502     -0.76500      0.00000      0.00000      0.00000      0.00000
H       2.23435     -0.24000     -0.00000     -0.05000     -0.03000     -0.00000
7
Model[16]: FrequencyLabel=A';ForceConstant=5.1749 mDyne/A;ReducedMass=1.0697 AMU;FreqValue=2865.4998;Frequency=2865.4998 cm^-1;Mode=15;PATH=Calculation 1;FrequenciesFrequencies;IRIntensity=0.0000 KM/Mole;PATH=Calculation 1;FrequenciesFrequencies
B       0.00000      0.00000      0.00000     -0.00000     -0.00000      0.00000
O       0.00000      1.53000      0.00000     -0.03000      0.02000     -0.00000
H      -0.90933      2.05500      0.00000      0.50000     -0.29000      0.00000
O      -1.32502     -0.76500      0.00000     -0.00000     -0.04000     -0.00000
H      -1.32502     -1.81500      0.00000      0.00000      0.58000     -0.00000
O       1.32502     -0.76500      0.00000      0.03000      0.02000      0.00000
H       2.23435     -0.24000     -0.00000     -0.50000     -0.29000     -0.00000
</ModelData>
</Models>
##$PEAKS=
<Peaks type="IR" xUnitsExpected="1/cm"  >
<PeakData id="1" title="1 (~2860 cm-1)" peakShape="broad" model="3.14" xMax="2880" xMin="2840"    />
<PeakData id="2" title="2 (~1430 cm-1)" peakShape="broad" model="3.12" xMax="1450" xMin="1410"    />
<PeakData id="3" title="3 (~1395 cm-1)" peakShape="broad" model="3.11" xMax="1410" xMin="1380"    />
<PeakData id="4" title="4 (~1115 cm-1)" peakShape="broad" model="3.10" xMax="1130" xMin="1100"    />
<PeakData id="5" title="5 (~880 cm-1)" peakShape="broad" model="3.6" xMax="900" xMin="860"    />
<PeakData id="6" title="6 (~790 cm-1)" peakShape="broad" model="3.5" xMax="810" xMin="770"    />
<PeakData id="7" title="7 (~440 cm-1)" peakShape="broad" model="3.2" xMax="460" xMin="420"    />
</Peaks>
##XUNITS= 1/CM
##YUNITS= TRANSMITTANCE
##XFACTOR= 1
##YFACTOR= 9.999000E-07
##FIRSTX= 3.064089E+03
##FIRSTY= 1
##LASTX= 2.435277E+02
##NPOINTS= 2000
##MINY= 1.000000E-04
##MAXY= 1
##XYDATA= (X++(Y..Y))
3064.089 1000100 1000100 1000100 1000100 1000100 1000100 1000100 1000100 1000100 1000100 1000100 1000100 1000100 1000100 1000100 1000100 1000100 1000100 1000100 1000100 1000100 1000100 1000100 1000100 1000100 1000100 1000100 1000100 999600 999100 998600 998100 997600 997100 996600 996100 995600 995100 994599 994099 993599 993099 992599 992099 991599 991099 990599 990099 989599 989099 988599 988099 987599 987099 986599 986099 985599 985099 984598 984098 983598 977466 976921 976356 975770 975163 974532 973878 973198
2966.7307 972492 971758 970994 970200 969372 968511 967612 966676 965698 964678 963612 962497 961331 960111 958833
2945.5662 957494 956089 954615 953066 951438 949725 947921 946021 944016 941900 939664 937299 934796
2927.2231 932142 929328 926339 923161 919778 916174 912328 908219 903824 899116 894067 888643 882809
2908.8806 876524 869742 862413 854481 845880 836540 826379 815308 803224 790012 775545 759680
2891.9485 742257 723100 702018 678803 653238 625098 594168 560255 523219 483014 439736
2876.4277 393700 345516 296169 247061 199976 156914 119762 89881 67777 53084 44926
2860.9067 42480 45438 54169 69524 92355 122954 160729 204254 251611 300813 350104 398122
2843.975 443920 486919 526828 563567 597193 627853 655742 681078 704083 724976 743962
2828.454 761232 776959 791303 804403 816388 827370 837450 846717 855252 863126 870401 877134
2811.5222 883375 889169 894556 899572 904249 908616 912699 916522 920105 923467 926627 929599 932398
2793.1794 935037 937527 939879 942103 944209 946203 948094 949889 951594 953214 954756 956224 957622
2774.837 958956 960228 961443 962604 963714 964775 965792 966765 967698 968593 969451 970276 971067 971828 972560
2753.672 973263 973941 974593 975221 975826 976410 976973 977516 978041 978741 979441 980141 980841 981541 982241 982941 983642 984342 985042 985742 986442 987142 987842 988542 989242 989942 990642 991342 992042 992742 993443 994143 994843 995543 996243 996943 997643 998343 999043 1000100 1000100
2695.8215A000100%Y90k100Tk101k100Vk101k100Uk101k100Vk101k100I60196
1552.9229 958096 953095 951095 949095 948052 946771 945443 944066 942637 941153 939612 938010 936345 934613
1533.1691 932811 930934 928980 926942 924818 922601 920287 917870 915344 912702 909937 907043 904010
1514.826 900830 897493 893990 890310 886441 882370 878083 873566 868802 863774 858462 852847 846905
1496.4834 840612 833942 826866 819352 811365 802868 793821 784178 773891 762907 751169 738614 725174
1478.1405 710776 695342 678787 661023 641954 621484 599514 575944 550680 523639 494753
1462.6198 463983 431329 396850 360683 323071 284386 245161 206107 168121 132250 99622
1447.0989 71303 48111 30407 17965 9995 5361 2906 1710 1190 1054 1220 1787 3071 5686
1427.3451 10582 18926 31836 50055 73752 102515 135495 171612 209741 248845 288047 326652
1410.4132 364142 400159 434471 466950 497543 526253 553125 578225 601641 623467 643801
1394.8923 662743 680390 696836 712169 726474 739828 752304 763969 774885 785109 794694
1379.3716 803688 812135 820076 827548 834585 841218 847477 853387 858973 864257 869260 874000 878495
1361.0287 882761 886812 890663 894326 897813 901134 904300 907320 910202 912955 915586 918101 920509
1342.6859 922813 925021 927137 929167 931114 932983 934779 936504 938163 939759 941295 942773 944198
1324.343 945570 946893 948169 949401 950589 953095 956096 956096 958096 960096 962096 963096 964666 964666 964666 964666 964666 964666 964666 964666 964666 964666 964666 964666 964666 964666 964666 964666 964666 964666 964666 964666 964666 964666 964666 964666 964666 964666 964666 964666 964666 964666 964666 964666 964666 964666 964666 964666 964666 964666 964666 964666 964666 964666 964666 964666 964666 964666 964666 964666 964666 964666 964666 964666 963838 962982
1231.218 962094 961175 960223 959235 958211 957148 956045 954899 953708 952470 951183 949843 948448 946995
1211.4642 945481 943902 942254 940535 938738 936860 934897 932842 930690 928435 926070 923589 920983
1193.1213 918246 915366 912336 909144 905780 902230 898482 894520 890329 885892 881189 876200 870902
1174.7784 865270 859277 852893 846085 838816 831047 822734 813829 804279 794024 783000 771136 758355
1156.4355 744569 729687 713606 696216 677398 657025 634967 611087 585250 557327 527207
1140.9149 494806 460087 423085 383935 342914 300479 257311 214343 172757 133923 99259
1125.394 69993 46887 30004 18674 11714 7823 5938 5414 6050 8089 12217 19531 31337
1107.0511 48786 72484 102298 137410 176563 218335 261368 304503 346831 387692 426650
1091.5304 463442 497944 530129 560039 587760 613408 637112 659006 679227 697906 715169
1076.0095 731133 745908 759595 772287 784068 795017 805204 814691 823539 831798 839519 846742
1059.0776 853509 859856 865814 871413 876681 881642 886319 890733 894901 898842 902571 906103 909451
1040.7347 912627 915643 918508 921233 923827 926297 928351 928351 928351 928351 928251 928151 928051 927951 927851 927751 927651 927551 927451 927351 927251 927151 927051 926950 926850 926750 926650 926550 926450 926350 926250 926150 926050 925950 925850 925750 925650 921818 919818 917818
984.2954 919822 917720 915536 913265 910904 908447 905890 903226 900451 897557 894539 891390 888101
965.9526 884665 881072 877315 873383 869265 864950 860425 855678 850694 845458 839954 834163 828068
947.6098 821647 814877 807736 800198 792234 783814 774907 765477 755486 744894 733658 721730 709060
929.26697 695596 681279 666051 649847 632601 614246 594713 573932 551837 528366 503467
913.7461 477099 445340 416172 385591 353695 320643 286675 252129 217452 183214 150102
898.2253 118903 90449 65536 44804 28600 16867 9112 4497 2047 888 390 191
881.29346 118 100 122 203 419 957 2199 4792 9619 17635 29635 46051 66883 91737 119942
860.12866 150691 183150 216540 250187 283535 316146 347695 377948 406748 434001 459658
844.6078 483705 506151 527024 546362 564208 580607 595602 609234 621536 632537 642254
829.087 650697 657862 663736 668286 671468 673216 673444 672042 668873 663771 656535 646929 634684 619500
809.3331 601056 579039 553183 523343 489600 452409 412767 372355 333564 299314 272621
793.8123 256069 251372 259179 279018 309320 347606 390924 436384 481598 524866 565157 601981
776.8805 635218 664987 691532 715156 736175 754895 771598 786538 799937 813938 827940
761.3596 841941 855943 869944 883945 897947 911948 925950 931611 935717 939476 942923 946092 949010
743.0168 951703 954193 956499 958639 960628 962480 964206 965818 967326 968737 970060 971303 972470
724.674 973569 974605 975581 976504 977375 978200 978981 979721 980423 981090 981724 982327 982901 983448 983969 984467 984941
700.6872 985395 985829 986244 986641 987022 987386 987736 988072 988394 988703 989000 989286 989561 989826 991099 991099 991099
676.7004 991099 993099 993099 995100 995100 998100 1000100 1000100 1000100 1000100 1000100 1000100 1000100 1000100 1000100 1000100 1000100 1000100 1000100 1000100 1000100 1000100 1000100 1000100 1000100 1000100 1000100 1000100 1000100 1000100 1000100 1000100 1000100 1000100 1000100 1000100 1000100 1000100 1000100 1000100 1000100 1000100 1000100 1000100 1000100 1000100 1000100 1000100 1000100 1000100 1000100 1000100 1000100 1000100 1000100 1000100 1000100 1000100 1000100 1000100 1000100 1000100 1000100 1000100 1000100 1000100 1000100 1000100 1000100 1000100 1000100 1000100 1000100 1000100 1000100 1000100 1000100 1000100 1000100 1000100 998000 997950 997898 997844 997789 997731 997671 997609 997545 997477 997408 997335
546.8897 997260 997181 997099 997014 996925 996832 996735 996633 996527 996416 996300 996178 996050 995916 995775 995627 995472 995308 995135
520.081 994953 994761 994558 994343 994115 993874 993618 993346 993057 992749 992420 992070 991695 991293 990862 990399 989902
496.0942 989365 988785 988158 987479 986740 985937 985060 984101 983049 981893 980619 979210 977647 975909 973968
474.9294 971795 969351 966593 963468 959913 955851 951192 945824 939616 932409 924019 914232 902811
456.5866 889512 874118 856501 836733 815244 793020 771756 753809 741794 737806 742605
441.06573 755280 773650 795096 817311 838670 858248 875656 890846 903958 915215 924862
425.5449 933133 940238 946361 951657 956256 960267 963778 966866 969593 972009 974160 976080 977801
407.2021 979348 980744 982006 983152 984194 985145 986015 986812 987545 988219 988842 989417 989950 990444 990904 991332
384.6263 991731 992104 992452 992779 993085 993372 993643 993897 994137 994363 994577 994779 994970 995152 995324 995487 995642
360.63953 995789 995929 996062 996190 996311 996427 996537 996643 996744 996841 996933 997022 997107 997189 997267 997342 997414 997484 997551 997615
332.41983 997677 997737 997794 997849 997903 997954 998004 1000100 1000100 1000100 1000100 1000100 1000100 1000100 1000100 1000100 1000100 1000100 1000100 1000100 1000100 1000100 1000100 1000100 1000100 1000100 1000100 1000100 1000100 1000100 1000100 1000100 1000100 1000100 1000100 1000100 1000100 1000100 1000100 1000100 1000100 1000100 1000100 1000100 1000100 1000100 1000100 1000100 1000100 1000100 1000100 1000100 1000100 1000100 1000100 1000100 1000100 1000100 1000100 1000100 1000100 1000100 1000100
243.5277A000100  $$checkpoint
##END= $$ end of B(OH)3
##TITLE=Raman of B(OH)3 $$ Begin of the data block
##JCAMP-DX=5.00 $$ ACD/DocManager Library v 5.00
##DATA TYPE=RAMAN SPECTRUM
##DATA CLASS=XYDATA
##BLOCK ID=4
##DATE=19 Feb 2012 10:30:00
##ORIGIN= Department of Chemistry, UWI, Jamaica
##OWNER= public domain
##SPECTROMETER/DATA SYSTEM= Gaussian simulation from WebMO.net
##$MODELS=
<Models>
<ModelData id="RB(OH)3" type="MOL">
B(OH)3.mol
__Jmol-14_02271911103D 1   1.00000     0.00000     0
Jmol version 14.29.31  2019-01-29 15:30 EXTRACT: ({0:6})
  7  6  0  0  0  0            999 V2000
    0.0000    0.0000    0.0000 B   0  0  0  0  0  0
    0.0000    1.5300    0.0000 O   0  0  0  0  0  0
   -0.9093    2.0550    0.0000 H   0  0  0  0  0  0
   -1.3250   -0.7650    0.0000 O   0  0  0  0  0  0
   -1.3250   -1.8150    0.0000 H   0  0  0  0  0  0
    1.3250   -0.7650    0.0000 O   0  0  0  0  0  0
    2.2344   -0.2400   -0.0000 H   0  0  0  0  0  0
  1  6  1  0  0  0
  1  2  1  0  0  0
  3  2  1  0  0  0
  4  5  1  0  0  0
  4  1  1  0  0  0
  6  7  1  0  0  0
M  END
</ModelData>
<ModelData id="4" type="XYZVIB" baseModel="RB(OH)3" vibrationScale=".5">
7
Model[1]: PATH=Calculation 1;Standard;Energy=-251.08131;Range=M.O.s;NFock==Conv=0.41D-08;E(RHF)=-251.081320805 A.U.;PATH=Calculation 1;Standard
B       0.00000      0.00000      0.00000
O       0.00000      1.53000      0.00000
H      -0.90933      2.05500      0.00000
O      -1.32502     -0.76500      0.00000
H      -1.32502     -1.81500      0.00000
O       1.32502     -0.76500      0.00000
H       2.23435     -0.24000     -0.00000
7
Model[2]: FrequencyLabel=E';ForceConstant=0.8211 mDyne/A;ReducedMass=7.0847 AMU;FreqValue=443.5276;Frequency=443.5276 cm^-1;Mode=1;PATH=Calculation 1;FrequenciesFrequencies;IRIntensity=13.8494 KM/Mole;PATH=Calculation 1;FrequenciesFrequencies
B       0.00000      0.00000      0.00000     -0.04000      0.04000      0.00000
O       0.00000      1.53000      0.00000     -0.09000      0.35000     -0.00000
H      -0.90933      2.05500      0.00000     -0.12000      0.31000     -0.00000
O      -1.32502     -0.76500      0.00000      0.36001     -0.10000     -0.00000
H      -1.32502     -1.81500      0.00000      0.51000     -0.09000      0.00000
O       1.32502     -0.76500      0.00000     -0.26000     -0.26000     -0.00000
H       2.23435     -0.24000     -0.00000     -0.16000     -0.43000     -0.00000
7
Model[3]: FrequencyLabel=E';ForceConstant=0.8211 mDyne/A;ReducedMass=7.0847 AMU;FreqValue=443.5276;Frequency=443.5276 cm^-1;Mode=2;PATH=Calculation 1;FrequenciesFrequencies;IRIntensity=13.8494 KM/Mole;PATH=Calculation 1;FrequenciesFrequencies
B       0.00000      0.00000      0.00000     -0.04000     -0.04000     -0.00000
O       0.00000      1.53000      0.00000      0.36001      0.10000      0.00000
H      -0.90933      2.05500      0.00000      0.45000      0.28000      0.00000
O      -1.32502     -0.76500      0.00000     -0.09000     -0.35000      0.00000
H      -1.32502     -1.81500      0.00000      0.05000     -0.35000      0.00000
O       1.32502     -0.76500      0.00000     -0.25000      0.26000      0.00000
H       2.23435     -0.24000     -0.00000     -0.29000      0.31000      0.00000
7
Model[4]: FrequencyLabel=A';ForceConstant=1.5118 mDyne/A;ReducedMass=8.6443 AMU;FreqValue=544.8204;Frequency=544.8204 cm^-1;Mode=3;PATH=Calculation 1;FrequenciesFrequencies;IRIntensity=0.0000 KM/Mole;PATH=Calculation 1;FrequenciesFrequencies
B       0.00000      0.00000      0.00000     -0.00000     -0.00000     -0.00000
O       0.00000      1.53000      0.00000     -0.01000      0.41000      0.00000
H      -0.90933      2.05500      0.00000     -0.04000      0.40000     -0.00000
O      -1.32502     -0.76500      0.00000     -0.35000     -0.22000      0.00000
H      -1.32502     -1.81500      0.00000     -0.33001     -0.24000     -0.00000
O       1.32502     -0.76500      0.00000      0.36001     -0.20001      0.00000
H       2.23435     -0.24000     -0.00000      0.37000     -0.17000     -0.00000
7
Model[5]: FrequencyLabel=A";ForceConstant=4.1118 mDyne/A;ReducedMass=11.1285 AMU;FreqValue=791.9002;Frequency=791.9002 cm^-1;Mode=4;PATH=Calculation 1;FrequenciesFrequencies;IRIntensity=114.9670 KM/Mole;PATH=Calculation 1;FrequenciesFrequencies
B       0.00000      0.00000      0.00000     -0.00000     -0.00000      0.91001
O       0.00000      1.53000      0.00000      0.00000     -0.00000     -0.20001
H      -0.90933      2.05500      0.00000      0.00000      0.00000     -0.13000
O      -1.32502     -0.76500      0.00000      0.00000      0.00000     -0.20001
H      -1.32502     -1.81500      0.00000      0.00000      0.00000     -0.13000
O       1.32502     -0.76500      0.00000      0.00000      0.00000     -0.20001
H       2.23435     -0.24000     -0.00000     -0.00000      0.00000     -0.13000
7
Model[6]: FrequencyLabel=E';ForceConstant=3.0219 mDyne/A;ReducedMass=6.6251 AMU;FreqValue=879.8615;Frequency=879.8615 cm^-1;Mode=5;PATH=Calculation 1;FrequenciesFrequencies;IRIntensity=418.6156 KM/Mole;PATH=Calculation 1;FrequenciesFrequencies
B       0.00000      0.00000      0.00000      0.59000      0.34000      0.00000
O       0.00000      1.53000      0.00000     -0.09000     -0.04000     -0.00000
H      -0.90933      2.05500      0.00000     -0.27001     -0.39000     -0.00000
O      -1.32502     -0.76500      0.00000     -0.14000     -0.10000     -0.00000
H      -1.32502     -1.81500      0.00000     -0.02000     -0.11000     -0.00000
O       1.32502     -0.76500      0.00000     -0.16000     -0.03000     -0.00000
H       2.23435     -0.24000     -0.00000      0.10000     -0.47000     -0.00000
7
Model[7]: FrequencyLabel=E';ForceConstant=3.0219 mDyne/A;ReducedMass=6.6251 AMU;FreqValue=879.8615;Frequency=879.8615 cm^-1;Mode=6;PATH=Calculation 1;FrequenciesFrequencies;IRIntensity=418.6154 KM/Mole;PATH=Calculation 1;FrequenciesFrequencies
B       0.00000      0.00000      0.00000     -0.34000      0.59000     -0.00000
O       0.00000      1.53000      0.00000      0.07000     -0.17000      0.00000
H      -0.90933      2.05500      0.00000      0.25000      0.14000      0.00000
O      -1.32502     -0.76500      0.00000      0.01000     -0.12000     -0.00000
H      -1.32502     -1.81500      0.00000      0.54000     -0.11000      0.00000
O       1.32502     -0.76500      0.00000      0.09000     -0.10000      0.00000
H       2.23435     -0.24000     -0.00000      0.18001     -0.23001     -0.00000
7
Model[8]: FrequencyLabel=E";ForceConstant=0.8293 mDyne/A;ReducedMass=1.1351 AMU;FreqValue=1113.5696;Frequency=1113.5696 cm^-1;Mode=7;PATH=Calculation 1;FrequenciesFrequencies;IRIntensity=0.0000 KM/Mole;PATH=Calculation 1;FrequenciesFrequencies
B       0.00000      0.00000      0.00000      0.00000      0.00000      0.00000
O       0.00000      1.53000      0.00000     -0.00000     -0.00000     -0.02000
H      -0.90933      2.05500      0.00000     -0.00000     -0.00000     -0.08000
O      -1.32502     -0.76500      0.00000      0.00000     -0.00000      0.07000
H      -1.32502     -1.81500      0.00000     -0.00000     -0.00000     -0.66001
O       1.32502     -0.76500      0.00000      0.00000     -0.00000     -0.05000
H       2.23435     -0.24000     -0.00000     -0.00000      0.00000      0.74000
7
Model[9]: FrequencyLabel=E";ForceConstant=0.8293 mDyne/A;ReducedMass=1.1351 AMU;FreqValue=1113.5696;Frequency=1113.5696 cm^-1;Mode=8;PATH=Calculation 1;FrequenciesFrequencies;IRIntensity=0.0000 KM/Mole;PATH=Calculation 1;FrequenciesFrequencies
B       0.00000      0.00000      0.00000     -0.00000      0.00000     -0.00000
O       0.00000      1.53000      0.00000     -0.00000     -0.00000     -0.07000
H      -0.90933      2.05500      0.00000      0.00000      0.00000      0.81000
O      -1.32502     -0.76500      0.00000      0.00000     -0.00000      0.02000
H      -1.32502     -1.81500      0.00000     -0.00000     -0.00000     -0.48000
O       1.32502     -0.76500      0.00000     -0.00000      0.00000      0.06000
H       2.23435     -0.24000     -0.00000      0.00000     -0.00000     -0.33001
7
Model[10]: FrequencyLabel=A";ForceConstant=0.7785 mDyne/A;ReducedMass=1.0606 AMU;FreqValue=1116.1386;Frequency=1116.1386 cm^-1;Mode=9;PATH=Calculation 1;FrequenciesFrequencies;IRIntensity=475.2508 KM/Mole;PATH=Calculation 1;FrequenciesFrequencies
B       0.00000      0.00000      0.00000      0.00000     -0.00000     -0.01000
O       0.00000      1.53000      0.00000     -0.00000      0.00000     -0.03000
H      -0.90933      2.05500      0.00000     -0.00000     -0.00000      0.58000
O      -1.32502     -0.76500      0.00000     -0.00000      0.00000     -0.03000
H      -1.32502     -1.81500      0.00000      0.00000      0.00000      0.58000
O       1.32502     -0.76500      0.00000     -0.00000     -0.00000     -0.03000
H       2.23435     -0.24000     -0.00000     -0.00000      0.00000      0.58000
7
Model[11]: FrequencyLabel=A';ForceConstant=1.2940 mDyne/A;ReducedMass=1.1297 AMU;FreqValue=1394.3227;Frequency=1394.3227 cm^-1;Mode=10;PATH=Calculation 1;FrequenciesFrequencies;IRIntensity=0.0000 KM/Mole;PATH=Calculation 1;FrequenciesFrequencies
B       0.00000      0.00000      0.00000     -0.00000      0.00000     -0.00000
O       0.00000      1.53000      0.00000      0.04000      0.03000     -0.00000
H      -0.90933      2.05500      0.00000     -0.27001     -0.51000      0.00000
O      -1.32502     -0.76500      0.00000     -0.05000      0.02000      0.00000
H      -1.32502     -1.81500      0.00000      0.57000      0.02000     -0.00000
O       1.32502     -0.76500      0.00000      0.01000     -0.05000      0.00000
H       2.23435     -0.24000     -0.00000     -0.30001      0.49001     -0.00000
7
Model[12]: FrequencyLabel=E';ForceConstant=1.4128 mDyne/A;ReducedMass=1.1657 AMU;FreqValue=1434.2137;Frequency=1434.2137 cm^-1;Mode=11;PATH=Calculation 1;FrequenciesFrequencies;IRIntensity=312.1214 KM/Mole;PATH=Calculation 1;FrequenciesFrequencies
B       0.00000      0.00000      0.00000      0.07000      0.03000      0.00000
O       0.00000      1.53000      0.00000     -0.05000     -0.04000      0.00000
H      -0.90933      2.05500      0.00000      0.33001      0.60001     -0.00000
O      -1.32502     -0.76500      0.00000     -0.00000     -0.00000     -0.00000
H      -1.32502     -1.81500      0.00000     -0.04000     -0.00000      0.00000
O       1.32502     -0.76500      0.00000      0.01000     -0.06000      0.00000
H       2.23435     -0.24000     -0.00000     -0.38000      0.61000     -0.00000
7
Model[13]: FrequencyLabel=E';ForceConstant=1.4128 mDyne/A;ReducedMass=1.1657 AMU;FreqValue=1434.2137;Frequency=1434.2137 cm^-1;Mode=12;PATH=Calculation 1;FrequenciesFrequencies;IRIntensity=312.1214 KM/Mole;PATH=Calculation 1;FrequenciesFrequencies
B       0.00000      0.00000      0.00000      0.03000     -0.07000      0.00000
O       0.00000      1.53000      0.00000     -0.03000     -0.02000     -0.00000
H      -0.90933      2.05500      0.00000      0.21000      0.38000     -0.00000
O      -1.32502     -0.76500      0.00000     -0.06000      0.03000      0.00000
H      -1.32502     -1.81500      0.00000      0.81000      0.02000     -0.00000
O       1.32502     -0.76500      0.00000     -0.01000      0.03000     -0.00000
H       2.23435     -0.24000     -0.00000      0.20001     -0.32000      0.00000
7
Model[14]: FrequencyLabel=E';ForceConstant=5.1444 mDyne/A;ReducedMass=1.0666 AMU;FreqValue=2861.1435;Frequency=2861.1435 cm^-1;Mode=13;PATH=Calculation 1;FrequenciesFrequencies;IRIntensity=143.8248 KM/Mole;PATH=Calculation 1;FrequenciesFrequencies
B       0.00000      0.00000      0.00000     -0.00000     -0.00000     -0.00000
O       0.00000      1.53000      0.00000     -0.02000      0.01000     -0.00000
H      -0.90933      2.05500      0.00000      0.31000     -0.18001      0.00000
O      -1.32502     -0.76500      0.00000     -0.00000     -0.03000      0.00000
H      -1.32502     -1.81500      0.00000      0.00000      0.45000     -0.00000
O       1.32502     -0.76500      0.00000     -0.04000     -0.02000     -0.00000
H       2.23435     -0.24000     -0.00000      0.71000      0.40000      0.00000
7
Model[15]: FrequencyLabel=E';ForceConstant=5.1444 mDyne/A;ReducedMass=1.0666 AMU;FreqValue=2861.1435;Frequency=2861.1435 cm^-1;Mode=14;PATH=Calculation 1;FrequenciesFrequencies;IRIntensity=143.8248 KM/Mole;PATH=Calculation 1;FrequenciesFrequencies
B       0.00000      0.00000      0.00000      0.00000     -0.00000      0.00000
O       0.00000      1.53000      0.00000      0.04000     -0.02000      0.00000
H      -0.90933      2.05500      0.00000     -0.63000      0.37000     -0.00000
O      -1.32502     -0.76500      0.00000     -0.00000     -0.04000      0.00000
H      -1.32502     -1.81500      0.00000      0.00000      0.68000     -0.00000
O       1.32502     -0.76500      0.00000      0.00000      0.00000      0.00000
H       2.23435     -0.24000     -0.00000     -0.05000     -0.03000     -0.00000
7
Model[16]: FrequencyLabel=A';ForceConstant=5.1749 mDyne/A;ReducedMass=1.0697 AMU;FreqValue=2865.4998;Frequency=2865.4998 cm^-1;Mode=15;PATH=Calculation 1;FrequenciesFrequencies;IRIntensity=0.0000 KM/Mole;PATH=Calculation 1;FrequenciesFrequencies
B       0.00000      0.00000      0.00000     -0.00000     -0.00000      0.00000
O       0.00000      1.53000      0.00000     -0.03000      0.02000     -0.00000
H      -0.90933      2.05500      0.00000      0.50000     -0.29000      0.00000
O      -1.32502     -0.76500      0.00000     -0.00000     -0.04000     -0.00000
H      -1.32502     -1.81500      0.00000      0.00000      0.58000     -0.00000
O       1.32502     -0.76500      0.00000      0.03000      0.02000      0.00000
H       2.23435     -0.24000     -0.00000     -0.50000     -0.29000     -0.00000
</ModelData>
</Models>
##$PEAKS=
<Peaks type="RAMAN" xUnitsExpected="1/cm"  >
<PeakData id="1" title="1 (~2865 cm-1)" peakShape="broad" model="4.16" xMax="2880" xMin="2863"    />
<PeakData id="2" title="2 (~2860 cm-1)" peakShape="broad" model="4.14" xMax="2862" xMin="2840"    />
<PeakData id="3" title="3 (~1435 cm-1)" peakShape="broad" model="4.12" xMax="1450" xMin="1420"    />
<PeakData id="4" title="4 (~1395 cm-1)" peakShape="broad" model="4.11" xMax="1410" xMin="1380"    />
<PeakData id="5" title="5 (~1115 cm-1)" peakShape="broad" model="4.8" xMax="1130" xMin="1100"    />
<PeakData id="6" title="6 (~880 cm-1)" peakShape="broad" model="4.6" xMax="895" xMin="865"    />
<PeakData id="7" title="7 (~545 cm-1)" peakShape="broad" model="4.4" xMax="560" xMin="530"    />
<PeakData id="8" title="8 (~445 cm-1)" peakShape="broad" model="4.2" xMax="460" xMin="430"    />
</Peaks>
##XUNITS= 1/CM
##YUNITS=RAMAN INTENSITY
##XFACTOR= 1
##YFACTOR= 9.232677E-07
##FIRSTX= 3.064089E+03
##FIRSTY= 0
##LASTX= 2.435276E+02
##NPOINTS= 2000
##MINY= 0
##MAXY= 9.232677E-01
##XYDATA= (X++(Y..Y))
3064.0889 0 0 0 0 0 0 0 0 0 0 0 0 0 0 0 0 0 0 0 0 0 0 0 0 0 0 0 0 0 0 0 0 0 0 0 0 0 0 0 0 0 0 0 0 0 0 0 0 0 0 0 0 0 0 0 0 4264 4366 4471 7526 7709 7899 8096 8300 8513 8733 8962 9200 9448 9706 9974 10254
2962.4978 10546 10850 11168 11500 11846 12209 12588 12985 13402 13838 14296 14778 15283 15815 16376 16966 17589
2938.511 18246 18941 19676 20454 21280 22156 23086 24076 25131 26256 27458 28743 30120 31597 33185
2917.3462 34894 36737 38728 40884 43222 45764 48533 51557 54867 58501 62500 66915 71803 77233
2897.5925 83285 90055 97656 106224 115923 126950 139543 153992 170651 189951 212415 238680
2880.6606 269508 305795 348562 398894 457807 525967 603203 687794 775648 859833 931153
2865.14 980175 1000000 988188 946997 882452 802842 716838 631715 552371 481335 419360
2849.619 366118 320751 282217 249487 221627 197832 177423 159838 144613 131369 119793
2834.0981 109628 100664 92723 85662 79358 73710 68632 64051 59906 56144 52720 49596 46737
2815.7554 44116 41706 39487 37438 35543 33787 32157 30640 29228 27911 26680 25528 24448 23435
2796.0015 22484 21589 20746 19951 19200 18491 17821 17186 16584 16013 15471 14956 14466 14000 13556 13133 12729
2772.0146 12343 11974 11622 11285 10963 10654 10357 10073 9801 9539 9288 9046 8814 8591 8376 8169 7969
2748.0278G777j86j79m330p2p0k940%Z39L02PTQURUJ0UJ1TJ2TJ3TJ4J5E13
1524.703 529 546 564 582 601 622 643 667 691 716 742 770 799 830 863 898 935 974 1016 1060 1108 1159 1213 1271 1334 1401 1473
1486.6063 1551 1635 1726 1825 1932 2049 2177 2317 2470 2639 2825 3032 3261 3516 3802 4123 4484 4893 5357
1459.7976 5888 6496 7197 8009 8954 10059 11355 12883 14686 16815 19319 22240 25589 29321 33286
1438.6328 37185 40560 42865 43639 42711 40285 36839 32919 28969 25271 21963 19086 16622 14529
1418.879 12758 11258 9986 8903 7979 7186 6503 5913 5402 4957 4570 4232 3936 3677 3446 3239
1396.3032 3048 2868 2695 2529 2371 2222 2084 1956 1839 1732 1635 1546 1464 1389 1320 1256 1197 1142 1090 1043 998
1366.6725 957 918 881 847 814 784 755 727 702 677 654 632 611 591 572 554 537 521 505 490 476 462 449 436 424 413 402 391 381 371
1324.3429 362 353 344 335 327 319 312 305 4 4 3 3 3 3 3 3 3 3 3 3 3 2 2 2 2 2 2 2 2 2 2 2 2 2 2 2 0 0 0 0 0 0 0 0 0 0 0 0 0 0 0 0 0 0 0 0 0 0 0 0 0 0 0 0 249 255 261 268 274 281 288 295 303 311 319 328 337 346 356 366 377 388 399 411 424 437 451 466
1200.1761 481 497 513 531 550 569 590 611 634 658 684 711 740 770 803 837 874 913 955 1000 1048 1099 1155 1214 1279 1348 1423
1162.0796 1505 1593 1690 1795 1911 2037 2177 2331 2501 2690 2901 3137 3401 3700 4037 4421 4859 5361
1136.6818 5940 6611 7391 8303 9374 10635 12125 13883 15951 18363 21129 24212 27486 30706 33494
1115.517 35397 36036 35268 33263 30416 27176 23912 20855 18122 15743 13705 11974 10508 9266
1095.7632 8211 7312 6543 5882 5311 4815 4383 4004 3670 3375 3113 2880 2671 2484 2315 2163 2025 1899
1070.3655 1785 1680 1585 1497 1416 1341 1272 1209 1149 1094 1043 996 951 909 870 834 800 767 737 708 682 656 632 609 588
1035.0908 567 548 529 512 495 479 464 450 436 423 410 398 387 376 365 355 345 336 327 319 310 302 295 287 280 288 282 276 270 265 16 17 17 18 18 19 19 20 20 21
978.65137 21 22 23 23 24 25 26 26 27 28 29 30 31 32 33 35 36 37 39 40 42 43 45 47 49 51 53 56 59 61 64 68 71 75 79 83 88 93 99 105 112 119 127 137 146 158 170 184 199 217 236 259 285
903.8691 314 348 387 433 486 549 623 710 813 934 1076 1238 1418 1610 1799 1962 2073 2111 2066 1948 1781
874.2384 1592 1401 1222 1061 922 803 701 615 543 481 428 383 345 311 282 257 235 215 198 182 169 156
843.1967 146 136 127 119 111 105 98 93 88 83 79 75 71 67 64 61 58 56 53 51 49 47 45 43 41 40 38 37 36 34 33 32 31 30 29 28 27 26 26 25 24 23 23 22 21 21 20 20 19 19 18 18 17 17 16 16 16 15 15 15 0 0
755.7156 0 0 0 0 0 0 0 0 0 0 0 0 0 0 0 0 0 0 0 0 0 0 0 0 0 0 0 0 0 0 0 0 0 0 0 0 0 0 0 0 0 0 0 0 0 0 0 0 0 0 0 0 0 0 0 0 0 0 0 0 0 0 0 0 0 198 203 208 213 218 223 229 235 241 247 254 261 268 275 283 291 300 308 318 327 337 348 359 370 382 395 408 422 437 453 469 486 504 524 544 566 588 613 638 666 695
606.151 726 760 795 833 874 918 966 1017 1072 1132 1197 1267 1344 1428 1520 1620 1731 1854 1989 2139 2307 2495 2705
573.69836 2942 3211 3516 3864 4264 4724 5258 5956 6683 7537 8542 9728 11129 12776 14697 16899
551.12256 19353 21960 24524 26743 28260 28771 28163 26572 24311 21738 19146 16719 14549 12661
531.3688 11045 9673 8512 7529 6696 5987 5381 4862 4414 4027 3691 3397 3140 2915 2716 2541 2385
507.382 2248 2126 2018 1922 1837 1762 1696 1638 1589 1546 1510 1481 1457 1440 1430 1425 1426 1434 1449 1471 1501 1539 1587 1646 1716 1799
470.69635 1899 2016 2154 2317 2510 2738 3007 3327 3706 4157 4693 5326 6066 6917 7867 8877 9871
446.7096 10731 11315 11506 11259 10627 9733 8718 7694 6736 5878 5132 4491 3947 3485 3093 2760 2475
422.72284 2038 1832 1654 1500 1365 1247 1143 1051 970 897 832 774 721 674 631 592 556 523 494 466 441 418
391.68115 396 376 358 341 325 310 296 283 271 260 249 239 230 221 212 204 197 190 183 177 171 165 159 154 149 145 140 136 132 128 124 120 117 114 111 108 105 102 99 97 94 92 90 87 85 83 81 79 77 0 0 0 0 0 0 0 0 0 0 0 0 0 0 0 0 0 0 0 0 0 0 0 0 0 0 0 0 0 0 0 0 0 0 0 0 0 0 0 0 0 0 0 0 0 0 0 0 0 0 0 0 0 0 0 0
243.5276@  $$checkpoint
##END=$$ End of RAMAN of B(OH)3
##TITLE= B(CN)3
##JCAMP-DX= 5.01
##DATA TYPE= INFRARED SPECTRUM
##DATA CLASS= XYDATA
##BLOCK ID=5
##ORIGIN= Department of Chemistry, UWI, JAMAICA
##OWNER= public domain
##LONGDATE= 2012/02/18 12:32:26.0301 -0500 $$ export date from JSpecView
##SPECTROMETER/DATA SYSTEM= from scan
##$MODELS=
<Models>
<ModelData id="IB(CN)3" type="MOL">
B(CN)3
__Jmol-14_02271917233D 1   1.00000     0.00000     0
Jmol version 14.29.31  2019-01-29 15:30 EXTRACT: ({0:6})
  7  6  0  0  0  0            999 V2000
    0.0000    0.0000    0.0000 B   0  0  0  0  0  0
   -0.0004    1.5365    0.0000 C   0  0  0  0  0  0
   -0.0007    2.6736    0.0000 N   0  0  0  0  0  0
    1.3309   -0.7679    0.0000 C   0  0  0  0  0  0
    2.3157   -1.3362    0.0000 N   0  0  0  0  0  0
   -1.3305   -0.7686    0.0000 C   0  0  0  0  0  0
   -2.3150   -1.3374    0.0000 N   0  0  0  0  0  0
  1  4  1  0  0  0
  2  1  1  0  0  0
  3  2  1  0  0  0
  4  5  1  0  0  0
  6  1  1  0  0  0
  7  6  1  0  0  0
M  END
</ModelData>
<ModelData id="5" type="XYZVIB" baseModel="IB(CN)3" vibrationScale=".5">
7
Model[1]: PATH=Calculation 1;Input;Energy=NaN;Range=M.O.s;NFock==Conv=0.43D-08;E(RHF)=-301.631021355 A.U.;PATH=Calculation 1;Input
B       0.00000      0.00000      0.00000
C      -0.00039      1.53653      0.00000
N      -0.00067      2.67355      0.00000
C       1.33086     -0.76793      0.00000
N       2.31570     -1.33620      0.00000
C      -1.33048     -0.76860      0.00000
N      -2.31503     -1.33736      0.00000
7
Model[2]: PATH=Calculation 1;Standard;Energy=-301.631;Range=M.O.s;NFock==Conv=0.43D-08;E(RHF)=-301.631021355 A.U.;PATH=Calculation 1;Standard
B       0.00000      0.00000      0.00000
C       0.00000      1.53653     -0.00000
N       0.00000      2.67355     -0.00000
C      -1.33067     -0.76826     -0.00000
N      -2.31537     -1.33678     -0.00000
C       1.33067     -0.76826      0.00000
N       2.31537     -1.33678      0.00000
7
Model[3]: FrequencyLabel=E';ForceConstant=0.1305 mDyne/A;ReducedMass=13.5325 AMU;FreqValue=127.9434;Frequency=127.9434 cm^-1;Mode=1;PATH=Calculation 1;FrequenciesFrequencies;IRIntensity=9.5191 KM/Mole;PATH=Calculation 1;FrequenciesFrequencies
B       0.00000      0.00000      0.00000     -0.00000     -0.28000      0.00000
C       0.00000      1.53653     -0.00000     -0.00000     -0.28000      0.00000
N       0.00000      2.67355     -0.00000      0.00000     -0.28000     -0.00000
C      -1.33067     -0.76826     -0.00000     -0.12000     -0.07000     -0.00000
N      -2.31537     -1.33678     -0.00000     -0.41000      0.44000      0.00000
C       1.33067     -0.76826      0.00000      0.12000     -0.07000      0.00000
N       2.31537     -1.33678      0.00000      0.41000      0.44000     -0.00000
7
Model[4]: FrequencyLabel=E';ForceConstant=0.1305 mDyne/A;ReducedMass=13.5325 AMU;FreqValue=127.9435;Frequency=127.9435 cm^-1;Mode=2;PATH=Calculation 1;FrequenciesFrequencies;IRIntensity=9.5191 KM/Mole;PATH=Calculation 1;FrequenciesFrequencies
B       0.00000      0.00000      0.00000     -0.28000      0.00000     -0.00000
C       0.00000      1.53653     -0.00000     -0.00000      0.00000     -0.00000
N       0.00000      2.67355     -0.00000      0.67000      0.00000      0.00000
C      -1.33067     -0.76826     -0.00000     -0.21000     -0.12000     -0.00000
N      -2.31537     -1.33678     -0.00000     -0.04000     -0.41000      0.00000
C       1.33067     -0.76826      0.00000     -0.21000      0.12000     -0.00000
N       2.31537     -1.33678      0.00000     -0.04000      0.41000      0.00000
7
Model[5]: FrequencyLabel=A2";ForceConstant=0.1871 mDyne/A;ReducedMass=12.6305 AMU;FreqValue=158.5595;Frequency=158.5595 cm^-1;Mode=3;PATH=Calculation 1;FrequenciesFrequencies;IRIntensity=41.5102 KM/Mole;PATH=Calculation 1;FrequenciesFrequencies
B       0.00000      0.00000      0.00000     -0.00000      0.00000      0.54000
C       0.00000      1.53653     -0.00000      0.00000      0.00000      0.29000
N       0.00000      2.67355     -0.00000      0.00000      0.00000     -0.39000
C      -1.33067     -0.76826     -0.00000     -0.00000      0.00000      0.29000
N      -2.31537     -1.33678     -0.00000      0.00000     -0.00000     -0.39000
C       1.33067     -0.76826      0.00000     -0.00000      0.00000      0.29000
N       2.31537     -1.33678      0.00000     -0.00000      0.00000     -0.39000
7
Model[6]: FrequencyLabel=E";ForceConstant=0.7301 mDyne/A;ReducedMass=12.3910 AMU;FreqValue=316.2432;Frequency=316.2432 cm^-1;Mode=4;PATH=Calculation 1;FrequenciesFrequencies;IRIntensity=0.0000 KM/Mole;PATH=Calculation 1;FrequenciesFrequencies
B       0.00000      0.00000      0.00000     -0.00000      0.00000      0.00000
C       0.00000      1.53653     -0.00000     -0.00000      0.00000     -0.38000
N       0.00000      2.67355     -0.00000      0.00000      0.00000      0.19000
C      -1.33067     -0.76826     -0.00000     -0.00000     -0.00000     -0.35000
N      -2.31537     -1.33678     -0.00000      0.00000     -0.00000      0.17000
C       1.33067     -0.76826      0.00000      0.00000      0.00000      0.73000
N       2.31537     -1.33678      0.00000     -0.00000     -0.00000     -0.36001
7
Model[7]: FrequencyLabel=E";ForceConstant=0.7301 mDyne/A;ReducedMass=12.3910 AMU;FreqValue=316.2432;Frequency=316.2432 cm^-1;Mode=5;PATH=Calculation 1;FrequenciesFrequencies;IRIntensity=0.0000 KM/Mole;PATH=Calculation 1;FrequenciesFrequencies
B       0.00000      0.00000      0.00000      0.00000      0.00000      0.00000
C       0.00000      1.53653     -0.00000      0.00000     -0.00000     -0.63000
N       0.00000      2.67355     -0.00000     -0.00000     -0.00000      0.31000
C      -1.33067     -0.76826     -0.00000      0.00000      0.00000      0.64000
N      -2.31537     -1.33678     -0.00000     -0.00000      0.00000     -0.32000
C       1.33067     -0.76826      0.00000      0.00000      0.00000     -0.02000
N       2.31537     -1.33678      0.00000      0.00000      0.00000      0.01000
7
Model[8]: FrequencyLabel=A2';ForceConstant=0.9442 mDyne/A;ReducedMass=12.3910 AMU;FreqValue=359.6226;Frequency=359.6226 cm^-1;Mode=6;PATH=Calculation 1;FrequenciesFrequencies;IRIntensity=0.0000 KM/Mole;PATH=Calculation 1;FrequenciesFrequencies
B       0.00000      0.00000      0.00000      0.00000     -0.00000     -0.00000
C       0.00000      1.53653     -0.00000      0.52000     -0.00000     -0.00000
N       0.00000      2.67355     -0.00000     -0.26000     -0.00000      0.00000
C      -1.33067     -0.76826     -0.00000     -0.26000      0.45000     -0.00000
N      -2.31537     -1.33678     -0.00000      0.13000     -0.22000      0.00000
C       1.33067     -0.76826      0.00000     -0.26000     -0.45000      0.00000
N       2.31537     -1.33678      0.00000      0.13000      0.22000     -0.00000
7
Model[9]: FrequencyLabel=E';ForceConstant=2.2745 mDyne/A;ReducedMass=12.2694 AMU;FreqValue=560.9308;Frequency=560.9308 cm^-1;Mode=7;PATH=Calculation 1;FrequenciesFrequencies;IRIntensity=3.0373 KM/Mole;PATH=Calculation 1;FrequenciesFrequencies
B       0.00000      0.00000      0.00000     -0.03000      0.00000     -0.00000
C       0.00000      1.53653     -0.00000      0.73000      0.00000     -0.00000
N       0.00000      2.67355     -0.00000     -0.18001      0.00000      0.00000
C      -1.33067     -0.76826     -0.00000      0.02000     -0.41000     -0.00000
N      -2.31537     -1.33678     -0.00000     -0.22000     -0.02000      0.00000
C       1.33067     -0.76826      0.00000      0.02000      0.41000      0.00000
N       2.31537     -1.33678      0.00000     -0.22000      0.02000     -0.00000
7
Model[10]: FrequencyLabel=E';ForceConstant=2.2745 mDyne/A;ReducedMass=12.2694 AMU;FreqValue=560.9309;Frequency=560.9309 cm^-1;Mode=8;PATH=Calculation 1;FrequenciesFrequencies;IRIntensity=3.0373 KM/Mole;PATH=Calculation 1;FrequenciesFrequencies
B       0.00000      0.00000      0.00000     -0.00000     -0.03000      0.00000
C       0.00000      1.53653     -0.00000      0.00000     -0.22000      0.00000
N       0.00000      2.67355     -0.00000     -0.00000     -0.24000      0.00000
C      -1.33067     -0.76826     -0.00000     -0.41000      0.49001     -0.00000
N      -2.31537     -1.33678     -0.00000     -0.02000     -0.20001      0.00000
C       1.33067     -0.76826      0.00000      0.41000      0.49001     -0.00000
N       2.31537     -1.33678      0.00000      0.02000     -0.20001      0.00000
7
Model[11]: FrequencyLabel=A1';ForceConstant=2.4641 mDyne/A;ReducedMass=13.1110 AMU;FreqValue=564.7853;Frequency=564.7853 cm^-1;Mode=9;PATH=Calculation 1;FrequenciesFrequencies;IRIntensity=0.0000 KM/Mole;PATH=Calculation 1;FrequenciesFrequencies
B       0.00000      0.00000      0.00000      0.00000      0.00000     -0.00000
C       0.00000      1.53653     -0.00000     -0.00000      0.39000     -0.00000
N       0.00000      2.67355     -0.00000      0.00000      0.43000      0.00000
C      -1.33067     -0.76826     -0.00000     -0.33001     -0.19000      0.00000
N      -2.31537     -1.33678     -0.00000     -0.37000     -0.21000     -0.00000
C       1.33067     -0.76826      0.00000      0.33001     -0.19000     -0.00000
N       2.31537     -1.33678      0.00000      0.37000     -0.21000      0.00000
7
Model[12]: FrequencyLabel=A2";ForceConstant=3.2219 mDyne/A;ReducedMass=11.3935 AMU;FreqValue=692.7901;Frequency=692.7901 cm^-1;Mode=10;PATH=Calculation 1;FrequenciesFrequencies;IRIntensity=35.1585 KM/Mole;PATH=Calculation 1;FrequenciesFrequencies
B       0.00000      0.00000      0.00000      0.00000      0.00000      0.80000
C       0.00000      1.53653     -0.00000      0.00000      0.00000     -0.33001
N       0.00000      2.67355     -0.00000     -0.00000      0.00000      0.08000
C      -1.33067     -0.76826     -0.00000     -0.00000     -0.00000     -0.33001
N      -2.31537     -1.33678     -0.00000      0.00000     -0.00000      0.08000
C       1.33067     -0.76826      0.00000     -0.00000     -0.00000     -0.33001
N       2.31537     -1.33678      0.00000      0.00000     -0.00000      0.08000
7
Model[13]: FrequencyLabel=E';ForceConstant=9.3295 mDyne/A;ReducedMass=11.4097 AMU;FreqValue=1178.0567;Frequency=1178.0567 cm^-1;Mode=11;PATH=Calculation 1;FrequenciesFrequencies;IRIntensity=299.0516 KM/Mole;PATH=Calculation 1;FrequenciesFrequencies
B       0.00000      0.00000      0.00000      0.00000      0.91001     -0.00000
C       0.00000      1.53653     -0.00000     -0.00000     -0.15001      0.00000
N       0.00000      2.67355     -0.00000      0.00000     -0.28000     -0.00000
C      -1.33067     -0.76826     -0.00000     -0.01000     -0.12000     -0.00000
N      -2.31537     -1.33678     -0.00000     -0.13000     -0.05000      0.00000
C       1.33067     -0.76826      0.00000      0.01000     -0.12000     -0.00000
N       2.31537     -1.33678      0.00000      0.13000     -0.05000      0.00000
7
Model[14]: FrequencyLabel=E';ForceConstant=9.3295 mDyne/A;ReducedMass=11.4097 AMU;FreqValue=1178.0567;Frequency=1178.0567 cm^-1;Mode=12;PATH=Calculation 1;FrequenciesFrequencies;IRIntensity=299.0516 KM/Mole;PATH=Calculation 1;FrequenciesFrequencies
B       0.00000      0.00000      0.00000      0.91001     -0.00000     -0.00000
C       0.00000      1.53653     -0.00000     -0.12000      0.00000     -0.00000
N       0.00000      2.67355     -0.00000      0.03000      0.00000      0.00000
C      -1.33067     -0.76826     -0.00000     -0.14000     -0.01000     -0.00000
N      -2.31537     -1.33678     -0.00000     -0.20001     -0.13000      0.00000
C       1.33067     -0.76826      0.00000     -0.14000      0.01000      0.00000
N       2.31537     -1.33678      0.00000     -0.20001      0.13000     -0.00000
7
Model[15]: FrequencyLabel=A1';ForceConstant=50.0071 mDyne/A;ReducedMass=12.7430 AMU;FreqValue=2580.8020;Frequency=2580.8020 cm^-1;Mode=13;PATH=Calculation 1;FrequenciesFrequencies;IRIntensity=0.0000 KM/Mole;PATH=Calculation 1;FrequenciesFrequencies
B       0.00000      0.00000      0.00000     -0.00000     -0.00000     -0.00000
C       0.00000      1.53653     -0.00000      0.00000      0.46001     -0.00000
N       0.00000      2.67355     -0.00000     -0.00000     -0.35000     -0.00000
C      -1.33067     -0.76826     -0.00000     -0.40000     -0.23001      0.00000
N      -2.31537     -1.33678     -0.00000      0.30001      0.18001     -0.00000
C       1.33067     -0.76826      0.00000      0.40000     -0.23001      0.00000
N       2.31537     -1.33678      0.00000     -0.30001      0.18001     -0.00000
7
Model[16]: FrequencyLabel=E';ForceConstant=49.9852 mDyne/A;ReducedMass=12.7153 AMU;FreqValue=2583.0446;Frequency=2583.0446 cm^-1;Mode=14;PATH=Calculation 1;FrequenciesFrequencies;IRIntensity=137.8796 KM/Mole;PATH=Calculation 1;FrequenciesFrequencies
B       0.00000      0.00000      0.00000     -0.11000      0.00000      0.00000
C       0.00000      1.53653     -0.00000      0.00000     -0.00000      0.00000
N       0.00000      2.67355     -0.00000     -0.00000      0.00000     -0.00000
C      -1.33067     -0.76826     -0.00000      0.48000      0.28000     -0.00000
N      -2.31537     -1.33678     -0.00000     -0.37000     -0.21000      0.00000
C       1.33067     -0.76826      0.00000      0.48000     -0.28000      0.00000
N       2.31537     -1.33678      0.00000     -0.37000      0.21000     -0.00000
7
Model[17]: FrequencyLabel=E';ForceConstant=49.9852 mDyne/A;ReducedMass=12.7153 AMU;FreqValue=2583.0446;Frequency=2583.0446 cm^-1;Mode=15;PATH=Calculation 1;FrequenciesFrequencies;IRIntensity=137.8796 KM/Mole;PATH=Calculation 1;FrequenciesFrequencies
B       0.00000      0.00000      0.00000     -0.00000     -0.11000      0.00000
C       0.00000      1.53653     -0.00000      0.00000      0.64000     -0.00000
N       0.00000      2.67355     -0.00000     -0.00000     -0.49001      0.00000
C      -1.33067     -0.76826     -0.00000      0.28000      0.16000     -0.00000
N      -2.31537     -1.33678     -0.00000     -0.21000     -0.12000      0.00000
C       1.33067     -0.76826      0.00000     -0.28000      0.16000      0.00000
N       2.31537     -1.33678      0.00000      0.21000     -0.12000     -0.00000
</ModelData>
</Models>
##$PEAKS=
<Peaks type="IR" xUnitsExpected="1/cm"  >
<PeakData id="1" title="1 (~2585 cm-1)" peakShape="broad" model="5.16" xMax="2600" xMin="2570"    />
<PeakData id="2" title="2 (~1180 cm-1)" peakShape="broad" model="5.13" xMax="1195" xMin="1165"    />
<PeakData id="3" title="3 (~690 cm-1)" peakShape="broad" model="5.12" xMax="705" xMin="675"    />
<PeakData id="4" title="4 (~560 cm-1)" peakShape="broad" model="5.9" xMax="580" xMin="540"    />
<PeakData id="5" title="5 (~160 cm-1)" peakShape="broad" model="5.5" xMax="175" xMin="145"    />
<PeakData id="6" title="6 (~130 cm-1)" peakShape="broad" model="5.3" xMax="145" xMin="115"    />
</Peaks>
##XUNITS= 1/CM
##YUNITS= TRANSMITTANCE
##XFACTOR= 1
##YFACTOR= 1.000000E-06
##FIRSTX= 2.783045E+03
##FIRSTY= 1
##LASTX= -7.205660E+01
##NPOINTS= 2001
##MINY= 2.698065E-10
##MAXY= 1
##XYDATA= (X++(Y..Y))
2783.0447 1000000 1000000 1000000 1000000 1000000 1000000 1000000 1000000 1000000 1000000 1000000 1000000 1000000 1000000 1000000 1000000 1000000 1000000 1000000 1000000 1000000 1000000 1000000 1000000 1000000 1000000 1000000 1000000 1000000 1000000 1000000 1000000 1000000 1000000 1000000 1000000 1000000 1000000 1000000 1000000 1000000 1000000 1000000 1000000 1000000 1000000 1000000 1000000 1000000 1000000 1000000 1000000 1000000 1000000 1000000 1000000 932148 930572 928941 927252 925504 923694 921817 919872 917855 915762 913589
2687.3987 911334 908990 906555 904022 901388 898646 895791 892817 889717 886485 883112 879591 875913
2668.8406 872070 868051 863846 859444 854833 850000 844932 839613 834027 828158 821987 815494 808658
2650.2825 801456 793863 785853 777396 768464 759021 749033 738461 727265 715401 702821 689477
2633.1519 675315 660280 644314 627355 609343 590213 569903 548353 525506 501316 475745
2617.4487 448775 420411 390690 359695 327562 294496 260790 226831 193117 160259 128964
2601.7456 100008 74166 52123 34345 20969 11718 5934 2712 1131 445 177 80 46
2583.1875 39 49 87 197 498 1261 2996 6474 12630 22348 36248 54552 77082 103337 132616
2561.7742 164138 197135 230908 264861 298509 331476 363482 394330 423891 452089 478891
2546.0713 504294 528321 551009 572407 592572 611564 629447 646283 662134 677061 691122
2530.3682 704372 716863 728645 739763 750263 760183 769563 778437 786838 794796 802341 809498
2513.2375 816291 822745 828879 834713 840265 845554 850593 855399 859984 864361 868543 872541 876363
2494.6794 880022 883525 886880 890096 893181 896140 898981 901710 904332 906852 909276 911609 913855
2476.1213I16017K084K009J936J869J803J740J682J624J570O7666%Z14j41353H55501
1295.5369 852252 848896 845429 841846 838141 834310 830346 826245 822000 817604 813051 808333 803443
1276.9788 798374 793116 787662 782001 776124 770020 763680 757092 750243 743121 735713 728006 719983
1258.4205 711632 702934 693875 684435 674598 664344 653653 642506 630882 618758 606114 592928
1241.2899 579177 564839 549893 534319 518098 501211 483646 465390 446437 426787 406446
1225.5869 385429 363765 341491 318664 295358 271668 247715 223646 199640 175903 152677
1209.8838 130230 108856 88859 70546 54197 40046 28248 18850 11767 6779 3545 1649
1192.7532 667 229 65 15 3 0 0 0 0 0 0 0 0 0 0 1 3 18 76 263 750 1821 3854 7278 12502 19854 29539 41624
1152.7819 56049 72647 91179 111357 132876 155432 178733 202514 226539 250602 274531
1137.0787 298180 321433 344197 366400 387989 408925 429184 448751 467620 485792 503276
1121.3757 520081 536224 551722 566593 580859 594541 607662 620242 632304 643870 654961
1105.6726 665598 675801 685590 694983 703998 712653 720964 728948 736619 743991 751080 757897 764455
1087.1145 770766 776841 782692 788328 793758 798993 804040 808909 813606 818140 822517 826745 830830
1068.5563H34777L816L689L570L453L343L236L134J40982%S70q918k14I90646
808.7421 990416 990178 989931 989674 989408 989131 988843 988544 988232 987908 987570 987218 986851 986467 986067 985649 985212
784.47375 984755 984277 983775 983250 982699 982120 981512 980873 980201 979493 978746 977958 977126 976247 975316 974331 973286
760.2054 972176 970997 969742 968405 966980 965456 963827 962082 960210 958198 956034 953700 951180
741.6472 948453 945498 942288 938794 934984 930819 926256 921244 915725 909633 902890 895405 887074
723.0891 877774 867364 855676 842517 827664 810857 791803 770171 745602 717719 686159
707.38605 650620 610950 567265 520124 470716 421019 373812 332437 300285 280164 273845
691.683 281876 303559 336984 379244 426919 476714 525938 572712 614981 654069 689036
675.9799 720058 747446 771568 792798 811494 827981 842548 855449 866904 877102 886206
660.27686 894356 901672 908257 914198 919572 924444 928871 932902 936579 939941 943018 945839 948430
641.7187 950812 953004 955023 956884 958600 960182 961642 962988 964229 965370 966419 967381 968261 969062
621.733 969788 970443 971028 971545 971995 972379 972698 972950 973135 973251 973296 973267 973159 972968 972688 972311 971829 971230
596.0371 970502 969629 968594 967375 965943 964269 962313 960029 957361 954239 950582 946287 941235 935281
576.0514 928257 919971 910221 906692 893202 877931 861168 843653 826727 812324 802648 799491
558.9208 803494 813848 828670 845759 863241 879853 894919 908190 919679 929529 937937
543.2177 945107 951230 956471 960975 964861 968228 971158 973720 975969 977953 979710 981271 982664
524.65955 983912 985032 986043 986957 987785 988539 989226 989854 990430 990959 991446 991895 992310 992694 993051 993382
501.81876 993690 993978 994247 994498 994733 994953 995161 995355 995539 995711 995874 996028 996174 996311 996442 996565 996683
477.55038 996794 996900 997001 997097 997189 997276 997359 997439 997515 997587 997657 997723 997787 997848 997907 997963 998018 998070 998119 998168 998214 998258 998301 998342
443.28915I98382L9L7J542%S12j0521k52k61k71k81k91l03l14l26l39I86488
261.99023 986121 985739 985341 984926 984493 984042 983571 983079 982564 982026 976713 976012 975278 974510 973706 972863 971979
237.72188 971051 970075 969049 967970 966833 965634 964369 963032 961619 960123 958537 956855 955069 953169
217.73618 951147 948990 946688 944227 941591 938765 935730 932465 928947 925148 921039 916586 911751
199.17801 906490 900752 894480 887609 880062 871754 862584 852436 841177 828652 814685 799071
182.04741 781577 761939 739866 715036 687114 655770 620717 581769 538934 492545 443409
166.34435 392961 343340 297286 257798 227596 208643 201942 207607 224932 252330 287319 326782
149.21375 367480 406542 441742 471532 494939 511410 520685 522747 517841 506600 490231 470729
132.08313 450977 434562 425196 425844 437898 460815 492383 529482 568956 608227 645540 679909
114.95253 710925 738562 763005 784547 803511 820217 834962 848009 859589 869901 879116
99.24947 887377 894810 901519 907594 913113 918141 922734 926942 930807 934366 937650 940687 943502
80.691315 946116 948548 950815 952932 954911 956766 958506 960140 961677 963126 964492 965781 967001
62.133156 968155 969248 970285 971270 972205 973095 973942 974749 975518 976252 976953 977623 978264 978877 979464 980027
39.292347 980567 981085 991746 991994 992231 992458 992675 992882 993082 993272 993455 993631 993800 993962 994118 994268
16.451538 994412 994551 994685 994814 994939 995059 995174 1000000 1000000 1000000 1000000 1000000 1000000 1000000 1000000 1000000 1000000 1000000 1000000 1000000 1000000 1000000 1000000 1000000 1000000 1000000 1000000 1000000 1000000 1000000 1000000 1000000 1000000 1000000 1000000 1000000 1000000 1000000 1000000 1000000 1000000 1000000 1000000 1000000 1000000 1000000 1000000 1000000 1000000 1000000 1000000 1000000 1000000 1000000 1000000 1000000 1000000 1000000 1000000 1000000 1000000 1000000
-72.0566A000000  $$checkpoint
##END= $$ end of IR B(CN)3 Block
##TITLE=Raman of B(CN)3 $$ Begin of the data block
##JCAMP-DX=5.00 $$ ACD/DocManager Library v 5.00
##DATA TYPE=RAMAN SPECTRUM
##DATA CLASS=XYDATA
##BLOCK ID=6
##DATE=19 Feb 2012 10:30:00
##ORIGIN= Department of Chemistry, UWI, Jamaica
##OWNER= public domain
##SPECTROMETER/DATA SYSTEM=from scan
##$MODELS=
<Models>
<ModelData id="RB(CN)3" type="MOL">
B(CN)3
__Jmol-14_02271917233D 1   1.00000     0.00000     0
Jmol version 14.29.31  2019-01-29 15:30 EXTRACT: ({0:6})
  7  6  0  0  0  0            999 V2000
    0.0000    0.0000    0.0000 B   0  0  0  0  0  0
   -0.0004    1.5365    0.0000 C   0  0  0  0  0  0
   -0.0007    2.6736    0.0000 N   0  0  0  0  0  0
    1.3309   -0.7679    0.0000 C   0  0  0  0  0  0
    2.3157   -1.3362    0.0000 N   0  0  0  0  0  0
   -1.3305   -0.7686    0.0000 C   0  0  0  0  0  0
   -2.3150   -1.3374    0.0000 N   0  0  0  0  0  0
  1  4  1  0  0  0
  2  1  1  0  0  0
  3  2  1  0  0  0
  4  5  1  0  0  0
  6  1  1  0  0  0
  7  6  1  0  0  0
M  END

</ModelData>
<ModelData id="6" type="XYZVIB" baseModel="RB(CN)3" vibrationScale=".5">
7
Model[1]: PATH=Calculation 1;Input;Energy=NaN;Range=M.O.s;NFock==Conv=0.43D-08;E(RHF)=-301.631021355 A.U.;PATH=Calculation 1;Input
B       0.00000      0.00000      0.00000
C      -0.00039      1.53653      0.00000
N      -0.00067      2.67355      0.00000
C       1.33086     -0.76793      0.00000
N       2.31570     -1.33620      0.00000
C      -1.33048     -0.76860      0.00000
N      -2.31503     -1.33736      0.00000
7
Model[2]: PATH=Calculation 1;Standard;Energy=-301.631;Range=M.O.s;NFock==Conv=0.43D-08;E(RHF)=-301.631021355 A.U.;PATH=Calculation 1;Standard
B       0.00000      0.00000      0.00000
C       0.00000      1.53653     -0.00000
N       0.00000      2.67355     -0.00000
C      -1.33067     -0.76826     -0.00000
N      -2.31537     -1.33678     -0.00000
C       1.33067     -0.76826      0.00000
N       2.31537     -1.33678      0.00000
7
Model[3]: FrequencyLabel=E';ForceConstant=0.1305 mDyne/A;ReducedMass=13.5325 AMU;FreqValue=127.9434;Frequency=127.9434 cm^-1;Mode=1;PATH=Calculation 1;FrequenciesFrequencies;IRIntensity=9.5191 KM/Mole;PATH=Calculation 1;FrequenciesFrequencies
B       0.00000      0.00000      0.00000     -0.00000     -0.28000      0.00000
C       0.00000      1.53653     -0.00000     -0.00000     -0.28000      0.00000
N       0.00000      2.67355     -0.00000      0.00000     -0.28000     -0.00000
C      -1.33067     -0.76826     -0.00000     -0.12000     -0.07000     -0.00000
N      -2.31537     -1.33678     -0.00000     -0.41000      0.44000      0.00000
C       1.33067     -0.76826      0.00000      0.12000     -0.07000      0.00000
N       2.31537     -1.33678      0.00000      0.41000      0.44000     -0.00000
7
Model[4]: FrequencyLabel=E';ForceConstant=0.1305 mDyne/A;ReducedMass=13.5325 AMU;FreqValue=127.9435;Frequency=127.9435 cm^-1;Mode=2;PATH=Calculation 1;FrequenciesFrequencies;IRIntensity=9.5191 KM/Mole;PATH=Calculation 1;FrequenciesFrequencies
B       0.00000      0.00000      0.00000     -0.28000      0.00000     -0.00000
C       0.00000      1.53653     -0.00000     -0.00000      0.00000     -0.00000
N       0.00000      2.67355     -0.00000      0.67000      0.00000      0.00000
C      -1.33067     -0.76826     -0.00000     -0.21000     -0.12000     -0.00000
N      -2.31537     -1.33678     -0.00000     -0.04000     -0.41000      0.00000
C       1.33067     -0.76826      0.00000     -0.21000      0.12000     -0.00000
N       2.31537     -1.33678      0.00000     -0.04000      0.41000      0.00000
7
Model[5]: FrequencyLabel=A2";ForceConstant=0.1871 mDyne/A;ReducedMass=12.6305 AMU;FreqValue=158.5595;Frequency=158.5595 cm^-1;Mode=3;PATH=Calculation 1;FrequenciesFrequencies;IRIntensity=41.5102 KM/Mole;PATH=Calculation 1;FrequenciesFrequencies
B       0.00000      0.00000      0.00000     -0.00000      0.00000      0.54000
C       0.00000      1.53653     -0.00000      0.00000      0.00000      0.29000
N       0.00000      2.67355     -0.00000      0.00000      0.00000     -0.39000
C      -1.33067     -0.76826     -0.00000     -0.00000      0.00000      0.29000
N      -2.31537     -1.33678     -0.00000      0.00000     -0.00000     -0.39000
C       1.33067     -0.76826      0.00000     -0.00000      0.00000      0.29000
N       2.31537     -1.33678      0.00000     -0.00000      0.00000     -0.39000
7
Model[6]: FrequencyLabel=E";ForceConstant=0.7301 mDyne/A;ReducedMass=12.3910 AMU;FreqValue=316.2432;Frequency=316.2432 cm^-1;Mode=4;PATH=Calculation 1;FrequenciesFrequencies;IRIntensity=0.0000 KM/Mole;PATH=Calculation 1;FrequenciesFrequencies
B       0.00000      0.00000      0.00000     -0.00000      0.00000      0.00000
C       0.00000      1.53653     -0.00000     -0.00000      0.00000     -0.38000
N       0.00000      2.67355     -0.00000      0.00000      0.00000      0.19000
C      -1.33067     -0.76826     -0.00000     -0.00000     -0.00000     -0.35000
N      -2.31537     -1.33678     -0.00000      0.00000     -0.00000      0.17000
C       1.33067     -0.76826      0.00000      0.00000      0.00000      0.73000
N       2.31537     -1.33678      0.00000     -0.00000     -0.00000     -0.36001
7
Model[7]: FrequencyLabel=E";ForceConstant=0.7301 mDyne/A;ReducedMass=12.3910 AMU;FreqValue=316.2432;Frequency=316.2432 cm^-1;Mode=5;PATH=Calculation 1;FrequenciesFrequencies;IRIntensity=0.0000 KM/Mole;PATH=Calculation 1;FrequenciesFrequencies
B       0.00000      0.00000      0.00000      0.00000      0.00000      0.00000
C       0.00000      1.53653     -0.00000      0.00000     -0.00000     -0.63000
N       0.00000      2.67355     -0.00000     -0.00000     -0.00000      0.31000
C      -1.33067     -0.76826     -0.00000      0.00000      0.00000      0.64000
N      -2.31537     -1.33678     -0.00000     -0.00000      0.00000     -0.32000
C       1.33067     -0.76826      0.00000      0.00000      0.00000     -0.02000
N       2.31537     -1.33678      0.00000      0.00000      0.00000      0.01000
7
Model[8]: FrequencyLabel=A2';ForceConstant=0.9442 mDyne/A;ReducedMass=12.3910 AMU;FreqValue=359.6226;Frequency=359.6226 cm^-1;Mode=6;PATH=Calculation 1;FrequenciesFrequencies;IRIntensity=0.0000 KM/Mole;PATH=Calculation 1;FrequenciesFrequencies
B       0.00000      0.00000      0.00000      0.00000     -0.00000     -0.00000
C       0.00000      1.53653     -0.00000      0.52000     -0.00000     -0.00000
N       0.00000      2.67355     -0.00000     -0.26000     -0.00000      0.00000
C      -1.33067     -0.76826     -0.00000     -0.26000      0.45000     -0.00000
N      -2.31537     -1.33678     -0.00000      0.13000     -0.22000      0.00000
C       1.33067     -0.76826      0.00000     -0.26000     -0.45000      0.00000
N       2.31537     -1.33678      0.00000      0.13000      0.22000     -0.00000
7
Model[9]: FrequencyLabel=E';ForceConstant=2.2745 mDyne/A;ReducedMass=12.2694 AMU;FreqValue=560.9308;Frequency=560.9308 cm^-1;Mode=7;PATH=Calculation 1;FrequenciesFrequencies;IRIntensity=3.0373 KM/Mole;PATH=Calculation 1;FrequenciesFrequencies
B       0.00000      0.00000      0.00000     -0.03000      0.00000     -0.00000
C       0.00000      1.53653     -0.00000      0.73000      0.00000     -0.00000
N       0.00000      2.67355     -0.00000     -0.18001      0.00000      0.00000
C      -1.33067     -0.76826     -0.00000      0.02000     -0.41000     -0.00000
N      -2.31537     -1.33678     -0.00000     -0.22000     -0.02000      0.00000
C       1.33067     -0.76826      0.00000      0.02000      0.41000      0.00000
N       2.31537     -1.33678      0.00000     -0.22000      0.02000     -0.00000
7
Model[10]: FrequencyLabel=E';ForceConstant=2.2745 mDyne/A;ReducedMass=12.2694 AMU;FreqValue=560.9309;Frequency=560.9309 cm^-1;Mode=8;PATH=Calculation 1;FrequenciesFrequencies;IRIntensity=3.0373 KM/Mole;PATH=Calculation 1;FrequenciesFrequencies
B       0.00000      0.00000      0.00000     -0.00000     -0.03000      0.00000
C       0.00000      1.53653     -0.00000      0.00000     -0.22000      0.00000
N       0.00000      2.67355     -0.00000     -0.00000     -0.24000      0.00000
C      -1.33067     -0.76826     -0.00000     -0.41000      0.49001     -0.00000
N      -2.31537     -1.33678     -0.00000     -0.02000     -0.20001      0.00000
C       1.33067     -0.76826      0.00000      0.41000      0.49001     -0.00000
N       2.31537     -1.33678      0.00000      0.02000     -0.20001      0.00000
7
Model[11]: FrequencyLabel=A1';ForceConstant=2.4641 mDyne/A;ReducedMass=13.1110 AMU;FreqValue=564.7853;Frequency=564.7853 cm^-1;Mode=9;PATH=Calculation 1;FrequenciesFrequencies;IRIntensity=0.0000 KM/Mole;PATH=Calculation 1;FrequenciesFrequencies
B       0.00000      0.00000      0.00000      0.00000      0.00000     -0.00000
C       0.00000      1.53653     -0.00000     -0.00000      0.39000     -0.00000
N       0.00000      2.67355     -0.00000      0.00000      0.43000      0.00000
C      -1.33067     -0.76826     -0.00000     -0.33001     -0.19000      0.00000
N      -2.31537     -1.33678     -0.00000     -0.37000     -0.21000     -0.00000
C       1.33067     -0.76826      0.00000      0.33001     -0.19000     -0.00000
N       2.31537     -1.33678      0.00000      0.37000     -0.21000      0.00000
7
Model[12]: FrequencyLabel=A2";ForceConstant=3.2219 mDyne/A;ReducedMass=11.3935 AMU;FreqValue=692.7901;Frequency=692.7901 cm^-1;Mode=10;PATH=Calculation 1;FrequenciesFrequencies;IRIntensity=35.1585 KM/Mole;PATH=Calculation 1;FrequenciesFrequencies
B       0.00000      0.00000      0.00000      0.00000      0.00000      0.80000
C       0.00000      1.53653     -0.00000      0.00000      0.00000     -0.33001
N       0.00000      2.67355     -0.00000     -0.00000      0.00000      0.08000
C      -1.33067     -0.76826     -0.00000     -0.00000     -0.00000     -0.33001
N      -2.31537     -1.33678     -0.00000      0.00000     -0.00000      0.08000
C       1.33067     -0.76826      0.00000     -0.00000     -0.00000     -0.33001
N       2.31537     -1.33678      0.00000      0.00000     -0.00000      0.08000
7
Model[13]: FrequencyLabel=E';ForceConstant=9.3295 mDyne/A;ReducedMass=11.4097 AMU;FreqValue=1178.0567;Frequency=1178.0567 cm^-1;Mode=11;PATH=Calculation 1;FrequenciesFrequencies;IRIntensity=299.0516 KM/Mole;PATH=Calculation 1;FrequenciesFrequencies
B       0.00000      0.00000      0.00000      0.00000      0.91001     -0.00000
C       0.00000      1.53653     -0.00000     -0.00000     -0.15001      0.00000
N       0.00000      2.67355     -0.00000      0.00000     -0.28000     -0.00000
C      -1.33067     -0.76826     -0.00000     -0.01000     -0.12000     -0.00000
N      -2.31537     -1.33678     -0.00000     -0.13000     -0.05000      0.00000
C       1.33067     -0.76826      0.00000      0.01000     -0.12000     -0.00000
N       2.31537     -1.33678      0.00000      0.13000     -0.05000      0.00000
7
Model[14]: FrequencyLabel=E';ForceConstant=9.3295 mDyne/A;ReducedMass=11.4097 AMU;FreqValue=1178.0567;Frequency=1178.0567 cm^-1;Mode=12;PATH=Calculation 1;FrequenciesFrequencies;IRIntensity=299.0516 KM/Mole;PATH=Calculation 1;FrequenciesFrequencies
B       0.00000      0.00000      0.00000      0.91001     -0.00000     -0.00000
C       0.00000      1.53653     -0.00000     -0.12000      0.00000     -0.00000
N       0.00000      2.67355     -0.00000      0.03000      0.00000      0.00000
C      -1.33067     -0.76826     -0.00000     -0.14000     -0.01000     -0.00000
N      -2.31537     -1.33678     -0.00000     -0.20001     -0.13000      0.00000
C       1.33067     -0.76826      0.00000     -0.14000      0.01000      0.00000
N       2.31537     -1.33678      0.00000     -0.20001      0.13000     -0.00000
7
Model[15]: FrequencyLabel=A1';ForceConstant=50.0071 mDyne/A;ReducedMass=12.7430 AMU;FreqValue=2580.8020;Frequency=2580.8020 cm^-1;Mode=13;PATH=Calculation 1;FrequenciesFrequencies;IRIntensity=0.0000 KM/Mole;PATH=Calculation 1;FrequenciesFrequencies
B       0.00000      0.00000      0.00000     -0.00000     -0.00000     -0.00000
C       0.00000      1.53653     -0.00000      0.00000      0.46001     -0.00000
N       0.00000      2.67355     -0.00000     -0.00000     -0.35000     -0.00000
C      -1.33067     -0.76826     -0.00000     -0.40000     -0.23001      0.00000
N      -2.31537     -1.33678     -0.00000      0.30001      0.18001     -0.00000
C       1.33067     -0.76826      0.00000      0.40000     -0.23001      0.00000
N       2.31537     -1.33678      0.00000     -0.30001      0.18001     -0.00000
7
Model[16]: FrequencyLabel=E';ForceConstant=49.9852 mDyne/A;ReducedMass=12.7153 AMU;FreqValue=2583.0446;Frequency=2583.0446 cm^-1;Mode=14;PATH=Calculation 1;FrequenciesFrequencies;IRIntensity=137.8796 KM/Mole;PATH=Calculation 1;FrequenciesFrequencies
B       0.00000      0.00000      0.00000     -0.11000      0.00000      0.00000
C       0.00000      1.53653     -0.00000      0.00000     -0.00000      0.00000
N       0.00000      2.67355     -0.00000     -0.00000      0.00000     -0.00000
C      -1.33067     -0.76826     -0.00000      0.48000      0.28000     -0.00000
N      -2.31537     -1.33678     -0.00000     -0.37000     -0.21000      0.00000
C       1.33067     -0.76826      0.00000      0.48000     -0.28000      0.00000
N       2.31537     -1.33678      0.00000     -0.37000      0.21000     -0.00000
7
Model[17]: FrequencyLabel=E';ForceConstant=49.9852 mDyne/A;ReducedMass=12.7153 AMU;FreqValue=2583.0446;Frequency=2583.0446 cm^-1;Mode=15;PATH=Calculation 1;FrequenciesFrequencies;IRIntensity=137.8796 KM/Mole;PATH=Calculation 1;FrequenciesFrequencies
B       0.00000      0.00000      0.00000     -0.00000     -0.11000      0.00000
C       0.00000      1.53653     -0.00000      0.00000      0.64000     -0.00000
N       0.00000      2.67355     -0.00000     -0.00000     -0.49001      0.00000
C      -1.33067     -0.76826     -0.00000      0.28000      0.16000     -0.00000
N      -2.31537     -1.33678     -0.00000     -0.21000     -0.12000      0.00000
C       1.33067     -0.76826      0.00000     -0.28000      0.16000      0.00000
N       2.31537     -1.33678      0.00000      0.21000     -0.12000     -0.00000
</ModelData>
</Models>
##$PEAKS=
<Peaks type="RAMAN" xUnitsExpected="1/cm"  >
<PeakData id="1" title="1 (~2585 cm-1)" peakShape="broad" model="6.16" xMax="2600" xMin="2583"    />
<PeakData id="2" title="2 (~2580 cm-1)" peakShape="broad" model="6.12" xMax="2583" xMin="2565"    />
<PeakData id="3" title="3 (~1180 cm-1)" peakShape="broad" model="6.13" xMax="1195" xMin="1165"    />
<PeakData id="4" title="4 (~565 cm-1)" peakShape="broad" model="6.10" xMax="585" xMin="563"    />
<PeakData id="5" title="5 (~560 cm-1)" peakShape="broad" model="6.9" xMax="562" xMin="540"    />
<PeakData id="5" title="6 (~320 cm-1)" peakShape="broad" model="6.6" xMax="340" xMin="300"    />
<PeakData id="6" title="6 (~130 cm-1)" peakShape="broad" model="6.3" xMax="145" xMin="115"    />
</Peaks>
##XUNITS=1/CM
##YUNITS=RAMAN INTENSITY
##XFACTOR= 1
##YFACTOR= 9.750954E-06
##FIRSTX= 2.783045E+03
##FIRSTY= 0
##LASTX= -7.205660E+01
##NPOINTS= 2001
##MINY= 0
##MAXY= 9.750954
##XYDATA= (X++(Y..Y))
2783.0447 0 0 0 0 0 0 0 0 0 0 0 0 0 0 0 0 0 0 0 0 0 0 0 0 0 0 0 0 0 0 0 0 0 0 0 0 0 0 0 0 0 0 0 0 0 0 0 0 0 0 0 0 0 0 0 0 2937 3008 7199 7374 7556 7744 7940 8143 8354 8573 8801 9038 9285 9542 9810 10089
2680.261 10380 10684 11002 11334 11681 12044 12424 12823 13241 13679 14140 14624 15134 15670 16235 16831 17461
2655.9927 18126 18830 19575 20366 21204 22096 23044 24054 25131 26282 27513 28832 30247 31767 33404
2634.5793 35169 37076 39141 41380 43815 46467 49364 52534 56015 59846 64075 68757 73959 79756
2614.5938 86241 93522 101730 111022 121587 133655 147504 163476 181987 203546 228773 258419
2597.4631 293374 334669 383437 440798 507622 584081 668949 758693 846705 923361 977596
2581.76 1000000 986190 938658 865861 779023 688550 601904 523261 454241 394863 344334
2566.057 301541 265332 234644 208552 186275 167168 150698 136432 124014 113152 103608
2550.3538 95185 87719 81075 75140 69820 65033 60713 56801 53250 50016 47064 44362 41883 39604
2530.3682 37504 35565 33770 32107 30563 29126 27788 26538 25371 24279 23255 22294 21391 20541
2510.3823 19741 18986 18274 17600 16963 16360 15789 15246 14731 14242 13776 13333 12911 12508 12124 11757 11407
2486.114 11072 10751 10444 10150 9869 9598 9339 9090 8851 8621 8400 8187 7983 7786 7596 7412 7236
2461.8457D205r9m106%Z12MJ%YJ%WJ%VJ%UJ%TJ%TJ%J%TJT%J%JU%JVKJB6
1225.5869 28 30 32 34 36 38 41 44 47 51 55 60 65 71 78 86 94 105 117 130 147 166 188 215 246 283 326 376 432 491 550 601 635 647 632 595 543
1172.7676 484 425 370 321 278 242 211 185 163 145 129 115 103 93 85 77 70 64 59 55 51 47 44 41 38 36 33 31 29 28 26 25 24 22 21 20 19 18 17 17 16
1114.2379A5%jT%j%Tj%j%Tj%Tj%Uj%Vj%Wj%Yjm%T60M0JTJ59NTONOVPVQB90
658.8493 299 307 317 326 337 347 358 370 382 395 408 423 437 453 470 487 506 525 546 568 591 616 642 670 700 732 766 803 842
617.4503 884 930 979 1031 1089 1151 1218 1291 1371 1459 1555 1661 1778 1907 2050 2210 2389 2589 2815 3071 3361
587.4718 3693 4073 4511 5019 5609 6300 7111 8066 9192 10520 12078 13888 15954 18243 20670 23083
564.631 25259 26929 27825 27762 26724 24885 22545 20016 17542 15266 13253 11513 10030 8772
544.64526 7709 6808 6042 5390 4831 4350 3934 3572 3256 2978 2734 2517 2325 2153 1999 1861 1737 1624
518.94934 1521 1428 1343 1266 1195 1129 1069 1013 962 914 870 829 790 755 721 690 661 633 608 583 561 539 519 499 481 464 448
480.4055 432 418 404 391 378 366 354 344 333 323 314 305 296 287 279 272 264 257 251 244 238 232 226 220 215 210 166 162 158 0 0 226 232 238 243 250 256 262 269 276 284 291
420.44836 299 308 316 325 335 344 355 365 377 388 401 414 427 441 456 472 488 506 524 543 563 585 608 632 657 685 713 744 777 812 849
376.19427 889 931 977 1026 1079 1137 1198 1265 1338 1417 1503 1597 1699 1812 1936 2074 2226 2394 2582 2793 3029 3296
344.78818 3597 3940 4332 4781 5300 5901 6601 7421 8384 9521 10866 12456 14331 16525 19048 21868
321.94736 24875 27840 30411 32165 32741 32011 30137 27496 24510 21517 18728 16244 14090 12251
301.96167 10692 9374 8260 7315 6511 5824 5234 4724 4282 3896 3559 3262 2999 2766 2559 2373 2206
277.6933 2056 1921 1798 1687 1585 1492 1407 1329 1257 1191 1129 1073 1020 971 926 884 844 807 773 740 710 876 853
244.85963 833 814 797 781 766 753 741 730 720 711 704 697 691 687 683 680 678 677 677 678 679 682 685 690 695 702 710 718 728 739 751 765 780 796 814
194.89536 613 639 667 697 729 763 800 839 882 927 976 1029 1087 1149 1217 1291 1371 1460 1557 1663 1781 1911 2056 2218
160.63416 2399 2602 2830 3089 3384 3721 4107 4552 5068 5670 6374 7201 8178 9332 10698 12309 14193
136.36578 16360 18782 21364 23911 26120 27625 28121 27493 25884 23616 21051 18480 16085 13951
116.38008 12101 10522 9183 8051 7094 6283 5593 5002 4495 4057 3678 3347 3057 2801 2576 2376
93.53927 2198 2038 1895 1766 1650 1544 1449 1361 1281 1208 1141 1080 1023 970 921 876 834 795 759 725 693 664 636
60.705605 610 585 562 540 520 500 482 464 448 432 418 404 390 377 365 354 343 332 322 313 304 295 286 278 271 263 256 249 243 237 230 225 219 214 208 203 199 194 0 0
3.603582 0 0 0 0 0 0 0 0 0 0 0 0 0 0 0 0 0 0 0 0 0 0 0 0 0 0 0 0 0 0 0 0 0 0 0 0 0 0 0 0 0 0 0 0 0 0 0 0 0 0 0 0 0
-72.0566@  $$checkpoint
##END=$$ End of RAMAN B(CN)3 Block
##TITLE= H2FCB(CN)3
##JCAMP-DX= 5.01
##DATA TYPE= INFRARED SPECTRUM
##DATA CLASS= XYDATA
##BLOCK ID=7
##ORIGIN= Department of Chemistry, UWI, JAMAICA
##OWNER= public domain
##LONGDATE= 2012/02/18 12:32:26.0301 -0500 $$ export date from JSpecView
##SPECTROMETER/DATA SYSTEM= from scan
##$MODELS=
<Models>
<ModelData id="IH2FCBCN2" type="MOL">
H2FCB(CN)2
__Jmol-14_02271917283D 1   1.00000     0.00000     0
Jmol version 14.29.31  2019-01-29 15:30 EXTRACT: ({0:8})
  9  8  0  0  0  0            999 V2000
    1.4580   -0.3800    0.0000 C   0  0  2  0  0  0
   -0.0000    0.2071    0.0000 B   0  0  0  0  0  0
   -1.2512   -0.6931   -0.0000 C   0  0  0  0  0  0
   -2.1824   -1.3458   -0.0000 N   0  0  0  0  0  0
   -0.1895    1.7430   -0.0000 C   0  0  0  0  0  0
   -0.2906    2.8757   -0.0000 N   0  0  0  0  0  0
    1.4632   -1.7467    0.0000 F   0  0  0  0  0  0
    2.0196   -0.0218    0.8545 H   0  0  0  0  0  0
    2.0196   -0.0218   -0.8545 H   0  0  0  0  0  0
  1  7  1  0  0  0
  1  9  1  0  0  0
  1  8  1  0  0  0
  2  1  1  0  0  0
  3  2  1  0  0  0
  4  3  1  0  0  0
  5  2  1  0  0  0
  6  5  1  0  0  0
M  END
</ModelData>
<ModelData id="7" type="XYZVIB" baseModel="IH2FCBCN2" vibrationScale=".5">
9
Model[1]: PATH=Calculation 1;Standard;Energy=-347.78027;Range=M.O.s;NFock==Conv=0.78D-08;E(RHF)=-347.780260658 A.U.;PATH=Calculation 1;Standard
C       1.45796     -0.37998      0.00000
B      -0.00000      0.20708      0.00000
C      -1.25124     -0.69310     -0.00000
N      -2.18244     -1.34584     -0.00000
C      -0.18954      1.74298     -0.00000
N      -0.29058      2.87571     -0.00000
F       1.46322     -1.74669      0.00000
H       2.01957     -0.02181      0.85448
H       2.01957     -0.02181     -0.85448
9
Model[2]: FrequencyLabel=A";ForceConstant=0.0004 mDyne/A;ReducedMass=2.3718 AMU;FreqValue=15.8676;Frequency=15.8676 cm^-1;Mode=1;PATH=Calculation 1;FrequenciesFrequencies;IRIntensity=9.5716 KM/Mole;PATH=Calculation 1;FrequenciesFrequencies
C       1.45796     -0.37998      0.00000     -0.00000      0.00000     -0.23001
B      -0.00000      0.20708      0.00000     -0.00000     -0.00000     -0.03000
C      -1.25124     -0.69310     -0.00000     -0.00000     -0.00000     -0.02000
N      -2.18244     -1.34584     -0.00000     -0.00000      0.00000     -0.06000
C      -0.18954      1.74298     -0.00000     -0.00000     -0.00000      0.03000
N      -0.29058      2.87571     -0.00000      0.00000     -0.00000      0.09000
F       1.46322     -1.74669      0.00000      0.00000      0.00000      0.18001
H       2.01957     -0.02181      0.85448      0.30001      0.27001     -0.54000
H       2.01957     -0.02181     -0.85448     -0.30001     -0.27001     -0.54000
9
Model[3]: FrequencyLabel=A';ForceConstant=0.1254 mDyne/A;ReducedMass=13.8489 AMU;FreqValue=123.9825;Frequency=123.9825 cm^-1;Mode=2;PATH=Calculation 1;FrequenciesFrequencies;IRIntensity=6.1419 KM/Mole;PATH=Calculation 1;FrequenciesFrequencies
C       1.45796     -0.37998      0.00000      0.19000     -0.07000      0.00000
B      -0.00000      0.20708      0.00000      0.15001     -0.16000      0.00000
C      -1.25124     -0.69310     -0.00000     -0.02000      0.07000      0.00000
N      -2.18244     -1.34584     -0.00000     -0.39000      0.59000     -0.00000
C      -0.18954      1.74298     -0.00000     -0.00000     -0.18001      0.00000
N      -0.29058      2.87571     -0.00000     -0.39000     -0.21000     -0.00000
F       1.46322     -1.74669      0.00000      0.37000     -0.07000     -0.00000
H       2.01957     -0.02181      0.85448      0.15001     -0.00000     -0.00000
H       2.01957     -0.02181     -0.85448      0.15001     -0.00000      0.00000
9
Model[4]: FrequencyLabel=A';ForceConstant=0.1157 mDyne/A;ReducedMass=9.5874 AMU;FreqValue=143.1133;Frequency=143.1133 cm^-1;Mode=3;PATH=Calculation 1;FrequenciesFrequencies;IRIntensity=11.1725 KM/Mole;PATH=Calculation 1;FrequenciesFrequencies
C       1.45796     -0.37998      0.00000     -0.13000      0.16000      0.00000
B      -0.00000      0.20708      0.00000     -0.24000     -0.12000      0.00000
C      -1.25124     -0.69310     -0.00000     -0.25000     -0.13000      0.00000
N      -2.18244     -1.34584     -0.00000     -0.28000     -0.08000     -0.00000
C      -0.18954      1.74298     -0.00000     -0.07000     -0.10000      0.00000
N      -0.29058      2.87571     -0.00000      0.46001     -0.05000     -0.00000
F       1.46322     -1.74669      0.00000      0.32000      0.18001     -0.00000
H       2.01957     -0.02181      0.85448     -0.24000      0.35000     -0.00000
H       2.01957     -0.02181     -0.85448     -0.24000      0.35000      0.00000
9
Model[5]: FrequencyLabel=A";ForceConstant=0.1236 mDyne/A;ReducedMass=6.9000 AMU;FreqValue=174.3700;Frequency=174.3700 cm^-1;Mode=4;PATH=Calculation 1;FrequenciesFrequencies;IRIntensity=25.2470 KM/Mole;PATH=Calculation 1;FrequenciesFrequencies
C       1.45796     -0.37998      0.00000      0.00000     -0.00000     -0.03000
B      -0.00000      0.20708      0.00000      0.00000      0.00000      0.41000
C      -1.25124     -0.69310     -0.00000      0.00000      0.00000      0.28000
N      -2.18244     -1.34584     -0.00000      0.00000     -0.00000     -0.28000
C      -0.18954      1.74298     -0.00000      0.00000      0.00000      0.27001
N      -0.29058      2.87571     -0.00000     -0.00000      0.00000     -0.32000
F       1.46322     -1.74669      0.00000     -0.00000     -0.00000     -0.09000
H       2.01957     -0.02181      0.85448      0.40000     -0.02000     -0.29000
H       2.01957     -0.02181     -0.85448     -0.40000      0.02000     -0.29000
9
Model[6]: FrequencyLabel=A";ForceConstant=0.7340 mDyne/A;ReducedMass=11.7517 AMU;FreqValue=325.5918;Frequency=325.5918 cm^-1;Mode=5;PATH=Calculation 1;FrequenciesFrequencies;IRIntensity=0.0574 KM/Mole;PATH=Calculation 1;FrequenciesFrequencies
C       1.45796     -0.37998      0.00000      0.00000      0.00000     -0.00000
B      -0.00000      0.20708      0.00000     -0.00000     -0.00000     -0.02000
C      -1.25124     -0.69310     -0.00000      0.00000     -0.00000      0.65000
N      -2.18244     -1.34584     -0.00000     -0.00000      0.00000     -0.31000
C      -0.18954      1.74298     -0.00000     -0.00000     -0.00000     -0.59000
N      -0.29058      2.87571     -0.00000      0.00000     -0.00000      0.28000
F       1.46322     -1.74669      0.00000     -0.00000      0.00000     -0.02000
H       2.01957     -0.02181      0.85448     -0.13000     -0.01000      0.10000
H       2.01957     -0.02181     -0.85448      0.13000      0.01000      0.10000
9
Model[7]: FrequencyLabel=A';ForceConstant=0.9024 mDyne/A;ReducedMass=12.1812 AMU;FreqValue=354.5957;Frequency=354.5957 cm^-1;Mode=6;PATH=Calculation 1;FrequenciesFrequencies;IRIntensity=4.7652 KM/Mole;PATH=Calculation 1;FrequenciesFrequencies
C       1.45796     -0.37998      0.00000     -0.17000     -0.24000      0.00000
B      -0.00000      0.20708      0.00000     -0.12000      0.09000      0.00000
C      -1.25124     -0.69310     -0.00000     -0.38000      0.41000     -0.00000
N      -2.18244     -1.34584     -0.00000      0.08000     -0.26000      0.00000
C      -0.18954      1.74298     -0.00000      0.28000      0.22000     -0.00000
N      -0.29058      2.87571     -0.00000     -0.19000      0.19000      0.00000
F       1.46322     -1.74669      0.00000      0.35000     -0.24000     -0.00000
H       2.01957     -0.02181      0.85448     -0.22000     -0.10000     -0.02000
H       2.01957     -0.02181     -0.85448     -0.22000     -0.10000      0.02000
9
Model[8]: FrequencyLabel=A';ForceConstant=1.5799 mDyne/A;ReducedMass=11.4162 AMU;FreqValue=484.6495;Frequency=484.6495 cm^-1;Mode=7;PATH=Calculation 1;FrequenciesFrequencies;IRIntensity=1.3842 KM/Mole;PATH=Calculation 1;FrequenciesFrequencies
C       1.45796     -0.37998      0.00000     -0.03000      0.20001      0.00000
B      -0.00000      0.20708      0.00000      0.05000     -0.11000      0.00000
C      -1.25124     -0.69310     -0.00000     -0.20001      0.21000     -0.00000
N      -2.18244     -1.34584     -0.00000      0.02000     -0.11000      0.00000
C      -0.18954      1.74298     -0.00000      0.61000     -0.26000     -0.00000
N      -0.29058      2.87571     -0.00000     -0.14000     -0.36001      0.00000
F       1.46322     -1.74669      0.00000     -0.18001      0.28000     -0.00000
H       2.01957     -0.02181      0.85448     -0.07000      0.26000      0.01000
H       2.01957     -0.02181     -0.85448     -0.07000      0.26000     -0.01000
9
Model[9]: FrequencyLabel=A";ForceConstant=0.4430 mDyne/A;ReducedMass=2.9383 AMU;FreqValue=505.8422;Frequency=505.8422 cm^-1;Mode=8;PATH=Calculation 1;FrequenciesFrequencies;IRIntensity=3.6507 KM/Mole;PATH=Calculation 1;FrequenciesFrequencies
C       1.45796     -0.37998      0.00000     -0.00000     -0.00000      0.13000
B      -0.00000      0.20708      0.00000     -0.00000      0.00000      0.26000
C      -1.25124     -0.69310     -0.00000      0.00000     -0.00000     -0.18001
N      -2.18244     -1.34584     -0.00000      0.00000      0.00000      0.06000
C      -0.18954      1.74298     -0.00000     -0.00000      0.00000     -0.23001
N      -0.29058      2.87571     -0.00000      0.00000      0.00000      0.07000
F       1.46322     -1.74669      0.00000      0.00000     -0.00000     -0.05000
H       2.01957     -0.02181      0.85448      0.59000     -0.03000     -0.26000
H       2.01957     -0.02181     -0.85448     -0.59000      0.03000     -0.26000
9
Model[10]: FrequencyLabel=A';ForceConstant=2.2959 mDyne/A;ReducedMass=12.4462 AMU;FreqValue=559.5476;Frequency=559.5476 cm^-1;Mode=9;PATH=Calculation 1;FrequenciesFrequencies;IRIntensity=2.8523 KM/Mole;PATH=Calculation 1;FrequenciesFrequencies
C       1.45796     -0.37998      0.00000      0.01000     -0.01000      0.00000
B      -0.00000      0.20708      0.00000      0.01000      0.01000      0.00000
C      -1.25124     -0.69310     -0.00000     -0.10000      0.62000     -0.00000
N      -2.18244     -1.34584     -0.00000      0.33001      0.06000      0.00000
C      -0.18954      1.74298     -0.00000     -0.52000     -0.32000     -0.00000
N      -0.29058      2.87571     -0.00000      0.17000     -0.29000      0.00000
F       1.46322     -1.74669      0.00000      0.01000     -0.01000     -0.00000
H       2.01957     -0.02181      0.85448      0.01000     -0.02000      0.00000
H       2.01957     -0.02181     -0.85448      0.01000     -0.02000     -0.00000
9
Model[11]: FrequencyLabel=A';ForceConstant=1.3361 mDyne/A;ReducedMass=5.3456 AMU;FreqValue=651.3144;Frequency=651.3144 cm^-1;Mode=10;PATH=Calculation 1;FrequenciesFrequencies;IRIntensity=21.0911 KM/Mole;PATH=Calculation 1;FrequenciesFrequencies
C       1.45796     -0.37998      0.00000      0.45000      0.04000     -0.00000
B      -0.00000      0.20708      0.00000      0.13000     -0.02000      0.00000
C      -1.25124     -0.69310     -0.00000     -0.28000      0.05000     -0.00000
N      -2.18244     -1.34584     -0.00000     -0.16000     -0.18001      0.00000
C      -0.18954      1.74298     -0.00000     -0.09000      0.05000     -0.00000
N      -0.29058      2.87571     -0.00000      0.01000      0.07000      0.00000
F       1.46322     -1.74669      0.00000     -0.07000      0.02000      0.00000
H       2.01957     -0.02181      0.85448      0.53000     -0.16000      0.02000
H       2.01957     -0.02181     -0.85448      0.53000     -0.16000     -0.02000
9
Model[12]: FrequencyLabel=A";ForceConstant=1.1916 mDyne/A;ReducedMass=2.5000 AMU;FreqValue=899.4443;Frequency=899.4443 cm^-1;Mode=11;PATH=Calculation 1;FrequenciesFrequencies;IRIntensity=20.1615 KM/Mole;PATH=Calculation 1;FrequenciesFrequencies
C       1.45796     -0.37998      0.00000     -0.00000      0.00000     -0.22000
B      -0.00000      0.20708      0.00000     -0.00000      0.00000      0.28000
C      -1.25124     -0.69310     -0.00000      0.00000     -0.00000     -0.09000
N      -2.18244     -1.34584     -0.00000      0.00000      0.00000      0.01000
C      -0.18954      1.74298     -0.00000      0.00000     -0.00000     -0.08000
N      -0.29058      2.87571     -0.00000     -0.00000     -0.00000      0.02000
F       1.46322     -1.74669      0.00000      0.00000     -0.00000      0.04000
H       2.01957     -0.02181      0.85448     -0.61000     -0.06000      0.23001
H       2.01957     -0.02181     -0.85448      0.61000      0.06000      0.23001
9
Model[13]: FrequencyLabel=A';ForceConstant=6.3011 mDyne/A;ReducedMass=8.5845 AMU;FreqValue=1116.1556;Frequency=1116.1556 cm^-1;Mode=12;PATH=Calculation 1;FrequenciesFrequencies;IRIntensity=247.7830 KM/Mole;PATH=Calculation 1;FrequenciesFrequencies
C       1.45796     -0.37998      0.00000      0.12000      0.26000      0.00000
B      -0.00000      0.20708      0.00000     -0.33001      0.62000     -0.00000
C      -1.25124     -0.69310     -0.00000      0.03000     -0.08000      0.00000
N      -2.18244     -1.34584     -0.00000     -0.04000     -0.01000     -0.00000
C      -0.18954      1.74298     -0.00000      0.09000     -0.11000      0.00000
N      -0.29058      2.87571     -0.00000      0.01000     -0.21000     -0.00000
F       1.46322     -1.74669      0.00000      0.03000     -0.22000     -0.00000
H       2.01957     -0.02181      0.85448      0.36001     -0.15001     -0.00000
H       2.01957     -0.02181     -0.85448      0.36001     -0.15001      0.00000
9
Model[14]: FrequencyLabel=A';ForceConstant=7.0566 mDyne/A;ReducedMass=8.4956 AMU;FreqValue=1187.3394;Frequency=1187.3394 cm^-1;Mode=13;PATH=Calculation 1;FrequenciesFrequencies;IRIntensity=70.7717 KM/Mole;PATH=Calculation 1;FrequenciesFrequencies
C       1.45796     -0.37998      0.00000     -0.19000     -0.37000     -0.00000
B      -0.00000      0.20708      0.00000      0.40000      0.47000      0.00000
C      -1.25124     -0.69310     -0.00000     -0.05000     -0.08000     -0.00000
N      -2.18244     -1.34584     -0.00000     -0.14000     -0.09000     -0.00000
C      -0.18954      1.74298     -0.00000     -0.06000     -0.06000     -0.00000
N      -0.29058      2.87571     -0.00000      0.03000     -0.11000      0.00000
F       1.46322     -1.74669      0.00000      0.05000      0.24000      0.00000
H       2.01957     -0.02181      0.85448     -0.04000     -0.40000     -0.07000
H       2.01957     -0.02181     -0.85448     -0.04000     -0.40000      0.07000
9
Model[15]: FrequencyLabel=A';ForceConstant=3.4851 mDyne/A;ReducedMass=3.8303 AMU;FreqValue=1242.7107;Frequency=1242.7107 cm^-1;Mode=14;PATH=Calculation 1;FrequenciesFrequencies;IRIntensity=144.6297 KM/Mole;PATH=Calculation 1;FrequenciesFrequencies
C       1.45796     -0.37998      0.00000     -0.10000      0.24000     -0.00000
B      -0.00000      0.20708      0.00000      0.36001      0.04000      0.00000
C      -1.25124     -0.69310     -0.00000     -0.05000     -0.01000     -0.00000
N      -2.18244     -1.34584     -0.00000     -0.07000     -0.05000      0.00000
C      -0.18954      1.74298     -0.00000     -0.04000     -0.00000     -0.00000
N      -0.29058      2.87571     -0.00000      0.01000     -0.00000      0.00000
F       1.46322     -1.74669      0.00000     -0.01000     -0.19000      0.00000
H       2.01957     -0.02181      0.85448     -0.31000      0.53000      0.00000
H       2.01957     -0.02181     -0.85448     -0.31000      0.53000     -0.00000
9
Model[16]: FrequencyLabel=A";ForceConstant=1.1752 mDyne/A;ReducedMass=1.0915 AMU;FreqValue=1351.7922;Frequency=1351.7922 cm^-1;Mode=15;PATH=Calculation 1;FrequenciesFrequencies;IRIntensity=2.8443 KM/Mole;PATH=Calculation 1;FrequenciesFrequencies
C       1.45796     -0.37998      0.00000     -0.00000      0.00000      0.06000
B      -0.00000      0.20708      0.00000      0.00000     -0.00000      0.03000
C      -1.25124     -0.69310     -0.00000     -0.00000      0.00000     -0.01000
N      -2.18244     -1.34584     -0.00000     -0.00000     -0.00000      0.00000
C      -0.18954      1.74298     -0.00000     -0.00000      0.00000     -0.00000
N      -0.29058      2.87571     -0.00000      0.00000      0.00000     -0.00000
F       1.46322     -1.74669      0.00000      0.00000     -0.00000     -0.04000
H       2.01957     -0.02181      0.85448     -0.19000      0.67000     -0.07000
H       2.01957     -0.02181     -0.85448      0.19000     -0.67000     -0.07000
9
Model[17]: FrequencyLabel=A';ForceConstant=2.1380 mDyne/A;ReducedMass=1.5832 AMU;FreqValue=1513.9762;Frequency=1513.9762 cm^-1;Mode=16;PATH=Calculation 1;FrequenciesFrequencies;IRIntensity=3.6646 KM/Mole;PATH=Calculation 1;FrequenciesFrequencies
C       1.45796     -0.37998      0.00000      0.15001     -0.14000     -0.00000
B      -0.00000      0.20708      0.00000     -0.06000      0.07000      0.00000
C      -1.25124     -0.69310     -0.00000      0.01000     -0.01000     -0.00000
N      -2.18244     -1.34584     -0.00000      0.00000      0.00000      0.00000
C      -0.18954      1.74298     -0.00000      0.00000     -0.00000     -0.00000
N      -0.29058      2.87571     -0.00000      0.00000     -0.01000      0.00000
F       1.46322     -1.74669      0.00000     -0.02000      0.01000     -0.00000
H       2.01957     -0.02181      0.85448     -0.43000      0.52000      0.11000
H       2.01957     -0.02181     -0.85448     -0.43000      0.52000     -0.11000
9
Model[18]: FrequencyLabel=A';ForceConstant=1.6254 mDyne/A;ReducedMass=1.0728 AMU;FreqValue=1603.6095;Frequency=1603.6095 cm^-1;Mode=17;PATH=Calculation 1;FrequenciesFrequencies;IRIntensity=13.3507 KM/Mole;PATH=Calculation 1;FrequenciesFrequencies
C       1.45796     -0.37998      0.00000      0.04000      0.06000      0.00000
B      -0.00000      0.20708      0.00000      0.01000     -0.00000      0.00000
C      -1.25124     -0.69310     -0.00000     -0.00000      0.00000     -0.00000
N      -2.18244     -1.34584     -0.00000     -0.00000     -0.00000     -0.00000
C      -0.18954      1.74298     -0.00000      0.00000     -0.00000      0.00000
N      -0.29058      2.87571     -0.00000     -0.00000      0.00000      0.00000
F       1.46322     -1.74669      0.00000      0.01000      0.00000     -0.00000
H       2.01957     -0.02181      0.85448     -0.39000     -0.39000      0.44000
H       2.01957     -0.02181     -0.85448     -0.39000     -0.39000     -0.44000
9
Model[19]: FrequencyLabel=A';ForceConstant=49.9033 mDyne/A;ReducedMass=12.7342 AMU;FreqValue=2579.0122;Frequency=2579.0122 cm^-1;Mode=18;PATH=Calculation 1;FrequenciesFrequencies;IRIntensity=25.7671 KM/Mole;PATH=Calculation 1;FrequenciesFrequencies
C       1.45796     -0.37998      0.00000      0.00000     -0.00000      0.00000
B      -0.00000      0.20708      0.00000     -0.07000      0.00000     -0.00000
C      -1.25124     -0.69310     -0.00000      0.54000      0.38000     -0.00000
N      -2.18244     -1.34584     -0.00000     -0.42000     -0.29000      0.00000
C      -0.18954      1.74298     -0.00000      0.04000     -0.43000      0.00000
N      -0.29058      2.87571     -0.00000     -0.03000      0.33001      0.00000
F       1.46322     -1.74669      0.00000     -0.00000      0.00000     -0.00000
H       2.01957     -0.02181      0.85448     -0.00000      0.01000     -0.01000
H       2.01957     -0.02181     -0.85448     -0.00000      0.01000      0.01000
9
Model[20]: FrequencyLabel=A';ForceConstant=49.9879 mDyne/A;ReducedMass=12.7204 AMU;FreqValue=2582.6020;Frequency=2582.6020 cm^-1;Mode=19;PATH=Calculation 1;FrequenciesFrequencies;IRIntensity=82.8032 KM/Mole;PATH=Calculation 1;FrequenciesFrequencies
C       1.45796     -0.37998      0.00000      0.00000     -0.00000      0.00000
B      -0.00000      0.20708      0.00000     -0.03000     -0.10000     -0.00000
C      -1.25124     -0.69310     -0.00000      0.36001      0.25000     -0.00000
N      -2.18244     -1.34584     -0.00000     -0.27001     -0.19000     -0.00000
C      -0.18954      1.74298     -0.00000     -0.06000      0.66001     -0.00000
N      -0.29058      2.87571     -0.00000      0.05000     -0.50000      0.00000
F       1.46322     -1.74669      0.00000     -0.00000      0.00000      0.00000
H       2.01957     -0.02181      0.85448      0.01000     -0.01000     -0.00000
H       2.01957     -0.02181     -0.85448      0.01000     -0.01000      0.00000
9
Model[21]: FrequencyLabel=A';ForceConstant=6.5806 mDyne/A;ReducedMass=1.0600 AMU;FreqValue=3246.0039;Frequency=3246.0039 cm^-1;Mode=20;PATH=Calculation 1;FrequenciesFrequencies;IRIntensity=12.6785 KM/Mole;PATH=Calculation 1;FrequenciesFrequencies
C       1.45796     -0.37998      0.00000     -0.06000     -0.03000     -0.00000
B      -0.00000      0.20708      0.00000      0.00000     -0.00000     -0.00000
C      -1.25124     -0.69310     -0.00000      0.00000      0.00000     -0.00000
N      -2.18244     -1.34584     -0.00000     -0.00000     -0.00000      0.00000
C      -0.18954      1.74298     -0.00000     -0.00000     -0.00000      0.00000
N      -0.29058      2.87571     -0.00000      0.00000      0.00000     -0.00000
F       1.46322     -1.74669      0.00000      0.00000     -0.00000      0.00000
H       2.01957     -0.02181      0.85448      0.35000      0.22000      0.57000
H       2.01957     -0.02181     -0.85448      0.35000      0.22000     -0.57000
9
Model[22]: FrequencyLabel=A";ForceConstant=6.9312 mDyne/A;ReducedMass=1.1000 AMU;FreqValue=3270.2883;Frequency=3270.2883 cm^-1;Mode=21;PATH=Calculation 1;FrequenciesFrequencies;IRIntensity=11.8429 KM/Mole;PATH=Calculation 1;FrequenciesFrequencies
C       1.45796     -0.37998      0.00000      0.00000      0.00000     -0.09000
B      -0.00000      0.20708      0.00000     -0.00000      0.00000     -0.00000
C      -1.25124     -0.69310     -0.00000     -0.00000     -0.00000     -0.00000
N      -2.18244     -1.34584     -0.00000      0.00000      0.00000      0.00000
C      -0.18954      1.74298     -0.00000      0.00000      0.00000      0.00000
N      -0.29058      2.87571     -0.00000     -0.00000     -0.00000     -0.00000
F       1.46322     -1.74669      0.00000     -0.00000      0.00000      0.00000
H       2.01957     -0.02181      0.85448      0.38000      0.22000      0.55000
H       2.01957     -0.02181     -0.85448     -0.38000     -0.22000      0.55000
</ModelData>
</Models>
##$PEAKS=
<Peaks type="IR" xUnitsExpected="1/cm"  >
<PeakData id="1" title="1 (~3270 cm-1)" peakShape="broad" model="7.22" xMax="3290" xMin="3255"    />
<PeakData id="2" title="2 (~3250 cm-1)" peakShape="broad" model="7.21" xMax="3255" xMin="3225"    />
<PeakData id="3" title="3 (~2585 cm-1)" peakShape="broad" model="7.20" xMax="2600" xMin="2583"    />
<PeakData id="4" title="4 (~2580 cm-1)" peakShape="broad" model="7.19" xMax="2582" xMin="2560"    />
<PeakData id="5" title="5 (~1605 cm-1)" peakShape="broad" model="7.18" xMax="1620" xMin="1590"    />
<PeakData id="6" title="6 (~1515 cm-1)" peakShape="broad" model="7.17" xMax="1530" xMin="1500"    />
<PeakData id="7" title="7 (~1350 cm-1)" peakShape="broad" model="7.16" xMax="1365" xMin="1335"    />
<PeakData id="8" title="8 (~1240 cm-1)" peakShape="broad" model="7.15" xMax="1255" xMin="1225"    />
<PeakData id="9" title="9 (~1190 cm-1)" peakShape="broad" model="7.14" xMax="1205" xMin="1175"    />
<PeakData id="10" title="10 (~1120 cm-1)" peakShape="broad" model="7.13" xMax="1135" xMin="1105"    />
<PeakData id="11" title="11 (~900 cm-1)" peakShape="broad" model="7.12" xMax="915" xMin="885"    />
<PeakData id="12" title="12 (~650 cm-1)" peakShape="broad" model="7.11" xMax="665" xMin="635"    />
<PeakData id="13" title="13 (~560 cm-1)" peakShape="broad" model="7.10" xMax="575" xMin="545"    />
<PeakData id="14" title="14 (~510 cm-1)" peakShape="broad" model="7.9" xMax="525" xMin="495"    />
<PeakData id="15" title="15 (~485 cm-1)" peakShape="broad" model="7.8" xMax="493" xMin="470"    />
<PeakData id="16" title="16 (~355 cm-1)" peakShape="broad" model="7.7" xMax="375" xMin="332"    />
<PeakData id="17" title="17 (~325 cm-1)" peakShape="broad" model="7.6" xMax="330" xMin="310"    />
<PeakData id="18" title="18 (~175 cm-1)" peakShape="broad" model="7.5" xMax="190" xMin="160"    />
<PeakData id="19" title="19 (~145 cm-1)" peakShape="broad" model="7.4" xMax="160" xMin="130"    />
<PeakData id="20" title="20 (~125 cm-1)" peakShape="broad" model="7.3" xMax="130" xMin="110"    />
<PeakData id="21" title="21 (~16 cm-1)" peakShape="broad" model="7.2" xMax="65" xMin="1"    />
</Peaks>
##XUNITS= 1/CM
##YUNITS= TRANSMITTANCE
##XFACTOR= 1
##YFACTOR= 9.999000E-07
##FIRSTX= 3.470288E+03
##FIRSTY= 1
##LASTX= -1.841324E+02
##NPOINTS= 2001
##MINY= 1.000000E-04
##MAXY= 1
##XYDATA= (X++(Y..Y))
3470.2883 1000100 1000100 1000100 1000100 1000100 1000100 1000100 1000100 1000100 1000100 1000100 1000100 1000100 1000100 1000100 1000100 1000100 1000100 1000100 1000100 1000100 1000100 1000100 1000100 1000100 1000100 1000100 1000100 1000100 1000100 1000100 1000100 1000100 1000100 1000100 1000100 1000100 1000100 1000100 1000100 1000100 1000100 1000100 1000100 997043 996948 996848 996744 996635 996520 996400 996273 996140 995999 995852 995696 995531 992100 991815
3362.483 991515 991198 990863 990509 990134 989736 989314 988865 988387 987878 987334 986753 986131 985465 984748 983978 983147
3331.4204 982250 981279 980225 979080 977831 976467 974972 973328 971517 969513 967288 964810 962037 958922
3305.8394 955407 951420 946875 941665 935657 928688 920551 910990 899683 886232 870151 850869 827756
3282.0857 800226 767953 731299 691966 653656 622050 603190 600442 612231 632748 654945
3261.9863 673128 683807 685334 677365 660716 637721 612818 592579 584162 592247 616551 652262
3240.0598 692930 733234 770036 802078 829256 852019 871002 886843 900110 911278 920736
3219.9604 928797 935711 941679 946861 951386 955359 958866 961975 964744 967221 969445 971449 973262
3196.2068 974907 976405 977771 979022 980170 981226 982199 983099 983932 984704 985423 986091 986715 987298 987843
3168.7986 988354 988833 989284 989707 990107 990483 990838 991174 991492 991794 992079 995272 995445 995609 995764 995911 996051
3137.736I96185J26J21J15J10J04J00L239%T30k1182o52p172r11r54I68229
2691.8967 967181 966080 964923 963707 962428 961080 959660 958161 956579 954907 953137 951263 949276
2668.143 947167 944925 942541 940001 937293 934400 931307 927994 924442 920626 916521 912098 907324
2644.3892 902162 896570 890501 883901 876709 868856 860261 850835 840472 829054 816442 802478 786981
2620.6355 769742 750524 729055 705029 678109 647924 614086 576213 533965 487118 435668
2600.5361 379989 321039 260573 201280 146647 100320 64971 41184 27349 20856 19676
2580.4368 23258 32678 50222 78266 117753 167363 224000 283991 344091 401940 456087 505810
2558.5103 550893 591439 627725 660115 688998 714759 737757 758319 776737 793271 808147
2538.4111 821563 833690 844680 854662 863750 872043 879628 886579 892963 898838 904255 909260 913891
2514.6572 918185 922172 925881 929336 932559 935571 938389 941029 943506 945832 948019 950079 952020
2490.9036 953852 955582 957218 958767 960233 961624 962944 964198 965390 966524 967604 968633 969614
2467.15I70550Q94Q55K1028K02O571%V01l446j07j12j17j24j29j36I95787
1708.8575 995637 995479 995312 995136 994951 994755 994548 994328 994095 993848 993585 993306 993008 992691 992352 991989 991600
1677.7949 991183 990734 990251 989731 989168 988558 987897 987178 986394 985538 984600 983570 982435 981181 979791 978246
1648.5596 976521 974589 972416 969961 967175 963998 960357 956161 950397 944703 938027 930147 920787
1624.8058 909598 896147 879903 860242 836481 807990 774444 736309 695570 656464 625466
1604.7065 609550 612958 634725 669268 709465 749528 786060 817701 844334 866430 884658
1584.6072 899688 912112 922425 931029 938244 944323 949469 953842 957567 960746 963461 965774 967737
1560.8535 969390 970765 971885 972767 973421 973852 974059 974034 973761 973218 972371 971174 969567 967468 964770 961334
1531.6182 956984 951497 944609 936036 925547 913125 899264 885367 873945 868023 869580 878168
1509.6917 891247 905836 919798 932087 942427 950939 957886 963551 968189 972009 975180 977833
1487.765 980070 981971 983600 988275 989404 990383 991236 991985 992644 992497 992992 993431 993821 994167 994476 994752
1458.5297 994998 995218 995414 995589 995745 995883 996005 996112 996205 996285 996353 996410 996454 996489 996512 996525 996527 996520 996501 996471 996431 996378
1418.331 996313 996235 996143 996036 995913 995771 995609 995426 995218 994982 994715 994412 994068 993678 994137 993602 992993 992297
1385.4413 991497 990573 989497 988238 986752 984987 982874 980325 977226 973433 968766 963012 955937 912581
1359.8604 901777 889833 877820 867669 861717 861481 866577 875001 884435 893242 900639 906431 910716
1336.1066 913699 915592 916582 916820 916421 915475 914045 912177 909901 907237 904193 900771 896966 892764
1310.5256 888149 883095 861664 855262 848311 840762 832562 823646 813945 803376 791848 779256 765481
1286.772 750389 733830 715632 695608 673546 649217 622374 592756 560105 524180 484787
1266.6726 441831 395380 345767 293711 240449 187844 138366 94823 59736 34466 18543
1246.5734 9872 5823 4385 4636 6730 11879 20821 37399 61979 94013 131326 171226 211050
1222.8196 248624 282372 311240 334567 351946 363116 367880 366063 357504 342080 319790 290895
1200.8931 256135 216994 175916 136270 101786 75488 58758 51460 53125 63959 84616 114969
1178.9666 153171 195949 239687 281373 318974 351372 378119 399185 414759 425125 430586
1158.8672 431417 427854 420089 408272 392526 372966 349719 322959 292948 260083 224957 188418
1136.9407 151616 116009 83291 55176 33041 17483 8008 3156 1103 393 161 100 111
1113.1869 214 573 1698 4723 11463 23928 43531 70564 104230 143028 185208 229111 273347
1089.4332 316854 358882 398945 436762 472203 505248 535947 564395 590717 615050 637537
1069.3339 658318 677530 707627 724000 739145 753169 766168 778231 789439 799864 809574
1049.2346 818627 827079 834979 842371 849296 855792 861890 867622 873016 878096 882886 887407 891678
1025.4808 895717 899539 903159 906592 905119 908049 910818 913437 915912 918253 920466 922557 924534
1001.7271 926400 928161 929821 931384 992039 991727 991396 991046 990674 990278 989858 989410 988932 988422 987876
974.319 987291 986664 985990 985265 984482 983637 982722 981729 980650 979475 978191 976785 975242 973543 971668
946.9108 969590 967282 964708 961827 958590 954938 950799 946086 940695 934495 927326 918990 909243
923.15704 897777 884214 868086 848821 825742 798089 765085 726125 681134 631174 579234
903.05774 530814 493467 474673 478736 504696 546809 597232 648975 697431 740371 777213
882.95844 808274 834247 855916 874019 889196 901981 912810 922036 929940 936752 942654 947796
861.0319 952298 956259 959759 962867 965636 968113 970337 972342 974153 975795 977289 978650 979895
837.2782 981036 982084 983048 983938 984761 985523 986230 986887 987499 988070 988603 989102 989569 990007 990419 990806 991170
806.21564 991513 991838 992144 992433 992707 992967 993214 993447 993670 993881 994082 994273 994456 994630 994796 994955 1000100
775.153 1000100 1000100 994662 994493 994316 994131 993937 993733 993519 993295 993058 992809 992547 992270 991978 991669 991343
744.09045 990997 990630 990241 989828 989388 988920 988420 987887 987316 986705 986049 985344 984586 983768 982884 981928 980890
713.0279 979763 978534 977192 975723 974111 972336 970376 968206 965795 963107 960098 956718 952905
689.2742 948585 943667 938043 931576 924101 915413 904591 892641 878518 861740 841722 817774
667.3476 789124 754996 714802 668516 617287 564230 514967 477107 458095 462176 488401
647.2483 531085 582389 635237 684893 729017 766955 798985 825794 848170 866861 882522
627.149 895700 905987 915421 923471 930374 936317 941452 945903 949769 953132 956058 958600 960803
603.39526 962356 963965 965317 966427 967305 967956 968377 968560 968492 968149 967498 966493 965072 963154 960631
575.9871 957363 953176 947861 941191 932975 923189 912210 901136 891959 887105 888159 894754 904836
552.2334 916018 926600 935765 943299 949296 953956 957489 960074 961849 962912 963323 963109 967314 965640
526.6524 963223 959948 955653 950130 943124 934357 923601 910837 896553 882133 870052 863281
504.7259 863728 870872 882106 894375 905452 914188 920211 923614 924832 924687 924443 925570 929084
480.97217 934949 942213 949732 956706 961594 966665 970864 974325 977182 979552 981530 983192 984598
457.21844 985796 986821 987703 988465 989125 989699 990198 990617 990993 991319 991599 992541 992722 992870 992987 993073 993132
426.15585 993162 993166 993143 993093 993015 992909 992773 992606 992405 992167 991890 991569 991199 990775 990290 989734 989099 988372 987538
391.43887 986579 985471 984189 982697 981842 979763 977309 974393 970904 966698 961591 955353 947697 938288
365.8579 926770 912865 896882 878850 860889 846156 838407 840077 850601 866836 885059 902564
343.9314 917998 930980 941636 950284 957272 962916 967481 971188 974228 976777 978993 980994 982836
320.17764 984521 986035 987373 988545 989568 990461 991244 991934 992544 993087 993573 994009 994402 994758 988607 988699
290.9423 988756 988780 988774 988738 988675 988583 988465 988321 988149 987951 987726 987473 987192 986880 986538 986163 982911 982379 981804
256.22528 981183 980514 979792 979014 978174 977267 976288 973681 972488 971197 969798 968279 966626 965968 963967
228.81714 961782 959389 956762 953869 950674 947132 943192 938793 933862 928312 922036 914908 906770
205.0634 897433 886676 874187 859624 842558 822465 798721 770611 737363 698259 652857
184.9641 601406 545467 488623 436782 397359 377103 379532 403488 443534 492015 541645
164.86478 587175 625641 655783 677299 690283 694918 691384 679976 661475 637761 612497 591225
142.93825 579973 582409 597570 620391 642927 663208 677055 684174 686531 688092 693746 707078
121.01173 728383 754898 782887 809469 833148 853494 870664 885055 897110 907239 915793
100.912415 923058 929265 934597 939200 943192 946667 949699 952349 954667 956692 958457 959989 961308
77.15868 962431 963372 964140 964741 965180 965458 965572 965518 965289 964874 964257 963418 962332 967010 965139 962904
47.923313 960241 957069 953286 948763 943336 936799 928886 919265 907522 893158 875610 854318 828920
24.16958 799619 767804 738799 713699 700711 703598 721504 749529 781626 813117 841438
4.0702662 865689 887273 903934 917609 928848 938124 945822 952254 957665 962248 966155 969509
-17.856258 972404 974919 977114 979042 980741 982247 983587 984785 985858 986824 987697 988487 989205 989859
-43.437202 990456 991004 991506 991968 992395 992788 993153 993491 993805 994098 994371 994625 994864 995087 995296 995492 995677
-74.49978 995851 996014 996169 996315 996453 996584 996707 996825 996936 997042 997143 997238 997330 997417 997499 997579 997654 1000100 1000100
-109.216774 1000100 1000100 1000100 1000100 1000100 1000100 1000100 1000100 1000100 1000100 1000100 1000100 1000100 1000100 1000100 1000100 1000100 1000100 1000100 1000100 1000100 1000100 1000100 1000100 1000100 1000100 1000100 1000100 1000100 1000100 1000100 1000100 1000100 1000100 1000100 1000100 1000100 1000100 1000100 1000100 1000100
-184.1324A000100  $$checkpoint
##END= $$ end of IR H2FCB(CN)2 Block
##TITLE=Raman of H2FCB(CN)2 $$ Begin of the data block
##JCAMP-DX=5.00 $$ ACD/DocManager Library v 5.00
##DATA TYPE=RAMAN SPECTRUM
##DATA CLASS=XYDATA
##BLOCK ID=8
##DATE=19 Feb 2012 10:30:00
##ORIGIN= Department of Chemistry, UWI, Jamaica
##OWNER= public domain
##SPECTROMETER/DATA SYSTEM=from scan
##$MODELS=
<Models>
<ModelData id="RH2FCBCN2" type="MOL">
H2FCB(CN)2
__Jmol-14_02271917283D 1   1.00000     0.00000     0
Jmol version 14.29.31  2019-01-29 15:30 EXTRACT: ({0:8})
  9  8  0  0  0  0            999 V2000
    1.4580   -0.3800    0.0000 C   0  0  2  0  0  0
   -0.0000    0.2071    0.0000 B   0  0  0  0  0  0
   -1.2512   -0.6931   -0.0000 C   0  0  0  0  0  0
   -2.1824   -1.3458   -0.0000 N   0  0  0  0  0  0
   -0.1895    1.7430   -0.0000 C   0  0  0  0  0  0
   -0.2906    2.8757   -0.0000 N   0  0  0  0  0  0
    1.4632   -1.7467    0.0000 F   0  0  0  0  0  0
    2.0196   -0.0218    0.8545 H   0  0  0  0  0  0
    2.0196   -0.0218   -0.8545 H   0  0  0  0  0  0
  1  7  1  0  0  0
  1  9  1  0  0  0
  1  8  1  0  0  0
  2  1  1  0  0  0
  3  2  1  0  0  0
  4  3  1  0  0  0
  5  2  1  0  0  0
  6  5  1  0  0  0
M  END
</ModelData>
<ModelData id="8" type="XYZVIB" baseModel="RH2FCBCN2" vibrationScale=".5">
9
Model[1]: PATH=Calculation 1;Standard;Energy=-347.78027;Range=M.O.s;NFock==Conv=0.78D-08;E(RHF)=-347.780260658 A.U.;PATH=Calculation 1;Standard
C       1.45796     -0.37998      0.00000
B      -0.00000      0.20708      0.00000
C      -1.25124     -0.69310     -0.00000
N      -2.18244     -1.34584     -0.00000
C      -0.18954      1.74298     -0.00000
N      -0.29058      2.87571     -0.00000
F       1.46322     -1.74669      0.00000
H       2.01957     -0.02181      0.85448
H       2.01957     -0.02181     -0.85448
9
Model[2]: FrequencyLabel=A";ForceConstant=0.0004 mDyne/A;ReducedMass=2.3718 AMU;FreqValue=15.8676;Frequency=15.8676 cm^-1;Mode=1;PATH=Calculation 1;FrequenciesFrequencies;IRIntensity=9.5716 KM/Mole;PATH=Calculation 1;FrequenciesFrequencies
C       1.45796     -0.37998      0.00000     -0.00000      0.00000     -0.23001
B      -0.00000      0.20708      0.00000     -0.00000     -0.00000     -0.03000
C      -1.25124     -0.69310     -0.00000     -0.00000     -0.00000     -0.02000
N      -2.18244     -1.34584     -0.00000     -0.00000      0.00000     -0.06000
C      -0.18954      1.74298     -0.00000     -0.00000     -0.00000      0.03000
N      -0.29058      2.87571     -0.00000      0.00000     -0.00000      0.09000
F       1.46322     -1.74669      0.00000      0.00000      0.00000      0.18001
H       2.01957     -0.02181      0.85448      0.30001      0.27001     -0.54000
H       2.01957     -0.02181     -0.85448     -0.30001     -0.27001     -0.54000
9
Model[3]: FrequencyLabel=A';ForceConstant=0.1254 mDyne/A;ReducedMass=13.8489 AMU;FreqValue=123.9825;Frequency=123.9825 cm^-1;Mode=2;PATH=Calculation 1;FrequenciesFrequencies;IRIntensity=6.1419 KM/Mole;PATH=Calculation 1;FrequenciesFrequencies
C       1.45796     -0.37998      0.00000      0.19000     -0.07000      0.00000
B      -0.00000      0.20708      0.00000      0.15001     -0.16000      0.00000
C      -1.25124     -0.69310     -0.00000     -0.02000      0.07000      0.00000
N      -2.18244     -1.34584     -0.00000     -0.39000      0.59000     -0.00000
C      -0.18954      1.74298     -0.00000     -0.00000     -0.18001      0.00000
N      -0.29058      2.87571     -0.00000     -0.39000     -0.21000     -0.00000
F       1.46322     -1.74669      0.00000      0.37000     -0.07000     -0.00000
H       2.01957     -0.02181      0.85448      0.15001     -0.00000     -0.00000
H       2.01957     -0.02181     -0.85448      0.15001     -0.00000      0.00000
9
Model[4]: FrequencyLabel=A';ForceConstant=0.1157 mDyne/A;ReducedMass=9.5874 AMU;FreqValue=143.1133;Frequency=143.1133 cm^-1;Mode=3;PATH=Calculation 1;FrequenciesFrequencies;IRIntensity=11.1725 KM/Mole;PATH=Calculation 1;FrequenciesFrequencies
C       1.45796     -0.37998      0.00000     -0.13000      0.16000      0.00000
B      -0.00000      0.20708      0.00000     -0.24000     -0.12000      0.00000
C      -1.25124     -0.69310     -0.00000     -0.25000     -0.13000      0.00000
N      -2.18244     -1.34584     -0.00000     -0.28000     -0.08000     -0.00000
C      -0.18954      1.74298     -0.00000     -0.07000     -0.10000      0.00000
N      -0.29058      2.87571     -0.00000      0.46001     -0.05000     -0.00000
F       1.46322     -1.74669      0.00000      0.32000      0.18001     -0.00000
H       2.01957     -0.02181      0.85448     -0.24000      0.35000     -0.00000
H       2.01957     -0.02181     -0.85448     -0.24000      0.35000      0.00000
9
Model[5]: FrequencyLabel=A";ForceConstant=0.1236 mDyne/A;ReducedMass=6.9000 AMU;FreqValue=174.3700;Frequency=174.3700 cm^-1;Mode=4;PATH=Calculation 1;FrequenciesFrequencies;IRIntensity=25.2470 KM/Mole;PATH=Calculation 1;FrequenciesFrequencies
C       1.45796     -0.37998      0.00000      0.00000     -0.00000     -0.03000
B      -0.00000      0.20708      0.00000      0.00000      0.00000      0.41000
C      -1.25124     -0.69310     -0.00000      0.00000      0.00000      0.28000
N      -2.18244     -1.34584     -0.00000      0.00000     -0.00000     -0.28000
C      -0.18954      1.74298     -0.00000      0.00000      0.00000      0.27001
N      -0.29058      2.87571     -0.00000     -0.00000      0.00000     -0.32000
F       1.46322     -1.74669      0.00000     -0.00000     -0.00000     -0.09000
H       2.01957     -0.02181      0.85448      0.40000     -0.02000     -0.29000
H       2.01957     -0.02181     -0.85448     -0.40000      0.02000     -0.29000
9
Model[6]: FrequencyLabel=A";ForceConstant=0.7340 mDyne/A;ReducedMass=11.7517 AMU;FreqValue=325.5918;Frequency=325.5918 cm^-1;Mode=5;PATH=Calculation 1;FrequenciesFrequencies;IRIntensity=0.0574 KM/Mole;PATH=Calculation 1;FrequenciesFrequencies
C       1.45796     -0.37998      0.00000      0.00000      0.00000     -0.00000
B      -0.00000      0.20708      0.00000     -0.00000     -0.00000     -0.02000
C      -1.25124     -0.69310     -0.00000      0.00000     -0.00000      0.65000
N      -2.18244     -1.34584     -0.00000     -0.00000      0.00000     -0.31000
C      -0.18954      1.74298     -0.00000     -0.00000     -0.00000     -0.59000
N      -0.29058      2.87571     -0.00000      0.00000     -0.00000      0.28000
F       1.46322     -1.74669      0.00000     -0.00000      0.00000     -0.02000
H       2.01957     -0.02181      0.85448     -0.13000     -0.01000      0.10000
H       2.01957     -0.02181     -0.85448      0.13000      0.01000      0.10000
9
Model[7]: FrequencyLabel=A';ForceConstant=0.9024 mDyne/A;ReducedMass=12.1812 AMU;FreqValue=354.5957;Frequency=354.5957 cm^-1;Mode=6;PATH=Calculation 1;FrequenciesFrequencies;IRIntensity=4.7652 KM/Mole;PATH=Calculation 1;FrequenciesFrequencies
C       1.45796     -0.37998      0.00000     -0.17000     -0.24000      0.00000
B      -0.00000      0.20708      0.00000     -0.12000      0.09000      0.00000
C      -1.25124     -0.69310     -0.00000     -0.38000      0.41000     -0.00000
N      -2.18244     -1.34584     -0.00000      0.08000     -0.26000      0.00000
C      -0.18954      1.74298     -0.00000      0.28000      0.22000     -0.00000
N      -0.29058      2.87571     -0.00000     -0.19000      0.19000      0.00000
F       1.46322     -1.74669      0.00000      0.35000     -0.24000     -0.00000
H       2.01957     -0.02181      0.85448     -0.22000     -0.10000     -0.02000
H       2.01957     -0.02181     -0.85448     -0.22000     -0.10000      0.02000
9
Model[8]: FrequencyLabel=A';ForceConstant=1.5799 mDyne/A;ReducedMass=11.4162 AMU;FreqValue=484.6495;Frequency=484.6495 cm^-1;Mode=7;PATH=Calculation 1;FrequenciesFrequencies;IRIntensity=1.3842 KM/Mole;PATH=Calculation 1;FrequenciesFrequencies
C       1.45796     -0.37998      0.00000     -0.03000      0.20001      0.00000
B      -0.00000      0.20708      0.00000      0.05000     -0.11000      0.00000
C      -1.25124     -0.69310     -0.00000     -0.20001      0.21000     -0.00000
N      -2.18244     -1.34584     -0.00000      0.02000     -0.11000      0.00000
C      -0.18954      1.74298     -0.00000      0.61000     -0.26000     -0.00000
N      -0.29058      2.87571     -0.00000     -0.14000     -0.36001      0.00000
F       1.46322     -1.74669      0.00000     -0.18001      0.28000     -0.00000
H       2.01957     -0.02181      0.85448     -0.07000      0.26000      0.01000
H       2.01957     -0.02181     -0.85448     -0.07000      0.26000     -0.01000
9
Model[9]: FrequencyLabel=A";ForceConstant=0.4430 mDyne/A;ReducedMass=2.9383 AMU;FreqValue=505.8422;Frequency=505.8422 cm^-1;Mode=8;PATH=Calculation 1;FrequenciesFrequencies;IRIntensity=3.6507 KM/Mole;PATH=Calculation 1;FrequenciesFrequencies
C       1.45796     -0.37998      0.00000     -0.00000     -0.00000      0.13000
B      -0.00000      0.20708      0.00000     -0.00000      0.00000      0.26000
C      -1.25124     -0.69310     -0.00000      0.00000     -0.00000     -0.18001
N      -2.18244     -1.34584     -0.00000      0.00000      0.00000      0.06000
C      -0.18954      1.74298     -0.00000     -0.00000      0.00000     -0.23001
N      -0.29058      2.87571     -0.00000      0.00000      0.00000      0.07000
F       1.46322     -1.74669      0.00000      0.00000     -0.00000     -0.05000
H       2.01957     -0.02181      0.85448      0.59000     -0.03000     -0.26000
H       2.01957     -0.02181     -0.85448     -0.59000      0.03000     -0.26000
9
Model[10]: FrequencyLabel=A';ForceConstant=2.2959 mDyne/A;ReducedMass=12.4462 AMU;FreqValue=559.5476;Frequency=559.5476 cm^-1;Mode=9;PATH=Calculation 1;FrequenciesFrequencies;IRIntensity=2.8523 KM/Mole;PATH=Calculation 1;FrequenciesFrequencies
C       1.45796     -0.37998      0.00000      0.01000     -0.01000      0.00000
B      -0.00000      0.20708      0.00000      0.01000      0.01000      0.00000
C      -1.25124     -0.69310     -0.00000     -0.10000      0.62000     -0.00000
N      -2.18244     -1.34584     -0.00000      0.33001      0.06000      0.00000
C      -0.18954      1.74298     -0.00000     -0.52000     -0.32000     -0.00000
N      -0.29058      2.87571     -0.00000      0.17000     -0.29000      0.00000
F       1.46322     -1.74669      0.00000      0.01000     -0.01000     -0.00000
H       2.01957     -0.02181      0.85448      0.01000     -0.02000      0.00000
H       2.01957     -0.02181     -0.85448      0.01000     -0.02000     -0.00000
9
Model[11]: FrequencyLabel=A';ForceConstant=1.3361 mDyne/A;ReducedMass=5.3456 AMU;FreqValue=651.3144;Frequency=651.3144 cm^-1;Mode=10;PATH=Calculation 1;FrequenciesFrequencies;IRIntensity=21.0911 KM/Mole;PATH=Calculation 1;FrequenciesFrequencies
C       1.45796     -0.37998      0.00000      0.45000      0.04000     -0.00000
B      -0.00000      0.20708      0.00000      0.13000     -0.02000      0.00000
C      -1.25124     -0.69310     -0.00000     -0.28000      0.05000     -0.00000
N      -2.18244     -1.34584     -0.00000     -0.16000     -0.18001      0.00000
C      -0.18954      1.74298     -0.00000     -0.09000      0.05000     -0.00000
N      -0.29058      2.87571     -0.00000      0.01000      0.07000      0.00000
F       1.46322     -1.74669      0.00000     -0.07000      0.02000      0.00000
H       2.01957     -0.02181      0.85448      0.53000     -0.16000      0.02000
H       2.01957     -0.02181     -0.85448      0.53000     -0.16000     -0.02000
9
Model[12]: FrequencyLabel=A";ForceConstant=1.1916 mDyne/A;ReducedMass=2.5000 AMU;FreqValue=899.4443;Frequency=899.4443 cm^-1;Mode=11;PATH=Calculation 1;FrequenciesFrequencies;IRIntensity=20.1615 KM/Mole;PATH=Calculation 1;FrequenciesFrequencies
C       1.45796     -0.37998      0.00000     -0.00000      0.00000     -0.22000
B      -0.00000      0.20708      0.00000     -0.00000      0.00000      0.28000
C      -1.25124     -0.69310     -0.00000      0.00000     -0.00000     -0.09000
N      -2.18244     -1.34584     -0.00000      0.00000      0.00000      0.01000
C      -0.18954      1.74298     -0.00000      0.00000     -0.00000     -0.08000
N      -0.29058      2.87571     -0.00000     -0.00000     -0.00000      0.02000
F       1.46322     -1.74669      0.00000      0.00000     -0.00000      0.04000
H       2.01957     -0.02181      0.85448     -0.61000     -0.06000      0.23001
H       2.01957     -0.02181     -0.85448      0.61000      0.06000      0.23001
9
Model[13]: FrequencyLabel=A';ForceConstant=6.3011 mDyne/A;ReducedMass=8.5845 AMU;FreqValue=1116.1556;Frequency=1116.1556 cm^-1;Mode=12;PATH=Calculation 1;FrequenciesFrequencies;IRIntensity=247.7830 KM/Mole;PATH=Calculation 1;FrequenciesFrequencies
C       1.45796     -0.37998      0.00000      0.12000      0.26000      0.00000
B      -0.00000      0.20708      0.00000     -0.33001      0.62000     -0.00000
C      -1.25124     -0.69310     -0.00000      0.03000     -0.08000      0.00000
N      -2.18244     -1.34584     -0.00000     -0.04000     -0.01000     -0.00000
C      -0.18954      1.74298     -0.00000      0.09000     -0.11000      0.00000
N      -0.29058      2.87571     -0.00000      0.01000     -0.21000     -0.00000
F       1.46322     -1.74669      0.00000      0.03000     -0.22000     -0.00000
H       2.01957     -0.02181      0.85448      0.36001     -0.15001     -0.00000
H       2.01957     -0.02181     -0.85448      0.36001     -0.15001      0.00000
9
Model[14]: FrequencyLabel=A';ForceConstant=7.0566 mDyne/A;ReducedMass=8.4956 AMU;FreqValue=1187.3394;Frequency=1187.3394 cm^-1;Mode=13;PATH=Calculation 1;FrequenciesFrequencies;IRIntensity=70.7717 KM/Mole;PATH=Calculation 1;FrequenciesFrequencies
C       1.45796     -0.37998      0.00000     -0.19000     -0.37000     -0.00000
B      -0.00000      0.20708      0.00000      0.40000      0.47000      0.00000
C      -1.25124     -0.69310     -0.00000     -0.05000     -0.08000     -0.00000
N      -2.18244     -1.34584     -0.00000     -0.14000     -0.09000     -0.00000
C      -0.18954      1.74298     -0.00000     -0.06000     -0.06000     -0.00000
$$ [...]
-184.1324@  $$checkpoint
##END=$$ End of RAMAN H2FCB(CN)2 Block
##END= $$ end of file