##TITLE= o-xylene (1,2-Dimethylbenzene)
##JCAMP-DX= 4.24 $$Exported GRAMS Data File
##DATA TYPE= INFRARED SPECTRUM
##ORIGIN= Dept of Chem, UWI, JAMAICA
##OWNER= public domain
##DATE=97/07/14
##TIME=10:05:00
##SPECTROMETER/DATA SYSTEM= PERKIN-ELMER 1000 FT-IR
##INSTRUMENTAL PARAMETERS= 4400.00, 450.00 cm-1; 16 scans; mode ratio; apod strong
##DATA PROCESSING=Imported: Mon Nov  9 07:38:04 1998
##$URL=http://wwwchem.uwimona.edu.jm:1104/software/jcampdx.html
##XUNITS=1/CM
##YUNITS=TRANSMITTANCE
##XFACTOR=0.1375
##YFACTOR=0.00270499
##FIRSTX=600.000000
##LASTX=4400.000000
##NPOINTS=3801
##FIRSTY=55.7981
##DELTAX=1.000000
##$ASSIGNMENT TYPE= CHIME
##$CHIME TARGET= CHIMEDISP
##PEAK ASSIGNMENT= (XYWA)
(3108, -1, 20, <load "3190.xyz"; select *; background [255,251,221];
wireframe 40; animation on>)
(3064, -1, 20, <load "3149.xyz"; select *; background [255,251,221];
wireframe 40; animation on>)
(3019, -1, 20, <load "3057.xyz"; select *; background [255,251,221];
wireframe 40; animation on>)
(2974, -1, 15, <load "3044.xyz"; select *; background [255,251,221];
wireframe 40; animation on>)
(2875, -1, 20, <load "3043.xyz"; select *; background [255,251,221];
wireframe 40; animation on>)
(1607, -1, 5,  <load "1663.xyz"; select *; background [255,251,221];
wireframe 40; animation on>)
(1516, -1, 25, <load "1592.xyz"; select *; background [255,251,221];
wireframe 40; animation on>)
(1497, -1, 15, <load "1471.xyz"; select *; background [255,251,221];
wireframe 40; animation on>)
(1465, -1, 30, <load "1457.xyz"; select *; background [255,251,221];
wireframe 40; animation on>)
(1386, -1, 5,  <load "1392.xyz"; select *; background [255,251,221];
wireframe 40; animation on>)
(1224, -1, 5,  <load "1202.xyz"; select *; background [255,251,221];
wireframe 40; animation on>)
(1119, -1, 5,  <load "1084.xyz"; select *; background [255,251,221];
wireframe 40; animation on>)
(1054, -1, 5,  <load "1065.xyz"; select *; background [255,251,221];
wireframe 40; animation on>)
(1020, -1, 10, <load "1049.xyz"; select *; background [255,251,221];
wireframe 40; animation on>)
(985,  -1, 5,  <load "1000.xyz"; select *; background [255,251,221];
wireframe 40; animation on>)
(744, -1, 20,  <load "625.xyz"; select *; background [255,251,221];
wireframe 40; animation on>)
(2400, -1, 2000,  <load "xyleneo.pdb"; background [255,251,221]; wireframe 40;>)
##XYDATA=(X++(Y..Y))
4364B0628K81K94J55Q3J54J97J19P4K54L20J06K1J05J96J19J62J95R6J76J43K45
4524B4123J55Q6K54J15O1K07K24J62Q0Q9J79J68J21R4J11J23P7P0J44J58O5M5M8
4691B6959Q6Q1J04J21R6J03Q2R4J05O9N5J27Q7QO7J07M0P2J13N4L1K11K26j167
4865B7931lP28K34J9K3M0K4k1J0oJJ9J5mk1k2km7q6j31j88k30k55j02k4j43l55
5062B7404o12p47q71p18j03N85P79N30K59J58K4l9n1j44j20r3k11k36l31m23m96
5215B4544o58p78p92q31q96q46q27r34j043j180j302j453j641j846j894j770j529
5338D324j112p31l54k01k11j65j01l4M6P4J05Q3P0R4J01J60L00N38R34J431J787
5491G138J921J910J792J555J352J168R62R15J119J256J053P51O03N81N28M23M24
$$ plain form
4364 20628 20909 21203 21358 21441 21595 21792 21911 21985 22239 22559 22665 22686 22791 22987 23106 23268 23463 23559 23735 23878 24123
4524 24123 24278 24364 24618 24733 24794 25001 25225 25387 25467 25556 25735 25903 26024 26118 26229 26352 26429 26499 26643 26801 26866 26911 26959
4691 26959 27045 27126 27230 27351 27447 27550 27632 27726 27831 27900 27955 28082 28169 28177 28244 28351 28391 28463 28576 28630 28661 28872 29098 27931
4865 27931 27928 28656 28890 28909 28932 28972 28996 28975 28985 28979 28980 28999 29014 29010 28989 28967 28965 28918 28832 28701 28513 28283 28028 27926 27902 27759 27404
5062 27404 26792 26045 25174 24456 24353 24938 25717 26247 26506 26664 26688 26649 26598 26454 26334 26241 26030 25794 25463 25040 24544
5215 24544 23886 23108 22316 21485 20589 19743 18916 17982 16939 15759 14457 13004 11363 9517 7623 5853 4324
5338 4324 3212 2481 2127 1926 1715 1550 1449 1415 1461 1535 1640 1723 1793 1887 1988 2148 2448 2986 3920 5351 7138
5491 7138 9059 10969 12761 14316 15668 16836 17798 18713 19832 21088 22141 22892 23495 24076 24604 25027 25451
5615B5451M25M30M28L45K66K51K15J02JO1J18J60K23K60K56K13J42J53J31J15L8
5767B9784M9jp7J7J54J45J12J53K09J67N2K7O2L1J0R6J15n3rP5K8L7K3Pn1o0p8
5964C1024j33k7r1l16m90p32r67n66M85J121Q96M44K00Q9M7M0m6j6N9O3J8J2om1
6138C1067o4j8o1j35j53Tj72k01k46k55k83k99k58k19k06j18NP5J79L01L13K76
6298B9375K84K75J54J81K28J21L6M4M9L3k3l1K9j7j00o9K3l5n9O8Q8J9L0N2O5Q6
6487C0906P1N8RM1M7L1J0M6P6rj02o6pJ7ok0n5l3L5j6o3m2m5n1p4p8o4j23j44j47
6705C0202j64k08k71l21m05n58p22p87p39m72k9L78N94O14N51M05K11J32R7P9J03
6858B8690J25K04K50K43J89J41J18J8K3J3m9j13j12j05r1j07j81j83j28j17j58
$$ plain form
5615 25451 25876 26306 26734 27079 27345 27596 27811 27913 27914 27975 28093 28253 28476 28736 28992 29205 29347 29500 29631 29746 29784
5767 29784 29833 29832 29755 29772 29926 30071 30183 30336 30545 30712 30764 30791 30853 30884 30894 30990 31105 31052 31043 31118 31146 31183 31206 31213 31162 31102 31024
5964 31024 30891 30864 30773 30457 29967 29235 28268 27702 28187 29308 30204 30648 30848 30937 30984 31024 30978 30962 31021 31084 31102 31114 31108 31067
6138 31067 31003 30985 30924 30789 30636 30483 30311 30110 29864 29609 29326 29027 28769 28550 28344 28226 28231 28306 28485 28786 29099 29375
6298 29375 29659 29934 30088 30269 30497 30618 30654 30698 30747 30780 30757 30726 30755 30738 30638 30569 30592 30557 30498 30566 30654 30673 30703 30755 30820 30906
6487 30906 30977 31035 31044 31085 31132 31163 31173 31219 31295 31286 31184 31118 31111 31128 31122 31102 31047 31014 31049 31033 30970 30928 30883 30832 30758 30680 30616 30493 30349 30202
6705 30202 30038 29830 29559 29238 28833 28275 27553 26766 26027 25555 25526 25904 26498 27112 27663 28068 28279 28411 28508 28587 28690
6858 28690 28815 29019 29269 29512 29701 29842 29960 29978 30001 30014 29965 29852 29740 29635 29544 29437 29256 29073 28945 28828 28670
7011B8670j47j56j70j66j79k00k39k48k49k82l51m37n35o87q74j052j239j472j620
7149A8367j564j262o69J69R14J280J326J156R33Q21P37O60N30L84L20J85O3j2p1
7287B4267j15j93l22l95m63n98p54q97r69j027j091j116j142j193j208j160j154
7411A0470j188j115p64j53N69J249J705J856J778J542J364J157Q98P43O25M76L43
7535B1555K55K44J76P0J4p1j76l53n97q32j029j239j715k399l030l198k294m09
7665D972J819L392L768L222K382J704J227R32P82O94O35N48M17L60L35K41J85J90
7796B7805J84J22R2R7R0Q8K2J2P4M0TQ7P7L1L2M7K3K0%m8n6k3k8m7n8o2p4q3r8
8007B8406j28j15j42j79k59l10l33l96n08o20p81j021j268j581j951k280k476k362
$$ plain form
7011 28670 28523 28367 28197 28031 27852 27652 27413 27165 26916 26634 26283 25846 25311 24624 23750 22698 21459 19987 18367
7149 18367 16803 15541 14872 15041 15955 17235 18561 19717 20650 21471 22208 22868 23398 23782 24102 24287 24350 24338 24267
7287 24267 24152 23959 23637 23242 22779 22181 21427 20530 19561 18534 17443 16327 15185 13992 12784 11624 10470
7411 10470 9282 8167 7403 7250 7819 9068 10773 12629 14407 15949 17313 18470 19368 20111 20736 21212 21555
7535 21555 21810 22054 22230 22300 22314 22243 22067 21714 21117 20285 19256 18017 16302 13903 10873 7675 5381 4972
7665 4972 6791 10183 13951 17173 19555 21259 22486 23418 24200 24894 25529 26077 26494 26854 27189 27430 27615 27805
7796 27805 27989 28111 28203 28300 28390 28478 28500 28512 28586 28626 28666 28753 28830 28861 28893 28940 28963 28983 28983 28935 28879 28856 28828 28781 28723 28661 28587 28504 28406
8007 28406 28278 28163 28021 27842 27583 27273 26940 26544 26036 25416 24635 23614 22346 20765 18814 16534 14058 11696
8138A1696j666m02J101K233K625K408J976J530J142Q99O99N18M01L25K26J44O9
8262B5924j5p1j31k06k98m17n45n50l53JL15M62M52L35J64L6l7j05j14r2o0J1Q9
8429B4795J56K37K49K28K26K12J80J35J10J03J00J30J51J35J11J13P7O3P8J6n8
8582B7547j04j32j85l20m22l57J3N03P34N92L54K16J41J34J17R0P9Q7Q0O0N7O0
8742B9344N6L9L2K6nj5j0m3p0q6j43Tj31j34j81k84m76p24r77j127j029n58K48
8909B3609R39J161J019P55N25L59K88K83K80K71K20J62J15R2TP3M6N3L8K0L5N3
9069C0488K1J0K2LkJ8J3qk5j8j5j9j3l1o2n3k9l4l8p1q1o8n3r1j12r4p8q8j07r2
9287B9293r7r1q1r0j00r3j20j41j50j88l03m21m41l13K6L29L98L62K80K36J68J42
$$ plain form
8138 11696 10030 9628 10729 12962 15587 17995 19971 21501 22643 23542 24241 24759 25160 25485 25711 25855 25924
8262 25924 25909 25838 25707 25501 25203 24786 24241 23691 23338 23339 23654 24116 24568 24903 25067 25103 25066 24961 24847 24755 24695 24706 24795
8429 24795 24951 25188 25437 25665 25891 26103 26283 26418 26528 26631 26731 26861 27012 27147 27258 27371 27448 27511 27589 27605 27547
8582 27547 27443 27311 27126 26806 26384 26027 26040 26543 27277 27869 28223 28439 28580 28714 28831 28921 29000 29087 29167 29227 29284 29344
8742 29344 29400 29439 29471 29497 29492 29477 29467 29424 29354 29268 29125 28982 28851 28717 28536 28252 27776 27052 26075 24948 23919 23361 23609
8909 23609 24548 25709 26728 27483 28008 28367 28655 28938 29218 29489 29709 29871 29986 30078 30170 30243 30289 30342 30380 30400 30435 30488
9069 30488 30509 30519 30541 30544 30542 30560 30573 30565 30540 30522 30507 30488 30475 30444 30382 30329 30300 30266 30228 30157 30076 30008 29955 29864 29752 29658 29580 29492 29385 29293
9287 29293 29196 29105 29024 28934 28834 28741 28621 28480 28330 28142 27839 27418 26977 26664 26690 27019 27417 27779 28059 28295 28463 28605
9447B8605J33J06R6Q4K4K1N5L6K2j2k9j8lnp6r0n9k5pPq3p3k4k6k4l3m1m8n7n3
9665B8403m4o6q9r6j04q2j2K6M5J03J6q5r0L2Rl7o2n6o5q4j25r8q6r3j32j25j89
9862B6814j63j53k36k37j97l66l32n33o27l10m07m56n65r01j134j494j760j541
9993A5402q82K19P61M36k81j005j649k117k138j581n36O32J554K154K431K063J749
10116A7212J364J052R51O24J92L04L92L09j45k03J17o2j12p5m00l24o5j44q0n0
10262B0857j4j00j66k40k76l17m26k05n97j006kL3j43l91l37k53l90m78m98p82
10407A4269p03m79n25n55n10o51j581r89o80p94o41m22k06o9mMo6k20l19l74m20
10560D065m18l56k90j82o8J97K13J82P8o4j95k94l40k57j34m4J15L32N09O23Q17
$$ plain form
9447 28605 28738 28844 28940 29024 29048 29069 29124 29160 29182 29170 29141 29123 29120 29115 29039 28949 28890 28865 28858 28865 28782 28709 28685 28659 28635 28602 28561 28513 28456 28403
9665 28403 28359 28293 28204 28108 28004 27922 27910 27936 27981 28084 28100 28015 27925 27957 27966 27929 27867 27811 27746 27662 27537 27439 27353 27260 27128 27003 26814
9862 26814 26651 26498 26262 26025 25828 25462 25130 24597 23970 23660 23253 22797 22232 21331 20197 18703 16943 15402
9993 15402 14520 14739 15500 15936 15655 14650 13001 10884 8746 7165 6629 7261 8815 10969 13400 15463 17212
10116 17212 18576 19628 20579 21203 21395 21699 22091 22400 22255 22052 22169 22107 21995 21920 21520 21196 21131 20987 20907 20857
10262 20857 20843 20743 20577 20337 20061 19744 19318 19113 18516 17510 17508 17541 17398 17007 16670 16417 16027 15549 15051 14269
10407 14269 13566 13087 12562 12007 11497 10846 9265 8276 7596 6802 6161 5739 5533 5464 5460 5464 5398 5178 4859 4485 4065
10560 4065 3647 3291 3001 2819 2751 2948 3161 3343 3421 3357 3162 2868 2528 2271 2137 2093 2208 2540 3049 3672 4489
10713D489P29M93L42K01J87K73L32L92M04L57K42O2j53l32o79r07p78j035j046
10851C573p23m79k93j32O8J31O4M86Q66J359K101K375K276K036J721J090J084J035
10982A8638P65Q54M81K70O19M00M70nj30Q52O91l09m52J63O12J75l63K50O3n8K90
11135B4276K76L63J52o60K44M43M82Q03k64j232N11k3k76O97j78l57L79K92J60
11273B6088l28k03L61N35k39p26P59R71m93p78j079M7P72L11R1m06j29K05L67M0
11418B6166j017P6L06q4Q3M07j050j515L0m86q42q06o37k80R9L31M18L72K22M8
11564B1841j64k77m03m59n70o66o61p52p86q07p88Tp39p22p05n31k56L18J250K047
11709A5382K297J945J461J105Q54J086P97p27N55Q29L84L40N35J35o07M07N47K83
$$ plain form
10713 4489 5218 5711 6053 6254 6441 6714 7046 7438 7842 8199 8441 8503 8350 8018 7339 6432 5654 4619 3573
10851 3573 2850 2371 2078 1946 2014 2145 2209 2695 3561 4920 7021 9396 11672 13708 15429 16519 17603 18638
10982 18638 19403 20257 20738 21008 21627 22027 22497 22492 22362 23214 23905 23596 23144 23307 23919 24094 23731 23981 24044 23986 24276
11135 24276 24552 24915 25067 24407 24651 25094 25576 26379 26115 24883 25394 25371 25095 25792 25614 25257 25636 25928 26088
11273 26088 25760 25557 25918 26453 26214 25488 26247 27218 26725 25947 24868 24915 25687 25998 26089 25683 25554 25759 26126 26166
11418 26166 25149 25225 25531 25447 25530 25937 24887 23372 23402 22916 22074 21268 20631 20351 20450 20781 21199 21571 21793 21841
11564 21841 21677 21400 20997 20538 19968 19302 18641 17889 17103 16296 15508 14720 13981 13259 12554 12023 11767 12085 13335 15382
11709 15382 17679 19624 21085 22190 23044 24130 24927 24200 24755 25584 25968 26308 26843 26978 26371 26778 27325 27608
11840B7608k85L0L59J33P8K76Q47j64j439M37K25K00J98O6M9N3L26O11o71m02j80
11993B8355jM93Q91J053k362j368O34O30K86LNo0J53L4r17k52J97q5nL09p84p06
12153B6503K22l29K09P91m40j078P24N28L90J05J62R06R02m35j590O86J014J58
12284B9428m7q1j27P5J2N77O25j946j36J145J544p75k724J355J027J31k08j7n11
12422B9347J69K05k14k74J9J67no38K32M77j165m72N70M17J74N8q2J35J24R2J70
12575B9506L18k56K9Q36O83j152j195Q05N78K80K64q93NP47l2k80J98J97M8j03
12720C0583l40N08l28p65N48K78L07K21n25m8K75K50K45q79j54L36o6O3L06m61
12865C0354l99O00L35n26j175J67K56m67k98k67l47m68q99n05l01l16p08l85J6
$$ plain form
11840 27608 27323 27353 27712 27845 27923 28199 29046 28882 27443 27880 28105 28305 28503 28569 28618 28671 28997 29608 28937 28535 28355
11993 28355 28354 28847 29738 30791 28429 27061 27695 28325 28611 28614 28619 28559 28712 28746 27829 27577 27774 27689 27684 27993 27209 26503
12153 26503 26725 26396 26605 27396 26956 25878 26602 27130 27520 27625 27787 28693 29595 29160 27570 28256 29270 29428
12284 29428 29381 29300 29173 29248 29260 29837 30462 28516 28380 29525 31069 30294 27570 28925 29952 30083 29875 29858 29347
12422 29347 29516 29721 29507 29233 29252 29419 29414 28776 29008 29485 28320 27848 28418 28835 29009 29067 28985 29120 29244 29336 29506
12575 29506 29824 29568 29597 30433 31116 29964 28769 29574 30152 30432 30696 29803 29808 30555 30523 30243 30441 30638 30686 30583
12720 30583 30243 30751 30423 29658 30206 30484 30791 31012 30487 30439 30714 30964 31209 30330 30176 30512 30446 30509 30815 30354
12865 30354 29955 30555 30890 30364 29189 29356 29612 29145 28847 28580 28233 27765 26866 26361 26060 25744 25036 24651 24667
13004B4667MJ94L82M16K90j77O00Q34L44L66O35L96O9L59K43J54L61K50J85J72
13149C0744J7J72J23k72k2L4mq8r4j67k75k04k24k75l20k46qn95o71J12K47J06
13309B8090n50n5N16L40K36L16L42K15J71K90K18J76K51N79m50q17N46K21k34j50
13455C0251q1j65j98k44k83k92l05k62k25k18j41n1J5J04J50K24J94K00K35j31
13600B8777k87K43J69j5j00j69k02k22k20j86j19l1M8Q1M4j5qp3K3k53p18l40l33
13767B6094m38m08n39n50l72l45k44r9M0J83L31M27M90N77O39O23O20M88M90N25
13913B8532M15L12K84L66M39k44r1L55J74J05k28j26O3o4j35j38j75k35k88l01
14058B9020l41l97l76l74Tl30k78j93J4j01k90J79K64J76K43L24L05K70K81K63
$$ plain form
13004 24667 24671 24865 25247 25663 25953 25776 26376 27210 27554 27920 28555 28951 29020 29379 29622 29776 30137 30387 30572 30744
13149 30744 30761 30933 31056 30784 30762 30796 30792 30704 30610 30443 30168 29964 29740 29465 29145 28899 28891 28296 27625 27737 27984 28090
13309 28090 27540 27485 28001 28341 28577 28893 29235 29450 29621 29911 30129 30305 30556 31135 30685 29868 30414 30635 30401 30251
13455 30251 30170 30005 29807 29563 29280 28988 28683 28421 28196 27978 27837 27786 27801 27905 28055 28279 28473 28673 28908 28777
13600 28777 28490 28733 28902 28887 28787 28618 28416 28194 27974 27788 27669 27638 27686 27767 27811 27796 27788 27715 27738 27485 26767 26427 26094
13767 26094 25656 25248 24709 24159 23787 23442 23198 23099 23139 23322 23653 24080 24570 25147 25786 26409 27029 27517 28007 28532
13913 28532 28947 29259 29543 29909 30348 30104 30013 30368 30542 30647 30419 30293 30356 30292 30157 30019 29844 29609 29321 29020
14058 29020 28679 28282 27906 27532 27158 26828 26550 26357 26371 26270 25980 26159 26423 26599 26842 27166 27471 27741 28022 28285
14204B8285K31K20K00K15K68K39J67J85J84J39J21J06R5R6kl2J16Q1L1L6L0J3K8
14371C1052K2J1K3L1J7J1K0NJ9M6M1N4j0m3J03Q5j82p2J09K8j0O6R2M1K9L9K0J3
14575C1660L0TJ3mj8l4k8k2%J1l6J2J9r6k4Kj9k1l1k6J5O4P5Q8P3J9L9M2qj3nj5
14807C1792k8k0Kj0k4p2o4kj6l2k8k3oK9M2O0P7M7L9N2L2J4OL3L8rML0L3l5m1R
15040C1929K1Jj4Nj1k5k2m9m4l1k5k2rTmL8K5olrLMj5LK3J1nlJ4J8j3k5j8n7p4
15295C1602q7j04j14j00l9oL5O4O8K9k6l3m9p3l1L7J13J35J03R6R7O9L6K7L1K9
15484C1909J4J5J7j%MJ2%J0mj4nj1j4jj9l4k7k2l7j9j3k9l9m7j7rl6j5K9K2LL6
15724C1658K2J4J7NJ4Mnj2l4pJ8J2J1KLkTJ1lkmj1k3j0kk7m1j8k2m0n5o9r1j11
$$ plain form
14204 28285 28516 28736 28936 29151 29419 29658 29825 30010 30194 30333 30454 30560 30655 30751 30749 30717 30833 30914 30945 30981 31011 31024 31052
14371 31052 31074 31085 31108 31139 31156 31167 31187 31192 31211 31257 31298 31352 31342 31299 31402 31487 31305 31233 31342 31370 31360 31426 31518 31559 31588 31627 31647 31660
14575 31660 31690 31720 31733 31729 31711 31677 31649 31627 31627 31638 31602 31614 31633 31537 31513 31515 31496 31475 31444 31418 31433 31497 31572 31660 31733 31752 31791 31833 31825 31812 31807 31792
14807 31792 31764 31744 31746 31736 31712 31640 31576 31574 31558 31526 31498 31475 31469 31498 31540 31600 31677 31724 31763 31815 31847 31861 31867 31900 31938 31929 31933 31963 31996 31961 31920 31929
15040 31929 31950 31951 31937 31942 31931 31906 31884 31835 31791 31760 31735 31713 31704 31695 31691 31729 31754 31748 31745 31736 31739 31743 31728 31731 31754 31765 31760 31757 31771 31789 31776 31751 31733 31676 31602
15295 31602 31515 31411 31297 31197 31158 31152 31187 31251 31319 31348 31322 31289 31240 31167 31136 31173 31286 31421 31524 31620 31717 31786 31822 31849 31880 31909
15484 31909 31923 31938 31955 31954 31954 31958 31970 31970 31980 31976 31962 31957 31946 31932 31931 31912 31878 31851 31829 31792 31773 31760 31731 31692 31645 31628 31619 31583 31568 31597 31619 31622 31658
15724 31658 31680 31694 31711 31716 31730 31734 31729 31717 31683 31676 31694 31706 31717 31719 31722 31720 31718 31729 31726 31724 31720 31709 31686 31676 31674 31647 31606 31588 31566 31526 31471 31402 31311 31200
15971C1200j50j86k03j55k9R8J66J56J12O1K6Qk7k4j1j4K8O2O4N4M0K2L5J9J5O
16160C1373j0k3j5m6o2m5l3j4kOM1P0L3kJ5K2K4M1L1TL7L6pJ5K0Nrmrj5k9pj6m3
16407C1409n5n0m1l2m1l3pk7k1k9l9m9n3p9q2r0r9j19p9o0n6j6N2O2J02J33J17
16604C0718J06J11J04Q3L2J5K0J6J2k5J0m9K2p4jl9l1k4q5pp7J6o8O2m4lq8j4j50
16815C0548q5j87q4j91J9j33J16r0J96j4J53%P0J5R5J1qn3n0p1n9r7r9m1k46l83
17004B9332k33l32m43k83j9K53L16K57K44K40L89O80L74n8j49Ll4k09r9n9p4m7
17164C0049K1jk1j2JK5L6K0j7l6jL1L3P6L5M5P3J05TR2J05Q3N9Q0O4L6PK9j2l7
17382C1073k1m4m9To5o1n7p3q6j02q4p5Tm4k5l1J2K4J8L7N3K6Pk6k4j8n2n8j8q
$$ plain form
15971 31200 31050 30864 30661 30506 30477 30575 30741 30897 31009 31070 31096 31104 31077 31053 31042 31028 31056 31118 31182 31236 31276 31298 31333 31352 31367 31373
16160 31373 31363 31340 31325 31279 31217 31172 31139 31125 31123 31129 31170 31240 31273 31271 31286 31308 31332 31373 31404 31435 31472 31508 31501 31516 31536 31541 31532 31528 31519 31504 31475 31468 31452 31409
16407 31409 31354 31304 31263 31231 31190 31157 31150 31123 31102 31073 31034 30985 30932 30853 30771 30681 30582 30463 30384 30324 30268 30252 30304 30366 30468 30601 30718
16604 30718 30824 30935 31039 31122 31154 31169 31189 31205 31217 31192 31202 31153 31175 31101 31100 31061 31030 31006 30921 30914 30837 30853 30785 30847 30803 30800 30712 30698 30548
16815 30548 30463 30276 30192 30001 30020 29887 30003 29913 30109 30095 30248 30248 30318 30333 30428 30439 30431 30378 30328 30257 30198 30101 30002 29961 29715 29332
17004 29332 29099 28767 28324 28041 28022 28275 28591 28848 29092 29332 29721 30401 30775 30717 30568 30571 30537 30328 30229 30170 30096 30049
17164 30049 30070 30069 30048 30036 30037 30062 30098 30118 30101 30065 30064 30095 30128 30204 30239 30284 30357 30462 30567 30659 30764 30847 30906 30986 31050 31086 31093 31122 31110 31073
17382 31073 31052 31008 30959 30910 30845 30784 30727 30654 30568 30466 30382 30307 30232 30188 30163 30132 30144 30168 30186 30223 30276 30302 30309 30283 30259 30241 30189 30131 30113 30105
17600C0105l8l1Nkj8k4l6k9n5o6n5m3j9M4Q3Q5L4TMj4k7n7p2p9j13r3k1L9R2J37
17818B9770J71J66J32J01P8K7L8N3J8JJ3j7pK3J9qOK9K5J3J8J2J1RjTmRJ2lrlL
18058C0704J1PklJ6J5K1K5TJMPJ7L8Ml3k2nj9n0l2k1m3m8o8o3m5j0K2M9O3R4P6
18298C0735M2L6N8K1K2L5K4LJ1J5pj5pnj2oQNKNQkqj3l0JLk3k5j6k9m3l8k8l5n8
18560C0634o2r3j15j18j58j83j40l8N6P0N9K8j5o9r4r8r7p6l6l4m1n7j12j51j72
18742B8888k06j79j08k6R0K02K74K85K53K16J82J32R4O5M4Jj2%nj1K0Rok1m4p2
18931C0065r3q3p3n5J3O0Q2J07J08Q6Q4P2J6nK5M8K7J9QL3M9L4K0J0MJ6J4%K4T
19149C0739OTj1j9pPMTkk7j4M%KJ5rk6plj8Pj5m3k8j6l5n4k6l7o0l0kK2J7j6k1
$$ plain form
17600 30105 30067 30036 30041 30039 30021 29997 29961 29932 29877 29811 29756 29713 29694 29738 29821 29906 29940 29974 29978 29964 29937 29880 29808 29729 29616 29523 29502 29541 29633 29770
17818 29770 29941 30107 30239 30340 30418 30445 30483 30536 30554 30555 30568 30551 30544 30567 30586 30578 30584 30613 30638 30651 30669 30681 30692 30701 30700 30699 30695 30704 30716 30713 30704 30701 30704
18058 30704 30715 30722 30720 30717 30733 30748 30769 30794 30819 30820 30824 30831 30848 30886 30890 30857 30835 30830 30811 30761 30729 30708 30665 30617 30549 30486 30441 30431 30453 30502 30565 30659 30735
18298 30735 30777 30813 30871 30892 30914 30949 30973 30976 30987 31002 30995 30980 30973 30968 30956 30950 30958 30963 30965 30970 30978 30976 30968 30955 30925 30926 30929 30906 30881 30865 30836 30793 30755 30727 30692 30634
18560 30634 30572 30479 30364 30246 30088 29905 29765 29727 29783 29853 29912 29940 29925 29856 29762 29664 29567 29491 29455 29421 29380 29323 29211 29060 28888
18742 28888 28682 28503 28395 28369 28459 28661 28935 29220 29473 29689 29871 30003 30097 30162 30206 30207 30195 30195 30190 30179 30199 30208 30202 30181 30137 30065
18931 30065 29972 29889 29816 29761 29774 29834 29916 30023 30131 30217 30301 30373 30389 30384 30409 30457 30484 30503 30511 30544 30593 30627 30647 30657 30661 30677 30691 30691 30715 30739
19149 30739 30745 30751 30740 30721 30714 30721 30725 30729 30727 30700 30686 30690 30690 30692 30707 30698 30672 30665 30662 30644 30651 30636 30593 30565 30549 30514 30460 30434 30397 30337 30307 30305 30327 30344 30328 30307
19411C0307k6l5n2p9o1j1k9k7rjkpRM2M1L6K4J1J0Rok1j0Rj1m0Tl1l3m4n0m8k3T
19658B9779m2m1m4o4p5r2j04Tj21j72k17Tk28k78l07l12l53l69l08k59k68k69l14
19825B5221m10n29o66p62Tn77k50J67N86Q46R26R12Q01O58N34M30L32K39J85J48
19971B8029J08P7M8K0k0l6o5r5j24j73j95j93k13k25j87j06j6P7J29J66J72J60
20131B7338J57J54J21J02J09Q2K7JTm0q1m9l8m8k6m5n1o2r7j04q9j03p0m2j9nJ0
20327B7133Rn4q8q6j01j52j90j95j99j78j27j01j14j07n9p1j08j27j22j17j30j51
20487B4565j57j45j57j85j95j85j94j80j55k01k26k06k03k02k47l14l26l46m05
20625B0336m52m79m90n06n35n96o50o70p13p73q02p89p81p97p79p57p45o88o28
$$ plain form
19411 30307 30281 30246 30194 30115 30054 30043 30014 29987 29978 29977 29975 29968 29977 30019 30060 30096 30120 30131 30141 30150 30144 30123 30113 30122 30111 30071 30031 30000 29967 29923 29873 29825 29802 29779
19658 29779 29737 29696 29652 29588 29513 29421 29317 29213 29092 28920 28703 28486 28258 27980 27673 27361 27008 26639 26331 26072 25804 25535 25221
19825 25221 24811 24282 23616 22854 22092 21515 21265 21432 22018 22864 23790 24702 25503 26161 26695 27125 27457 27696 27881 28029
19971 28029 28137 28214 28262 28282 28262 28226 28161 28066 27942 27769 27574 27381 27168 26943 26756 26650 26634 26711 26840 27006 27178 27338
20131 27338 27495 27649 27770 27872 27981 28063 28090 28091 28092 28052 27971 27922 27884 27836 27810 27765 27714 27652 27555 27451 27362 27259 27189 27147 27128 27123 27133
20327 27133 27142 27088 27000 26914 26813 26661 26471 26276 26077 25899 25772 25671 25557 25450 25391 25320 25212 25085 24963 24846 24716 24565
20487 24565 24408 24263 24106 23921 23726 23541 23347 23167 23012 22811 22585 22379 22176 21974 21727 21413 21087 20741 20336
20625 20336 19884 19405 18915 18409 17874 17278 16628 15958 15245 14472 13670 12881 12100 11303 10524 9767 9022 8334 7706
20764G706n74m62l42k52j32l6J3L6L9M9O4K6J1j5m8p3r3j08j12q5q7p1j8OK9M1
20953E512M9Q2Q0N8P2R5Q9Q6P1L4L8M6J9L5M2Mj1l6q0j13j51k02k18k14k10k33
21142D944k46k33k52k75k65k38k25k02j92j66j23q4n9k9j3J6K6K1M5L9L8M9N7M1
21316B674j7l7n3q5o5n9p1o4n0j6J6L1O1Q0J04J38J49J81J72J46J65J64J04R0J14
21498C872R1P1L8j3k7r0j59j64j78k01j86j92j45p7o5j9N1J00J44K21K90L62M13
21665D137M60N18N20M98M68L97L14K37J54O5koM6J57K58L05L21K92J89R9Pj16k33
21833I085l00l65m44n09n50n89o53o60o03n43m83l91k86k02r9k4L6J00J43K01J92
21985C056J49J50J48TJ94K92L58L77TM02L52K76K34J60J18Q3Lj0j9p4r6r8j14j31
$$ plain form
20764 7706 7132 6670 6328 6076 5944 5908 5921 5957 5996 6045 6109 6135 6146 6131 6083 6010 5917 5809 5697 5612 5525 5454 5436 5442 5471 5512
20953 5512 5561 5643 5723 5781 5853 5948 6037 6123 6194 6228 6266 6312 6331 6366 6408 6412 6401 6365 6285 6172 6021 5819 5601 5387 5177 4944
21142 4944 4698 4465 4213 3938 3673 3435 3210 3008 2816 2650 2527 2443 2384 2355 2342 2358 2384 2405 2450 2489 2527 2576 2633 2674
21316 2674 2657 2620 2567 2482 2417 2358 2287 2223 2173 2157 2173 2204 2265 2345 2449 2587 2736 2917 3089 3235 3400 3564 3668 3758 3872
21498 3872 3963 4034 4072 4059 4032 3942 3783 3619 3441 3240 3054 2862 2717 2640 2575 2556 2607 2707 2851 3072 3362 3724 4137
21665 4137 4597 5115 5635 6133 6601 6998 7312 7549 7703 7768 7766 7760 7806 7963 8221 8526 8847 9139 9328 9427 9434 9318 9085
21833 9085 8785 8420 7976 7467 6917 6328 5675 5015 4412 3869 3386 2995 2709 2507 2408 2384 2420 2520 2663 2864 3056
21985 3056 3205 3355 3503 3651 3845 4137 4495 4872 5249 5651 6003 6279 6513 6673 6791 6874 6877 6867 6848 6774 6678 6580 6466 6335
22160F335j56j34j01p3j7N2R7J24R4N1K2l8r0j02j27j39j09r2o1L6J26J98K74L85
22335F555M21L98L96L43K55J80J65J68K26L25M84P18R52J103J117J033R48Q03O62
22473A7252N50M53L44K45J82J14J3n4q1j49k26k79l23l78l94l91l59k38J5L26O53
22625A7275R63J105J047R18P48N98N03L73K58K65K49J76J63J67J28J00R1J12J22
22764B5361J14J13Q2K1P2J28O3M1O2P2M6K5L0L5L9M5J3TL1L4M1J7kqk3j0KrJJ3
22982B6462J0L7O6Q3J08J19J09J30J18O7N8O9P5Q6N3J7K4L8%MM2M4J7L8K6l7k4
23178B7839K7O%J9J5%qj0jMK%Tk3LJ5j4j9%jJJ6j9k9OL6N5K8K6K9K5P3lk2J8RJ
23447B8104OjMj1k6K%K1K8j4j5K2J8m0m7MJ0j7rJ5Jn0lL9rk0mJ4K8Mj7prk9qJ5
$$ plain form
22160 6335 6179 6045 5944 5871 5854 5906 6003 6127 6221 6272 6294 6256 6166 6064 5937 5798 5689 5597 5536 5572 5698 5896 6170 6555
22335 6555 6976 7374 7770 8113 8368 8548 8713 8881 9107 9432 9916 10634 11586 12689 13806 14839 15787 16590 17252
22473 17252 17802 18255 18599 18844 19026 19140 19153 19099 19018 18869 18643 18364 18041 17663 17269 16878 16519 16281 16296 16622 17275
22625 17275 18238 19343 20390 21308 22056 22654 23157 23530 23788 24053 24302 24478 24641 24808 24936 25036 25127 25239 25361
22764 25361 25475 25588 25670 25691 25763 25891 25954 25995 26057 26129 26175 26200 26230 26265 26304 26349 26362 26375 26406 26440 26481 26498 26496 26488 26465 26455 26457 26448 26449 26462
22982 26462 26472 26509 26575 26658 26766 26885 26994 27124 27242 27309 27367 27436 27511 27597 27650 27667 27691 27729 27729 27733 27775 27819 27836 27874 27900 27863 27839
23178 27839 27866 27872 27872 27891 27906 27906 27898 27888 27887 27891 27893 27893 27893 27870 27873 27888 27874 27855 27855 27854 27855 27871 27852 27823 27829 27865 27920 27948 27974 28003 28028 28101 28098 28076 28094 28103 28104
23447 28104 28110 28109 28113 28102 28076 28078 28078 28099 28127 28113 28098 28120 28138 28098 28051 28055 28065 28048 28039 28054 28055 28005 28002 28041 28032 28012 28008 28022 28050 28054 28037 28030 28021 27992 27984 27999
23709B7999k5k9J7nk2J0Nj0%Tj4K2Pl1m5k2l2k6J4l1k4J1qj5J3kj0jj3Oj6k4J2
23949B7711mk0j2K0%k5J4Nj2j3KqRL0Qm3l7j3%J5n1m5M6L8j2j9%lj7J2J7j6TKk0
24204B7543j7J2J5pTj8NJ9pk8KJ1j9pNloj4k1k0j3J5K6K9l0l4pmrj2pMJ0Kl9NK2
24473B7396j8Jj5l6j0Qj7j4J9k0m1JL1%j4pJ6J8J2K4j1rL3M8K5j4K7K4n1qN7L8
24705B7493m3KO0J7nk7TqJ6qmL6J6j9PJ6j6k1J0oPM0L4k4n4j3j0J4M7K2nm%L3j3
24960B7563m0J7K3K4ok0J0nlJ1l7n2L5P9L7j60j03O3M7L1ok4J7K0rJ0RNL2K0l4T
25193B7520L5P9M4n5k0N7K9j3j5J5Km3oL1K2N2M8%p6l8R1N0N1N4m3j5P2J4L4L9
25411B8015M3J8n2m9O8Q2L9N2L6r5r1N6O8Q9J33r4j64J07P9K3J1K8K5J9lk4J3J37
$$ plain form
23709 27999 27974 27945 27962 27957 27935 27945 27950 27940 27940 27940 27926 27948 27955 27924 27879 27857 27825 27799 27813 27782 27758 27769 27761 27746 27759 27757 27747 27746 27733 27739 27723 27699 27711
23949 27711 27707 27687 27675 27695 27695 27670 27684 27689 27677 27664 27666 27658 27667 27697 27705 27662 27625 27612 27612 27627 27576 27531 27577 27615 27603 27584 27584 27581 27564 27576 27593 27577 27561 27563 27543
24204 27543 27526 27538 27553 27546 27539 27521 27526 27545 27538 27510 27512 27523 27504 27497 27502 27499 27493 27479 27458 27438 27425 27440 27466 27495 27465 27431 27424 27420 27411 27399 27392 27396 27406 27408 27369 27374 27396
24473 27396 27378 27379 27364 27328 27318 27326 27309 27295 27314 27294 27253 27254 27285 27285 27271 27264 27280 27298 27310 27334 27323 27314 27347 27395 27420 27406 27433 27457 27406 27398 27455 27493
24705 27493 27450 27452 27512 27529 27524 27497 27470 27462 27478 27470 27466 27502 27518 27499 27506 27522 27506 27485 27495 27489 27496 27536 27570 27546 27492 27479 27469 27483 27530 27552 27547 27543 27543 27576 27563
24960 27563 27523 27540 27563 27587 27581 27561 27571 27566 27563 27574 27537 27485 27520 27599 27636 27476 27373 27436 27483 27514 27508 27484 27501 27521 27512 27522 27531 27536 27568 27588 27554 27520
25193 27520 27555 27634 27678 27623 27603 27660 27689 27676 27661 27676 27678 27635 27629 27660 27682 27734 27782 27782 27706 27668 27759 27809 27860 27914 27871 27856 27928 27942 27976 28015
25411 28015 28058 28076 28024 27975 28043 28125 28164 28216 28252 28157 28066 28122 28190 28279 28412 28318 28154 28261 28340 28363 28374 28402 28427 28446 28443 28419 28432 28569
25615B8569P2j46p8P1N7j1m8l9L3M1M7M5M1Q8q4j50R2N4J0L2P4J7K0r2m9j39j04
25811B8423J48J94J23j99j89O2J12P9mO5R5j44m1J29nJ06L81j67m14n59j65M97
25971B8527J02L3P4j8m1M9m1J3Q0j30m9Q8q8nN12P9m70k45o27K61M91K05k03qq7
26153B8502l82K13J62J2Q0j87nJ38R6L68K74j57J84n78m58J114J17p34J23k3M44
26305B9303L80j83k66q86J41M29J97J16J91K35Q61K85k303j225J066J061J74n69
26436B9007o0M02J45j41m6J43P1j20j00K23N49N62n89k27M1q93p45j0Q73P32O64
26589C0481j016j188P07M70m0j6J5TL5J7J28N52K44k31m10j783N54J793J282j327
26735C0282k838M83J410J20m95J68K65L4k2m8N69J092j011j705J068k13o64O33
$$ plain form
25615 28569 28641 28495 28417 28488 28545 28534 28486 28447 28480 28521 28568 28613 28654 28742 28658 28508 28600 28654 28664 28696 28770 28787 28807 28715 28666 28527 28423
25811 28423 28571 28765 28888 28689 28500 28562 28674 28753 28749 28814 28909 28765 28724 28853 28848 28954 29335 29168 28754 28195 28030 28527
25971 28527 28629 28662 28736 28718 28677 28726 28685 28698 28778 28648 28599 28687 28599 28594 29106 29185 28715 28470 27843 28104 28595 28800 28597 28589 28502
26153 28502 28120 28333 28495 28507 28587 28400 28395 28533 28629 28997 29271 29114 29298 28720 28262 29376 29493 28759 28882 28859 29303
26305 29303 29683 29500 29234 28348 28489 28918 29115 29231 29422 29657 30518 30803 28500 27275 28341 29402 29576 29007
26436 29007 28947 29349 29494 29353 29307 29450 29521 29401 29301 29524 30073 30635 30046 29819 29860 28967 28222 28212 29085 29817 30481
26589 30481 29465 28277 28984 29454 29414 29398 29413 29428 29463 29480 29608 30160 30404 30173 29763 27980 28534 30327 31609 30282
26735 30282 27444 27927 29337 29457 28962 29130 29395 29429 29407 29359 29928 31020 30009 28304 29372 29159 28495 29128
26865B9128L29O2j2n9P9J75M79J6j169l2O01J11o5K82N70m61l37Q91j315j065J005
27018B9213L31L3L21J19m29J32O09n75n23N76K48l37o43J61M52N94N09j226l13
27156B9252J305o69j012l21J99M81M14k43N28K066j222m722J350K092J330j205
27273B9623j477J762j210j486J296J016K0m43O38J26j151J05N62J78M20n3q98J12
27404B9140J001J55j331k63O38J75qL1M2K02L98m04r55K91L73K10m5l91p5J63N3
27556B9400L1k8kJ8KK18M75l94r25K11R79J106j171k188M12Q85J052M21k039o07
27702B7856J009K57LL0J72P11N31k203j051J430J130L66j779j458Q00Q09M11n7
27833B8967o37m8M79O50k19j105O60O98q63N55Q26k102l4P66o00L63L84q17m7L75
$$ plain form
26865 29128 29457 29519 29507 29448 29527 29702 30181 30197 29028 28996 29597 29708 29643 29925 30495 30034 29697 30588 29273 28208 29213
27018 29213 29544 29577 29898 30017 29588 29720 30329 29754 29231 29807 30055 29718 29075 29236 29688 30282 30791 29565 29252
27156 29252 30557 29888 28876 28555 28754 29235 29649 29406 29934 32000 30778 26056 27406 29498 30828 29623
27273 29623 28146 29908 28698 27212 28508 29524 29544 29101 29739 29865 28714 28819 29381 29559 29979 29926 29028 29140
27404 29140 30141 30296 28965 28702 29340 29515 29507 29538 29580 29782 30180 29776 28821 29112 29485 29695 29650 29259 29184 29347 29400
27556 29400 29431 29403 29401 29419 29421 29639 30114 29720 28795 29006 29985 31091 29920 27732 28144 29029 30081 30502 28463 27856
27702 27856 28865 29122 29125 29155 29327 30038 30569 28366 27315 28745 29875 30241 28462 27004 27804 28613 29024 28967
27833 28967 28330 28282 28761 29411 29192 28087 28747 29445 28582 29137 29963 27861 27827 28593 27993 28356 28740 27923 27876 28251
27978B8251O5Q2J4N10P53j41j21k841j069K087M65k53L92N81K4p58L97N69j339
28116B7668n51J072J130k8k183n08J285P63q27p87N23L82L85N60q52j111N30N07
28247B7958N58j14j893q6P35M64N17q82j109N35L39P7K24N16M70o63k85O42l36
28385B7667K24q9n75K03L02L24J59L3K0P3J12J00L04J65o46j98N62k76k21M09K33
28538B8885o6m13j30L28J73q1j5J88k66m37J23J68O0M0j8m4P4K59n3n25p1K30K15
28705B8624n4k14L0j50o6J51j8k0M8Nl8%M6O2J2j03k4P4O7M6L1M9k8l9Q2L0j2L1
28909B8622K5rL0K3K1L7J5k0rK1QJ5OJ9O3Pm0j2Pom5j8J3j2l0k0qj1l0m3j7L1j6
29149B8617j13n7Ll8p2n2RJ7J6j2RM0j7j4K1lrm4m2qo5m2k4o9l5J2k6qL6TN0N9
$$ plain form
27978 28251 28316 28398 28412 28922 29675 29534 29413 26572 25503 27590 28055 27802 28194 28775 28799 28041 28438 29007 27668
28116 27668 27117 28189 29319 29291 27108 26600 27885 28648 27821 27034 27557 27939 28324 28884 28032 26921 27451 27958
28247 27958 28516 28402 26509 26423 27158 27622 28139 27257 26148 26683 27022 27099 27323 27839 28309 27646 27361 28003 27667
28385 27667 27891 27802 27227 27430 27732 28056 28215 28248 28268 28341 28453 28553 28857 29022 28376 28178 28740 28464 28243 28652 28885
28538 28885 28819 28406 28276 28604 28777 28696 28681 28869 28603 28166 28289 28457 28517 28557 28539 28495 28569 28828 28775 28250 28179 28409 28624
28705 28624 28570 28356 28386 28236 28170 28321 28303 28283 28331 28336 28298 28298 28344 28406 28418 28315 28291 28365 28432 28478 28509 28558 28530 28491 28573 28603 28591 28622
28909 28622 28647 28638 28668 28691 28712 28749 28764 28744 28735 28756 28764 28779 28785 28804 28867 28874 28834 28822 28829 28823 28778 28760 28773 28761 28731 28711 28703 28692 28662 28619 28602 28633 28617
29149 28617 28504 28447 28450 28412 28340 28288 28297 28314 28330 28318 28327 28367 28350 28336 28357 28354 28345 28301 28259 28251 28186 28144 28120 28051 28016 28028 28002 27994 28030 28066 28116 28175
29382B8175N3RJ0Q1L8j9J6K6JMO3M1n5l9K6n0k5J4m5n6n2l5rp3q8n3p9j05r8j15
29600B7561j54Tr9p5j03m8ON6J36J53J47J36J26J28J10R4Q7P6M1K4M8M3K4L7Tr
29789B8428NK6oqJ5L6PJ7Oj4TNpmjj2Ql6l5K1j0k7J7Rj1k1oj1j8mnj0l6j0k4n6
30051B8214nqj4l1j7nj7n3n4l3l1%K6Ok7rJ2Qj9k8rk6m4n0k9j1l2Tp9r4j4N8L5
30291B7588LJ9L7O7Q0M0nK3O1K1j1MTk3PM3pj4LK2L3K7TL3NK0J9oK7L6J4k8n3Q
30538B8124L7n9o6Kl2o7o1n7n1p0k7PJ4RlTOJ0k0l8j0k8p0p7n8o7j00n6o2m5K3
30764B7105Pk1m4k5L0M7L6J7J4M4j2k9K6J6l4m5qn1k4KmTj0J5M0K4L6K6L7N1J9
30989B7281L3M9J1k7NK5L8NJ3M4M7Lj6K6L9j0m8NM0k0n5n4m3j7pm7p0n4n8j04o9
$$ plain form
29382 28175 28228 28237 28247 28328 28366 28347 28363 28389 28390 28394 28457 28498 28443 28404 28430 28380 28355 28369 28324 28268 28216 28181 28172 28099 28011 27958 27879 27774 27676 27561
29600 27561 27407 27253 27154 27079 26976 26928 26934 26990 27126 27279 27426 27562 27688 27816 27926 28020 28107 28183 28224 28248 28296 28339 28363 28400 28437 28428
29789 28428 28433 28459 28453 28445 28460 28496 28503 28520 28526 28512 28498 28503 28496 28492 28491 28479 28487 28451 28416 28437 28427 28400 28417 28426 28415 28394 28388 28377 28359 28355 28350 28340 28304 28294 28270 28214
30051 28214 28209 28201 28187 28156 28139 28134 28117 28064 28010 27977 27946 27946 27972 27978 27951 27942 27954 27962 27943 27915 27906 27880 27836 27786 27757 27746 27714 27682 27603 27509 27495 27553 27588
30291 27588 27591 27610 27647 27714 27794 27834 27829 27852 27913 27934 27923 27927 27931 27908 27915 27958 27951 27937 27940 27962 27995 28022 28049 28082 28087 28107 28126 28120 28147 28183 28197 28169 28116 28124
30538 28124 28161 28102 28036 28038 28006 27939 27878 27821 27770 27700 27673 27680 27694 27703 27700 27697 27703 27713 27693 27655 27645 27617 27547 27470 27412 27345 27245 27189 27127 27082 27105
30764 27105 27112 27091 27047 27022 27052 27099 27135 27152 27166 27210 27198 27169 27195 27211 27177 27132 27124 27073 27049 27051 27047 27043 27033 27048 27088 27112 27148 27174 27211 27262 27281
30989 27281 27314 27363 27374 27347 27352 27377 27415 27420 27433 27477 27524 27527 27511 27537 27576 27566 27518 27523 27563 27543 27488 27434 27391 27374 27367 27320 27250 27196 27138 27034 26965
31215B6965k4n3j25j23n3j08j37q2j09j10q4j08j00q8o6k1l3lK1M5O2K9Q2J07J11
31396B5995J54J27P0O7Q9Q8J00R3J9L8N5M3LjN0J2J1pk9K1j7j2L7m9p8l6l2j2J
31607B6800k6n4k0pj0J9J7k5j1M2N7L2K7N1M5J4J2L6Km3K4O4Rl9j2M1j9o3l6JJ4
31833B6942Lo6l6N1K4j1k4k3J8J5MK7J8l7m4K2K8J3j2LN1k9l8L7
32000B6936
$$ plain form
31215 26965 26941 26888 26763 26640 26587 26479 26342 26260 26151 26041 25957 25849 25749 25661 25595 25574 25541 25538 25559 25604 25666 25695 25777 25884 25995
31396 25995 26149 26276 26346 26413 26502 26590 26690 26783 26802 26840 26895 26938 26941 26940 26990 27002 27013 27006 26977 26998 26981 26969 27006 26957 26879 26843 26811 26799 26800
31607 26800 26774 26720 26700 26693 26683 26702 26719 26694 26683 26725 26782 26814 26841 26892 26937 26951 26963 26999 27001 26958 26982 27046 27055 27016 27004 27045 27026 26963 26927 26928 26942
31833 26942 26945 26879 26843 26894 26918 26907 26883 26860 26878 26893 26897 26924 26942 26905 26861 26883 26911 26924 26912 26915 26966 26937 26899 26936
32000 26936
##END= 
