##TITLE= p-xylene (1,4-Dimethylbenzene)
##JCAMP-DX= 4.24 $$Exported GRAMS Data File
##DATA TYPE= INFRARED SPECTRUM
##ORIGIN= Dept of Chem, UWI, JAMAICA
##OWNER= public domain
##DATE= 97/07/14
##TIME= 10:09:00
##SPECTROMETER/DATA SYSTEM= PERKIN-ELMER 1000 FT-IR
##INSTRUMENTAL PARAMETERS= 4400.00, 450.00 cm-1; 16 scans; mode ratio; apod strong
##CAS NAME= p-xylene
##MOLFORM= C 8 H 10
##CAS REGISTRY NO= 106-42-3
##MP= 12
##BP= 138
##MW= 106.17
##XUNITS= 1/CM
##YUNITS= TRANSMITTANCE
##XFACTOR= 0.0039500000
##YFACTOR= 0.0000936031
##FIRSTX= 600.000000
##FIRSTY=  59.945408
##LASTX= 4400.000000
##NPOINTS= 3801
##MAXY=  93.618350
##MINY=   0.015258
##DELTAX=   1.000000
##$ASSIGNMENT TYPE= CHIME
##$CHIME TARGET= CHIMEDISP
##PEAK ASSIGNMENT= (XYWA)
(3135, -1, 20, <load "3194.xyz"; select *; background [255,251,221];
wireframe 40; animation on>)
(3094, -1, 20, <load "3147.xyz"; select *; background [255,251,221];
wireframe 40; animation on>)
(2924, -1, 15, <load "3057.xyz"; select *; background [255,251,221];
wireframe 40; animation on>)
(2868, -1, 15, <load "3044.xyz"; select *; background [255,251,221];
wireframe 40; animation on>)
(2730, -1, 20, <load "3043.xyz"; select *; background [255,251,221];
wireframe 40; animation on>)
(1793, -1, 5,  <load "1792.xyz"; select *; background [255,251,221];
wireframe 40; animation on>)
(1631, -1, 5,  <load "1763.xyz"; select *; background [255,251,221];
wireframe 40; animation on>)
(1450, -1, 25, <load "1447.xyz"; select *; background [255,251,221];
wireframe 40; animation on>)
(1373, -1, 5,  <load "1383.xyz"; select *; background [255,251,221];
wireframe 40; animation on>)
(1214, -1, 5,  <load "1234.xyz"; select *; background [255,251,221];
wireframe 40; animation on>)
(1119, -1, 5,  <load "1120.xyz"; select *; background [255,251,221];
wireframe 40; animation on>)
(1098, -1, 5,  <load "1078.xyz"; select *; background [255,251,221];
wireframe 40; animation on>)
(1045, -1, 10, <load "1052.xyz"; select *; background [255,251,221];
wireframe 40; animation on>)
(1016, -1, 5,  <load "1036.xyz"; select *; background [255,251,221];
wireframe 40; animation on>)
(792, -1, 20,  <load "658.xyz"; select *; background [255,251,221];
wireframe 40; animation on>)
(2400, -1, 2000,  <load "xylenep.pdb"; background [255,251,221]; wireframe 40;>)
##XYDATA= (X++(Y..Y))
151898F40421L684P531O293L553P564N999K804N999N738N901N054K934N771O683
155443G15929L424L879M923N673O260O945L227K054L293M141M760O194M565J630
158987G76897M108N021L847L717M206M401O19K413K967k087O6K738p17l260k706
162784H02230j728K608N803N412O521P727O586N477M825O293M108L781N478L423
166329H68544J695K576M010K902M499M467K054K380N673k706n2361R259L3549
169620H86541J3856J272j989m24m010o586n771K94M075O684R357P433J663K576
173164I14971L782K119j63l391o129j0368j2650l325Q281Q607K804o5L553L913
176708I11939l26P82M662M076K412M663N542K674J499J044P17J96J597J891j467
$$ y = [640421, 644105, 651636, 657929, 661482, 669046, 675045, 677849, 683848, 689586, 695487, 700541, 703475, 709246, 715929, 719353, 723232, 728155, 733828, 740088, 747033, 750260, 752314, 755607, 759748, 764508, 770702, 775267, 776897, 781005, 786026, 789873, 793590, 797796, 802197, 802816, 805229, 808196, 806109, 806175, 808913, 808196, 804936, 802230, 800502, 803110, 808913, 814325, 820846, 828573, 835159, 840636, 845461, 851754, 855862, 859643, 865121, 868544, 870239, 872815, 876825, 879727, 884226, 888693, 890747, 893127, 898800, 896094, 843733, 852992, 886541, 900397, 901669, 899680, 899256, 895246, 888660, 882889, 883183, 887258, 893942, 903299, 910732, 912395, 914971, 918753, 920872, 920709, 917318, 911189, 900821, 888171, 884846, 893127, 901734, 904538, 904473, 908026, 911939, 911613, 912395, 917057, 921133, 923545, 928208, 933750, 936424, 937923, 938967, 939684, 939880, 941477, 943368, 941901]
180506I41901k380j043O84r45j663%k413m434j793M57k29J109o5j109k934k315
184556I22828K250K901K022N053N738K94l3Q15j597l815m108p335r129o358k28
188354I09298N021M988L847L195K706J793%m336l130k93l456m923k282m076p205
192151I01147o097o227q151j0889j1313j3074j8747k0083j7671j5943j3595r781
195189G49576p629q282j2161j8714k5626l0353l3418m0330m8513n4545n9338o3934
198227C46733o9217p2280o5630n6306m1080k5267j1150k543r78r46K94L26l92
201518A564k60o6J207N053J4867L0028M5611N7121O4032O4065O0218N5327M8872
204810D47639M3036L9515L3190K9310K6148K2137J9627J9562J7573J4313J1867
$$ y = [941901, 939521, 938478, 939162, 938217, 936554, 936554, 934141, 929707, 927914, 928371, 928142, 929251, 929186, 928077, 925143, 922828, 925078, 927979, 930001, 935054, 940792, 941086, 941053, 941868, 940271, 936456, 932348, 925013, 915884, 909526, 909298, 914319, 919307, 923154, 926349, 929055, 930848, 930848, 926512, 923382, 923089, 919633, 914710, 912428, 908352, 901147, 895050, 888823, 880672, 869783, 858470, 845396, 826649, 806566, 788895, 772952, 759357, 749576, 741947, 733665, 721504, 702790, 677164, 646811, 613393, 573063, 524550, 470005, 410667, 346733, 277516, 205236, 139606, 83300, 42220, 16953, 5803, 3260, 2282, 1336, 1630, 1956, 1564, 1304, 1238, 2445, 7498, 22365, 52393, 98004, 155125, 219157, 283222, 343440, 398767, 447639, 490675, 530190, 563380, 592690, 618838, 640975, 660602, 680164, 697737, 712050, 723917]
207594G23917J0009J0107R194M402K217J597n54j500k61j173m630l945l586n315
211139G40479l390Q15L390O847R683J1411J2487J0564J1835J2389J0237J0074
214177H36821Q282N835O978P140N183N673O912N152L488M010N249N804M173K608
217721I13308K413L945M923L195K836K739K021J207K249J956K94R13J923O52p50
221518I43824m89J337M108K119j108m24J500R45k93J304K119r45r8N54N22k94
225569I54681j793k184K28K93j336j96O5r13j597r46j891k119k217k478l26R46
229620I38217o85k93Q47p82j043j31n21q48r8j304q15j337k739l455j859k282
233670I20872l586l195m434n413m597n933p466n999l945m043m141j369R13J728
$$ y = [723917, 733926, 744033, 753227, 757629, 759846, 761443, 760889, 759389, 759128, 757955, 753325, 749380, 745794, 740479, 737089, 737904, 741294, 748141, 757824, 769235, 781722, 792286, 804121, 816510, 826747, 836821, 845103, 850938, 857916, 865056, 870239, 875912, 882824, 887976, 891464, 895474, 900723, 906527, 910700, 913308, 915721, 919666, 924589, 927784, 930620, 933359, 935380, 936587, 938836, 940792, 941086, 941999, 943922, 944574, 943824, 943335, 944672, 948780, 950899, 949791, 949367, 950867, 951812, 951519, 952823, 954942, 953997, 953899, 954453, 954975, 954681, 952888, 950704, 950932, 951225, 949889, 949693, 949758, 948845, 947248, 946302, 944411, 942292, 940075, 937597, 937271, 938217, 937532, 937239, 938086, 937304, 936261, 936130, 935609, 934761, 934663, 933359, 932544, 931207, 928468, 925013, 923154, 920872, 917286, 914091, 909657, 904244, 899647, 893714, 886248, 880249, 876304, 872261, 868120, 866751, 867664, 869392]
237215H69392J630J304J337J369R78J96O5l26j369j826k119k837l782m597m010
241012H55405m956o031o358p172o880n705n119m401l815k282R13K902J891K151
244556H10543M206M499L489L097M141L358J989K021K347J794J467J369N54k61
248101H44613m56k61r78j337q15j369k641j956j043k152k478k836k869j859k478
251898H19085l684l065k934k967k608l782l586l652m499n216m174l260n184o716
255443G63758o227o684q444j2552j6791j9920k0605j9399k6767m6133p3455r8657
258481D08124r2266k7713M7796P0520N0437K4616P042l195r651j3921j7965k0474
261518D23350k2040k3148k4517k4811k3083j9790j5748j1737p661k022M695R781
$$ y = [869392, 871022, 872326, 873663, 875032, 876010, 876206, 876271, 875945, 874576, 872750, 870631, 867794, 864012, 859415, 855405, 850449, 844418, 838060, 830888, 824008, 818303, 813184, 808783, 804968, 802686, 803599, 806501, 808392, 810543, 814749, 819248, 822737, 825834, 829975, 833333, 835322, 837343, 839690, 841484, 842951, 844320, 844874, 844613, 844157, 843896, 842918, 841581, 840766, 839397, 836756, 834800, 833757, 831605, 829127, 826291, 823422, 821563, 819085, 815401, 812336, 809402, 806435, 803827, 800045, 796459, 792807, 788308, 783092, 778918, 775658, 770474, 763758, 757531, 750847, 742403, 729851, 713060, 693140, 672535, 653136, 626369, 580236, 506781, 408124, 315858, 288145, 335941, 406461, 456898, 481514, 488556, 485361, 475710, 461789, 443824, 423350, 401310, 378162, 353645, 328834, 305751, 285961, 270213, 258476, 250815, 248793, 253488, 263269]
264556B63269J4573J9791K3409K5039K6701K6376K6115K5105K3963K3865K2529
267341E20735K0377J9268J7932J7149J5780J4639J3986J2879J1280J0238J0041
270126F84304R912Q835P792P532P726O847O195P009O097M239L390L978L260K250
273670G69366J434J598J467p50j858k380m076n901q542j1052j3824j7443k3083
276962F84956k8234l2179l8830m4764m7861m8774m4927l3745j2519J3204L2016
279746C98343L8928L5831K7647J7410P466k510j3237k3767l5505m7698n7936o4815
282784B80157o4195n0372j9464K4811P0814J00939J05340R2071P3324N5328M0525
285569G09278L0582K3213J8388J5487J3269J1607J0009Q281P727O064N054M695
$$ y = [263269, 277842, 297633, 321042, 346081, 372782, 399158, 425273, 450378, 474341, 498206, 520735, 541112, 560380, 578312, 595461, 611241, 625880, 639866, 652745, 664025, 674263, 684304, 694216, 703051, 710843, 718375, 726101, 732948, 739143, 746152, 752249, 756488, 759878, 763856, 767116, 769366, 770800, 772398, 773865, 773115, 771257, 768877, 764801, 758900, 750358, 739306, 725482, 708039, 684956, 656722, 624543, 585713, 540949, 493088, 444314, 399387, 365642, 353123, 366327, 398343, 437271, 473102, 500749, 518159, 525625, 523115, 509878, 486111, 450606, 402908, 344972, 280157, 215962, 165590, 146126, 170937, 241751, 342690, 448030, 540101, 613425, 668753, 709278, 739860, 763073, 781461, 796948, 810217, 821824, 831833, 840114, 847841, 853905, 858959, 863654]
288607H63654L488K837K575J891J272P82J565K315J108O6L91Q15Q15L59n22j108
292658H82303N54P17l91O5L59l3J31O5r78o6j467k934k869k054j924k380k608
296962H66490m303p304q672r487j0727j2030j3726j3172q542j434O683J2259J4541
300253H10576J3335J1052J1085R748P727O293M727L782L912K804J467J011J30
303544H87649m89r7r8o85o85J31J206J370J597Q48j435m597q346j4606k2692l3646
307594H05425m8709p1336r5592r4451l3679O0316J08731R3147O0478L6679K3050
310379H44059J4737R487N836L098J173n87k054l130n281o977q118j0303j1052
313670H30888j0205r651p368k902J826N967R487J2063J2552J2096J1541R586P661
$$ y = [863654, 867142, 869979, 872554, 874445, 875717, 876499, 878064, 880379, 881487, 881553, 881944, 882759, 883574, 883933, 883411, 882303, 882857, 883574, 883183, 883248, 883607, 883574, 883705, 883770, 882792, 882726, 881259, 878325, 875456, 873402, 871478, 869098, 866490, 862187, 854883, 846211, 836724, 825997, 813967, 800241, 787069, 778527, 777093, 783776, 796035, 810576, 823911, 834963, 846048, 855796, 863523, 869816, 874543, 878325, 882237, 885041, 886508, 887519, 887649, 887160, 887063, 886965, 886280, 885595, 885726, 886932, 888302, 889899, 890747, 889312, 884715, 876369, 861763, 839071, 805425, 756716, 685380, 589788, 495337, 461658, 521974, 630705, 723852, 784330, 821009, 844059, 858796, 868283, 874119, 877217, 878390, 877803, 875749, 872619, 867338, 860361, 852243, 841940, 830888, 820683, 811032, 803664, 800762, 802588, 808555, 818042, 830105, 842657, 854753, 866294, 875880, 883541]
316962H83541O912O097M402K543K347K934K902J076k28O5o20q15j271j891j630
320759I06364p83j141j434m57N54N87J011P17J337J011L58O20R13R78J141K93
324810I12069m56L2P83N21j010j141p18j499j272j239j369j467k152k087j467
328607H97528j565k901k804k152k934m076l912m728m499m988o162n836m662m499
332151H41810n478m955m565n216o977p564r846r260o651m499k967k93J923K641
335696G78103L587L782K706J369Q15Q48j304k511j597k478m532l749n347p890
339240G61802o456j891k086k804k837k347k347k446l749m075l782l684l424l260
342784G16614n543m597k021m043m597l130o911n576j0954j3693o521j0042j1704
$$ y = [883541, 890453, 896550, 900952, 903495, 905842, 908776, 911678, 912754, 912526, 912591, 911971, 911156, 909885, 907994, 906364, 905581, 904440, 903006, 902549, 903103, 903690, 904701, 905418, 906755, 907766, 908124, 908744, 909657, 910635, 911776, 912069, 911613, 911645, 912428, 912949, 911939, 910798, 910080, 908581, 907309, 906070, 904701, 903234, 901082, 898995, 897528, 895963, 893062, 890258, 888106, 885172, 881096, 877184, 872456, 867957, 862969, 856807, 850971, 846309, 841810, 836332, 831377, 826812, 821596, 814619, 807055, 797209, 787949, 781298, 776799, 773832, 773539, 775462, 778103, 781690, 785472, 788178, 789547, 790362, 791210, 789906, 787395, 785798, 783320, 778788, 775039, 769692, 761802, 755346, 753455, 751369, 748565, 745728, 743381, 741034, 738588, 734839, 730764, 726982, 723298, 719874, 716614, 711071, 706474, 704453, 700410, 695813, 692683, 685772, 680196, 669242, 655549, 649028, 638986, 627282]
346075F27282j2552j6041j6562k0312k5333l3124n0502n9175n8881n0046k9342
348860B55412K28K6310M1406M5645M1503L5342L0027K6865J8193Q802J3922J3269
351898E56924P988O977J0531N379n705J630P238O455n379p140R45n575r422j1118
355443E59728k1453j9333j0792j3400j1867j1476j2063j4574j2161j0563r553
358227D12493r194r716k641j0009k1029o52l91m630j1052j0009p075r096q934
361518C08065q933j4997j2161q444j1966j1313o553o879k7517j1639m663r031
364556A73969r487r194p695p498o912n021l880p140n021j467k315l521j402%J370
368354A04786K640m694K93M499L978N282N640P401P401M564O814J0792R389R683
$$ y = [627282, 614730, 598689, 582127, 561815, 536482, 503358, 452856, 393681, 334800, 284754, 255412, 255640, 281950, 323356, 369001, 410504, 445846, 475873, 502738, 520931, 529733, 543655, 556924, 564912, 571889, 582420, 587799, 582094, 583724, 590962, 597417, 592038, 584898, 585843, 580268, 570846, 559728, 538275, 518942, 508150, 494750, 482883, 471407, 459344, 444770, 432609, 422046, 412493, 403299, 393583, 390942, 380933, 359904, 359252, 358861, 354231, 343179, 333170, 326095, 316999, 308065, 299132, 284135, 271974, 263530, 251564, 240251, 233698, 226819, 199302, 187663, 183000, 173969, 164482, 155288, 147593, 140095, 133183, 128162, 124282, 117142, 112121, 110654, 108339, 104818, 103416, 103416, 104786, 107426, 102732, 103025, 107524, 111502, 116784, 122424, 129825, 137226, 141790, 148604, 159396, 168785, 178468]
371898A78468J1249J2976R454N478Q476J4313R683M434R749R194Q835P499P335
375189B97143Q086Q118O227O912j858m630K641j0270j8453p760o846p499k152
378481B69659q574k674J0694r8L3n22j1574j6595j4932j7410l5244m7503l2016
381772I3244k1550k2464j5519j1313j0727o553l521r45m89R78K901Q836K5039
385063C7917M1145N1317N2360N1481N2621M6296M1308L4885L1756K7223K6344
387848D94653J9398J272J6269J8388J9431K5887M076j8160J7931N119L59K1811
390886F26434K608k771J3302J2683J0433k283n54J3302J8062q80j3400K3703L0581
394177G31220m792j3074k2366M304K4061J4052R324l391K674J0009J3921N641
$$ y = [178468, 189717, 202693, 212147, 217625, 226101, 240414, 250097, 254531, 264280, 273474, 282309, 289808, 297143, 305229, 313347, 319574, 326486, 324628, 319998, 322639, 312369, 293916, 286156, 279310, 271811, 269659, 261085, 258411, 269105, 269007, 269040, 268518, 256944, 240349, 225417, 208007, 172763, 125260, 93244, 71694, 49230, 33711, 22398, 11671, 5118, 1597, 652, 163, 1141, 4042, 12878, 37917, 79062, 130379, 182739, 234220, 286841, 333137, 374445, 409330, 441086, 468309, 494653, 514051, 515323, 531592, 549980, 569411, 595298, 599374, 581214, 599145, 604264, 604623, 626434, 629042, 626271, 639573, 652256, 662689, 660406, 659852, 673154, 691216, 690336, 676936, 700639, 731220, 726428, 713354, 690988, 695292, 719353, 733405, 742729, 739338, 742012, 752021, 765942, 771583]
397215G71583k3377M858J2878K804Q640J9268j6399k7093J7573R846L260M304
400253G88145L423K706L000K869J826J760J859J662K29Q15Q47L228J858p49M56
404050H13934r8j173j891k250l815m629n054o064k315n54l325k054k772o096k967
407848G68877m239o162o944N379J761n0339q118M303q574j1085o749k0247m4112
411139F13751j7018j2031j7051k7289j4737j30K804J0074K1127L4233K2268Q868
414177F24869L3451L1266L0386K7419K2822J9008J7345K1779K6180n510l26J500
417215H50189M336J6758K8527L3582n4024l6678J6953J7410Q282J532K119J533
420253H90519P987M630k1909o619M043j793N934K0409o520n934J5193j337J1215
$$ y = [771583, 748206, 753064, 765942, 768746, 777386, 796654, 780255, 753162, 770735, 780581, 783841, 788145, 791568, 794274, 797274, 800143, 801969, 803729, 805588, 807250, 807479, 808294, 809141, 812369, 814227, 813478, 813934, 813836, 812663, 810772, 808522, 804707, 800078, 795024, 788960, 786645, 786091, 782766, 780712, 777940, 771844, 768877, 764638, 758476, 751532, 756911, 758672, 708333, 700215, 704518, 695944, 684859, 678110, 657863, 613751, 596733, 584702, 567651, 540362, 525625, 525495, 528299, 538373, 559500, 593733, 616001, 624869, 658320, 689586, 719972, 747391, 770213, 789221, 806566, 828345, 854525, 849015, 848689, 850189, 854525, 871283, 899810, 933392, 879368, 842690, 859643, 877053, 885335, 886867, 888986, 890519, 898506, 903136, 881227, 874608, 878651, 876858, 882792, 903201, 896681, 890747, 905940, 904603, 915818]
423544I15818K7126r748l2375J8486J1411P173k902k413J9953K0964j6790n2459
426582I04244J3498K6017L652k185j565j010M564L326J9138J9464n4350n575K9636
429873I58854M1309k2920p8150L4755K5919J565p075m56j3432N836Q476k641m597
433164I47443L359O520J859j6237O130J0563l9906k1094R846O227L26k510p075
436455I05451j826k054k152K152P140r259r46K1388J7410l1169l3092J9432J4182
439746I06657Q216Q542k4061k445J7931j662q119M532N152K543%o977J4019p108
443291I17220j9170J3367N771O325M760j4965k999N477N412N282k5855o716R194
446582I03103J467N771J1639q639p597J7606J1215j1117k8104Q672J1705o977
$$ y = [915818, 942944, 933196, 900821, 919307, 930718, 937891, 934989, 932576, 952529, 973493, 956703, 904244, 917742, 943759, 947411, 945226, 943661, 942651, 947215, 950541, 969679, 989143, 934793, 929218, 958854, 1000163, 977243, 899093, 933848, 959767, 961332, 954257, 953801, 940369, 946205, 954681, 952040, 947443, 950802, 957322, 959181, 942944, 949074, 959637, 919731, 898637, 908483, 914710, 915036, 912526, 905451, 903625, 901571, 899419, 901571, 908711, 899452, 898506, 919894, 937304, 906135, 873043, 892475, 906657, 914873, 923415, 899354, 896909, 914840, 913178, 905059, 909591, 914743, 917286, 917286, 910309, 924328, 917220, 898050, 911417, 917188, 923513, 928273, 913308, 910309, 915786, 921198, 926480, 900625, 893909, 903103, 904570, 910341, 921980, 913341, 905744, 923350, 934565, 923448, 895344, 904016, 915721, 908744]
449620I08744j402m24k641n347j8127r781n803q640k5724k1583j3791j8780j6040
452911G60661j1053r129q281j7116J0465K3051J3856J7051K5724K0410J1965J8225
455949H55829J4313J0433J4280J1020R291P727L358P662N510n086K184K902K217
459240I41640J239J598l26l000o52j011j858k608l26N738j1411j6041M141O651
462784I23774L2k1192j0302O325N87k772o19J271m23L26M531M043N575P271J5454
466582I33881j0107k0214J5812Q347l554l59K771P83j30m24j304j989j663k152
470126I19698l586m108m304n412n836m760l553o20n87m56l26j1705j5812j076
473670H57557m239q737j0237j2390j4573j6073j7704k0703k3311k5398k7615k8853
$$ y = [908744, 907342, 906918, 904277, 898930, 880803, 871022, 865219, 856579, 830855, 809272, 795481, 776701, 760661, 749608, 740479, 732198, 715082, 725547, 748598, 762454, 779505, 805229, 825639, 837604, 855829, 870142, 880575, 894855, 905875, 915166, 922893, 926251, 933913, 939423, 934337, 936521, 939423, 941640, 942879, 944477, 944151, 941151, 940499, 939488, 937630, 935022, 934696, 940434, 929023, 912982, 917123, 923774, 923806, 902614, 892312, 898637, 899224, 896452, 895833, 897104, 896681, 897007, 901538, 905581, 911156, 918427, 933881, 923774, 903560, 919372, 927719, 924165, 923806, 926577, 927360, 927230, 926806, 925502, 923513, 921850, 919698, 916112, 912004, 907700, 902288, 896452, 891692, 888139, 887519, 886932, 886476, 886150, 874445, 858633, 857557, 853318, 844581, 834344, 821954, 807381, 791308, 773604, 752901, 729590, 704192, 676577, 647724]
476708F47724l0810l2864l0484k6930j8910j5062j4183K674J3172J9724K7941
479493E41992L0940L3256L6906L5570L1690K8854K4876K0540J7606J3856J0824
482278H26910J1672J3498J3399J1933O162O358P140L847K543J826K901N478j1770
485569I01897o879N151Q48q15p564k576M662M826O944Q803P629O553N314L815
489113I38608L195K934K152J761J728P50M23J305N575r13r520K380K901j662j761
492911I49856j043j793k413l195l749l815l912l163l59K250L326L032M075M238
496455I43335K870K380J760J369J109j532k739Q48o6r12j500j826j598r45q48
500253I41705q80o52l91k94l26r8R8o5%K93R79n22j369K543J825n347k771R46
$$ y = [647724, 616914, 584050, 553566, 526636, 507726, 492664, 478481, 481155, 494327, 514051, 541992, 572932, 606188, 643094, 678664, 710354, 739208, 764084, 784624, 802230, 816086, 826910, 838582, 852080, 865479, 877412, 883574, 889932, 897072, 900919, 903462, 905288, 908189, 913667, 901897, 895018, 900169, 901017, 900202, 892638, 890062, 894724, 899550, 906494, 915297, 922926, 929479, 934793, 938608, 941803, 944737, 946889, 948650, 950378, 951128, 951551, 952856, 958431, 957518, 947998, 950378, 953279, 951617, 949856, 948813, 947020, 944607, 941412, 937663, 933848, 929936, 926773, 926414, 928664, 931990, 935022, 939097, 943335, 946205, 948585, 950345, 951714, 952823, 951291, 948552, 949400, 949334, 948422, 946922, 945096, 943498, 942553, 941705, 940825, 940173, 939782, 939488, 939162, 939064, 939162, 939097, 939097, 939390, 940369, 939847, 938478, 941021, 942846, 937499, 934728, 935674]
504810I35674j598j271P17O19J96J402J826K217K217K315K380K347J663J630K119
508607I54453K021J598J565J630J109J336J598j011j95R12O20N87K61m57l58N86
512658I66255m56r46r7j305j923j304j956k902k673j663R8K217K803L228K641
516455I62017J30m89Q15l2n87o52o5J173J370J271J044J010J467J141K61J63o5
520759I69972L59K93k93n87L59O84J31j305j173J63L2l91l58k29R8L3p18j238
525316I65832q16q80o19o6K94N87j96L3O19L3j63j337j402r13k086k674l064m500
529873I48682n803o716p401p825q085n152m24L880P303Q249P629P336N738M075
533417I51486L489K641J793J467J337P82Q48R45J109P17J63L26R46P17L58J96
$$ y = [935674, 934076, 932805, 933522, 934141, 934337, 935739, 937565, 939782, 941999, 944314, 946694, 949041, 950704, 952334, 954453, 956474, 958072, 959637, 961267, 962376, 963712, 965310, 964299, 964104, 965016, 965636, 966223, 966484, 966027, 965669, 966255, 965799, 964853, 964756, 963451, 961528, 960224, 958268, 955366, 952693, 951030, 951128, 953345, 956148, 959376, 962017, 962147, 961658, 962473, 962441, 961854, 961202, 961137, 962310, 963680, 964951, 965995, 967005, 968472, 969613, 969874, 970037, 969972, 970331, 970624, 970331, 969744, 970103, 970787, 970918, 969613, 968440, 968603, 968635, 968244, 967886, 967657, 967755, 967788, 967070, 965832, 965016, 964136, 963517, 963451, 963745, 964332, 964136, 964169, 964788, 964821, 964658, 963321, 961919, 961006, 958920, 956246, 953182, 948682, 942879, 936163, 928762, 920937, 912852, 907700, 907276, 911156, 918459, 926708, 934337, 941673, 947411, 951486, 954975, 957616, 959409, 960876, 962213, 962995, 963843, 964788, 965897, 966614, 966777, 967103, 968049, 968766, 969124, 969320]
537468I69320k61l58J95P50j63r8O85N54m24o19k28L58l2m89k94j30j31%J63l2
542531I68766m89o52%J95m24o5k93m24j63p17k94J31l26k61j31o19l3L26j206
547341I63321j239k28J30L59q15j109r78n87O6l59n87K28R8k61l2L58R13O52l2
552151I59898q15n22j30L2o19p17k29J96n22k28j63q80j31n87j206p82j402k152
556708I49041l065m075m825n543l977m89K249L782L847L130L032K380J533J238
560253I48258J272Q48R78K61k29l91%l26L3l26q15k29L92O52J30J31P82N22%o6
565316I51877o5r8j30l91j044k93R8M89J63k94q80K94J63j96k93L26N54r8n87
570126I49595R8K28r8l58n87J96N86j30q15l59m89m56p17o20j011j075j142o52
$$ y = [969320, 969059, 968701, 968896, 969646, 969483, 969385, 970070, 970624, 970200, 969581, 969353, 969711, 969679, 969190, 968896, 968766, 968635, 968635, 968798, 968766, 968277, 967625, 967625, 967820, 967396, 967331, 967038, 966614, 966451, 965734, 965440, 965571, 965245, 964984, 964853, 964234, 964201, 964527, 963321, 962082, 961854, 961984, 962343, 961528, 960419, 959441, 958854, 958920, 958561, 957974, 958202, 958300, 958039, 958007, 958365, 959278, 959930, 959898, 959083, 958561, 958431, 958463, 957844, 957127, 956898, 957094, 956572, 956344, 956181, 955301, 955170, 954583, 953377, 952595, 951193, 949041, 945976, 941901, 937076, 931533, 927556, 927067, 929316, 933098, 936945, 940075, 943107, 945487, 947020, 948258, 949530, 950378, 951356, 951617, 951388, 950997, 950997, 950671, 950704, 950378, 949563, 949334, 949726, 950378, 950508, 950639, 951421, 951943, 951943, 951877, 951812, 951714, 951584, 951193, 950149, 949856, 949954, 950443, 950606, 950312, 949432, 949726, 949889, 949693, 949400, 949726, 950280, 950182, 949595, 949693, 949921, 949823, 949465, 948878, 949074, 949660, 949530, 948715, 948356, 947867, 947411, 946694, 946074, 945063, 943988, 942846, 942194]
574683I42194j141j271j728j533j434r13j858k250j435j010k250l325l293k185
578227I16568j369q48n54%l26o5o5j337m24k380j989n705m434p662q998j1248
582278H69164j4215j2716j3497k641M075J2683J4117J5812J0140R161L945M956
585316I00984j63L815J95L652k185K869o064r7o912n87n641k151m239k901o130
589113H74445n281q347q966j0074p629n901j728K347o5j663K967K445R13L913
592658H37376N738N281M141K869M401O554J2878J7769M923n902n933j598l977
595949H84520o456j695j304l815k967J63o5j337n86j64P50K772K314J859K869
599746H76858K217K184J761J695J859K184K543L782L130L684L456L162L293L228
$$ y = [942194, 941053, 939782, 938054, 936521, 935087, 934174, 932316, 930066, 928631, 927621, 925371, 922046, 918753, 916568, 915199, 914351, 913797, 913797, 913471, 913406, 913341, 912004, 911580, 909200, 907211, 901506, 897072, 889410, 880412, 869164, 854949, 842233, 828736, 826095, 830170, 842853, 856970, 872782, 882922, 892083, 896028, 900984, 900821, 904636, 904831, 908483, 906298, 909167, 903103, 903006, 896094, 895507, 889866, 887715, 883476, 880575, 874445, 869164, 860817, 851851, 841777, 834148, 828247, 826519, 828866, 828801, 827138, 830105, 832550, 833463, 837376, 843114, 848395, 852536, 855405, 859806, 866360, 879238, 897007, 901930, 896028, 890095, 888497, 884520, 878064, 876369, 875065, 871250, 868283, 868446, 868381, 867044, 866458, 866294, 867044, 869816, 872130, 873989, 876858, 879075, 881259, 883020, 884715, 886574, 888758, 891301, 895083, 898213, 901897, 905353, 908515, 911808, 915036]
603291I15036K673J500M89J207Q47k28l26j96r78j076r13j206j011j727j924j663
607341I10504j956k739j630j206j272j076j336j728j598j989k054j597j532j924
610886H86867l26P17P50J076J239J076J500J597J728J337M56O85R8m24j402j043
614936H95931k61N54K054L489L129K967K185J728J793K086J272N54J31M23k28
618734I17807n21J63r8p50j96K94r8n22q80n87l58l26m90p17r13j63q80j141o20
623544I09004l58k94j63%K94J63j31l91o5K93N55J30L3J010M89%M24J96K93R78
628607I12460N87M57O5L91K61J63N87K28l59J142J499K94N87J108M56K94R78P50
633164I21948P17J206O20L2M90M23K29J63M23K94L26%J96o20p17k94J63k93j109
$$ y = [915036, 917709, 919209, 919698, 920905, 921752, 921524, 921198, 921002, 920024, 918948, 918035, 916829, 915818, 914091, 912167, 910504, 908548, 905809, 904179, 902973, 901701, 900625, 899289, 897561, 895963, 893974, 891920, 890323, 888791, 886867, 886541, 887258, 888008, 889084, 890323, 891399, 892899, 894496, 896224, 897561, 898017, 898702, 898800, 898376, 896974, 895931, 895670, 896224, 898278, 901767, 904896, 907863, 910048, 911776, 913569, 915655, 916927, 917481, 917612, 918035, 917807, 917286, 917449, 917351, 916601, 916405, 916699, 916601, 916079, 915199, 914612, 914254, 913928, 913438, 912721, 911808, 911645, 910765, 909624, 909004, 908646, 908352, 908189, 908189, 908483, 908646, 908515, 908124, 908059, 908352, 908907, 909037, 909070, 910080, 910569, 910569, 910993, 911189, 911482, 912460, 913047, 913504, 913569, 913960, 914221, 914384, 914971, 915199, 914840, 915982, 917481, 917775, 918362, 919470, 919926, 920220, 921198, 921948, 922665, 923871, 924491, 924523, 925013, 925436, 925665, 925828, 926251, 926545, 926871, 926871, 927067, 926447, 925730, 925436, 925599, 925306, 924197]
637974I24197j010p18j564k054k609l945n021n412n738m369r45K119M532N673
641518I03136N216M500L423K673J826R46J695J174M89Q80r8j63L59r8p82o85j31
645822I24360%j30k93k61j96m56o5k94n22j95l91m89l3o52n87m56p18j760k934
650632I13928k935l195m727n510o064p597q868r716j0041r781p369l423K28L195
654177H38125N282O130N607N575M663K477J598R8j467j957k249j695P49L163N151
657974H71250O716O977O391N281L847L293K380J631J695J728R13O52R13O84o5
661772I14286o19M56Q15J63J31m89k94J043K29p83r13o19%j96l58r13j924j663
666329I08352j695l228m108k967j793p17K184N380N705M337L162J761R45J63M89
$$ y = [924197, 923187, 922469, 920905, 918851, 916242, 912297, 907276, 901864, 896126, 891757, 890812, 892931, 897463, 903136, 908352, 912852, 916275, 918948, 920774, 921720, 923415, 924589, 925078, 925958, 925860, 925697, 926056, 925958, 925176, 924491, 924360, 924360, 924230, 923937, 923676, 923480, 923024, 922959, 922665, 922143, 921948, 921557, 921068, 921035, 920383, 919796, 919340, 918622, 916862, 913928, 910993, 907798, 903071, 897561, 891497, 883900, 875032, 865316, 855275, 845494, 838125, 834702, 834930, 838125, 843407, 849537, 855144, 860719, 865382, 867859, 869457, 869555, 868088, 866131, 863882, 862187, 862936, 866099, 871250, 877966, 884943, 891334, 896615, 900462, 903755, 906135, 907766, 909461, 911189, 912102, 912754, 913667, 914351, 914286, 913667, 914123, 914938, 915101, 915232, 914743, 914449, 915492, 915721, 914938, 914025, 913406, 913406, 913210, 912852, 911939, 910015, 908352, 906657, 903429, 899321, 896354, 894561, 893844, 896028, 901408, 907113, 911450, 914612, 916373, 917318, 917481, 917970]
670126I17970K29n22q48p50o84m24q15j076j272j141n54J63O85Q47Q48N87N22
674430I13765J95R8N87R78K61l92o5J31l26m57n54o85l26r8p49j272q48j010j598
679240I07635p82j141j468q15j434j598j369j891j663j043j435j565j565j206
682784H88660j597k054j533j010k380k869k446l097m467m825m793m173l945m173
686329H45298k902k249j761r13j597k804m043n184n901p759j0205j3139j5747
689620G71094j9530k3963k8071l0842l2440l1788k7028j7541m662R129K2692L1918
692658F18968L5602L5799L2081K7093K2529J8420J4965J1640Q933P498N999M956
695696H44483M075L033K673J956J663J434R79Q47J044N54L2j30J30j30p50n54
$$ y = [917970, 918199, 917677, 916829, 916079, 915395, 914971, 914156, 913080, 911808, 910667, 910113, 910276, 910961, 911808, 912656, 913243, 913765, 913960, 914058, 914645, 915623, 915884, 915492, 915427, 915558, 915232, 914775, 914221, 913536, 913210, 913112, 912363, 911091, 910243, 909233, 907635, 906853, 905712, 904244, 903429, 901995, 900397, 899028, 897137, 895474, 894431, 892996, 891431, 889866, 888660, 887063, 885009, 883476, 882466, 880086, 877217, 874771, 871674, 867207, 862382, 857589, 853416, 849471, 845298, 842396, 840147, 838386, 837473, 835876, 833072, 829029, 823845, 817944, 810185, 799980, 786841, 771094, 751564, 727601, 699530, 668688, 636248, 604460, 577432, 559891, 555229, 564358, 587050, 618968, 654570, 690369, 722450, 749543, 772072, 790492, 805457, 817097, 826030, 833528, 839527, 844483, 848558, 851591, 854264, 856220, 857883, 859317, 860296, 861143, 862187, 862741, 862773, 862643, 862773, 862643, 861893, 861339]
699746H61339k61m89o52j141j044q47j141j533k054j239q80j467j695j435j108
703544H44353j826k576k119j956k282k413k347l065k641l097k804k869l097l130
707088H08131l554m173l424k282k738l456l782l489l195m108n119m857l945m206
710632G55803n836o129n739o227o683o814p010q053q542q020q868r749r683r259
714177F49191q770q314p694o847o749o651o749q444j0954j2390j2910j3563j3302
717468E25854j1183r357j0075j0563j1900j3367j5128j6204j7866j8454j8616
720253C73141k0181k1257k1029k0638k0670k0410j9692j9660j8975j7377j6595
723037A56657j6171j5193j2715j0857j0237r749p955n249l782l358k184r79l26
$$ y = [861339, 861078, 860589, 859937, 858796, 857752, 856905, 855764, 854231, 852177, 850938, 850058, 848591, 846896, 845461, 844353, 842527, 839951, 837832, 835876, 833594, 831181, 828834, 825769, 823128, 820031, 817227, 814358, 811261, 808131, 804577, 800404, 796980, 794698, 791960, 788504, 784722, 781233, 778038, 773930, 768811, 763954, 760009, 755803, 749967, 743838, 738099, 731872, 725189, 718375, 711365, 703312, 694770, 686750, 677882, 668133, 658450, 649191, 640421, 632107, 624413, 617566, 610817, 604166, 597417, 588973, 578019, 565629, 552719, 539156, 525854, 514671, 505314, 495239, 484676, 472776, 459409, 444281, 428077, 410211, 391757, 373141, 352960, 331703, 310674, 290036, 269366, 248956, 229264, 209604, 190629, 173252, 156657, 140486, 125293, 112578, 101721, 91484, 81735, 73780, 68531, 64749, 61391, 59207, 58228, 57902]
726329E7902R13K217L032L456M402N249N021M858N477N282M564M043M108L456
729873A13980K510J858J663J076J011J174K93k61l2P49O20R13J304J108M57q15
733924A27608k054l358l554m923o032n966p238q444q738q248p923q737q282p368
737468C6743p042o195m499m238l521j859j434j044k28J63r8N22J435J793K217
741265A2715L325M369M141L455L750L847L195K282J696J630K28o5L26j63l3M57
745316D5155l3L26O85N87K93P83J728K380K901K706K837L586L293K739K803K022
749367G4791P82Q48J63q15q15o20j206j565j532j924k086j663j239j141n22k61
753417F1195r7M89J141O52N54J337J173R8k28O52%j271j924k706k902l553m108
$$ y = [57902, 58815, 61032, 64064, 67520, 71922, 77171, 82192, 87050, 92527, 97809, 102373, 106416, 110524, 113980, 116490, 118348, 120011, 121087, 122098, 123272, 123565, 123304, 123272, 124021, 124641, 125554, 126858, 127966, 128423, 127608, 125554, 122196, 118642, 113719, 107687, 101721, 94483, 86039, 77301, 69053, 61130, 52393, 44111, 36743, 29701, 23506, 19007, 14769, 11248, 9389, 7955, 6911, 6683, 6846, 6748, 7270, 8705, 10498, 12715, 16040, 20409, 24550, 28005, 31755, 35602, 38797, 41079, 42775, 44405, 44633, 44568, 44894, 44731, 44698, 45155, 45122, 45448, 46133, 46720, 47013, 47796, 49524, 51904, 54805, 57511, 60348, 63934, 67227, 69966, 72769, 74791, 75573, 76421, 76584, 75769, 74954, 74334, 73128, 71563, 70031, 68107, 66021, 64358, 63119, 61978, 61456, 61195, 61098, 61587, 62728, 63380, 63934, 65271, 66444, 66542, 66314, 66966, 66966, 65695, 63771, 61065, 58163, 54610, 50502]
757721E0502l750m010l782l847l847j859n54J63K348L651M141M466M923M369K478
761518E5392R13p17j826k543m499n673n478m760l912l815k575o52O84K902N021
765316B8462N803P401Q770P662P108O455M988L163K347J663l59j663j956k314
768860G7530k772l554m107m304l782k641j663j923j924O5J891L619O521J0205
772405G3161J3171J5552J9692K2855K4941K5757K5723K5985K5137K3409K2040
775189C17423K1713K0377J8584J7149J5258J4802J3954J2324J1118R976R520Q184
778227D90382O781N706M955M206K445J044M89q48k282l032l815n673p694r716
781772D82948j1476j2813j3726j3074j0465n967l26O032J3530J9757K2757K4224
$$ y = [50502, 46752, 42742, 38960, 35113, 31266, 29407, 28853, 29016, 31364, 35015, 39156, 43622, 48545, 52914, 55392, 56305, 55588, 53762, 51219, 46720, 41047, 35569, 30809, 26897, 23082, 20507, 19855, 20539, 23441, 28462, 34265, 41666, 50436, 58098, 65206, 71661, 76649, 79812, 82159, 83822, 83463, 81800, 79844, 77530, 74758, 71204, 67097, 62793, 59011, 56370, 54707, 52784, 50860, 50925, 52816, 56435, 62956, 73161, 86332, 101884, 121576, 144431, 169372, 195129, 220852, 246837, 271974, 295383, 317423, 339136, 359513, 378097, 395246, 410504, 425306, 439260, 451584, 462702, 472678, 482198, 490382, 497163, 502869, 507824, 512030, 514475, 515519, 516008, 515160, 512878, 509846, 506031, 500358, 492664, 482948, 471472, 458659, 444933, 431859, 421394, 415427, 415101, 421133, 434663, 454420, 477177, 501401]
784810E01401K4355K4094K2887K1616K0637J9464J7671J6302J5356J3693J1411
787594G08887R879R031Q118P010N249L847K413P17J206J728j63j011K61L3k185
791392G55020m792o586q151j0628j3498j5487j6692j4150o944J434J0727J9300
794430F89553K3214K0768J6856J4312J2553J0041P923N868M011L716L326K445
797468H14586K087K184J891K184K478K152K184K511K347J761J174J239R45R78
801012H40701J565J076Q80R13J31O19P50R8J95R78M57J63Q80L26O20N86J31O19
805569H51688Q81r8j31M57K61m57K94M56j30k29K94L26K61L58O52o5m89r8O6K60
810632H54557J63J31J95j95J30L26l2l26l26K28J076p18o84J076O5J63j63m24
$$ y = [501401, 525756, 549850, 572737, 594353, 614990, 634454, 652125, 668427, 683783, 697476, 708887, 718766, 727797, 735915, 742925, 748174, 752021, 754434, 755151, 756357, 758085, 757922, 756911, 757172, 757205, 755020, 750228, 743642, 735491, 724863, 711365, 695878, 679186, 665036, 658092, 659526, 670253, 689553, 712767, 733535, 750391, 764703, 777256, 787297, 795220, 801088, 805099, 808815, 812141, 814586, 816673, 818857, 820748, 822932, 825410, 827562, 829746, 832257, 834604, 836365, 837539, 838778, 839723, 840701, 842266, 843342, 844222, 845135, 845266, 845885, 846635, 846733, 846928, 847906, 848363, 848526, 849406, 849732, 850352, 850938, 851069, 851688, 852569, 852471, 852340, 852797, 853058, 852601, 852895, 853351, 853221, 852992, 853286, 853612, 853873, 854231, 854883, 854818, 854329, 854231, 854297, 854557, 854720, 854851, 855046, 854851, 854981, 855307, 855275, 854949, 854623, 854851, 855927, 855209, 854525, 855601, 855666, 855829, 855666, 855242]
815189H55242n54o5L2m24R8O85k61r13q15m56J30l26j076K94Q47m56j141o85%
819999H50156%r8n54J96m89j826k61R8j63o5n22J30L59j63r13q48o52q15m89O5
825063H43146j63m89J63J63o5K28O6j31l59l26K29Q15L2r78l26K61J63J63K61
829873H42853j31r7o6M24J31J63M89O5o5r8J96O52M24k61k94j30O5K61j63j369
834936H43049j96L26j96J96j63m89N22M23o5j95o6m89p82k61j076k61J239J31
839493H41647p50k28m57%j96l26N22j30%n22r45K93Q80j63j173r46j96K94L2o84
844556H36952r78L26K61l26j64k28k28n22o5n54k61j95O5L2R8L91O6k61O52l59
849620H34702q80j63J95K29O5p50K28P50n54o20R8K61L3J95j30n22r8o19l91J95
$$ y = [855242, 854688, 854623, 854655, 854231, 854329, 855014, 854753, 853840, 853025, 852569, 852699, 852373, 851297, 851591, 852438, 851982, 850841, 850156, 850156, 850156, 850058, 849504, 849700, 849211, 847385, 847124, 847222, 847059, 846994, 846472, 846602, 846961, 846798, 845885, 845037, 844385, 843570, 843081, 843146, 842983, 842494, 842657, 842820, 842755, 842983, 843049, 842918, 842559, 842233, 842462, 843277, 843309, 842331, 842005, 842266, 842429, 842592, 842853, 842722, 842625, 842559, 842983, 843114, 843277, 843766, 843831, 843766, 843668, 843864, 844516, 844940, 844679, 844385, 844255, 844320, 844581, 844418, 843049, 842853, 843179, 842983, 843179, 843016, 842527, 843049, 843472, 843407, 843212, 843146, 842657, 841875, 841614, 840538, 840277, 841516, 841647, 840897, 840669, 840212, 840212, 840016, 839690, 840212, 840082, 840082, 839560, 838615, 838908, 839788, 839625, 838452, 837506, 837310, 837604, 837636, 836952, 835974, 836300, 836561, 836235, 836071, 835843, 835615, 835093, 835028, 834474, 834213, 834018, 834083, 834115, 834213, 834604, 834670, 834409, 835061, 834702, 833822, 833659, 833854, 834083, 834148, 833398, 833626, 834376, 833822, 833202, 833300, 833561, 833594, 833789, 833659, 833137, 833039, 832420, 832029, 832224]
854683H32224R8j30k28o6r8L59R46J95k93L2P18J108R78N87J174Q80q48j30J174
859493H38680M89j207m89J696J141m57o52l2j011O5O85L3J043L26r78q80O84Q48
864050H39984m24l3L92l26p50R8N21r13j434n54N21j95m57p17r46r7J141r8q48
868860H34865l2J075J174L3m24P17J565P17J174O20K28J271J989J435l000k152
872911H41255K120J630K28K61L91J30%l2N54J30N22J532Q48p82j500P50J728P82
877468H50547k61%J011O52n54m89L58k60j337J96P17N54J435O52k61j826j923
881772H49211J141J043J011M56j663j793P17Q15j30R8Q48k94j369p83J272J467
885822H52047P50J760J044l130k902Q48J402K706L554k348l749J695J761O84K29
$$ y = [832224, 832322, 832192, 831964, 831898, 831800, 832159, 833105, 833300, 833007, 833039, 833757, 834865, 835843, 836430, 837604, 838484, 837636, 837506, 838680, 839169, 837962, 837473, 839169, 840310, 839853, 839201, 839169, 838158, 838223, 838908, 838941, 839984, 840310, 839332, 838452, 839136, 839984, 839560, 839527, 839919, 839593, 838843, 838941, 839462, 838549, 837115, 836561, 837082, 836887, 836430, 835713, 834767, 834670, 835811, 835713, 834865, 834833, 835908, 837082, 837115, 836691, 837408, 838973, 839690, 840864, 841484, 841712, 842983, 844972, 846407, 843407, 841255, 843375, 845005, 845233, 845494, 845885, 846015, 846015, 845983, 846537, 846667, 847189, 848721, 849569, 848787, 847287, 848037, 849765, 850547, 850286, 850286, 851297, 851949, 851395, 850906, 851264, 851004, 849667, 849863, 850580, 851134, 852569, 853221, 852960, 851134, 849211, 850352, 851395, 852406, 852862, 851199, 849406, 850123, 850938, 850808, 850906, 851754, 851460, 850091, 849308, 850580, 852047, 852797, 854557, 855601, 852471, 849569, 850417, 851819, 854525, 858079, 855731, 851982, 853677, 855438, 856122, 856351]
889620H56351J369J206K94p50r78O19L456K087k902j728J369R13n87j173j533
893417H58013J96P50P17Q80J435K054k054l749J891J825O85J141J695K283K869
897215H70631k120k380l651j826M206M923K869m304m597J076K837J793m24J761
900759H70794K836l619j304L358K94K673R455k869r716j3889m368J1997L456K152
904303H71250J696j370j630K61j435L92J434l130j304J500k087J174J2976J043
907848H80770j1900o064j3791O520J1998N673k771R78k315q150N933L684%R46
911392H71511n575j239K315J760P336M923l749L358j5747j2161K5300K706j9236
914683H61502m57o84J0726Q933l195o814k2007J696R617L913L064M598N835K1062
$$ y = [856351, 857720, 858926, 859220, 858470, 857492, 858111, 861567, 863654, 860752, 859024, 860393, 861306, 860719, 859546, 858013, 858209, 858959, 859676, 860556, 861991, 864045, 861991, 858242, 860133, 861958, 862643, 863784, 865479, 867762, 870631, 868511, 866131, 862480, 860654, 864860, 869783, 872652, 868348, 863751, 864827, 867664, 869457, 869033, 870794, 873630, 870011, 868707, 872065, 872359, 875032, 884487, 881618, 871902, 858013, 853645, 865642, 869098, 871250, 872946, 871576, 869946, 870207, 868772, 869164, 870598, 867468, 866164, 867664, 865577, 866751, 879727, 880770, 868870, 862806, 849015, 855535, 867533, 873206, 870435, 871413, 869098, 860948, 866881, 870565, 870565, 871511, 865936, 864697, 867012, 868772, 876108, 881031, 877282, 880640, 864893, 852732, 878032, 880738, 861502, 861045, 860361, 871087, 880020, 876825, 870011, 848004, 849700, 859317, 863230, 866294, 870892, 876727, 897789]
918227H97789P140n5751l1332K5235K6180L489j5030k119Q607K510m368j859L097
921518H63588J728l064m369L554J3889J3823j2715n542j109k2235j8323n87J8812
924810H47450J6008J4019k6767l1527J3335P792m956m140l424k543l91k28M173
928101H28801J5910R357j728p727l7526J5585M4633L2799k9017o6151J1900L5048
931139H51884M597j0726M108O357J696r8j467J3725K5855k3475l9775K3311o227
934430H49765j6889J4248Q346K446J304j011R45M500J2747J370k6930j598J4280
937721H63523L619J96Q248J4248j0759p531K0018l1071k4615K4452Q510K28P466
941012H76532K412j0074K185J2715j2520j1509J3107O422q770j5584K739J0139
$$ y = [897789, 904929, 849178, 817846, 843081, 869261, 872750, 857720, 855601, 864208, 866718, 862350, 860491, 863588, 865316, 862252, 857883, 861437, 875326, 889149, 876434, 870892, 869783, 847548, 829225, 828638, 847450, 863458, 877477, 850710, 819183, 832518, 840310, 835354, 831214, 827790, 825247, 824856, 824628, 828801, 844711, 854068, 852340, 844613, 807087, 822672, 867305, 900104, 871087, 804936, 816836, 851884, 856481, 845755, 849863, 856220, 857916, 857818, 856351, 870076, 895931, 872456, 832681, 855992, 849765, 832876, 847124, 855470, 857916, 859220, 858209, 859154, 863654, 876401, 877771, 850841, 849243, 863523, 867142, 867338, 875586, 889834, 879075, 871544, 891562, 860491, 835876, 860328, 868838, 869066, 876532, 878944, 868870, 871055, 883770, 871250, 859741, 872848, 879270, 870500, 854916, 857655, 867794]
944050H67794J6497J3400l0418p238L0223j5943k5202r194M629J2813R292n575
947088H61078J4280M9198k9799j13165L1886N0828L1429k9473l5766M0852l0060
949873H41288l6548L1690K5202O20r129J7116M011k6702K836J4183M303J0759
952911H79629p50k2235L032K5333L684l3092p890J4215M434l59L91P83N934J0400
956455H83509r096k0736P010J0074N510m56p662j467K738J794O84k054o5P17o52
960253H69848O423J1313j1867k2366N738K3572K6343k9505n4154J0205K1485K5333
963291H82368J0009m8872j5617K3442O194P50k61L847J9954J3367n4578k5202
966329H15401L4951K8690R977m4536l7754J8975J9627R194j630j5454k119J1313
$$ y = [867794, 884291, 897691, 867273, 860035, 890258, 874315, 849113, 839919, 844548, 857361, 866653, 861078, 875358, 924556, 894757, 781592, 813478, 864306, 895735, 866262, 830496, 871348, 841288, 804740, 836430, 861632, 862252, 853123, 870239, 874250, 847548, 850384, 864567, 868870, 879629, 878879, 856644, 859676, 885009, 888693, 855601, 847711, 861926, 866360, 866001, 866392, 867175, 873109, 883509, 874413, 853677, 860687, 870761, 876271, 875815, 868153, 866686, 869424, 871218, 871902, 869848, 869783, 870500, 869848, 876271, 887584, 875717, 853351, 859089, 882661, 909004, 879499, 825345, 835550, 857035, 882368, 892377, 843505, 827888, 851330, 857524, 858274, 858013, 861860, 881814, 895181, 840603, 815401, 850352, 879042, 889019, 844483, 806729, 825704, 845331, 854525, 852895, 837441, 835322, 846635]
969367H46635J5258o292k5594J6106J6171j9562J5650J8323n2361%J9106j3726
972405H29714R813Q803k0018n87J0205K934L815K282J3269J8421k119m402p2639
975696G99491k7550N0209J1215o096R259J3139p50j7247J0726J3074l4494j4149
978734H06827K7125K8854j109n3697j2976L1723J8356k1421j9301J3270J0531
981518H28182J0237J3237k0768k7159J2911J5030J7377j597m4927J30K1062J5193
984556H38908J5291k1257k6800J3302P564P50L325J0466J0042j7769q738J3009
987594H38093r748M205n184j7051M662O749O651L260q47j63K28j109J989P760
991139H39495K347j6497n510J1672o064n934Q249N249k771j0694l163P988L945
$$ y = [846635, 861893, 855601, 830007, 846113, 862284, 842722, 858372, 876695, 824334, 824334, 843440, 829714, 839527, 848330, 828312, 827725, 837930, 840864, 844679, 846961, 860230, 878651, 876532, 872130, 799491, 771941, 822150, 833365, 827269, 836528, 849667, 848917, 831670, 842396, 855470, 820976, 806827, 833952, 862806, 861697, 808000, 795024, 826747, 845103, 823682, 804381, 817651, 828182, 838419, 851656, 830888, 803729, 816640, 831670, 849047, 847450, 802523, 802653, 823715, 838908, 854199, 832942, 806142, 819444, 827008, 827758, 831083, 841549, 851591, 833822, 825084, 838093, 828345, 832550, 827366, 810315, 814977, 821726, 828377, 831637, 830790, 830627, 830855, 829746, 831735, 839495, 841842, 825345, 819835, 831507, 825443, 819509, 827758, 833007, 830236, 819542, 816379, 824367, 828312]
994430H28312j304J597M793n966p466M108L814J826P82m23J63K575N738r78j1280
998227H26291j044O032N412p50m075J336k510j141M206J63o52J369R13j369o85
1002025H33496R78J500K61k478o6J924J63O5J891N54j956j95J630r8l26K28%K94
1006582H37865L26M89L58Q15M24l91K28J402N87j141%J108M89P50l2j272R13J043
1011139H43961j695m24J598L58K29P82K28l26l58k29r78J63K29j565j859p82o52
1015443H38680j63m57j760j141m57j695j793j207r78k478l358j793j663l325k380
1019240H14032j859l781l782k185k673k967k445k478l261m434l488l130n412p075
1022784G65062p922q379q445j0726j2096r226n054k706m56L782P140P824Q412R553
$$ y = [828312, 827008, 828605, 833398, 827432, 819966, 824074, 827888, 829714, 830496, 830073, 830236, 832811, 838549, 837571, 826291, 825247, 831279, 836691, 835941, 831866, 833202, 830692, 829551, 833757, 833920, 833268, 834637, 835550, 834181, 833496, 834474, 835974, 836235, 833757, 833691, 835615, 835778, 835843, 837734, 838288, 836332, 836137, 837767, 837669, 837343, 837571, 837571, 837865, 838191, 838680, 839038, 839853, 840277, 839886, 840114, 841516, 842103, 840962, 840962, 842070, 842559, 843309, 843277, 842005, 842918, 843961, 842266, 841842, 843440, 843798, 844027, 844809, 845037, 844711, 844353, 844124, 843146, 843309, 843538, 841973, 840114, 839332, 838680, 838517, 838060, 836300, 835159, 834702, 833007, 831214, 830007, 829029, 826551, 823193, 821400, 819737, 816412, 814032, 812173, 808392, 804610, 802425, 799752, 796785, 794340, 791862, 788601, 784167, 780679, 777549, 772137, 765062, 757140, 748761, 740316, 729590, 717494, 708268, 703214, 700508, 700052, 703834, 710974, 718798, 727210, 736763]
1026329G36763Q705P694P760N542K902J695R78o5k641m564l261l619p433p760o227
1030126G36469o194n543l260j337J532M500P238Q965R520R847R324Q901Q183P238
1033670G95383N608N607N054M271L782K184K022K640K380J924J043J011J500R78
1037215H35387Q15Q15N22Q15K61j63Q80M24j239%O84J63P83N22r46q48l2O19r8
1042025H39364j95o5q81p82O5k61o52L26N87k28j96M89J109M56n54j304L2N22J30
1046835H37962j95O85J108l26n22Q15J96o52n54m89o6R8N22j96j076j173o6k28
1051392H35843o52m56J30O5r45j011k93j011j532M24O5j141n22p17l3J043p82j467
1055949H27008J141J206R8j174j141P50P83M56P50O19p17r8J728l2r46k28K28j076
$$ y = [736763, 745468, 753162, 760922, 766464, 769366, 771061, 772039, 771974, 769333, 764769, 761508, 757889, 750456, 742696, 736469, 730275, 724732, 721472, 720135, 721667, 726167, 733405, 742370, 751890, 761737, 771061, 779962, 788145, 795383, 800991, 806598, 811652, 815923, 819705, 821889, 823911, 826551, 828931, 830855, 831898, 832909, 834409, 835387, 836202, 837017, 837539, 838354, 838615, 838452, 839332, 839756, 838517, 838517, 839201, 839364, 840147, 840669, 839723, 838875, 838843, 839462, 839364, 839169, 839104, 838223, 837441, 837506, 837245, 836593, 836919, 837506, 837278, 837082, 837571, 838680, 839136, 838582, 837278, 837310, 837832, 837962, 837767, 838452, 839560, 839234, 838712, 839527, 839723, 839071, 838517, 838028, 837962, 838060, 838582, 838386, 837310, 836137, 836071, 835843, 835191, 834735, 834865, 834930, 833985, 832974, 832681, 831670, 830138, 830562, 830627, 829486, 828964, 828247, 828214, 829257, 828475, 827008, 828149, 829355, 829453, 828279, 827138, 827888, 828671, 829127, 829877, 830496, 829779, 829681, 831409, 831377, 830431, 830203, 830431, 829355]
1060506H29355m24N22N54L59l91j109p17l59L59M56j076j662p18o52r12l92m89
1064810H22704n87n54j011j858j369R8o6j434j402p83r78j010r78k772j825k511
1068860H03664l423p83n54k478k608j011j336k446k021l065k249k94j760k576j598
1072658G75462k347k087k282k901j761n22j173k511p50J076Q15L59J728K380K380
1076455G67866J891R13P50K543J597q47N86J565k28r13l2O84o84k543k120j499
1080506G69529n87R8L2R46J467J663J760J533k94J31J564N55O52k94k347j565l91
1084810G74452j011j565k706k967k217k445k087k217j825k413k478k804j369n22
1088354G45826k738j174o20k086j239l26o5J30K28k93m89M56J337Q15R8N87O52
$$ y = [829355, 828931, 829453, 830007, 830366, 829975, 828866, 828149, 827790, 828149, 828605, 827529, 825867, 825149, 824497, 823585, 823193, 822704, 822117, 821563, 820552, 818694, 817325, 817423, 817357, 815923, 814521, 813738, 812760, 811750, 810772, 808000, 806175, 803664, 800241, 799458, 798904, 796426, 793818, 792807, 791471, 789025, 787004, 783939, 781690, 781396, 779636, 777060, 775462, 773115, 771028, 768746, 765845, 764084, 763562, 762389, 759878, 759128, 760204, 761019, 761378, 763106, 765486, 767866, 769757, 770670, 771420, 773963, 775560, 774713, 775299, 776864, 776636, 775723, 775691, 776375, 775691, 773148, 771028, 769529, 768942, 769040, 769072, 770018, 771485, 773148, 774908, 776441, 776147, 776278, 777842, 778397, 779049, 778755, 776408, 774843, 774452, 773441, 771876, 769170, 766203, 763986, 761541, 759454, 757237, 755412, 752999, 750521, 747717, 746348, 745826, 743088, 741914, 741294, 739208, 737969, 737643, 737578, 737708, 737936, 737643, 737154, 737610, 738947, 739762, 739860, 740447, 741099]
1092658G41099L91J826J923j95M89J141L59K93R46J532j31J96J858J891Q81M56
1096708G54955J761J989L91n22N54R46P82O52J31p50K93J565J044J30p82l59J565
1101012G64345J108n21j011L91J239n54m24L3J043k61j467Q48K249J239m89j565
1105063G66203m89K28L26j95m57j010m57m89k771p50J239k61n22p82L59J63j859
1109367G58476p50q15j043k28p17J30R13r78l26P17n87m89O52Q80O53O19r8O5
$$ y = [741099, 741490, 743316, 745239, 745044, 745533, 746674, 747033, 747326, 748272, 749804, 749673, 749869, 751727, 753618, 754499, 754955, 756716, 758705, 759096, 758574, 759128, 760074, 760856, 761508, 761639, 760889, 761182, 762747, 763791, 763921, 763139, 762780, 764345, 765453, 764932, 763921, 764312, 765551, 764997, 764573, 764606, 765649, 765388, 763921, 764769, 767018, 768257, 767768, 766203, 765714, 765942, 766268, 766073, 765616, 764606, 764149, 763660, 760889, 760139, 761378, 761117, 760595, 759813, 760172, 760335, 758476, 757726, 756911, 755868, 755640, 754923, 755053, 755966, 754988, 754662, 755379, 754792, 754303, 754955, 755835, 756488, 757107, 757009, 757074]
##END=
