##TITLE= E100 dye (curcumin from turmeric)
##JCAMP-DX= 5.01
##DATA TYPE= UV/Vis SPECTRUM
##DATA CLASS= XYDATA
##ORIGIN= Lappeenranta Univ of Technology
##OWNER= Jouni Haanpalo
##LONGDATE= 2006/08/28 22:30:17.0276 -0400 $$ export date from JSpecView
##SPECTROMETERDATASYSTEM= Hewlett Packard 8452A Diode Array Spectrophotometer.
##RESOLUTION= 2
##XUNITS= NANOMETERS
##YUNITS= ARBITRARY
##XFACTOR= 3.6E-4
##YFACTOR= 1.95721507E-6
##FIRSTX= 190
##FIRSTY= 0.80065443
##LASTX= 550
##NPOINTS= 181
##XYDATA= (X++(Y..Y))
527778D09078J33975J41691P3930P2565N4501O4575M919K1548K5727n7020k1961I05768
600000H89506j8094l890n239Q084m249R730Q458J0307Q248l836o821j6801k6600H20722
683333G85890m1241m3970m4865m0087l6337l0779k9211k5446k4433k1174k0355D08213
755556C88903k0192k0535j9949j8337j7174j7042j5795j4103j1600r277o713m771B10343
833333B08379j123m44K73K10R75J286J739J964K604K635L321L844M701N238O011B48591
927778B56176Q357Q958R488J0041J0337J0151J0672J1164J0883J1320J1795J1562C93276
1005556D04775J2988J3277J3573J3900J5724J6427J7431J8664J8905J9888K0386F08250
1077778F31646K2835K7706K5657K6000K6763K2897K3591K1384K1260J5810J9646I03843
$$ plain form
527778 409078 543053 684744 758674 831239 885740 950315 955234 976782 1002509 945489 923528 905768
600000 889506 871412 867522 862283 870367 866118 875848 884306 894613 902861 899025 892204 875403 848803 820722
683333 785890 744649 700679 655814 615727 579390 548611 519400 493954 469521 448347 427992 408213
755556 388903 368711 348176 328227 309890 292716 275674 259879 245776 234176 224899 218186 213415 210343
833333 208379 207256 206812 207085 207295 208270 209556 211295 213259 215863 218498 221819 225663 230364 235602 241613 248591
927778 256176 264533 273491 282979 293020 303357 313508 324180 335344 346227 357547 369342 380904 393276
1005556 404775 417763 431040 444613 458513 474237 490664 508095 526759 545664 565552 585938 608250
1077778 631646 654481 682187 707844 733844 760607 783504 807095 828479 849739 865549 885195 903843
1150000I20206J5546J2778R495L812j09j2723j1234j8126k3801j7611k3427j9638H15647
1227778H02355j9007j7019k1462k4136l0545l4863l9393m1109m3712n0471m2660C95171
1300000C52932m1163l8076l1090l0474k6826k3817k1915k2226j0252j9092j0524F5564
1372222E6934q908p561o234m649m802l219l248k985j635k044j431j277p32j005F540
1461111F299j088%q27L16q17L58r05O08p30p05C750
$$ plain form
1150000 920206 935752 948530 958025 961837 961728 949005 937771 919645 895844 878233 854806 835168 815647
1227778 802355 783348 766329 744867 720731 690186 655323 615930 574821 531109 480638 437978 395171
1300000 352932 311769 273693 242603 212129 185303 161486 139571 117345 107093 88001 77477 65564
1372222 56934 48026 40465 34231 29582 24780 21561 18313 15328 13693 11649 10218 8941 8209 7204 6540
1461111 6299 5211 5211 4384 4700 3883 4241 3336 3944 3214 2509 3750
1527778B672  $$checkpoint
##END=