##TITLE= CuNNO_77_1_27
##JCAMP-DX= 5.0 $$converted from text file
##DATA TYPE= EPR SPECTRUM
##ORIGIN= Department of Chemistry , Bristol University
##OWNER= John Maher
##DATE= 91/10/21
##SPECTROMETER/DATA SYSTEM= Bruker ESP300E
##INSTRUMENTAL PARAMETERS= X Band
##.FREQUENCY= 9.4400500GHz
##.POWER= 63.5 mW
##.GAIN= 2.5E4
##.MODULATION FREQUENCY= 100kHz
##.MODUTLATION AMPLITUDE= 2.048G
##.CENTRE= 2641.51G
##.SWEEP= 3681.0G
##DELTAX=   1.798240    
##XUNITS= GAUSS
##YUNITS= ARBITRARY UNITS
##XFACTOR=   .1362217    
##YFACTOR=   1.855259    
##FIRSTX=   800.5620    
##LASTX=   4463.577    
##MAXY=   60791.28    
##MINY=  -56670.72    
##NPOINTS=   2038
##FIRSTY=   13095    
##XYDATA=(X++(Y..Y))
5877G058l3P9ok1o2QM5l5n9J7p7j4Q2P3q5oRM8J16q6j8L3P6n9k0N2Q7j00TJ00j7m0J9
$$ 7058 7025 7104 7098 7077 7015 7023 7068 7033 6974 6991 6914 6900 6982 7055 6970 6964 6973 7021 7137 7051 7033 7066 7142 7083 7063 7115 7202 7102 7002 7102 7085 7045 7064
6313G064k4l1k7J10O8Pj27l0N9Tn1m4l8pP0M2k5n5q1O6k6p1p0R3R5Q4q4o0j21O2Q3K1
$$ 7064 7040 7009 6982 7092 7160 7167 7040 7010 7069 7128 7077 7033 6995 6988 7058 7100 7075 7020 6939 7005 6979 6908 6838 6931 7026 7110 7026 6966 6845 6907 6990 7011
6735G011l1K0P3k4P9o3j11R5r0J24M5j34P9pJ7J71L0j85M8N7q1j7l9m6N5j3l0qJ79m7
$$ 7011 6980 7000 7073 7049 7128 7065 6954 7049 6959 7083 7128 6994 7073 7066 7083 7254 7284 7099 7147 7204 7123 7106 7067 7021 7076 7063 7033 7025 7204 7157
7131G157j70N4O2O4j1j33k9Q8o9Tj4N5J12ro4k0O4Q1l6pN2Q8l1j46KL1j5j50J19Tn0j60
$$ 7157 6987 7041 7103 7167 7156 7023 6994 7082 7013 6944 6930 6985 7097 7088 7024 7004 7068 7149 7113 7106 7158 7246 7215 7069 7071 7102 7087 6937 7056 7175 7125 6965
7553F965J25o4j6K01n8p3j04L5O2R0l7o9o0j9R7qPl8J23oj74K09J79j46m1jn2o8M5j5
$$ 6965 7090 7026 7010 7211 7153 7080 6976 7011 7073 7163 7126 7057 6997 6978 7075 7067 7074 7036 7159 7153 6979 7188 7367 7221 7180 7179 7127 7059 7104 7089
7949G089oQ0M9m8Mr5J6M1j7M7l9N6j0P0k1lo1R5Ql3o2j11N2J05r0n9J13N6j8L9j03Nj
$$ 7089 7083 7163 7212 7164 7168 7073 7089 7130 7113 7160 7121 7177 7167 7237 7216 7213 7152 7247 7255 7222 7160 7049 7101 7206 7116 7057 7170 7226 7208 7247 7144 7149 7148
8385G148m6P5O5l6K3K9L6O5l7o4L0p7o5pR3N7j18J09K8O4J23o6J63K20K0J52N2N6K58
$$ 7148 7102 7177 7242 7206 7229 7258 7294 7359 7322 7258 7288 7211 7146 7139 7232 7289 7171 7280 7308 7372 7495 7429 7592 7812 7832 7984 8036 8092 8350
8768H350O1p2N4R7p9q3j98k9j00j38j17j55q6j11j2j28j08K9Lp9j65O6L5L1rp6k4J08
$$ 8350 8411 8339 8393 8490 8411 8328 8130 8101 8001 7863 7746 7591 7505 7394 7382 7254 7146 7175 7178 7099 6934 7000 7035 7066 7057 6981 6957 7065
9138G065Q1J25Q2l1q0J18L0q4J92TK29J61K67L62J42K93J43J61K58K37rlm8j80k91j96
$$ 7065 7146 7271 7353 7322 7242 7360 7390 7306 7498 7690 7919 8080 8347 8709 8851 9144 9287 9448 9706 9943 9934 9931 9883 9703 9412 9216
9481I216l17k92l98l52k35r5j70k07k3l0l7n6q1j9j53k9Q0j2O9m1pJ06K19k3n4O9K5R0
$$ 9216 8899 8607 8209 7857 7622 7527 7357 7150 7127 7097 7060 7004 6923 6904 6751 6722 6802 6790 6859 6818 6811 6917 7136 7113 7059 7128 7153 7243
9850G243K52L13K63K91N01N05L89M86M08L33L15TJ44L5j51k91l36m79n42m85n95m62m17
$$ 7243 7495 7808 8071 8362 8863 9368 9757 10243 10651 10984 11299 11614 11758 11793 11642 11351 11015 10536 9994 9509 8914 8452 8035
10154H035m15l12k38j72q2j39j48Q0k3j14N4pk8oJ79N0J12L0K21K29J56J22L22L03N28
$$ 8035 7620 7308 7070 6898 6816 6677 6529 6609 6586 6472 6526 6519 6491 6485 6664 6714 6826 6856 7077 7306 7462 7584 7906 8209 8737
10484H737N13N81N41N55P40P18N52N22L88J81J05l6k18n57n08o77p74p38o99p82n95m27
$$ 8737 9250 9831 10372 10927 11667 12385 12937 13459 13847 14028 14133 14097 13879 13322 12814 12137 11363 10625 9926 9144 8549 8122
10774H122m58m13j81k26j36Q8p0n0j4NJ34L8m2m6P7J16J52M6L8J17J28M68L60M22N38
$$ 8122 7664 7251 7070 6844 6708 6796 6726 6676 6662 6667 6801 6839 6797 6751 6828 6944 7096 7142 7180 7297 7425 7893 8253 8675 9213
11104I213O65Q58P75J005R06O87P26O94M96N01J61j32k84m43o11p56o40p01r25p92p96
$$ 9213 9878 10736 11511 12516 13422 14109 14835 15529 16025 16526 16687 16555 16271 15828 15217 14461 13821 13120 12195 11403 10607
11382A0607n64o15o43n00m87l25l50l85k11j24j41k07k09p1l1j71j26j50k48j90j74k82
$$ 10607 10043 9428 8785 8285 7798 7473 7123 6738 6527 6403 6262 6055 5846 5775 5744 5573 5447 5297 5049 4859 4685 4403
11672D403l64n85l47l99n95n33n43l67l81n52o08l66n16k74j97j74k49mL6M2K01J18J05
$$ 4403 4039 3454 3107 2708 2113 1580 1037 670 289 -263 -871 -1237 -1753 -2027 -2224 -2398 -2647 -2651 -2615 -2573 -2372 -2254 -2149
11976b149K01J02L3L9J75P3j73O4M1J95J31R0K27K73L01M51N41N57N08N09N28N06O92
$$ -2149 -1948 -1846 -1813 -1774 -1599 -1526 -1699 -1635 -1594 -1399 -1268 -1178 -951 -678 -377 74 615 1172 1680 2189 2717 3223 3915
12279C915N11O75O10N25M28M76K97K51O8k5r2j80l06l01m43m42o29n24l80m38j94k48
$$ 3915 4426 5101 5711 6236 6664 7140 7437 7688 7756 7731 7639 7459 7153 6852 6409 5967 5338 4814 4434 3996 3802 3554
12570C554k9k8P4J97J11N1K29K87J66K42J66J94J12J20O9J15K13K3J15J9M3N2Q9J9J50
$$ 3554 3525 3497 3571 3768 3879 3930 4159 4446 4612 4854 5020 5214 5326 5446 5515 5630 5843 5866 5981 6000 6043 6095 6184 6203 6353
12900F353mN4J59O2K5m7TN0J02o5M0J20R8j34l3m5L7P7k2N0k1K0k7m7p9j1J9K1J22J62
$$ 6353 6349 6403 6562 6624 6649 6602 6555 6605 6707 6642 6682 6802 6900 6766 6733 6688 6725 6802 6780 6830 6809 6829 6802 6755 6676 6665 6684 6705 6827 6989
13296F989j55k8k3l2M4J11o8N2%j6M8J02j15R6J20l5p9M8p1q4K4N4j54L9P4l0N3M1L4
$$ 6989 6834 6806 6783 6751 6795 6906 6838 6890 6890 6874 6922 7024 6909 7005 7125 7090 7011 7059 6988 6904 6928 6982 6828 6867 6941 6911 6964 7005 7039
13679G039K4lk8m7Lk2Q5n4k1M4n9p9P4k0TQ4m3l6MK2N0J00K5k3m7M4K7N7p7L2j53o8J20
$$ 7039 7063 7060 7032 6985 6988 6966 7051 6997 6976 7020 6961 6882 6956 6936 6916 7000 6957 6921 6925 6947 6997 7097 7122 7099 7052 7096 7123 7180 7103 7135 6982 6914 7034
14114G034ko7O1j3L3r4J45l4l3J8l0J5K3M3Q1prN6J0j1j8q2j36KK07M8j1o8m7R2j7j5
$$ 7034 7032 6965 7026 7013 7046 6952 7097 7063 7030 7048 7018 7033 7056 7099 7180 7173 7164 7220 7230 7219 7201 7119 6983 6985 7192 7240 7229 7161 7114 7206 7189 7174
14537G174ml7N1m9L2Ll7j03o6N9TJ9n6J4J33o0N7PpN4lq4O4O2Q1j25m6N4Rj1n1K8O3O
$$ 7174 7170 7133 7184 7135 7167 7170 7133 7030 6964 7023 7082 7101 7045 7059 7192 7132 7189 7196 7189 7243 7240 7156 7220 7282 7363 7238 7192 7246 7255 7244 7193 7221 7284 7290
14985G290Jm7O2J9m5O0j08M9J12n4j00Q5R8%rk1J1M6M8lrJ14k2J13J66P5J36J52P4N7
$$ 7290 7291 7244 7306 7325 7280 7340 7232 7281 7393 7339 7239 7324 7422 7422 7413 7392 7403 7449 7497 7494 7485 7599 7577 7690 7856 7931 8067 8219 8293 8350
15382H350P6J56Q7J38J51J07J54J81J83J70K09n9M9J17r5MN4l0j02p1p2q7j58k38o3q8
$$ 8350 8426 8582 8669 8807 8958 9065 9219 9400 9583 9753 9962 9903 9952 10069 9974 9978 10032 10002 9900 9829 9757 9670 9512 9274 9211 9123
15725I123j33j62j15l0p4T%m4J32p7j33J39K40J24J69K00L48K03J60L90K20K88K26L36
$$ 9123 8990 8828 8713 8683 8609 8535 8535 8491 8623 8546 8413 8552 8792 8916 9085 9285 9633 9836 9996 10386 10606 10894 11120 11456
16042A1456K95K80J57K59J38J16K43J0j26m8p2l59j66j87k10j80j82l06j52l78k88k09
$$ 11456 11751 12031 12188 12447 12585 12701 12944 12954 12828 12780 12708 12349 12183 11996 11786 11606 11424 11118 10966 10588 10300 10091
16332A0091j82j69j97k40J8j10O8j2K32J23K22J78L23K56L21M81M83M85L84M84M39M59
$$ 10091 9909 9740 9543 9303 9321 9211 9279 9267 9499 9622 9844 10022 10345 10601 10922 11403 11886 12371 12755 13239 13678 14137
16622A4137L19L90J74L76K58K18j5O7k12j93k53k62m08l17m80l80l70n59n23m44m35k14
$$ 14137 14456 14846 15020 15396 15654 15872 15857 15924 15712 15519 15266 15004 14596 14279 13799 13419 13049 12490 11967 11523 11088 10874
16913A0874k64j70j37l29q6J57R1J39J12L10L68M04L80L20O15M71N18N41O78O23N25N52
$$ 10874 10610 10440 10303 9974 9888 10045 10136 10275 10387 10697 11065 11469 11849 12169 12784 13255 13773 14314 14992 15615 16140 16692
17203A6692N00M33M15L26K06j5j20j58l21k03m26n85o23m99n60n29p26n74o98m46l05
$$ 16692 17192 17625 18040 18366 18572 18557 18437 18279 17958 17755 17329 16744 16121 15622 15062 14533 13807 13233 12535 12089 11784
17480A1784m44l98m33l18r4m9k7j85L3J61K08K91M60K43L57N33L11M02M46N02M68L02
$$ 11784 11340 10942 10509 10191 10097 10048 10021 9836 9869 10030 10238 10529 10989 11232 11589 12122 12433 12835 13281 13783 14251 14553
17771A4553L19L31L65K48J12M3n0k14j38l08k91n11k64m24m73n75m87m44m69m27l10l35
$$ 14553 14872 15203 15568 15816 15928 15971 15921 15707 15569 15261 14970 14459 14195 13771 13298 12723 12236 11792 11323 10896 10586 10251
18061A0251k34j81k48k01L0M3j20J33Q7L2J35K17K62K79K76K43J99M10L61L38K73K81
$$ 10251 10017 9836 9588 9387 9417 9460 9340 9473 9560 9592 9727 9944 10206 10485 10761 11004 11203 11613 11974 12312 12585 12866
18352A2866K92J12O4Q4J27J50o3L1j94j16r1j42r7k05j71l68r6r1L9j19j24K2K37L3K03
$$ 12866 13158 13270 13334 13418 13545 13695 13632 13663 13469 13353 13262 13120 13023 12818 12647 12279 12183 12092 12131 12012 11888 11910 12147 12180 12383
18682A2383K06J81L12J53K25K11L84L38K58K41L96M55K95M29L13L37L38M51J70L11L21
$$ 12383 12589 12770 13082 13235 13460 13671 14055 14393 14651 14892 15288 15743 16038 16467 16780 17117 17455 17906 18076 18387 18708
18959A8708L61L67K36J68J09K68J96J0J08K61K88M0P9N7K28J1J25J51J14K39Q4K63J75
$$ 18708 19069 19436 19672 19840 19949 20217 20413 20423 20531 20792 21080 21120 21199 21256 21484 21495 21620 21771 21885 22124 22208 22471 22646
19263B2646J64K44K77K33L98L11J59J61L90K55L48K36M67J83K29K42L46K53L29J95K25
$$ 22646 22810 23054 23331 23564 23962 24273 24432 24593 24983 25238 25586 25822 26289 26472 26701 26943 27289 27542 27871 28066 28291
19540B8291J79J82M35K81K59TL09J60K59L10J60K49K58K08O5J89K19J56K38l3n3J00n1
$$ 28291 28470 28652 29087 29368 29627 29886 30195 30355 30614 30924 31084 31333 31591 31799 31864 32053 32272 32428 32666 32633 32580 32680 32629
19843C2629M8R0m3p2j26k1j12jj75J1j27j84N9j25j36j74q8j64j86j6j58jj53j70j79
$$ 32629 32677 32767 32724 32652 32526 32505 32393 32392 32217 32228 32101 31917 31976 31851 31715 31541 31453 31289 31103 31087 30929 30928 30775 30605 30426
20173C0426Mk17j11k65k77j16j35k86n4j01j79j52ml3j18j92l1k50j45k8k32j44j13j10
$$ 30426 30430 30213 30102 29837 29560 29444 29309 29023 28969 28868 28689 28537 28533 28500 28382 28190 28159 27909 27764 27736 27504 27360 27247 27137
20490B7137j2p5k51j98o2q5m6k12l40j31j70o8R6o9j84q9l2j60j23Jj05M9q5o7j18%j00
$$ 27137 27125 27050 26799 26601 26539 26454 26408 26196 25856 25725 25555 25487 25583 25514 25330 25241 25209 25049 24926 24927 24822 24871 24786 24719 24601 24601 24501
20847B4501r3m7j23J11O0k6k3O3K9J0N7N8M7J12R1L5J80K18J74Q6J07J18K17K81K28K40
$$ 24501 24408 24361 24238 24349 24409 24383 24360 24423 24452 24462 24519 24577 24624 24736 24827 24862 25042 25260 25434 25520 25627 25745 25962 26243 26471 26711
21190B6711K21K19K20K38K37K57J95J89J50J62J84M3J36K06J34M4j67mN3Jk1n7Lj37l10
$$ 26711 26932 27151 27371 27609 27846 28103 28298 28487 28637 28799 28983 29026 29162 29368 29502 29546 29379 29375 29428 29429 29408 29351 29354 29217 28907
21520B8907k48j24k01l07m14l49l60l66l38m19o98o94m80m69n63o78o66p07o80o69o83
$$ 28907 28659 28535 28334 28027 27613 27264 26904 26538 26200 25781 25083 24389 23909 23440 22877 22199 21533 20826 20146 19477 18794
21797A8794q28q12p88p95r77r25r01j004q24j009j010q76r51r30j022j009r61r06j002
$$ 18794 17966 17154 16366 15571 14594 13669 12768 11764 10940 9931 8921 8045 7094 6164 5142 4133 3172 2266 1264
22048A264j097r41q23p39q98q24q06Tn66p55p43n93n82m42n21m90n11m42l21l48k21j63
$$ 1264 167 -774 -1597 -2336 -3234 -4058 -4864 -5670 -6236 -6991 -7734 -8327 -8909 -9351 -9872 -10362 -10873 -11315 -11636 -11984 -12205 -12368
22338a2368k60k76j66q5l8J37J15R3P4J8J58K55K43J65J72M96L84L06K68L28J84K23L34
$$ -12368 -12628 -12904 -13070 -13155 -13193 -13056 -12941 -12848 -12774 -12756 -12598 -12343 -12100 -11935 -11763 -11267 -10883 -10577 -10309 -9981 -9797 -9574 -9240
22642i240M62L62L90L97L95K69L39L97M74K01K79L28L58M20M31L26L40K58M02L35K30
$$ -9240 -8778 -8416 -8026 -7629 -7234 -6965 -6626 -6229 -5755 -5554 -5275 -4947 -4589 -4169 -3738 -3412 -3072 -2814 -2412 -2077 -1847
22919a847K80K34L10K61K37L23J21K80L23J79K84K58R0J70J57K01K79K23K38J53J43K83
$$ -1847 -1567 -1333 -1023 -762 -525 -202 -81 199 522 701 985 1243 1333 1503 1660 1861 2140 2363 2601 2754 2897 3180
23210C180K9J12j5K59K75K79LN2Q6J16K46R7n6J31K8Q9J08J28J08J30Q7Q6J07K74J40
$$ 3180 3209 3321 3306 3565 3840 4119 4122 4174 4260 4376 4622 4719 4663 4794 4822 4911 5019 5147 5255 5385 5472 5558 5665 5939 6079
23540F079j7P8P9O4R3K30J31O7J51O3J65o9J99J00K27J25R7O0J80O0m5N8K01K02PJ93
$$ 6079 6062 6140 6219 6283 6376 6606 6737 6804 6955 7018 7183 7114 7313 7413 7640 7765 7862 7922 8102 8162 8117 8175 8376 8578 8585 8778
23883H778O7J18Q3R3J62l0r8J72J58N3K02J21J00O6M5J54J7N5J39N8J08J62J22M8P3J46
$$ 8778 8845 8963 9046 9139 9301 9271 9173 9345 9503 9556 9758 9879 9979 10045 10090 10244 10261 10316 10455 10513 10621 10783 10905 10953 11026 11172
24226A1172j9J64K11P3J92P8R4J39K94J18J63J74K41K81J71J44J77L22K56K08J91K91
$$ 11172 11153 11317 11528 11601 11793 11871 11965 12104 12398 12516 12679 12853 13094 13375 13546 13690 13867 14189 14445 14653 14844 15135
24516A5135K63L45K44K43J26J85O9M19K45K19K61K02K10L02L15N6J28K11J96K37L06L64
$$ 15135 15398 15743 15987 16230 16356 16541 16610 17029 17274 17493 17754 17956 18166 18468 18783 18839 18967 19178 19374 19611 19917 20281
24807B0281K55K59J88K52R5Q5J82K12J54R7K05J67J06O7r0N8j27o1J6o2m5j28k52k34
$$ 20281 20536 20795 20983 21235 21330 21415 21597 21809 21963 22060 22265 22432 22538 22605 22515 22573 22446 22385 22401 22339 22294 22166 21914 21680
25124B1680j23l22k57l19l32l16m31l56m64m94n05m63m50m20m60o96o16n85o89n62p72
$$ 21680 21557 21235 20978 20659 20327 20011 19580 19224 18760 18266 17761 17298 16848 16428 15968 15272 14656 14071 13382 12820 12048
25401A2048q71p03o11o69p59q35r06o79o72q26p05o88p52p73p58q39p45p52o65o88o26
$$ 12048 11177 10474 9863 9194 8435 7600 6694 6015 5343 4517 3812 3124 2372 1599 841 2 -743 -1495 -2160 -2848 -3474
25678c474p46o09n34n51o64n50l78l85n29m43n12m63k06k84k62k95j37k94l12l33j96
$$ -3474 -4220 -4829 -5363 -5914 -6578 -7128 -7506 -7891 -8420 -8863 -9375 -9838 -10044 -10328 -10590 -10885 -11022 -11316 -11628 -11961 -12157
25955a2157NK26q2j68j4o9r0r8O1J91rk1K8j1J19q0Q1P2m4k7oM3J8r1M0jr2LN5J35J38
$$ -12157 -12152 -11926 -12008 -12176 -12190 -12259 -12349 -12447 -12386 -12195 -12204 -12225 -12197 -12208 -12089 -12169 -12088 -12016 -12060 -12087 -12093 -12050 -12032 -12123 -12083 -12084 -12176 -12173 -12118 -11983 -11845
26365a1845J99K14L15J16R3K56J70K75J96L26K37Q7K27R6L2J59o3k65j79l23k71k84n16
$$ -11845 -11646 -11432 -11117 -11001 -10908 -10652 -10482 -10207 -10011 -9685 -9448 -9361 -9134 -9038 -9006 -8847 -8910 -9175 -9354 -9677 -9948 -10232 -10748
26668a0748m90n52o60n67n47n80p10o21m79n15o05m82l02l00l69k62j27j60j95k50l8
$$ -10748 -11238 -11790 -12450 -13017 -13564 -14144 -14854 -15475 -15954 -16469 -17074 -17556 -17858 -18158 -18527 -18789 -18916 -19076 -19271 -19521 -19559
26945a9559Mko9j02j28k54k61l57k59k87l18n56m52n44n62n90p77q23p43o00p10p42m46
$$ -19559 -19555 -19557 -19626 -19728 -19856 -20110 -20371 -20728 -20987 -21274 -21592 -22148 -22600 -23144 -23706 -24296 -25073 -25896 -26639 -27239 -27949 -28691 -29137
27249b9137l09m12l10k72j06N4Q8J52L28M06M88N48O65O25O50N64P03O96N99N48L50J63
$$ -29137 -29446 -29858 -30168 -30440 -30546 -30492 -30404 -30252 -29924 -29518 -29030 -28482 -27817 -27192 -26542 -25978 -25275 -24579 -23980 -23432 -23082 -22919
27539b2919L14K37L60L09R4l4q6j80j84j88l8j11k08r9j96k09M8K74M13K16M21O28P59
$$ -22919 -22605 -22368 -22008 -21699 -21605 -21639 -21725 -21905 -22089 -22277 -22315 -22426 -22634 -22733 -22929 -23138 -23090 -22816 -22403 -22187 -21766 -21138 -20379
27843b0379M97P11Q52Q94R44R88J018J257R26R56R08Q10P17O61O70M78M49L62K38L19
$$ -20379 -19882 -19171 -18319 -17425 -16481 -15493 -14475 -13218 -12292 -11336 -10428 -9618 -8901 -8240 -7570 -7092 -6643 -6281 -6043 -5724
28107e724L44K4j03q8j01q1l06l7M8k1j24o8J4J20J18K60L78L81M37M88O42M33N47N16
$$ -5724 -5380 -5356 -5459 -5547 -5648 -5729 -6035 -6072 -6024 -6045 -6169 -6237 -6223 -6103 -5985 -5725 -5347 -4966 -4529 -4041 -3399 -2966 -2419 -1903
28424a903O23M47M93O39O60N57L99M18M14J93K86J28J86L8n7q7j46j17j41j26Tk12M4
$$ -1903 -1280 -833 -340 299 959 1516 1915 2333 2747 2940 3226 3354 3540 3578 3521 3434 3288 3171 3030 2904 2778 2566 2610
28728B610j98k69l28k03j51N2j2R4N2J36J08J83L46K90J67P9R9K63L43L10K49J19L37
$$ 2610 2412 2143 1815 1612 1461 1513 1501 1595 1647 1783 1891 2074 2420 2710 2877 2956 3055 3318 3661 3971 4220 4339 4676
29031D676K16K01J35M3M1N7Q4o6QQ3K9j6r2m8m5k58k56j01PK6N9r3Qrj01K1J00R1R5k1
$$ 4676 4892 5093 5228 5271 5312 5369 5453 5387 5395 5478 5507 5491 5399 5351 5306 5048 4792 4691 4698 4724 4783 4690 4698 4689 4588 4609 4709 4800 4895 4874
29427D874Q2R1J84K41J08J67R3M3J82J44J91P9L0R4K3J24J02m7j4J21n3J53J63k2q2k02
$$ 4874 4956 5047 5231 5472 5580 5747 5840 5883 6065 6209 6400 6479 6509 6603 6626 6750 6852 6805 6791 6912 6859 7012 7175 7153 7071 6869
29770F869K5q2L4O1J38O7J6j2n4j24J7J39j4q8j65N6J17J43M7L9r4j07N5m3j44J1R8q3
$$ 6869 6894 6812 6846 6907 7045 7112 7128 7116 7062 6938 6955 7094 7080 6992 6827 6883 7000 7143 7190 7229 7135 7028 7083 7040 6896 6907 7005 6922
30140F922O1M9n3R5Lr2N4j1p7j11LJ23M8j02P3K6J79j05qj63Q0l0N5Q2q1l2LM1J37Po8
$$ 6922 6983 7032 6979 7074 7077 6985 7039 7028 6951 6840 6843 6966 7014 6912 6985 7011 7190 7085 7077 6914 6994 6964 7019 7101 7020 6988 6991 7032 7169 7176 7108
30549G108%j5J6O6M3j19r2P5r7l3o9j9jK9J03J75m3K1n2J22%q7o8n4N3R7J11j01M6q4
$$ 7108 7108 7093 7109 7175 7218 7099 7007 7082 6985 6952 6883 6864 6863 6892 6995 7170 7127 7148 7096 7218 7218 7131 7063 7009 7062 7159 7270 7169 7215 7131
30945G131p2P8L2n9J9J27Op4m9K4j8K9j04k18pJ33J68K8r9O8R4q8qk3Ko4L1N3j0JQ4J13
$$ 7131 7059 7137 7169 7110 7129 7256 7262 7188 7139 7163 7145 7174 7070 6852 6845 6978 7146 7174 7075 7143 7237 7149 7141 7118 7120 7056 7087 7140 7130 7131 7215 7328
31368G328L9m9j32o9k4N8rK1j60O5K7L8l8j22J00J04M3K6p8O7j15M9k9l1j64P8o6MP0
$$ 7328 7367 7318 7186 7117 7093 7151 7142 7163 7003 7068 7095 7133 7095 6973 7073 7177 7220 7246 7168 7235 7120 7169 7140 7109 6945 7023 6957 6961 7031
31751G031oQ1j29l9J47o2Q3p2r8j3%KJ56n1k2M8m3Kj23k2JN4J72Ko0K8mj6L5Q8j61j82
$$ 7031 7025 7106 6977 6938 7085 7023 7106 7034 6936 6923 6923 6925 7081 7030 7008 7056 7013 7015 6892 6870 6871 6925 7097 7099 7039 7067 7063 7047 7082 7170 7009 6827
32173F827R8l5mJ66q0n8R7k9o9J00O4K7m5J34r6j13Q4k3j5J0M5J9N5q6pj9M6o1J4j5O6
$$ 6827 6925 6890 6886 7052 6972 6914 7011 6982 6913 7013 7077 7104 7059 7193 7097 6984 7068 7045 7030 7040 7085 7104 7159 7073 7066 7047 7093 7032 7046 7031 7097
32582G097j43M5K6M5N8R8j32l7M7r2q5J58M0R0
$$ 7097 6954 6999 7025 7070 7128 7226 7094 7057 7104 7012 6927 7085 7125 7215
32767G215
$$ 7215
##END=
