##TITLE=cis-[Cu(glyO)2 H2O$$ Begin of the data block
##JCAMP-DX= 4.24   $$ ISAS JCAMP-DX check program V1.1/a
##DATA TYPE= INFRARED SPECTRUM
##ORIGIN= Dept of Chemistry, UWI, JAMAICA
##OWNER= RJ Lancashire
##DATE= 04/02/17
##TIME= 14:43:40
##SPECTROMETER/DATA SYSTEM= Bruker Vector 22
##INSTRUMENT PARAMETERS= 4000- 400 cm-1 scan by 10 collections
##DATA PROCESSING= OPUS NT export
##DELTAX=   1.928777    
##XUNITS= 1/CM
##YUNITS= TRANSMITTANCE
##XFACTOR=   .1220827    
##YFACTOR=   .2956995E-04
##FIRSTX=   399.2568    
##LASTX=   4000.283    
##MAXY=   .9689184    
##MINY=   .2028673E-01
##NPOINTS=   1868
##FIRSTY=   .9645280    
##XYDATA=(X++(Y..Y))
3270 32619 32460 32369 32334 32342 32384 32453 32522 32598 32745 32767 32672 32574 32550 32576 32581 32528 32446 32384 32357 32332 32254 32087 31816 31420 30875 30166 29352 28574 28022
3729 28022 27848 28087 28638 29309 29902 30280 30397 30295 30072 29844 29710 29726 29885 30130 30388 30600 30739 30806 30824 30805 30763 30703 30629 30545
4108 30545 30452 30345 30224 30090 29945 29788 29610 29395 29136 28835 28513 28196 27910 27671 27479 27325 27179 27008 26773 26438 25979 25387
4455 25387 24659 23805 22851 21846 20873 20030 19421 19116 19134 19429 19901 20428 20896 21236 21434 21535 21612 21735 21940 22222 22545 22861
4803 22861 23136 23355 23529 23674 23811 23948 24084 24210 24313 24381 24405 24388 24334 24252 24154 24053 23964 23897 23863 23863 23891 23940 24002 24064 24120 24158 24169 24140 24067
5261 24067 23943 23766 23528 23218 22827 22345 21772 21111 20374 19582 18771 17993 17311 16791 16484 16409 16550 16858 17259 17679 18057 18354
5609 18354 18559 18684 18756 18808 18875 18986 19162 19408 19721 20086 20482 20888 21282 21645 21961 22219 22414 22545 22616 22635 22608 22539 22430 22282
5988 22282 22086 21840 21545 21214 20876 20575 20362 20283 20367 20620 21026 21555 22166 22822 23492 24152 24791 25400 25972 26504 26993 27439
6335 27439 27843 28208 28538 28836 29106 29351 29572 29774 29955 30119 30265 30398 30518 30629 30730 30824 30911 30991 31067 31139 31206 31269 31327 31383
6715 31383 31435 31484 31531 31576 31619 31660 31699 31737 31773 31811 31851 31890 31929 31963 31990 32011 32027 32037 32043 32043 32041 32039 32040 32044 32048 32052 32057 32065 32070 32068 32053 32026 31990 31949 31901 31840 31767 31688 31615
7331 31615 31550 31467 31325 31081 30698 30138 29332 28173 26574 24568 22403 20535 19482 19600 20887 22957 25207 27081 28299
7631 28299 28910 29181 29403 29736 30174 30600 30882 30931 30724 30296 29736 29181 28790 28697 28954 29502 30187 30834 31311 31576 31667 31662 31626
7994 31626 31591 31559 31521 31479 31440 31413 31392 31358 31295 31200 31089 30971 30848 30708 30543 30366 30199 30055 29910 29725 29476 29173 28830 28381 27624
8389 27624 26271 24129 21319 18371 16092 15237 16154 18613 21911 25180 27701 29067 29173 28131 26228 23926 21848
8658 21848 20642 20745 22168 24465 26922 28888 30031 30400 30278 29970 29645 29326 28974 28570 28137 27711 27300 26880 26413
8958 26413 25877 25260 24553 23718 22702 21451 19932 18149 16159 14084 12112 10485 9446 9159 9661 10840 12484 14360
9242 14360 16268 18085 19747 21228 22512 23586 24448 25106 25579 25894 26083 26166 26165 26080 25895 25577 25101 24468 23723 22948 22223
9574 22223 21600 21076 20620 20213 19900 19792 20021 20653 21636 22790 23875 24696 25191 25435 25591 25816 26186 26681 27212 27688 28052
9906 28052 28294 28445 28538 28601 28649 28683 28707 28720 28723 28718 28706 28688 28664 28634 28600 28564 28523 28478 28429 28377 28322 28264 28202 28140 28076 28013 27949 27887 27824 27762 27694 27621
10412 27621 27535 27437 27327 27205 27073 26929 26771 26596 26406 26204 25995 25777 25548 25298 25022 24705 24325 23835 23164 22245 21038
10743 21038 19581 17999 16499 15311 14628 14540 15018 15919 17039 18170 19154 19910 20435 20785 21024 21199 21313 21336 21229 20958
11059 20958 20518 19923 19190 18338 17380 16338 15243 14131 13032 11960 10908 9860 8807 7757 6740 5803 4997 4369
11344 4369 3954 3773 3828 4086 4477 4902 5271 5567 5892 6462 7536 9269 11583 14134 16410 17942 18523 18305 17737 17343
11660 17343 17491 18249 19414 20669 21752 22569 23175 23681 24164 24625 25023 25319 25518 25660 25783 25893 25971 25982 25916 25792 25651
11991 25651 25533 25450 25393 25338 25268 25185 25104 25050 25042 25078 25138 25193 25206 25161 25054 24908 24752 24617 24516 24434 24343 24209 24018 23777 23512 23251
12402 23251 23001 22748 22465 22121 21707 21235 20736 20241 19768 19314 18852 18343 17746 17042 16245 15403 14575 13811 13121 12469 11791
12734 11791 11025 10140 9144 8072 6967 5870 4810 3820 2945 2234 1728 1437 1326 1330 1373 1396 1371 1308 1228 1152 1084 1013 926
13097 926 823 731 686 726 868 1108 1416 1759 2107 2447 2776 3105 3450 3831 4270 4780 5359 5988 6632 7255 7841 8398 8957
13461 8957 9555 10214 10931 11674 12396 13053 13608 14043 14351 14528 14569 14467 14222 13856 13427 13030 12780 12785 13112 13761 14667 15726
13808 15726 16833 17914 18936 19894 20787 21601 22310 22890 23339 23687 23983 24279 24605 24957 25305 25613 25853 26030 26172 26318 26500
14140 26500 26727 26976 27215 27411 27553 27656 27749 27851 27972 28099 28210 28294 28347 28379 28406 28438 28479 28535 28607 28699 28806 28919 29019 29092 29129
14535 29129 29137 29132 29132 29151 29196 29264 29345 29430 29508 29570 29613 29637 29647 29651 29658 29673 29692 29711 29727 29735 29740 29749 29772 29811 29863 29917 29957 29968 29948 29905 29863 29842 29854 29894 29945 29986
15104 29986 30003 29996 29976 29956 29947 29954 29978 30018 30072 30136 30200 30249 30273 30270 30246 30218 30204 30211 30239 30281 30328 30373 30411 30438 30454 30457 30451 30442 30437 30440 30449 30459 30466 30470 30474 30483 30496 30511 30523 30527
15736 30527 30518 30503 30484 30466 30456 30455 30464 30480 30502 30518 30527 30519 30500 30474 30449 30428 30417 30412 30412 30414 30418 30422 30424 30420 30410 30394 30378 30364 30354 30347 30346 30349 30359 30371 30384 30392 30391 30381 30365 30347
16368 30347 30333 30323 30316 30310 30306 30304 30305 30309 30315 30317 30316 30310 30303 30294 30286 30277 30266 30257 30249 30241 30233 30224 30213 30200 30184 30165 30145 30122 30099 30077 30060 30050 30051 30061 30077 30094 30110 30120 30125 30124 30118 30109 30098 30083
17063 30083 30066 30047 30027 30006 29988 29972 29956 29941 29921 29895 29863 29828 29795 29768 29748 29735 29725 29716 29702 29685 29665 29644 29623 29605 29589 29576 29566 29559 29554 29550 29548 29545 29540 29532 29521 29507 29493
17647 29493 29482 29478 29480 29488 29501 29516 29529 29538 29544 29544 29538 29530 29518 29505 29489 29473 29455 29436 29414 29388 29359 29327 29293 29256 29217 29177 29136 29093 29049 29002 28951 28896 28837 28774 28707 28639
18216 28639 28574 28512 28459 28415 28380 28356 28339 28327 28318 28309 28297 28283 28269 28253 28239 28228 28221 28216 28216 28221 28226 28231 28236 28238 28240 28240 28239 28237 28233 28223 28206 28181 28146 28104 28057 28012 27974 27947 27935 27935 27945
18864 27945 27963 27982 27999 28012 28016 28009 27989 27960 27923 27881 27840 27802 27770 27744 27722 27698 27676 27659 27658 27679 27723 27776 27819 27832 27807 27749 27678 27617 27588 27601 27656 27745 27858
19385 27858 27984 28117 28249 28375 28492 28595 28685 28760 28818 28859 28882 28891 28891 28889 28893 28906 28929 28961 28997 29034 29067 29096 29119 29135 29146 29152 29155 29156 29155 29153 29152 29151 29151 29152 29154 29156
19954 29156 29159 29161 29163 29163 29163 29161 29158 29154 29150 29145 29140 29135 29130 29126 29121 29115 29105 29094 29077 29054 29027 28995 28956 28913 28866 28813 28758 28701 28643 28587 28536 28490 28453 28423 28404 28393 28387 28389 28394 28401 28410 28420 28432 28444 28456
20665 28456 28467 28477 28485 28494 28504 28519 28538 28562 28587 28615 28641 28665 28684 28700 28712 28720 28728 28735 28742 28751 28761 28771 28782 28791 28798 28804 28807 28809 28810 28808 28805 28800 28794 28788 28781 28774 28766 28760 28754 28749 28744 28737 28728 28718 28705
21376 28705 28689 28669 28646 28618 28589 28561 28535 28514 28501 28494 28494 28497 28503 28510 28519 28525 28530 28533 28533 28530 28524 28514 28503 28489 28473 28456 28438 28418 28399 28379 28360 28341 28325 28312 28301 28295 28292 28290 28288 28285
22008 28285 28280 28272 28261 28248 28233 28218 28202 28187 28172 28158 28145 28131 28119 28107 28096 28084 28073 28062 28051 28037 28022 28006 27986 27964 27938 27909 27878 27841 27802 27761 27719 27678 27640 27605 27574
22561 27574 27548 27522 27498 27473 27447 27422 27395 27370 27345 27323 27303 27285 27267 27249 27227 27201 27169 27131 27087 27039 26991 26945 26907 26878 26861 26854 26853 26855 26858 26858 26855 26851 26845 26842 26842 26845 26852 26859 26868 26877 26886 26894 26898 26895
23256 26895 26880 26854 26814 26764 26711 26663 26626 26604 26595 26596 26601 26605 26604 26597 26582 26561 26533 26501 26464 26421 26371 26311 26240 26160 26072 25980 25884 25787 25691 25600 25512 25424 25331 25221
23793 25221 25088 24916 24690 24384 23975 23454 22846 22219 21682 21347 21294 21535 22000 22568 23113 23541 23815 23939 23932 23801 23547 23186
24141 23186 22764 22370 22103 22042 22206 22550 22982 23394 23699 23847 23831 23683 23467 23258 23124 23105 23195 23352 23516 23639 23702 23715 23708 23702
24520 23702 23705 23708 23699 23670 23623 23565 23503 23443 23383 23324 23265 23205 23146 23087 23030 22973 22915 22857 22798 22735 22670 22601 22530 22460 22388 22314 22238 22157 22073 21985 21894 21803 21712 21622 21533 21443 21351
25105 21351 21257 21159 21059 20959 20857 20754 20649 20540 20426 20307 20183 20055 19925 19791 19653 19509 19359 19201 19037 18865 18685 18499
25452 18499 18305 18105 17895 17678 17449 17210 16956 16687 16399 16091 15758 15402 15021 14615 14187 13740 13274 12791 12297 11791 11282
25784 11282 10779 10298 9862 9492 9216 9052 9009 9085 9258 9496 9764 10022 10244 10413 10523 10581 10590 10563 10509 10434 10346 10249 10144 10034
26163 10034 9914 9783 9638 9475 9294 9093 8876 8646 8407 8163 7917 7672 7427 7183 6937 6691 6441 6186 5926 5662 5393 5121
26511 5121 4845 4570 4296 4026 3762 3508 3266 3041 2839 2665 2522 2412 2338 2297 2290 2317 2380 2477 2608 2772 2964 3179 3411 3654
26890 3654 3900 4147 4389 4620 4839 5042 5229 5401 5560 5706 5840 5965 6080 6188 6284 6367 6428 6461 6450 6374 6217 5968 5642
27253 5642 5281 4954 4739 4701 4864 5208 5675 6189 6684 7116 7468 7746 7966 8143 8288 8414 8526 8630 8729 8827 8922 9016 9109
27617 9109 9203 9299 9396 9495 9598 9702 9810 9920 10034 10151 10267 10385 10502 10618 10732 10844 10953 11062 11168 11274 11378 11484 11588 11693
27996 11693 11796 11900 12001 12103 12205 12306 12406 12506 12603 12699 12797 12896 12997 13100 13203 13306 13410 13514 13624 13739 13860 13987 14116 14246 14374 14501
28406 14501 14627 14754 14885 15022 15164 15311 15459 15606 15751 15894 16038 16187 16340 16500 16664 16830 16996 17160 17318 17472 17619 17764
28754 17764 17906 18052 18200 18355 18513 18673 18831 18979 19116 19244 19367 19492 19624 19765 19914 20067 20218 20363 20495 20614 20719
29086 20719 20818 20920 21035 21174 21332 21502 21669 21816 21931 22016 22083 22149 22232 22343 22482 22640 22804 22961 23103 23228 23337 23439 23537
29449 23537 23637 23740 23849 23966 24093 24233 24384 24535 24678 24796 24889 24958 25018 25085 25168 25266 25365 25446 25493 25507 25505 25513 25562 25668 25822 26000 26157
29876 26157 26261 26290 26255 26180 26099 26040 26017 26036 26099 26199 26325 26452 26547 26583 26553 26473 26386 26333 26336 26385 26447 26488 26488 26448 26391 26340 26314 26321 26359 26418 26485
30366 26485 26541 26573 26574 26550 26516 26485 26464 26457 26461 26483 26527 26595 26674 26743 26781 26784 26769 26760 26779 26821 26863 26878 26849 26782 26695 26612 26547 26507 26486 26476 26465 26449 26424 26396
30903 26396 26372 26360 26359 26359 26350 26323 26286 26251 26237 26254 26302 26372 26447 26506 26530 26510 26448 26369 26302 26273 26294 26354 26425 26477 26489 26458 26398 26333 26291 26289 26330 26396 26453
31424 26453 26472 26440 26368 26291 26246 26250 26296 26350 26379 26367 26318 26259 26217 26208 26229 26255 26264 26244 26203 26159 26130 26120 26125 26130 26121 26099 26064 26027 26000 25990 26007 26047 26091 26113
31961 26113 26092 26023 25926 25836 25777 25756 25757 25757 25746 25725 25703 25682 25663 25641 25621 25605 25596 25589 25578 25565 25561 25572 25587 25592 25576 25550 25541 25565 25616 25661 25679 25678 25686 25717 25745 25721
32530 25721 25629 25511 25446 25471 25542 25568 25533 25565 25873 25882 25854 25814 25786 25792 25855
32767 25855
##END=
