##TITLE= Copy2Cl2
##JCAMP-DX= 4.24 $$Exported PE UV WinLab Data File
##DATA TYPE= UV/VIS SPECTRUM
##ORIGIN= Chem. Dept. UWI, JAMAICA
##OWNER= public domain
##SPECTROMETER/DATA SYSTEM= PERKIN-ELMER LAMBDA 19 UV/VIS/NIR UV
##$URL= http://wwwchem.uwimona.edu.jm:1104/software/jcampdx.html
##DATE= 97/06/27
##TIME= 09:24:00
##XUNITS= NANOMETERS
##YUNITS= ABSORBANCE
##XFACTOR= 0.0003000000
##YFACTOR= 0.0000009685
##FIRSTX= 500.000000
##FIRSTY=   0.107883
##LASTX= 800.000000
##NPOINTS= 301
##MAXY=   1.002419
##MINY=   0.033894
##DELTAX=   0.352941
##XYDATA= (X++(Y..Y))
1666666 111388 112301 113272 114012 114719 115445 116132 116905 117513 118122 118798 119423 119977 120600 121208 121756 122217 122710 123231
1726666 123231 123662 124173 124739 125433 126219 127144 128531 129813 131372 133127 134912 137069 139396 141999 144674
1776666 144674 147727 151173 155061 159414 164281 169743 176000 182866 190403 198788 207864 217689 228330 239796
1823333 239796 251938 265274 279363 294280 310074 326593 343830 362070 381197 400880 421345
1860000 421345 442692 464795 487199 510253 532399 554909 577130 598854 619795 639942 659051
1896666 659051 676653 692685 707185 719384 728809 735342 739105 739820 737683 733694 727728 721039 714021
1940000 714021 707643 702706 699629 698606 699798 703646 710322 719844 731814 745598 761014 777192 794661
1983333 794661 812884 831883 851439 871590 891864 912326 932524 952219 970965 988218 1003280
2020000 1003280 1015499 1024885 1031419 1034518 1034995 1032770 1028139 1021364 1013018 1002926 992222 981248 970295
2063333 970295 959958 950457 941937 934775 929110 924510 920358 916826 913806 910868 908613 907388 907514 908714
2110000 908714 911222 914052 916580 918889 919321 917397 913293 906828 898658 888990 878875 868750 858909 849215
2156666 849215 840354 832244 824666 817592 811486 806023 801465 797251 793917 790719 787991 784950 781856 777842
2203333 777842 772931 766817 759496 750449 739732 727213 713099 696903 679651 660657 640714 619784
2243333 619784 598382 576313 553801 531377 508862 486215 463914 441991 420386 399316 378877
2280000 378877 359150 339717 320989 303035 285733 269242 253660 238784 224391 211132 198415
2316666 198415 186384 175113 164608 154597 145494 136869 128785 121381 114562 108269 102318 96903 92100
2360000 92100 87413 83104 79263 75548 72495 69459 66851 64434 62336 60251 58725 57021 55576 54374
2406666 54374 53145 52297 51538 50788 50164 49509 48882 48123 47351 46725 46040 45508 44968 44506 44293 44014 43776 43581
2466666 43581 43436 43142 42757 42534 42140 41547 41102 40628 40029 39644 39304 39063 38569 38253 38092 38007 37608 37562 37238
2530000 37238 37153 37014 37001 36750 36808 37040 36885 36894 36801 36571 36436 36332 36141 35998 36122 35842 35741 35591 35586 35298 35491
2600000 35491 35430 35408 35097 35057 35128 35109 35081 35126 35068 35176 35095 35207 35178 35226 34995 35169 35207 35126 35300 35141
##END=
