##TITLE= Copy2Br2
##JCAMP-DX= 4.24 $$Exported PE UV WinLab Data File
##DATA TYPE= UV/VIS SPECTRUM
##ORIGIN= Chem. Dept. UWI, JAMAICA
##OWNER= public domain
##SPECTROMETER/DATA SYSTEM= PERKIN-ELMER LAMBDA 19 UV/VIS/NIR UV
##$URL= http://wwwchem.uwimona.edu.jm:1104/software/jcampdx.html
##DATE= 97/06/27
##TIME= 09:37:00
##XUNITS= NANOMETERS
##YUNITS= ABSORBANCE
##XFACTOR= 0.0003000000
##YFACTOR= 0.0000008749
##FIRSTX= 500.000000
##FIRSTY=   0.047822
##LASTX= 800.000000
##NPOINTS= 301
##MAXY=   0.886615
##MINY=   0.011687
##DELTAX=   0.352941
##XYDATA= (X++(Y..Y))
1666666 54658 54353 54214 54063 54065 54060 54164 54420 54660 55068 55431 55861 56334 56818 57402 58063 58745 59256 59819 60314 60789
1733333 60789 61177 61537 62016 62456 62925 63333 63673 64098 64566 65120 65607 66115 66720 67349 68090 68783 69526 70437 71260
1796666 71260 72204 73355 74554 75887 77452 79027 80835 82677 84753 86916 89446 92260 95278 98834
1843333 98834 102582 106957 111635 116631 122211 128130 134622 141538 149201 156944 165579 174670 184402 194701
1890000 194701 205584 217161 229362 241827 255010 268802 282752 297555 312805 328587 344684
1926666 344684 361323 377962 394539 411223 427376 443113 458279 472556 486147 498869 510711
1963333 510711 521764 531705 540375 547152 551744 554569 555825 555299 554557 553700 553507 554477 557025 560901 566498
2013333 566498 573785 582749 593150 605108 618377 632725 648240 664946 682689 701857 722253 743666
2053333 743666 765903 788258 809769 829233 845795 859173 870676 880437 890197 899583 908218 916129
2093333 916129 923106 929074 934275 939096 944107 948991 954319 959937 965400 971260 976921 982521 988026 993644
2140000 993644 998985 1003806 1008216 1011386 1013097 1013357 1011275 1007236 1001125 992965 983508 973044 961307 948878
2186666 948878 935867 922768 909311 895849 882601 868905 855310 841542 827390 812512 797103
2223333 797103 781177 764348 747152 728982 710064 690625 670859 650363 629343 608182 586836
2260000 586836 565068 543357 521743 500198 479063 458515 438101 417948 398326 379104 360273
2296666 360273 341832 323788 306828 290038 274272 258855 244177 229920 216437 203403 191150
2333333 191150 179373 168123 157672 147649 138226 129268 120879 112892 105698 98632 92251 86347 80828
2376666 80828 75726 70770 66479 62314 58436 55076 51941 49032 46510 44059 42008 40117 38512 36997
2423333 36997 35669 34248 32937 31483 29989 28805 27865 26870 26058 25356 24710 24126 23644 23033 22640 22152 21708
2480000 21708 21343 20767 19786 19213 18343 18092 17811 17368 17057 16680 16339 16084 15944 15741 15557 15476 15489 15347 15132
2543333 15132 14942 14881 14579 14705 14666 14384 14379 14214 14173 14195 13857 13844 13855 13858 13865 13764 13809 13683 13567 13565 13619 13381 13633 13357
2623333 13357 13618 13535 13707 13740 13620 13676 13827 13817 13860 13703 13791 13845 14006
##END=
