##TITLE= Co(acac)3
##JCAMP-DX= 5.0 $$Exported PE UV WinLab Data File
##DATA TYPE= UV/VIS SPECTRUM
##ORIGIN= Chem. Dept. UWI, JAMAICA
##OWNER= public domain
##$URL= http://wwwchem.uwimona.edu.jm:1104/software/jcampdx.html
##DATE= 96/01/19
##TIME= 17:55:00
##SPECTROMETER/DATA SYSTEM= PERKIN-ELMER LAMBDA 19 UV/VIS/NIR UV
##RESOLUTION= 1.000000
##XUNITS= NANOMETERS
##YUNITS= ABSORBANCE
##XFACTOR= 0.0003000100
##YFACTOR= 0.0000008543
##FIRSTX= 399.980000
##FIRSTY=   0.920897
##LASTX= 700.000000
##NPOINTS= 3001
##MAXY=   0.920897
##MINY=   0.066566
##DELTAX=   0.100003
##XYDATA= (X++(Y..Y))
1333222A077915j377j043k624j637j404j681j395p77k206k650n61j044j620j266
1337888A056630j446k248k486K93j858k505l72j542k428j857k96j663j943l90k042
1342888A033847k309j519j032j770j782k88j380k565j422j466j452r18n09k516
1347555A012919k509p21j182j667j468j162j387k103j542j188r60j042k057k275
1352221I91656j188q55j879k001m3k021k388j287q43k058j260k51k015j797j206
1357221I70564j173j335j339q45k496j761q05j148j483j194j023j921k526p96j396
1362221I49323r07j044j701j941j441q84j433j780l39j127k415j910q75j491j780
1367221I28255k11j796j480j244j314k003j234P6l062j114r93j454j472j064j137
$$ y = [1077915, 1076538, 1075495, 1072871, 1071234, 1069830, 1068149, 1066754, 1065977, 1063771, 1061121, 1060560, 1059516, 1057896, 1056630, 1055184, 1052936, 1050450, 1050743, 1048885, 1046380, 1046008, 1044466, 1042038, 1040181, 1039885, 1038222, 1036279, 1035889, 1033847, 1031538, 1030019, 1028987, 1027217, 1025435, 1025147, 1023767, 1021202, 1019780, 1018314, 1016862, 1015944, 1015435, 1012919, 1010410, 1009689, 1008507, 1006840, 1005372, 1004210, 1002823, 1000720, 999178, 997990, 997030, 995988, 993931, 991656, 990468, 989613, 987734, 985733, 985690, 983669, 981281, 979994, 979151, 977093, 975833, 975582, 973567, 971770, 970564, 969391, 968056, 966717, 965872, 963376, 961615, 960810, 959662, 958179, 956985, 955962, 954041, 951515, 950719, 949323, 948416, 947372, 945671, 943730, 942289, 941405, 939972, 938192, 937853, 936726, 934311, 932401, 931526, 930035, 928255, 928044, 926248, 924768, 923524, 922210, 920207, 918973, 919049, 915987, 914873, 913880, 912426, 910954, 909890, 908753]
1372220I08753k288r68r42j001j274j396j721k002p98r43j784q01q69j880k047
1377220H88039j189r83j888m77n42j869j824j533j292j431m12j021k341j271j214
1382220H68752j257j094o57j983j314j420j010j443j045j009j494k004r14j021
1386887H51087j471j182q42j505k039j028r61j272r74j141j904j442o94j191j342
1391886H32099p9j756k068j220q15j486j761m87j079k366n45j066j306r11r30j608
1397220H12616k190o89r24j425r20j158j667j480j132j329j222J10j678k026j211
1402219G93675n50j415j776N83j864k263j273q70p56j210m42j907j935q56j210
1407219G75931j396p16j73k092k101K5j366j458p45r46j763j666o20j204q63r68
$$ y = [908753, 906465, 905497, 904555, 903554, 902280, 900884, 899163, 897161, 896363, 895420, 893636, 892835, 891966, 890086, 888039, 886850, 885867, 883979, 883502, 882960, 881091, 879267, 877734, 876442, 875011, 874599, 873578, 871237, 869966, 868752, 867495, 866401, 865744, 863761, 862447, 861027, 860017, 858574, 857529, 856520, 855026, 853022, 852108, 851087, 849616, 848434, 847592, 846087, 844048, 843020, 842059, 840787, 839813, 838672, 836768, 835326, 834632, 833441, 832099, 832020, 830264, 828196, 826976, 826161, 824675, 822914, 822427, 821348, 818982, 818437, 817371, 816065, 815154, 814224, 812616, 810426, 809737, 808813, 807388, 806468, 805310, 803643, 802163, 801031, 799702, 798480, 798590, 796912, 794886, 793675, 793125, 791710, 789934, 790517, 788653, 786390, 785117, 784247, 783491, 782281, 781839, 779932, 777997, 777141, 775931, 774535, 773819, 773646, 771554, 769453, 769478, 768112, 766654, 765909, 764963, 763200, 761534, 760914, 759710, 758847, 757879]
1412552G57879j691j524r79p29j602r56k65j806j459q92p91j340j302o64j693j290
1417886G38896j042j059j370r16o64j475j764n65j712j195k52q84j964j247m75
1422885G22312j482j121o34j144j673p56o31k059q19l03j600j685j122o94j116
1427885G05473j002m31k066j332j027j021j024k93p58k195r34p59j399j222n09
1432885F89501q85k063n50j088j242p01q04j431j505m80r52j529p80j020j485j334
1438218F71652p67r51j472r4q77k457j085l81r36j191l51r97k414p36n97j079r48
1443885F54319o24j138j663p48q32j550q97p26j331j370o06p89j776k14p71j708
1449218F37576j412l23r17j282l93j112j745j200p86j264o56M98k107j705r16r53
$$ y = [757879, 756188, 754664, 753685, 752956, 751354, 750398, 750133, 748327, 746868, 745976, 745185, 743845, 742543, 741879, 740186, 738896, 737854, 736795, 735425, 734509, 733845, 732370, 730606, 730041, 728329, 727134, 726882, 725998, 724034, 722787, 722312, 720830, 719709, 719075, 717931, 716258, 715502, 714871, 712812, 711993, 711690, 710090, 708405, 707283, 706589, 705473, 704471, 704040, 701974, 700642, 699615, 698594, 697570, 697277, 696519, 694324, 693390, 692631, 691232, 690010, 689501, 688616, 686553, 686003, 684915, 683673, 682972, 682168, 680737, 679232, 678752, 677800, 676271, 675491, 674471, 672986, 671652, 670885, 669934, 668462, 668368, 667491, 665034, 663949, 663568, 662632, 661441, 661090, 660093, 657679, 656943, 656346, 655267, 654319, 653695, 652557, 650894, 650146, 649314, 647764, 646867, 646141, 644810, 643440, 642834, 642045, 640269, 640055, 639284, 637576, 636164, 635841, 634924, 633642, 633249, 632137, 630392, 629192, 628406, 627142, 626486, 626984, 624877, 623172, 622256, 621303]
1454551F21303r57n20r11j468j393m34j568q67n13r63j328j220m92j054j145n53
1459884F05917q45j598j413q44p76j100n59j121j347o76o83j637o17j09j973j674
1465217E88945r80p59p60o52m31j677j435n73j338q81l69r98j679p22n61j323j342
1470884E72465o70p57j238j050n44j373p17p21j416j300p24p90j266o00j74j721
1476217E57404j381r82o51r75j065k80j861p73m34j206j087n87j126j503j074l67
1481550E42052j199o95r28j269j014r65q76j247l40j002j575j065l40m72j809j47
1486883E27109n65k178j231l01n14j370m26r65j892r78m08j212j166l24o98k352
1492216E10529m28o60q24q31j034q24j501p90j147n61m66r33j266j221p08r74r54
$$ y = [621303, 620346, 619826, 618915, 617447, 616054, 615620, 614052, 613185, 612672, 611709, 610381, 609161, 608669, 607615, 606470, 605917, 605072, 603474, 602061, 601217, 600441, 599341, 598782, 597661, 596314, 595638, 594955, 593318, 592701, 592592, 590619, 588945, 587965, 587206, 586446, 585794, 585363, 583686, 582251, 581678, 580340, 579459, 579090, 578092, 576413, 575691, 575130, 573807, 572465, 571795, 571038, 569800, 568750, 568206, 566833, 566116, 565395, 563979, 562679, 561955, 561165, 559899, 559299, 559125, 557404, 556023, 555041, 554390, 553415, 552350, 552070, 550209, 549436, 549002, 547796, 546709, 546122, 544996, 543493, 542419, 542052, 540853, 540158, 539230, 537961, 536947, 535982, 535106, 533859, 533519, 532517, 530942, 529877, 529537, 529065, 527256, 527109, 526544, 524366, 523135, 522834, 522320, 520950, 520524, 519559, 517667, 516689, 516281, 515069, 513903, 513579, 512881, 510529, 510101, 509441, 508617, 507786, 506752, 505928, 504427, 503637, 502490, 501929, 501463, 500530, 499264, 498043, 497335, 496361, 495407]
1497883D95407l13j402j356j090q38q19o35m68j573j323p05r30j015n52Q6j956
1503216D80518j896l18r26j121m51l97j785j450j61j473j084q1p41j718j503P8
1508549D65491r41q97n86q90j606j102m05r46r08k74j525j604q87m82j017q18j87
1514216D50416j306j866n79p33p59k51q96j605j298o14r02p31n26j012j546j203
1519549D34589l86j345q88n17q38j401j176o03r17m25m75j537j289p71j067j271
1524882D19683k12jj637j310q61q56p63o90r35j357r11p03q32r05n67r62j529q38
1530882D03814m28j379n68n69j369j460o66n47j200r6o70j778j169m44o91j436
1536215C89344l16o46j514j280o05n38q24o75j205j537o48n48r41o40m04r01k476
$$ y = [495407, 495094, 493692, 492336, 491246, 490408, 489589, 488954, 488486, 486913, 485590, 484885, 483955, 482940, 482388, 482474, 480518, 478622, 478304, 477378, 476257, 475806, 475409, 473624, 472174, 472013, 470540, 469456, 469375, 468634, 466916, 465413, 465491, 464550, 463653, 463067, 462177, 460571, 459469, 459064, 458118, 457210, 456936, 455411, 453807, 452920, 452438, 451421, 450603, 450416, 449110, 447244, 446665, 445932, 445173, 444922, 444026, 442421, 441123, 440509, 439607, 438876, 438350, 437338, 435792, 434589, 434203, 432858, 431970, 431453, 430615, 429214, 428038, 427435, 426518, 426093, 425618, 424081, 422792, 422021, 420954, 419683, 419471, 419470, 417833, 416523, 415662, 414806, 414043, 413353, 412418, 411061, 410150, 409447, 408615, 407710, 407143, 406181, 404652, 403814, 403386, 402007, 401439, 400870, 399501, 398041, 397375, 396828, 395628, 395532, 394862, 393084, 391915, 391471, 390780, 389344, 389028, 388382, 386868, 385588, 384983, 384445, 383621, 382946, 381741, 380204, 379556, 379008, 378067, 377427, 377023, 376122, 373646]
1541881C73646l80l31r67p57q59j151j305o34j094p78k34o86j614j173l57q27j327
1547548C59172N3n33j755q62o11r98o20l28j473j806k65q55j038n22k87j397j528
1553214C44347n32n00q45n13p21j324j124m90p00j402J35p17j556j365p16l50j223
1558881C30404j24r10j527r06m23q28o17K56k205j369m61p15r40j66l23j630j320
1564547C16196p20q12j148n07m81j250p84l05j211p33k08q52j427j039j33j114
1569880C03472r31k71q84j324q27p02r98o36n6j451j270k75m01j021n98m47j638
1575547B89742r24n77n08q00o03o24j116r50o19r93n66k57q33j149j013n73r39
1581213B76698l21n98j223j022l17o65j241p7k50j558r23l16o96j332j08K44k229
$$ y = [373646, 373266, 372935, 371968, 371211, 370352, 369201, 367896, 367262, 366168, 365390, 365156, 364470, 362856, 361683, 361326, 360499, 359172, 359225, 358692, 356937, 356075, 355464, 354466, 353846, 353518, 352045, 350239, 349974, 349119, 348081, 347559, 347272, 345875, 344347, 343815, 343315, 342470, 341957, 341236, 339912, 338788, 338298, 337598, 336196, 336331, 335614, 334058, 332693, 331977, 331627, 330404, 330280, 329370, 327843, 326937, 326514, 325686, 325069, 325325, 323120, 321751, 321290, 320575, 319635, 319469, 319146, 317516, 316196, 315476, 314664, 313516, 313009, 312528, 311278, 310494, 310189, 308978, 308245, 308037, 307185, 305758, 304719, 304586, 303472, 302541, 302270, 301386, 300062, 299235, 298533, 297535, 296899, 296843, 295392, 294122, 293847, 293446, 292425, 291827, 291380, 289742, 288818, 288241, 287733, 286933, 286330, 285706, 284590, 283640, 283021, 282028, 281462, 281205, 280372, 279223, 278210, 277637, 276698, 276377, 275779, 274556, 273534, 273217, 272552, 271311, 271234, 270984, 269426, 268503, 268187, 267491, 266159, 266051, 266295, 264066]
1586880B64066r40n76n84l95n3j171j694k70p38o83o60j81q43j490n99r7o95m72
1592880B51925n38r60r95p76k56j159l11l96j546j146j06lr00p70l12j203p85n31
1598880B39232m70l22o84r77j113m38o27o57l24n74r53p74k22j428m20K1q35j152
1604879B27283n75R4q57r53J90n47j711j180j76j74n56K2r15j290n98l57o71n22
1610879B16507K86j219j621r8j39p36j47P6r67j609m30j56n93m35o07r15o76r5
1616879B06426r25k47l4q55j104m13k92n34o05J71o93j464m51k82p18m8M02j173
1622879A97161j417k80j44o98n09K3j103r54m11j59k51j43m67j131o44l90l67m76
1628879A87640J8o21q94m13k46p12n98p2o92q62n60k77k91R9n71j312k99o2m32
$$ y = [264066, 263126, 262550, 261966, 261571, 261518, 260347, 258653, 258383, 257645, 256962, 256302, 256121, 255278, 253788, 253189, 253092, 252397, 251925, 251387, 250427, 249432, 248656, 248400, 247241, 246930, 246534, 244988, 243842, 243736, 243733, 242833, 242063, 241751, 240548, 239763, 239232, 238762, 238440, 237756, 236779, 235666, 235228, 234601, 233944, 233620, 233046, 232093, 231319, 231097, 229669, 229249, 229270, 228435, 227283, 226708, 226802, 225945, 224992, 225182, 224635, 222924, 221744, 221568, 221394, 220838, 220860, 219945, 218655, 218057, 217700, 217029, 216507, 216793, 215574, 213953, 213855, 213716, 212980, 212833, 212909, 211942, 210333, 209903, 209747, 209154, 208719, 208112, 207197, 206521, 206426, 205501, 205254, 205220, 204365, 203261, 202848, 202556, 202022, 201417, 201588, 200895, 199431, 198980, 198698, 197980, 197932, 198334, 197161, 195744, 195464, 195320, 194622, 194113, 194136, 193033, 192079, 191668, 191509, 191258, 191115, 190648, 189517, 188873, 188483, 188116, 187640, 187658, 187037, 186143, 185730, 185484, 184772, 184174, 184102, 183410, 182548, 181988, 181711, 181420, 181519, 180948, 179636, 179337, 179275, 178843]
1635212A78843l30K37n54j209p00j11n46m87j33l27r11j97K00j214j79K14q25j221
1641211A70550L55l9j154J66K7q47q32j00k26o84r6K59j300p83J58j05o27k02M41
1647545A64961r56j252l1J60l05m78l41k92q28k80m13L9M3n41p07k91K9m13l5n90
1654211A57479n33m7q4q37k00P46p52j278j91n4o81q5P80q96j120L17j32n52K07
1660544A52087M87j095j490M59l05n39K24O11p59j324K94J91r25L90J8p46p46N5
1666544A46887K0o38K61Q9r68n43L38Q0m66L32n85q25j88P5o7K9J03r95j89r8l03
1673544A42349j71K68o4n41m03l50j19P1J64j64o36m01J63n58k31N52k78o86k03
1679877A38762K42k10j39L68n97m18J41j20m52Q2O10j188m42M93Lk35L57O4r91
$$ y = [178843, 178513, 178750, 178196, 176987, 176287, 176176, 175630, 175143, 175010, 174683, 173772, 173575, 173775, 172561, 172382, 172596, 171771, 170550, 170905, 170866, 169712, 169878, 169905, 169058, 168226, 168126, 167900, 167216, 167120, 167379, 166079, 165296, 165454, 165349, 164722, 164520, 164961, 164005, 162753, 162722, 162882, 162577, 162099, 161758, 161466, 160638, 160358, 159945, 159984, 160027, 159486, 158779, 158488, 158517, 158104, 158069, 157479, 156946, 156899, 156815, 155978, 155778, 156524, 155772, 154494, 154303, 154249, 153568, 153483, 154263, 153367, 152247, 152564, 152432, 151880, 152087, 152574, 151479, 149989, 150448, 150143, 149604, 149828, 150439, 149680, 148356, 148650, 148841, 147916, 148306, 148324, 147578, 146832, 146887, 146907, 146269, 146530, 146619, 145651, 145108, 145446, 145526, 145060, 145392, 144807, 143982, 143794, 143869, 143802, 143831, 143934, 142939, 142750, 142652, 142349, 142178, 142446, 142382, 141841, 141438, 141088, 140969, 141040, 141204, 141040, 140404, 140003, 140166, 139608, 139377, 139929, 139651, 138965, 138762, 139004, 138794, 138655, 139023, 138426, 138008, 138149, 138029, 137577, 137659, 138269, 137081, 136639, 137132, 137135, 136900, 137257, 137321, 136330]
1686210A36330n45K81p3J67J9k34m95j13m2j54K21L23k95m28j50j4r4j22K70m52
1692876A34400k26J06M4j40Q4K13q00M1L77k01k74M45P5j028l9L89j92J09K97k03
1699543A33477m49l2J30m48L54L09k49m20RL99k51K17m1k70j91M0J36j32N66J3
1706209A33167o91K9N44j16j94L82o8q86K63L59k3L14L34n57o83P55j44k53N64
1712542A33096J91l78k13M35M7K0N90Po16j40K67R1J3P16j70m29K0L94J63k21O73
1719542A34556l9j009L79M31o8K79N37k55p77P25J46n5P56R7n42l34P14k28J73
1725875A35486O54k23l68K53L46Q1Q0N30k06k40K10K63J92R8M56j54j82M16J29
1732208A37821k33N64O49o95o55O37N15R5N62K63k87j92N95j14L69O02k84l67L88
$$ y = [136330, 135785, 136066, 135993, 136160, 136179, 135945, 135450, 135337, 135295, 135141, 135362, 135685, 135390, 134962, 134812, 134798, 134704, 134582, 134852, 134400, 134174, 134280, 134324, 134184, 134268, 134481, 133681, 133722, 134099, 133898, 133624, 134069, 134144, 133116, 133077, 133466, 133274, 133383, 133680, 133477, 133028, 132996, 133126, 132678, 133032, 133341, 133092, 132672, 132681, 133080, 132829, 133046, 133005, 132735, 132544, 132584, 132720, 132588, 133154, 133167, 132476, 132505, 133049, 132933, 132739, 133121, 133053, 132167, 132430, 132789, 132766, 133080, 133414, 132857, 132174, 132929, 132785, 132532, 133096, 133287, 132909, 132696, 133131, 133178, 133198, 133788, 133795, 133179, 133039, 133306, 133397, 133410, 134126, 133956, 133527, 133547, 133941, 134104, 133883, 134556, 134517, 133508, 133887, 134318, 134250, 134529, 135066, 134811, 134034, 134759, 134905, 134850, 135606, 135703, 135161, 134827, 135541, 135313, 135486, 136140, 135917, 135549, 135802, 136148, 136229, 136309, 136839, 136633, 136393, 136603, 136866, 137058, 137156, 137612, 137458, 137276, 137692, 137821, 137588, 138152, 138801, 138106, 137451, 138088, 138603, 138698, 139260, 139523, 139236, 139044, 139639, 139525, 139894, 140496, 140212, 139845, 140233]
1738542A40233M62j34J78P95k19k91J61M56L23K64M31j24R7L20J33P6N29K86n99
1744908A43377k25O38M12J89M09K19KM4O79m8L07N65J2l19J26M59k27R08N67l20
1751574A47774j64K51L68M35O62J14k67K75M68R8M3R41K3m89O4O71K48N7N11M41
1758241A52524n01K3O49K57O98O19k77k43Q35L25p0M50N85p9o0N73M13K9P11R5
1764907A57556l32L79N64J03L64R11p9m31N47P05K29J26P45J01k85L58J13N55P57
1771240A62986M66m40j55J103J80p3J005M61m48j21O36L55K58P49L31r4K98M48
1777240A67945jQ91J085l24p08O82Q11J92L00P85l07k81N68O59J35P67O60m59L5
1783573A73435P54K37J84J164N36m38o1Q36O48l09O13N76Q6L39N83k60P91R58l67
$$ y = [140233, 140695, 140561, 140739, 141534, 141315, 141024, 141185, 141641, 141964, 142228, 142659, 142535, 142632, 142952, 143085, 143161, 143690, 143976, 143377, 143152, 143790, 144202, 144391, 144800, 145019, 145021, 145065, 145744, 145696, 146003, 146568, 146580, 146261, 146387, 146846, 146619, 147527, 148094, 147774, 147610, 147861, 148229, 148664, 149326, 149440, 149173, 149448, 149916, 150014, 150057, 150998, 151021, 150532, 150596, 151267, 151515, 151572, 152083, 152524, 152023, 152046, 152695, 152952, 153650, 154269, 153992, 153749, 154584, 154909, 154839, 155289, 155874, 155795, 155735, 156308, 156721, 156750, 157461, 157556, 157224, 157603, 158167, 158270, 158634, 159545, 159466, 159035, 159582, 160287, 160516, 160642, 161387, 161488, 161203, 161561, 161674, 162229, 162986, 163452, 163012, 162857, 163960, 164140, 164067, 165072, 165533, 165085, 164964, 165600, 165955, 166213, 166962, 167293, 167199, 167497, 167945, 167944, 168835, 169920, 169596, 168888, 169570, 170381, 170573, 170873, 171658, 171351, 171070, 171638, 172297, 172432, 173199, 173859, 173400, 173435, 174189, 174426, 174610, 175774, 176310, 175872, 175811, 176647, 177295, 176986, 177599, 178175, 178261, 178600, 179183, 178923, 179714, 180672, 180305]
1789906A80305o4O76N00LQ50O47l03p0O20M90N02R54L67l82K28L93L73L50Q08M66
1796573A87713j23M57O02l5O05P33J43l4M42M07KP79R34l6j60P61O58J28P89R01
1803239A95666q24J95P93L26M70P50K55k80L40P92K63M62P53K38l55O53O81N19
1809239B01697L92O63M6K5Q02K96R8O06Q21r2J13P05M40K44J026L09k84L55N14
1815572B08776L78O50J240k01l72P30P17K29O06O79J20k64O61L55M15J102N96k89
1821572B16128OP11M25P5J185M43k79J26O08O90K94P41L53Q3M63O00L06M80J048
1827905B24486q1n59R20R44R3N07J172J28r92R90L93M54R11N13k81J45J130J00
1833905B30973K44J196O53k26J20P84L61L75O64J88J17M96M59K67Q35O45m5l19
$$ y = [180305, 180241, 180917, 181417, 181420, 182270, 182917, 182614, 182544, 183164, 183654, 184156, 185110, 185477, 185095, 185323, 185716, 186089, 186439, 187247, 187713, 187590, 188047, 188649, 188614, 189219, 189952, 190095, 190061, 190503, 190910, 190912, 191691, 192625, 192589, 192429, 193190, 193848, 193976, 194765, 195666, 194842, 195037, 195830, 196156, 196626, 197376, 197631, 197351, 197691, 198483, 198746, 199208, 199961, 200199, 199844, 200497, 201178, 201697, 202089, 202752, 202798, 202823, 203625, 203921, 204019, 204625, 205446, 205354, 205467, 206172, 206612, 206856, 207882, 208191, 207907, 208262, 208776, 209154, 209804, 211044, 210843, 210471, 211201, 211918, 212147, 212753, 213432, 213552, 213288, 213949, 214304, 214719, 215821, 216417, 216128, 216134, 216845, 217270, 217345, 218530, 218973, 218694, 218820, 219428, 220118, 220412, 221153, 221506, 221589, 222052, 222652, 222958, 223438, 224486, 224405, 223846, 224766, 225710, 225803, 226310, 227482, 227610, 226618, 227608, 228001, 228455, 229366, 229879, 229598, 229743, 230873, 230973, 231217, 232413, 233066, 232840, 232960, 233744, 234105, 234480, 235144, 235332, 235449, 235945, 236404, 236671, 237506, 238151, 238106, 237787]
1839905B37787Q34Q30L72L80Q61R3l13P84N12N28J006L08m64K96R40j28N27J338
1845905B46491K17m36N00R63k0P13Q40j06J8P64L88MJ173Q84n04l18Q36Q41M09
1852238B53657N95Q57j45j10Q59O37N92N58L29k14K89P26K68M91N59K95JL75P42
1858571B61361J03P60Q82j5P1O22L38K54J336K57m10M20Q56K71K43O82J22j8O22
1864904B68757N76L03O25O14M48k26M59O64J45O85R23J68l76L92R27n4J112P51
1870904B76893l11K3J041L43n6J040O04j85O8P60k14Q94Q71K49L23P07k71q49J409
1877237B83339R21L11M07N09n9j82P45N31K95O37M17O6M80J188j68m31R44J36k8
1883570B90058J029J676p08j19N82mo6P93J058L54K0P91l37K4J052M29P9N85N57
$$ y = [237787, 238621, 239451, 239823, 240203, 241064, 241157, 240844, 241628, 242140, 242668, 243674, 243982, 243518, 243814, 244754, 244626, 245153, 246491, 246708, 246272, 246772, 247735, 247715, 248428, 249268, 249162, 249180, 249944, 250332, 250336, 251509, 252393, 251889, 251571, 252407, 253248, 253657, 254252, 255109, 254964, 254854, 255713, 256350, 256942, 257500, 257829, 257615, 257904, 258630, 258898, 259389, 259948, 260243, 260244, 260619, 261361, 261464, 262224, 263106, 263091, 263162, 263784, 264122, 264376, 265712, 265969, 265559, 265979, 266835, 267106, 267349, 268031, 268153, 268135, 268757, 269333, 269636, 270261, 270875, 271323, 271097, 271556, 272220, 272365, 273050, 273973, 274141, 273765, 274157, 275084, 275030, 276142, 276893, 276582, 276605, 277646, 277989, 277933, 278973, 279577, 279392, 279460, 280220, 280006, 280900, 281771, 282020, 282343, 283050, 282779, 281930, 283339, 284260, 284571, 284978, 285487, 285428, 285246, 285991, 286522, 286817, 287454, 287871, 287937, 288417, 289605, 289437, 289006, 289950, 290086, 290058, 291087, 292763, 292055, 291936, 292518, 292514, 292448, 293241, 294299, 294653, 294673, 295464, 295127, 295151, 296203, 296632, 296711, 297296, 297853]
1889903B97853l29J1R38L12L52P84J94j24K00J076k87L0J240J63R1Q55R86n06j19
1896236C03720Q78l42J02J085R49k50L17L68n84L25J293M37J26M45J92l45L58J012
1902236C10086J74J54R18M33r3J89N62l28L42N37L90M8P56P43o81O32M01k40M38
1908569C15461R61O90k14J1K86k86L85J207M18K6O60k92p03J004P98J74L2N20M5
1914902C21183j40R51O61m69L27M51O0K47P21M22m89M99N64m77L54J212K38l14
1920902C26001O68O1o32M76R01M92qN28k05q02J004Q16n2M14L86l51m92J021O10
1927235C30836M0O33N16j92j65P74J6r8L57J12nL84Q68k77m1P59p7k96Q03O13K
1934235C35562l05M61k45l84J271N62l31L68L95m48j39J443j89l6N08L56k53k31
$$ y = [297853, 297524, 297535, 298473, 298785, 299137, 299921, 300115, 299991, 300191, 301267, 300980, 301010, 302250, 302413, 302504, 303359, 304345, 303839, 303720, 304598, 304256, 304358, 305443, 306392, 306142, 306459, 306827, 306243, 306568, 307861, 308298, 308424, 308869, 309061, 308716, 309074, 310086, 310260, 310414, 311332, 311765, 311672, 311861, 312423, 312095, 312437, 312974, 313364, 313412, 314168, 314911, 314230, 314862, 315263, 315023, 315461, 316422, 317112, 316898, 316909, 317195, 316909, 317294, 318501, 318919, 318945, 319605, 319313, 318610, 319614, 320412, 320586, 320618, 321138, 321183, 321043, 321994, 322655, 322186, 322513, 322964, 323024, 323271, 323992, 324414, 323925, 324424, 324988, 324511, 324865, 326077, 326315, 326001, 326669, 326730, 326098, 326574, 327475, 327967, 327959, 328487, 328282, 327480, 328484, 329300, 329248, 329662, 330048, 329697, 329205, 330226, 330836, 330876, 331509, 332025, 331833, 331668, 332442, 332458, 332360, 332717, 332829, 332824, 333208, 334076, 333799, 333758, 334517, 334440, 334144, 334947, 335560, 335562, 335257, 335718, 335473, 335089, 336360, 336922, 336591, 336959, 337354, 336906, 336767, 338210, 338021, 337985, 338493, 338849, 338596, 338365]
1940235C38365O48M6j15N92J03k13K94P76j77r4N04K9l08P40O88l17o5N92l47n22
1946901C41219R46Q13k40Q2K26m44R1P99K57o1L07Q9o09K2J027J1n3N54j1n82L18
1953901C44761R92l11l18M26j27J10P30J52k64J37K54n85K04R98J11k81L30R8r31
1960234C46486M8Q36J68mK99p3m66K21P49o26L96P45k35o20O28O98q08J03K66l38
1966901C48473j60R11M8l81K7K22l32J74O87J12p26M54O2p10M12P45N6k91M9k26
1973567C49606m06O26M69l13K63K64o33p43R70L12q15J33N93k00m4N73j51l97L64
1979900C50471l10l54M68P29j12n74K89j63o01O78M75m20O8J48m00r08P04J16j10
1986233C50194L15K43p07j93M69R2o14K25K61l31m0P58k00p22N98k83l78L81O34
$$ y = [338365, 339013, 339059, 338944, 339536, 339639, 339426, 339720, 340496, 340319, 340225, 340729, 340758, 340450, 341190, 341878, 341561, 341496, 342088, 341741, 341219, 342165, 342978, 342738, 342820, 343046, 342602, 342693, 343492, 343749, 343688, 343995, 344084, 343475, 343497, 344524, 344535, 344482, 345036, 345025, 344443, 344761, 345753, 345442, 345124, 345550, 345423, 345533, 346263, 346415, 346151, 346288, 346542, 345957, 346161, 347159, 347270, 346989, 347319, 347417, 346486, 346534, 347370, 347538, 347534, 347833, 347760, 347294, 347515, 348264, 347638, 348034, 348779, 348544, 347924, 348552, 349250, 348442, 348545, 348811, 348473, 348313, 349224, 349272, 348891, 348918, 349140, 348808, 348982, 349669, 349781, 349055, 349509, 349571, 348861, 349273, 350018, 350074, 349783, 349832, 349606, 349200, 349826, 350295, 349982, 350245, 350509, 349876, 349133, 350103, 350415, 349600, 349733, 350326, 350126, 350082, 350655, 350504, 350107, 350471, 350161, 349807, 350275, 351004, 350892, 350318, 350607, 350444, 349843, 350521, 350996, 350576, 350644, 350792, 350392, 349484, 350188, 350304, 350194, 350509, 350752, 350045, 349852, 350321, 350413, 349799, 350024, 350285, 349954, 349914, 350672, 350472, 349750, 350348, 350065, 349687, 350068, 350702]
1992566C50702o29m58M22p78l09Q43L61m92n8K68n63l00L50j2j18J81j34q02o9
1998900C48405M68j18r0L84j85p92j83P38m11o26M92k62k94L96O74q56m52L78p41
2005233C46925r3P67O5n63r3M6p72k22O91M8n62J23j1q39k60M46k2k66K03J03m87
2012232C45227N6J33j094N9L37k47n00J51O04r71j42K20n02l41N90J53j007j23
2018232C42603j34o53K39N03J78q8j01n51j116J77N02%j98j65m55j071M74J51r92
2024565C39303M29J79o82l99N44Q1j176N77l6n97k51L04j46p54R0m29p71L75N59
2030898C37200l14k67r0q13p31k33Q83j2l77l0m72q74j35K47l86J09M23o43r30
2037232C32555L93K18j211J83m14m32K20N48q64p83L91o64n33L56M97n54m70L0
$$ y = [350702, 350073, 349615, 350037, 349259, 348950, 349793, 350154, 349662, 349604, 349872, 349309, 349009, 349359, 349347, 349229, 349410, 349276, 348474, 348405, 348873, 348755, 348665, 349049, 348864, 348072, 347889, 348627, 348216, 347590, 348082, 347820, 347526, 347922, 348596, 347740, 347288, 347666, 346925, 346832, 347599, 347664, 347101, 347008, 347054, 346282, 346060, 346751, 346799, 346237, 346360, 346349, 345510, 345250, 345696, 345674, 345408, 345611, 345714, 345227, 345283, 345416, 344322, 344381, 344718, 344471, 343971, 344122, 344726, 343755, 343613, 343833, 343331, 342990, 343580, 343733, 342726, 342603, 342469, 341816, 342055, 342558, 342736, 342648, 342547, 341996, 340880, 341057, 341559, 341559, 341361, 341196, 340741, 339670, 340144, 340295, 339303, 339732, 339911, 339229, 338830, 339374, 339455, 338279, 338856, 338820, 338223, 337972, 338276, 338130, 337376, 337466, 337037, 336266, 336641, 337200, 336886, 336619, 336529, 335716, 334985, 334752, 335635, 335623, 335246, 335216, 334744, 333870, 333735, 333982, 333596, 333705, 334128, 333485, 332555, 332948, 333166, 331955, 332138, 331724, 331292, 331512, 332060, 331196, 330413, 330804, 330140, 329607, 329963, 330460, 329906, 329436, 329466]
2043231C29466r39p76O83J24n73r1J28r42o23N00k32m42l6r6o89m99K08o61n53
2049564C23957L49l59n28K87M71r80o62N20m82n72K83J23o32n80K6r53p09P77J89
2055898C20525o69p6j91j241k84K74j75r4m7k71j057k23L42p72j87P3m41p95k54
2062231C14437M65p96m37J61p24m39K77M08j065l46rr07j51O66k73q46M3j80j806
2068564C08478l53R22l57l45N3o97j201J17k0n39m6j97n89n98K86k32r77k92K39
2074897C03652l39l67P6n3p10n19k53o99j22M55l50j067jm32j268J96K41n34m00
2081230B97506L73p21j126j95L40p15r6j01p17q25Q09m91j313L73q5o21l23K50
2087230B92322n55j029Ql15q60M1J81n71o12j67o59q16K02L80m16n90k8j078j325
$$ y = [329466, 328527, 327751, 328434, 328558, 327985, 327894, 328022, 327080, 326457, 326957, 326725, 326283, 326247, 326151, 325462, 324963, 325171, 324510, 323957, 324306, 323947, 323419, 323706, 324177, 323197, 322535, 323055, 322573, 322001, 322284, 322407, 321775, 321195, 321221, 320268, 319559, 320336, 320525, 319856, 319780, 319589, 318348, 318064, 318338, 318163, 318069, 318022, 317751, 316694, 316471, 316813, 316041, 315854, 315927, 315486, 314691, 314437, 314902, 314106, 313669, 313830, 313106, 312667, 312944, 313352, 312287, 311941, 311932, 311025, 310874, 311540, 311267, 310421, 310464, 310284, 308478, 308125, 309047, 308690, 308345, 308398, 307701, 306500, 306617, 306597, 306058, 306012, 305815, 305226, 304628, 304914, 304682, 303705, 303413, 303652, 303313, 302946, 303022, 302969, 302259, 301740, 301487, 300788, 300666, 301121, 300771, 299704, 299703, 299271, 298003, 298199, 298440, 297906, 297506, 297879, 297158, 296032, 295837, 296177, 295462, 295366, 295265, 294548, 293723, 294532, 294041, 292728, 293101, 293016, 292395, 292072, 292322, 291767, 290738, 290746, 290431, 289571, 289612, 289793, 289222, 288610, 288443, 287784, 286968, 287170, 287550, 287134, 286544, 286516, 285438, 284113]
2093563B84113N69K57l27k45l34j052p14L71m41p31K98l97o80l24j56o19p31k7
2099563B78830m27m28L05K85j105o06j9j008o57K93K11l46p26k12j089j195R63
2105229B73069K5q95j63k18r34p39M42p86m32K66l03r95J9M92j259r79L50n89n31
2111562B65840j11K58r93o55m5p12n87M99J73r59o17l67j153j74J36n5k33j83p43
2117896B59319j248m20N0k34o02j84j88p30n31K23p14j85k14o69m59L32l88j064
2123895B52094k54l72r44j16K23m73m04n03n70j111q0N58l47n97q3r04j302R5J88
2130228B45098n57k72m3n22r86l31n2q81K25k51q74o58M14j41j529J3L3r84j63
2136562B37539L45n59j418M2p0j218j86J12l11l24j27j070j147K96K50n09l12l46
$$ y = [284113, 284682, 284939, 284612, 284367, 284033, 282981, 282267, 282638, 282197, 281466, 281764, 281367, 280687, 280363, 280207, 279588, 278857, 278830, 278403, 277975, 278280, 278565, 277460, 276854, 276835, 275827, 275170, 275463, 275674, 275328, 274602, 274390, 273301, 272106, 273069, 273094, 272199, 272036, 271818, 270884, 270145, 270587, 269801, 269369, 269635, 269332, 268337, 268356, 268848, 267589, 266610, 266960, 266371, 265840, 265729, 265987, 264994, 264339, 264294, 263582, 262995, 263494, 263667, 262708, 262091, 261724, 260571, 260397, 260533, 260478, 260245, 260062, 259319, 258071, 257651, 257701, 257467, 256865, 256681, 256493, 255763, 255232, 255455, 254741, 254556, 254342, 253673, 253214, 253546, 253158, 252094, 251840, 251468, 250524, 250408, 250631, 250158, 249754, 249251, 248681, 247570, 247490, 248048, 247701, 247104, 247021, 246117, 244815, 244910, 245098, 244541, 244269, 244226, 243704, 242718, 242387, 242335, 241454, 241679, 241428, 240554, 239896, 240310, 240169, 238640, 238653, 238686, 237702, 237539, 237884, 237325, 235907, 235949, 235879, 234661, 234475, 234587, 234276, 233952, 233825, 232755, 231608, 231904, 232154, 231645, 231333, 230987]
2142561B30987q24j093J01Op00o5Mp21o38K19o59q00j09l54o66k57M93l11j434
2148895B23179j57l78j176M33J29o28n20J11j024j493N49J05m82l10J17j132p09
2154561B16614Q8p16m89K18j77p75o23J86q28n65m6k89n46j5k87n46q10O4p90p03
2161227B08965J35K41k51q70m43j195m78N34P5n99j87l63j448o08L10n81l36K72
2167227B03173j55j235m87L12j030m04n4l33m61J51j44j025m13m59n89l69M52M9
2173227A96979j301n23k05q08l03K33k07o45k56l67j061j71K71m79m83k14j54j047
2179227A89259k26j44o75l06K44l78r55P3k3q41m97k94o62m22L82k71q01l32o68
2185560A82463j129J87O53l09j033J41k94j210k16K07m44m75J11m52j465O4M34
$$ y = [230987, 230163, 229070, 229171, 229177, 228477, 228412, 228416, 227695, 227057, 227276, 226617, 225817, 225708, 225354, 224688, 224431, 224924, 224613, 223179, 223022, 222644, 221468, 221901, 222030, 221402, 220882, 220993, 219969, 218476, 219025, 219130, 218648, 218338, 218455, 217323, 216614, 216702, 215986, 215497, 215715, 215538, 214763, 214140, 214326, 213498, 212933, 212887, 212598, 212052, 212037, 211750, 211204, 210394, 210458, 209668, 208965, 209100, 209341, 209090, 208220, 207777, 206582, 206104, 206638, 206713, 206114, 205927, 205564, 204116, 203508, 203818, 203237, 202901, 203173, 203018, 201783, 201296, 201608, 200578, 200174, 200120, 199787, 199326, 199477, 199333, 198308, 197895, 197436, 196847, 196478, 196930, 196979, 195678, 195155, 194950, 194142, 193839, 194072, 193865, 193220, 192964, 192597, 191536, 191365, 191636, 191157, 190674, 190460, 190306, 189259, 189033, 188889, 188214, 187908, 188152, 187774, 186819, 186892, 186869, 186028, 185531, 185237, 184575, 184153, 184535, 184264, 183463, 183131, 182463, 181334, 181521, 182174, 181865, 180832, 180973, 180679, 179469, 179253, 179460, 179016, 178541, 178652, 178200, 176735, 176799, 177233]
2191226A77233p33j73m5q68j122K24j55q54K64j59j035m12J064q98q06P7p23q63
2197226A70016N7M09o92q04k94p23m66L11J20m87k20nq75j286P48l94n27j99j87
2203559A64502p24r38N46j73j004P2L4p57o47K84l15r18P7p27q28J28O67r67n38
2209892A57774j76o68n59M75K3m39m63l3q94r90M9l46m30L8K22q93l38L29n95o55
2216559A51431k5q3q15m39J040j432n16N3q10n65M63M04q60q37M77j409p43R44
2222559A46278J57r28k06J09j448l09O01J22p73n27O3r13l92L6k53l17%k90q98
2228892A40112k2Q3p59o07r0l39j12K91jp72n67n9p70k82L72k34q44j49j97j143
2235558A33911j08O57o5l69m5p07p96q5L9n12l9l1m94q70K19j17r02o5J5n41o41
$$ y = [177233, 176500, 176327, 176282, 175414, 174292, 174516, 174361, 173507, 173771, 173612, 172577, 172165, 173229, 172331, 171525, 171602, 170879, 170016, 170073, 170482, 169790, 168986, 168692, 167969, 167503, 167814, 167934, 167447, 167227, 167222, 166347, 165061, 165809, 165415, 164888, 164689, 164502, 163778, 162840, 163386, 163213, 162209, 162281, 162315, 161558, 160911, 161195, 160880, 159962, 160039, 159312, 158484, 158612, 159279, 158312, 157774, 157598, 156930, 156371, 156846, 156869, 156430, 155967, 155934, 155040, 154050, 154099, 153753, 153323, 153361, 153583, 152690, 152352, 152681, 152086, 151431, 151406, 151323, 150508, 150069, 151109, 149677, 149161, 149214, 148404, 147839, 148302, 148706, 147846, 147009, 147486, 146077, 145334, 146278, 146435, 145507, 145301, 145410, 143962, 143653, 144254, 144376, 143603, 143076, 143139, 142226, 141834, 141870, 141617, 141300, 141300, 141010, 140112, 140090, 140173, 139414, 138807, 138717, 138378, 138266, 138557, 138556, 137784, 137217, 137158, 136388, 136106, 136478, 136244, 135400, 135251, 135054, 133911, 133803, 134460, 134395, 134026, 133981, 133274, 132478, 132393, 132432, 131920, 131881, 131850, 131356, 130486, 130705, 130588, 129686, 129621, 129636, 129095, 128454]
2242558A28454K95j09p15K3m42p43j98N62n4m57M0r14j132K41M97m21m48J32l92
2248891A24219j000J10L24o76k00o3q00n36L59k40n92r6jl24l78K19k6o86n10k48
2255558A18855m12k29M60k54n78n1l87o40L81J76p15m44J97r79j120M59L8l08m
2261891A14445J19p18q07O82j70n08J98l2p62n20M61l19p62P5n14n55K84L88n16
2268224A10469p93k01k83m18K43L05m98k99J96r35o93O84o5n17O9J47r64n77L43
2274557A06213j43k36k05n34m98o6M04q46J68J27l68n00K36R3p53k92k14o31o1
2280890A01894M11N4q38R1l41r97q9Q78o9o51K65m13j099k68N81l59j15J88n06
2287223I8617q95N57O76j692J00L92o60o39O99L84j050l3j40o34r5K42k9q24O55
$$ y = [128454, 128749, 128640, 127925, 127948, 127506, 126763, 126565, 127127, 127073, 126616, 126656, 125742, 124610, 124851, 125348, 124927, 124479, 124611, 124219, 123219, 123329, 123653, 122977, 122777, 122714, 121914, 121378, 121737, 121497, 120905, 120809, 120808, 120484, 120106, 120325, 120299, 119613, 119103, 118855, 118443, 118214, 118674, 118420, 117842, 117791, 117404, 116764, 117145, 117321, 116606, 116162, 116359, 115380, 114260, 114719, 114757, 114449, 114445, 114564, 113846, 113039, 113721, 113551, 113043, 113241, 113209, 112447, 111927, 112388, 112069, 111307, 111382, 110868, 110313, 110597, 110985, 110469, 109676, 109475, 109192, 108774, 109017, 109322, 108824, 108525, 108721, 107786, 107093, 107777, 107712, 107195, 107264, 107411, 106447, 105870, 106213, 106070, 105834, 105629, 105095, 104597, 104531, 104935, 104089, 104257, 104384, 104016, 103516, 103752, 103845, 103092, 102800, 102586, 101955, 101894, 102305, 102359, 101521, 101612, 101271, 100274, 100185, 101063, 100994, 100343, 100608, 100195, 99096, 98828, 99409, 99050, 98935, 99123, 98617, 97722, 98279, 98955, 97263, 97363, 97755, 97095, 96456, 97155, 97539, 96489, 96456, 96316, 95682, 95587, 95829, 95800, 94976, 95631]
2293590I5631l57j191k56P70J27o01r1j64r33k13Q58k68m94j16n14o80N82N21o64
2299923I1947l25n3k22K7k30l03r9l7m60q19R81l46o20RJ46l66m42K58J78j593
2306589H7631N04J2r8L04K07o86q90O73k50q10O74J47o41o28K68l89l43J69L6m25
2313256H5465j59L8k84l6L79m89n43K4J3k84O8N58p75n82M3M7k51o4J84p97n00
2320255H2055O95l32k69N18q3q99k43M93j73m98M00k84o74q5J64Q7q5M32r51n30
2326922G9738J17k2m57Q9O45q49l66K32Lj46l7l1l76k23K9m31J21M57j96
$$ y = [95631, 95274, 94083, 93827, 94597, 94724, 94123, 94032, 93868, 92935, 92722, 93580, 93312, 92818, 92702, 92188, 91508, 92090, 92611, 91947, 91622, 91569, 91347, 91374, 91144, 90841, 90742, 90705, 90245, 89426, 90407, 90061, 89441, 89450, 89596, 89230, 88788, 89046, 89224, 87631, 88135, 88147, 88049, 88353, 88560, 87874, 86984, 87657, 87407, 86597, 87271, 87418, 86777, 86149, 86417, 86028, 85685, 85854, 85890, 85465, 85306, 85344, 85060, 85024, 85403, 84914, 84371, 84395, 84408, 84124, 84192, 84750, 83975, 83393, 83436, 83483, 83232, 83168, 83352, 82555, 82055, 82750, 82418, 82149, 82667, 82584, 81685, 81442, 81935, 81762, 81264, 81664, 81380, 80706, 80621, 80785, 80872, 80787, 81219, 80268, 79738, 79855, 79833, 79376, 79465, 80110, 79261, 78895, 79127, 79130, 78984, 78947, 78916, 78540, 78317, 78346, 77915, 78036, 78493, 78297]
##END=
