##TITLE= 1-vinylpyrrolidin-2-one
##JCAMP-DX= 5.01 $$converted from ppm to Hz
##DATA TYPE= NMR SPECTRUM
##DATA CLASS= XYDATA
##ORIGIN= PSLC
##OWNER= public domain
##DATE= 00/07/04
##TIME= 15:26:48
##LONGDATE= 2000/07/04 15:26:48 $$ export date from JSpecView
##SPECTROMETER/DATA SYSTEM= TECMAG APOLLO NTNMR
##INSTRUMENTAL PARAMETERS= ^1H
##.OBSERVE NUCLEUS= ^1H
##.OBSERVE FREQUENCY= 199.58295
##.SOLVENT NAME= CDCl3
##MOLFORM= C9H9NO
##CAS REGISTRY NO= 88-12-0
##XUNITS= HZ
##YUNITS= ARBITRARY UNITS
##XFACTOR= 2.29521094E-3
##YFACTOR= 2.03687564E-3
##FIRSTX= -263.5
##FIRSTY= -2.86294722
##LASTX= 2031.7109375
##NPOINTS= 18955
##XYDATA= (X++(Y..Y))
-114804a406O58p1o47n14J037O90o22J09P1l25K39j512K489n32j42P63m55n89O23E45
-113696c93p88Q93K340k154k10r3J55O62j443m66J205o74R73j773J245j160J576i45
-112694G16j516J028o28P72k2r17M4L35M63q67L05J82o14Q04L25k290K30P62P53c78
-111586H74j294n1l73N92j132J495q47n06Q35m54M1O64r81n33J906p69k77J020a031
-110531i26K63o22J683n46k36j29j50m59J712j515K44J5Q11j437J942p31j12k86B83
-109476c24n50Q56p45O55M77j153j5L64J123n39j550R35L02k31p0p82p84K625k138a628
-108368g31J129j381K78M71q86K31j13J098j238J149j704R25j563K261R87j273a410
-107418a393J488K50j406j83j22o42K686j492o41J421N23n22j401K641j908j064a130
$$ plain form
-114804 -1406 -748 -819 -1466 -1980 -943 -253 -875 -766 -695 -1020 -781 -2293 196 -336 -478 285 -170 -759 -136 545
-113696 -393 -1181 -288 2052 -102 -312 -405 -250 412 -1031 -1497 -292 -966 7 -1766 -521 -1681 -105 -945
-112694 716 -800 228 -400 372 350 -567 -523 -188 275 -592 -287 -105 -719 85 410 -1880 -1650 -888 -135 -378
-111586 874 -420 -471 -844 -252 -1384 111 -736 -1242 -407 -861 -820 -156 -1137 -1670 236 -533 -810 210 -1031
-110531 -926 -663 -1285 398 -148 -384 -513 -663 -1122 590 -925 -681 -666 145 -1292 650 -81 -193 -479 283
-109476 -324 -874 -18 -763 -108 369 -784 -799 -435 688 149 -1401 -466 -164 -395 -465 -1247 -2031 594 -1544 -1628
-108368 -731 398 -983 -705 -234 -1120 -889 -1002 96 -1142 7 -1697 -772 -2335 -74 913 -360 -1410
-107418 -1393 95 345 -1061 -1244 -1366 -2008 678 -814 -1455 -34 489 -33 -1434 1207 -701 -1765 -1130
-106468c68J9m69J174j261R80O07j466K0j117P20J482l33k301J891K84o06m94O63b036
-105413h5k66J18l61m6R33j523N08R18j17L28l85p43j67Lj053K093j323K247j333A99
-104305g0q2J03j043L17j370R35n28J355K50p44L55J11m60N52P17M96j290l89K71d80
-103197f95p4J19m57J169l72P5pk1K79J034j865R8o07k00J078N22K19m89L29o50b231
-102037a84o72r35J367Q28j330N68m26L82j025K684k227J015m16j15J776p74r1f81
-101034C57l73q76N05L4K4p28J746j432J54n78J111j39q47J134N68m91k9O2l87a038
-99926b87N51p2R39j384q01O9m58Q80m85K123j938P46M1k60j191j17O49L42Q90e31
-98818a023R49J20O2q63l90J260J78r01J82J24j67r20K180l319J167Q42J95J341C47
$$ plain form
-106468 -368 -349 -818 356 -905 75 682 -784 -764 -1881 -1161 321 -12 -2313 -422 -138 -744 -1238 -575 -2036
-105413 -85 -351 -233 -594 -640 293 -1230 -722 196 79 407 22 -721 -888 -885 -1938 155 -1168 1079 -254 199
-104305 -70 -152 -49 -1092 -775 -2145 -1210 -1738 -383 -133 -877 -522 -411 -871 -319 398 894 -396 -785 -514 -480
-103197 -695 -769 -650 -1107 62 -310 -235 -242 -263 16 1050 -815 -717 -1324 -1524 -446 76 295 -194 135 -515 -2231
-102037 -184 -856 -1791 -424 404 -926 -358 -784 -402 -1427 1257 -970 45 -371 -486 1290 516 425 -681
-101034 357 -16 -892 -387 -353 -329 -1057 689 -743 -589 -1167 -56 -195 -1042 92 660 169 140 202 -185 -1038
-99926 -287 264 192 1131 -253 -1054 -985 -1443 -563 -1048 1075 -863 -117 -76 -336 -1527 -1644 -995 -653 237 -531
-98818 -1023 -74 46 108 -755 -1145 115 293 -608 -426 -302 -469 -1389 791 -2528 -1361 -519 -324 1017 347
-97763d64k97N85m2k90R53j049J09m86J601J99j205l5R43o58J039j584r11J373a434
-96708d8n58p80l2P57o60J066l40M1m50J645j292N24r81o7K407k986J400r69M41b44
-95600f96O54r23O84m75P89o14j00P89j008m18O24P35k82j039j164K456P03k688B83
-94545a207O95J699p09k79j742K807k995K778j081j199K085o93j195K278j182d86
-93648c79j07J7n49N95m48j111J976j47O03n92j460J893m38P43j284r5L82o35a11
-92593a017Q41l47R36q03N24p27M42J265j071P20J258l604J681o91o8n64l42O93a031
-91537e38o39r01J618P63p48q99J263P53r66Pl90N14n49N76m46j309J243oK47b22
-90429I7j190P03N59j349R56J51J73q54n36R55k1q54K13J517j626q08J412m30i83
$$ plain form
-97763 -464 -761 -176 -218 -508 445 -604 -495 -981 620 819 -386 -421 522 -136 903 -681 -1592 -219 -1434
-96708 -48 -606 -1386 -1418 -661 -1321 -255 -595 -554 -1004 641 -651 -127 -1108 -1175 1232 -1754 -354 -1323 -882 -244
-95600 -696 -42 -965 -281 -756 33 -581 -681 108 -900 -1318 -694 41 -241 -1280 -2444 12 715 -1973 283
-94545 -1207 -512 1187 478 199 -1543 1264 -1731 1047 -34 -1233 852 159 -1036 1242 60 -486
-93648 -379 -486 -469 -1018 -423 -871 -1982 -6 -153 450 -142 -1602 291 -147 596 -688 -783 -401 -1036 -111
-92593 -1017 -176 -523 413 -390 134 -593 -151 1114 43 763 2021 -1583 98 -593 -661 -1225 -1567 -874 -1031
-91537 -538 -1177 -2078 -460 303 -445 -1344 -81 672 -294 -287 -677 -163 -712 -136 -582 -1891 -648 -654 -407 -222
-90429 97 -1093 -390 169 -1180 -224 -73 100 -754 -1290 -335 -356 -1210 -997 520 -1106 -1914 -502 -932 -983
-89374a147Q35j18o03J636p18o40O24Q64k051N49M66J82j402P86l60J834k013f05
-88372B28j191J558j201J266Q5j773J211p06j95J285M8j333jQ81j127J349j311G03
-87369i28J068j72q63P52J8n62j23K25j01p8j09K0J243j906J479j334J178P29B05
-86314h60j474J625J299j280O08j29k60J521p32j229k65N11K93L03n09m22O30E32
-85312a116R37l40J47O16j329P42J081j380Q6J391j262l7M81q10O26m47N41o63e21
-84257A361k276P45N71j144N99m54J602k22j652K37r63K660l432K627j257j0L5b60
-83254c53j261O41m13J094K47n72O80N81j266J004n52R6j27K1K12j168O68k70g55
-82199f84J566q67p07J418j976K030j344o64J680j765j561J210J402n94Q13j198a057
$$ plain form
-89374 -1147 -312 -430 -1033 603 -115 -755 -131 733 -1318 -769 -303 -121 -1523 -737 -1097 737 -1276 -605
-88372 228 -963 595 -606 660 745 -1028 183 -523 -718 567 615 -718 -719 162 -965 384 -927 703
-87369 -928 140 -32 -895 -143 -125 -687 -810 -585 -686 -764 -873 -853 390 -1516 -37 -1371 -193 536 205
-86314 -860 -2334 -709 590 -690 -82 -211 -471 1050 318 -911 -1176 -665 -372 -69 -578 -1000 -370 532
-85312 -1116 -179 -519 -372 244 -1085 -343 738 -642 -556 835 -427 -464 17 -793 -167 -614 -73 -736 -521
-84257 1361 -915 -170 401 -743 -144 -598 1004 782 -870 -633 -1596 1064 -2368 259 -998 -1008 -973 -260
-83254 -353 -1614 -973 -1386 -292 -45 -617 63 644 -622 382 -170 -74 -201 -180 32 -1136 -468 -738 -755
-82199 -684 882 15 -692 726 -1250 780 -564 -1228 452 -1313 -2874 -1664 -262 -856 -43 -1241 -1057
-81249c35p88J920j079j68L09j032K97m68J26K81j99J224o90L19K56p45J205p95a219
-80194ij607J630j560N64J46M08m47L89o10Q79N70k60r3Oj064O30k69k60O66j248g46
-79033g73O21n38L72O46k384Q94K036l603J102r5j37n32J578J96J400j238N48c53
-78031a89j27R4J392j534J105j812M87K59J3j491J886J84n93n87n11K064o36j303A295
-76976c55k8p08J39k38O94n94J235l07n54r7J424r06k41m45J76o11q44K312K10i62
-75868e71L45j472R05J202K82n08j299J678j290Q30j283J343J68l35L84n22L50h41
-74865a295R52J99J183j657K45o76O92qR92r85k34m00n08J197k54L02O82J90j37d98
-73758b02j606K656j369P57K45j421Q71j727K299o22n78m24J895k081Q24L52r40F59
$$ plain form
-81249 -335 -1123 797 -282 -450 -141 -1173 -876 -1344 -1218 -937 -1136 88 -602 -283 -27 -772 433 -362 -1219
-80194 -9 -1616 14 -1546 -982 -836 -428 -875 -486 -1096 -217 353 93 0 6 -1058 -428 -697 -957 -291 -1539 -746
-79033 -773 -152 -690 -318 328 -2056 -1162 874 -2729 -1627 -1722 -1859 -2391 -813 -617 783 -455 93 -353
-78031 -189 -316 -222 1170 -364 741 -1071 -584 -325 -312 -1803 83 267 -326 -913 -1424 640 4 -1299 1295
-76976 -355 -383 -1091 -952 -1190 -496 -1090 145 -162 -716 -813 611 -295 -536 -981 -805 -1416 -2260 52 262 -962
-75868 -571 -226 -1698 -793 409 691 183 -1116 562 -728 102 -1181 162 330 -5 379 -143 207 -841
-74865 -1295 -343 -144 1039 -618 -373 -1049 -357 -365 627 -358 -592 -992 -1500 -303 -557 -255 427 617 480 -498
-73758 -202 -1808 848 -521 236 481 -940 -69 -1796 503 -119 -697 -1121 774 -1307 -483 -131 -1071 659
-72755a136J119p75M65Q39j167l9m0J403j825O29k5L17q24J119l98M26K69j228i70
-71700i77J671q92j272J044L96j742N92P68O91j68j340M73J81m47M20J043q65F32
-70697d74L02j01J409j219k20R26k57j911J320q07P37L73p99N64o08R89o28P20g88
-69642H5r01J150k01O86j700k52J604r20J480j533J627j459j106J028J174j841c14
-68693G75P87k340J543j399J024j542Q63k80J548r91o31J865r92J357k603J906a00
-67743a225R50r67J233J13N97J23j626o53Q45P48j096R1Q34l25P84k21m49j125e14
-66688h82J491j337k77L64J279n14M67j634P85n2R55r01L63P10j515l91J110m05a722
-65633a619J270j661J119J025l52Q94j747R90m56J187j495J445j756m50Q29J612e0
$$ plain form
-72755 -1136 -17 -792 -327 512 -655 -694 -734 669 -1156 -527 -552 -235 -1059 60 -338 88 357 -871 -970
-71700 -977 694 -198 -1470 -426 -30 -1772 -1180 -412 279 111 -1229 -756 -575 -1022 -602 441 -424 632
-70697 -474 -172 -273 1136 -83 -303 623 366 -1545 -225 -1032 -295 78 -721 -157 -765 224 -404 316 -788
-69642 85 -816 334 133 819 -881 -1133 471 -449 1031 -502 1125 -334 -1440 -412 762 -1079 -314
-68693 775 1562 -778 765 -634 390 -1152 -289 -569 979 -12 -643 1222 230 1587 -1016 890 -100
-67743 -1225 -275 -1242 -9 104 701 824 -802 -1455 -610 138 -958 -867 -33 -358 426 205 -244 -1369 -514
-66688 -882 609 -728 -1005 -641 638 124 591 -1043 -258 -310 645 -256 107 817 -698 -1089 21 -384 -1722
-65633 -1619 -349 -2010 -891 134 -218 676 -1071 -81 -537 650 -845 600 -1156 -1606 -777 835 -50
-64683A36j138J146p77O04l98o85R05r44Q88k3N2P28j667j09J636L08p54J5J186d59
-63575H7l38j108K227k692J887o82N91r20R47J92o84K09l24K49l59M86M03R45a018
-62520h04J99l80K28J99l70m25K574k050k02M24p2l71J28J17m68K44K88n5Ln12a10
-61359d23P54J36K8j038k013L227j863J574r06J069j286N18k09N48N7j397M87C38
-60357e82M63k71J35Q88j483J206p91l36O69j458J053M22m04k86J236n60p08L23B37
-59301a382J060Q85j429N77k8J80j210K713j693O02l01K54P94p11j116L67J394G09
-58299b17L87N81K1j817J477r54O05j766N17l90O54J041q81O81j092J813r73O47c95
-57244E2m02m86O54N54rK85l20L56o35p54J77N92P70j714O02k86n2j1J661j234a178
$$ plain form
-64683 136 -1002 144 -633 -29 -427 -1112 -207 -1151 -263 -286 -234 494 -1173 -1282 354 662 -92 -77 1109 -459
-63575 87 -251 -1359 868 -1824 63 -619 -28 -948 -1 191 -493 -284 -608 -359 -718 -232 171 1116 -1018
-62520 -804 -605 -985 -757 -558 -928 -1353 1221 -829 -1031 -607 -679 -1050 -922 -805 -1273 -1029 -741 -796 -793 -1305 -110
-61359 -423 331 467 495 -543 -2556 671 -1192 382 -524 545 -741 -223 -432 116 173 -1224 -737 338
-60357 -582 -119 -390 -255 633 -850 356 -435 -771 -102 -1560 -507 -85 -489 -775 461 -99 -807 -484 237
-59301 -1382 -322 563 -866 -289 -317 -137 -1347 1366 -327 275 -26 228 1022 311 -805 -438 956 709
-58299 -217 170 751 772 -1045 432 -522 83 -1683 -1166 -1556 -902 139 -742 -61 -1153 660 -313 334 -395
-57244 52 -350 -836 -182 372 363 648 328 684 49 -705 -528 64 834 -880 -278 -564 -616 -627 1034 -200 -1178
-56083D96o73Q09j154P76j547J429j199J513qj005K43L1L52R80n94j088o17P00I48
-55028B43o68M26k16j80P55J71r4K88j309J59L68q41J179j580J031J358k297J071c36
-53973a59K52J072l000J864l91K75Q58j429P50l32k40j393J883J8P59l22m37k3d93
-52918I8k7L1J51j427K108r96L84j203R07j163J40j168J767l14J613m4j976P87a204
-51862a747J244m03N49j044q7J965k258J746n13J107j594n76J464L32k80m61j202a434
-50860f41J401r45j52J21j8K52o26l33j235J565L50m45o4L43Q72j35j334K55J816i69
-49752g97m1J369j440J530m42J84j430J907j333J590p76o72J193k172J477n92i40
-48802e30j20j29P69l64k02j01L25K37p25K50J270j592M5J122j334P95J015j53f67
$$ plain form
-56083 496 -177 632 -522 254 -1293 136 -1063 450 442 -563 -320 -289 63 1043 449 -639 -1256 -556 948
-55028 243 -425 1 -215 -395 360 531 437 725 -584 -425 -57 -898 281 -1299 -268 1090 -1207 -136 -336
-53973 -159 93 1165 -1835 29 -362 -87 771 -658 92 -240 -480 -1873 10 28 787 465 28 5 -493
-52918 98 71 102 253 -1174 934 -62 322 -881 26 -1137 -997 -2165 -398 -712 901 857 -1119 -332 -1204
-51862 -1747 -503 -906 -357 -1401 -1488 477 -1781 -35 -548 559 -1035 -1611 -147 185 -95 -556 -1758 -1434
-50860 -641 760 -185 -337 -216 -234 18 -608 -941 -2176 -611 -261 -706 -770 -427 445 310 -1024 -769 1047 -969
-49752 -797 -838 531 -909 621 179 363 -1067 840 -493 1097 321 -351 842 -1330 147 -445 -940
-48802 -530 -650 -779 -10 -374 -576 -677 -352 -115 -840 -590 680 -912 -867 255 -1079 -284 731 578 -667
-47747A60j324N53n29J907j2q80O04m56P19j903l23M49k92N13M68K81n9j44J109A703
-46639a006P30j097Q93n28N96j351J115K61J001k401K277j071J139j769K458j446a428
-45690f64J678N76k176o31Q77J256r83k29o80R55K27r3k44j921J811N98l50j023h43
-44634e98K06O53L18p26k49JK39N84j339N13K10o44N42P40r54M40m67k61N64j10c23
-43474I94j108k31r18L27J526j13j468K744k443M9O39r2j23P2L09J77j333m6O32C33
-42366a845J617j621J710l11j56K95J178n95r86m50R24J004n69j089J259j323a437
-41416C31p05P19J227k248K22p81R47j7O72r46L76q60J192r74q90J687j82Q54d97
-40361E67j371K152m28o91o31M04o59P1L89j21J032j745K292j967J346k265K620C23
$$ plain form
-47747 160 -1164 -611 -1140 767 755 -125 479 23 742 -1161 -1484 -1035 -1327 -814 -346 -65 -124 -268 841 1703
-46639 -1006 -276 -1373 -480 -1008 -412 -1763 -648 -387 614 -1787 490 -581 558 -1211 1247 -199 -1428
-45690 -664 1014 1590 -586 -1217 -340 916 -67 -296 -976 -21 206 113 -131 -2052 -241 357 7 -1016 -843
-44634 -598 -392 261 579 -147 -396 -395 -156 428 -911 -398 -188 -832 -290 450 -504 -64 -531 -792 -228 -338 -323
-43474 994 -114 -345 -1263 -936 590 477 -991 1753 -690 -641 -2 -94 -217 -145 164 341 -992 -1038 -406 333
-42366 -1845 -228 -1849 -139 -450 -606 -311 867 272 -714 -1164 -240 764 195 -894 365 -958 -1437
-41416 331 -374 345 1572 -676 -454 -1235 -288 -305 367 -579 -203 -1063 129 -845 -1735 -48 -230 624 -497
-40361 567 -804 1348 920 229 -402 2 -657 -586 -197 -318 714 -1031 1261 -706 640 -1625 995 323
-39358A365k691J750r93J235p96m40P43k09P11j807J709j731R42j83r17R94M85B62
-38356b81J96%J269j390O2p23p6R43K52J36o90n92J880q32j120R75J32r98J561b45
-37248b85K196k16j629L84l96l18n41Q86M98j370M94K246k245Q22L80m49j485i72
-36246i8J05o62K091k951J567n95N87O69j149L65ol20Q50j113j0O53j174J634a54
-35190G4N83M15q04j873J689P68j2M49p69R55r78m93l99Q59m97M08k190J212k82i39
-34083h9J107L57l18j471J639n92mj260O23k30n58J054j58j75n7Q08j731K853a30
-33027A008q93J33J94j657L796k435m09l08n24J189J73j683J425m90K26R64q80f66
-32025A251k108O73m83O30L64j473K656k759J033p31J465k158L52Q87O60j35q51e01
$$ plain form
-39358 1365 -1326 424 -569 666 -130 -570 173 -36 675 -1132 577 -1154 -212 -395 -1312 -318 167 262
-38356 -281 -85 -85 1184 -206 -144 -867 -943 0 252 388 -302 -894 986 154 -966 9 141 -857 704 -245
-37248 -285 1911 1695 66 450 54 -264 -805 81 579 -791 -297 1949 -296 526 906 457 -1028 -972
-36246 -98 7 -655 1436 -1515 52 -543 44 713 -436 -71 -77 -397 453 -660 -670 -17 -1191 443 -154
-35190 74 657 1072 268 -1605 84 852 840 1289 520 1475 497 4 -395 464 -33 375 -1815 -603 -885 -939
-34083 -89 1018 1375 1057 -414 1225 633 629 -631 -8 -238 -796 258 100 -75 -132 676 -1055 1798 -130
-33027 1008 115 248 442 -1215 2581 146 -263 -571 -1095 94 267 -1416 9 -481 -255 709 -171 -666
-32025 1251 -857 -184 -667 -37 327 -1146 1510 -1249 -216 -947 518 -1640 -1288 -401 259 124 -727 -501
-31022E76n16j376m43J313J64M05k12L65j052O82J195j935L24J675p80L14L73b03
-30020a019J800o59r26O56J175k328M27j4J21L54j03M42J792l014J791o4k183A67
-29018A702k833J531p10q37Q13N78m89N39k50M96l50L10r10R46o34j234J083K48b71
-27962e90l63J128n97p47J436P0r87J28N71j10M47n95Q46q01n68J777l98N53j061I8
-26854E96K63o91n71J374k531K942j158N11J728k399j201j606j191R4K289J144A420
-25905F25R76N3j462J21J090k450J010j012R65n13n07J547q90Q66j95j049p92i72
-24902a744O12J670m63j353q57K001O19j381l90J990j327O89o63J184q84J13R99a52
-23900a53J046r18O4N0j52L40l31J603k121P01m80m01J941j629J485j496L74n47d50
$$ plain form
-31022 576 60 -1316 -1759 -446 -282 123 -89 276 -776 -94 1101 -834 -510 1165 385 699 1072 -203
-30020 -1019 781 122 -804 -148 1027 -1301 -874 -888 -767 -413 -516 -74 1718 -1296 495 431 -1752 167
-29018 1702 -1131 400 -310 -1147 -334 244 -245 294 44 540 190 500 -410 536 -98 -1332 -249 -1 -271
-27962 -590 -953 175 -422 -1169 267 337 -650 -522 49 -61 386 -209 637 -164 -732 1045 647 1200 139 98
-26854 596 859 168 -403 971 -1560 1382 224 735 2463 64 -1137 -2743 -3934 -3840 -1551 -407 1420
-25905 625 1601 1654 192 313 1403 -1047 -37 -1049 -84 -597 -1104 443 -447 419 224 -825 -1617 -972
-24902 -1744 -1132 538 75 -1278 -2135 -134 485 -896 -1286 704 -623 66 -597 587 -297 -184 815 -152
-23900 -153 893 -25 39 89 -63 277 -54 1549 -572 129 -351 -752 1189 -440 1045 -451 -77 -624 -450
-22845A272r84r00J028j35o33k00Q45Q14k445K935j868m8j373J652M93p68k84H01
-21842a114Q91K77N68j904J818j677J217j137P05K64N89j76q75l37P62p7j896E73
-20840A386k027L092k926PR99r55R14M79k056J084l13J57p16j14J365q92R30j571H82
-19785I6m92O66j411J530j109N47k52J521p62p93j18O06N03r69J251K8j499q9I45
-18730D47J12K73K66j950K416n49k87J131j852K23M0J011j346L75l62Q19p22K90F03
-17674i04M70J067J020j491N65q29K4L14L97j52J51k60J123m58r82o98Q98J19E36
-16619e80J189o19R05n60M75J51O63p47J18Q8n06o72J59K25j067M64J769j253C99
-15564d73P42q55K094j627K52R51l36p44j62J01J236j483K661k031j303J407O83C88
$$ plain form
-22845 1272 288 -612 416 281 -352 -552 293 1107 -1338 1597 -271 -319 -1692 -40 453 -315 -599 801
-21842 -1114 -223 54 622 -1282 536 -1141 76 -1061 -356 -92 497 321 -554 -891 -129 -206 -2102 573
-20840 1386 -641 2451 -475 -468 531 -424 490 969 -1087 -3 -316 -159 -875 -989 376 -516 414 -1157 882
-19785 96 -396 270 -1141 389 -720 -173 -425 1096 334 -459 -577 29 532 -437 814 842 -657 -746 945
-18730 447 559 832 1098 -852 1564 1015 728 1859 7 230 270 1281 -65 310 -52 767 45 335 603
-17674 -904 -434 633 1653 162 727 -102 -78 236 633 481 632 372 1495 1037 55 -643 255 374 536
-16619 -580 609 -10 895 335 810 961 1624 877 995 1083 577 -95 64 289 -778 -314 1455 202 399
-15564 -473 269 -586 1508 -119 133 1084 748 4 -158 -57 1179 -304 2357 326 -977 430 1113 388
-14562I19l06q7P79Q32r66j053J978k487m644K248J803L36N35k56Q33j98P36o81E80
-13506G01L2o02P81m63J52k52P41n28q28J395j242J376j048J295q50m06q70K198G2
-12451B474l048L51K196k52j741M94k28j108R78R96q21J485j576J590j557j091A288
-11502D21O51j149j30J166k0M35p61j69k38L224l200R73p35Q05M85J193j566N70D68
-10446B145k098L15J506q16R78j845J203p04M18J47k38r01J231J03k76j53N41A320
-9444A445k94Q86n05j39J19M80J63o5q86J431m13j531J564l41j846K271l26j117A932
-8389B956k14l76l06r14J136L44j530J015J34m11J54K20m60o42K015j499O68B321
-7386A314J236n1n7r8j164R14j84J453j97n79L61J246m34k79p95n27J670k457B689
$$ plain form
-14562 919 613 526 1305 2137 1171 118 2096 -391 -5035 -2787 -984 -648 -113 -369 464 266 1002 321 580
-13506 701 733 131 912 449 601 349 1090 562 -266 1129 -113 1263 215 1510 660 254 -616 1582 72
-12451 2474 -574 -223 1973 1721 -20 474 246 -862 116 1112 291 1776 200 1790 233 -858 1288
-11502 421 1072 -77 -207 959 939 1374 613 444 206 3430 230 1203 468 1273 1758 2951 1385 1955 468
-10446 2145 47 362 1868 1052 2030 185 1388 684 1102 1249 1011 110 1341 1444 1168 1015 1556 1320
-9444 1445 1151 2037 1532 1393 1512 1992 2155 2090 1204 2635 2222 691 2255 1914 68 2339 2013 896 1932
-8389 2956 2742 2366 2060 1146 2282 2626 1096 2111 2245 1834 1988 2208 1748 1106 3121 1622 2290 2321
-7386 1314 2550 2499 2442 2344 1180 2094 1910 3363 3166 2587 2948 4194 3760 3481 2686 2159 3829 1372 2689
-6331D044m23p19J393k179J985m01P78k92j290R16o84J123p04q96J047Q56M59D432
-5329C451P57L5o43J81J111k85J579J95j590J801J28J80O50P64j902j507M312H023
-4326G227J128j269P94o16J461J86j631K381j118L01l72N50l16J237j498n87H823
-3377I168R46K82L24q24J342o01L84R12p1P24J400q53J879O4j330J797o07J592A7894
-2321A7886R00R25p43J25Q18L10q3P16J420M25O9O23J886L155Q668Q878m546C6602
-1319B9053K13m269l824n30lK107M83K114L889J961L319K184Q734O654Q639K925F5711
-369G2838J8016K8942O1007J26825L08437L71280k11548k99761p5035j48564A31942
264F8678k5842j4250n578k166k459k830l295Q2j65j496k55o69K373r22l73H731
$$ plain form
-6331 4044 3621 2902 4295 2116 4101 3700 4478 4186 2896 3812 3128 4251 3547 2651 3698 4554 5013 4432
-5329 3451 4208 4243 3600 3781 4892 4607 6186 6381 4791 6592 6720 6900 7550 8314 6412 4905 9217 8023
-4326 7227 8355 7086 7880 7264 8725 8911 7280 9661 8543 8844 8472 9022 8706 9943 8445 7858 8823
-3377 9168 10114 10396 10720 9896 11238 10637 11021 11933 11862 12586 13986 13133 15012 15076 13746 15543 14936 16528 17894
-2321 17886 18786 19711 18968 19093 19911 20221 20138 20854 22274 22699 22768 23391 25277 28432 37100 45978 41432 36602
-1319 29053 29266 24997 21173 20643 20640 22747 23230 25344 29233 31194 34513 36697 45431 52085 60724 63649 65711
-369 72838 90854 119796 180803 307628 616065 987345 775797 476036 401001 252437 131942
264 68678 42836 28586 23008 20842 18383 15553 12258 12340 12175 10679 10424 9755 12128 11206 10833 8731
1161G361p54L266M930J2173j837q245k973m017m071k364q69j777O55J361j781c2
2058D54m76j70J11J433l17p79K343j777o58k22J191j76J37n89o57M48j259R31c81
3113d96k13J097r5j071J96R3j41O9K242r15j444M18j175j607K130n49j264J743a450
4168b594J595J02j095O98j11o96m56k0J414j096m65K793j902P92N69j70Q55a818
5170a510M42L79m4L73k23k25L71n73Ql46J710j123n27J292j167j69k45J292a430
6226a499k09J08M53K29J70j768L75K202j204J134M6r51L08j704K332j069J485i29
7228b035J809r02j219J153R00l40j086P55j61j217J840j610J419j452O67J747a962
8178a189J082k337M55J94K05L86q82K426o58j60j150L96p6J5j4M12n57K56q5i86
$$ plain form
1161 7361 6607 9873 14803 26976 25139 16894 13921 9904 5833 3469 2600 823 1478 2839 1058 -32
2058 454 -22 -192 -81 1352 1035 256 2599 822 164 -58 1133 957 1094 505 -152 296 -963 -32 -381
3113 -496 -709 388 293 -778 -582 -489 -630 -561 1681 766 -678 -260 -1435 -3042 -912 -1461 -2725 -982 -1450
4168 -2594 -999 -897 -1992 -1294 -1405 -2101 -2557 -2577 -1163 -2259 -2724 69 -1833 -1041 -472 -642 213 -1818
5170 -1510 -1068 -689 -733 -360 -583 -808 -437 -1010 -1002 -1348 362 -761 -1288 4 -1163 -1332 -1577 -285 -1430
6226 -1499 -1708 -1600 -1147 -918 -748 -2516 -2141 61 -1143 -9 37 -914 -606 -2310 22 -1047 438 -929
7228 -2035 -226 -1128 -2347 -1194 -294 -634 -1720 -965 -1126 -2343 -503 -2113 -694 -2146 -1479 268 -1962
8178 -1189 -107 -2444 -1989 -1795 -1590 -1204 -2086 340 -318 -478 -1628 -1232 -1308 -1293 -1307 -895 -1452 -1196 -1281 -986
9286b9j697O11l89J300j496J865k216J028j65n98K42j36Q65m38M21p3O61m60h96
10341f56j408J030n63J097q87n39Q46l65J410k068m96P11K468q57k53j288o9a792
11343a474J419j549J185k44j546P56l06J398J51k51j085J49j30N85K52Pj476f50
12346A63j582k5N59j221J177J96P69j023R23m67m69r10N16Q9N00L54p72J050a271
13401a519J099j323O36K5L6n10j02P84Q54l37k66J839j553p83M99r93o82P63d04
14456i60k08O29o61O25j977K89Q16o90R00P32j426O25r97J479O25q90k32K46i27
15511d09k48p34J060j538J694k747J909N02j289P60j44P22j792J032j41L15j609i11
16514b015J496k259K236O1m74Q28q47O59M3j040O99M1l86L10n56J056k74j009a417
$$ plain form
9286 -29 -1726 -1115 -1504 -204 -1700 165 -2051 -1023 -1188 -1786 -1544 -1680 -815 -1253 -832 -905 -244 -704 -896
10341 -656 -2064 -1034 -1597 -500 -1387 -1926 -1080 -1445 -35 -2103 -2599 -1888 580 -277 -530 -1818 -1887 -1792
11343 -1474 -55 -1604 -419 -663 -2209 -1453 -1759 -361 -210 -461 -1546 -1397 -1527 -942 -690 -683 -2159 -650
12346 163 -1419 -1444 -885 -2106 -929 -733 36 -987 -64 -531 -1000 -1910 -1394 -1305 -805 -451 -1223 -173 -1271
13401 -1519 -420 -1743 -1107 -1082 -1046 -1556 -1658 -874 -20 -357 -623 1216 -337 -1120 -621 -1614 -2296 -1533 -404
14456 -960 -1168 -539 -1200 -575 -2552 -2263 -1447 -2137 -1237 -505 -1931 -1306 -2303 -824 -199 -1089 -1321 -1075 -927
15511 -409 -657 -1391 -331 -1869 -175 -2922 -1013 -511 -1800 -1040 -1184 -462 -2254 -1222 -1363 -1048 -2657 -911
16514 -2015 -519 -2778 -542 -481 -955 -127 -974 -315 -272 -1312 -613 -572 -958 -648 -1204 -148 -422 -1431 -1417
17569b44o12n92J326j974J639j127P66p05N35O06R3p25J213K88m96o15L77j247b7
18624g68K29p68l1Q52K04j84O35j014p16Q31m90N63n53M01Q29j11o85P87n32e63
19732e51P70m34r82r0P59K64N1j910M52R17K87O96q84q10L35R77q68l13R57j408b710
20893a833p47K315n01J3K8m97O61O34j685P27L27O99j800J367P73j650J161j250a153
21948e88q0n60J490j46L14k49q95j516K364r15Q01m62k5J180j589O31K71r00f68
23003a810J476n8j302K405j003O30j321j34J1K512j418m36J547k060J231k50d74
23953h96P64l77J40j028J333j9j023Q62k02q66J545M09K84j894nm4J156k44j60b88
25061D70r23J106j501Q44M52Q41O1J90J433m79k7j45j656J178J101j558L28K134D596
$$ plain form
17569 -244 -856 -1448 -122 -2096 -457 -1584 -818 -1523 -988 -382 -289 -1014 199 487 -9 -624 -247 -1494 -27
18624 -768 -539 -1307 -1338 -486 -282 -466 169 -845 -1561 -730 -1220 -657 -1210 -809 20 -91 -776 11 -521 -563
19732 -551 219 -215 -1197 -1287 -528 -264 -213 -2123 -1671 -754 -467 229 -655 -1465 -1130 -153 -1021 -1334 -377 -1785 -2710
20893 -1833 -2580 -265 -766 -753 -725 -1222 -561 73 -1612 -885 -558 141 -1659 -292 481 -1169 -8 -1258 -1153
21948 -588 -668 -1228 262 116 430 181 -714 -2230 134 -781 20 -442 -467 713 -876 -245 26 -874 -668
23003 -1810 -334 -392 -1694 711 -292 338 -983 -1117 -1106 1406 -12 -448 1099 -961 270 20 -474
23953 -896 -132 -509 -369 -1397 -64 -83 -1106 -244 -446 -1312 233 642 926 -968 -973 -1017 139 -105 -265 -288
25061 470 -453 653 -848 -4 448 1289 1350 1540 2973 2494 2467 2322 666 1844 2945 1387 1715 3849 4596
26116C967m341q22J422j195r57R19m03j70O53j210J574k073J031l6Q54Q25j613f8
27118c46K1r89o0J049q93k65m74R09k57J96k67o79J384j424J238o48M91l09j63a481
28226f34k33o78r00K305n75j59n68n13J536j025m89J45J061L18o19j70K36m65f71
29281a277o48J805n38r05k12q05N24m51J529n67M32J472p46L81j412P70r42k58a973
30337b344J458l39J420j55j083o71R96l33m35J218j388K15p45J791j246j29O96a146
31339a78Q9l30k91R00j029p74K46J606q67Q64k193L27L98j76J830j413K699k880d76
32394d68j166j13Q37M08q14J95Q5k67n04M19M66M08m81O8m90R02K54j129l01c87
33502D58k408M48P62L92j453J283j088l42j207K541l94J626j540O50j398Q80g77
$$ plain form
26116 3967 -374 -1196 226 -969 -1926 -1007 -1410 -1580 -927 -2137 -563 -2636 -1605 -1641 -787 38 -1575 -68
27118 -346 -325 -1314 -1374 -325 -1218 -1483 -1957 -1048 -1305 -1109 -1376 -2055 -671 -2095 -857 -1505 -1014 -1323 -1486 -1481
28226 -634 -867 -1545 -2445 -140 -715 -874 -1442 -1955 -419 -1444 -1933 -1788 -727 -409 -1028 -1198 -962 -1427 -671
29281 -1277 -1925 -120 -658 -1563 -1775 -2580 -2056 -2507 -978 -1545 -1113 359 -387 -6 -1418 -648 -1590 -1848 -1973
30337 -2344 -886 -1225 195 40 -1043 -1714 -718 -1051 -1486 -268 -1656 -1441 -2186 -395 -1641 -1770 -1074 -1146
31339 -178 -89 -419 -710 190 -839 -1613 -1367 239 -628 236 -1957 -1630 -1232 -1408 422 -991 1708 -1172 -476
32394 -468 -1634 -1747 -910 -502 -1316 -1121 -1036 -1303 -1807 -1388 -922 -514 -995 -927 -1417 -515 -261 -1390 -1691 -387
33502 458 -1950 -1502 -740 -348 -1801 -518 -1606 -1948 -3155 -614 -1008 618 -922 -272 -1670 -790 -777
34452f08N20j306o81k65J923J5o19M19P30p29R38k22j186J16l89J467m6j230a391
35507a207J20K781j766j246o58J216j72r33J445o75j357J094K37j19K56j319a769
36457a320J443o47k80m81L20J523k498K783n45k312J396Q33p37K2J507k262R08f75
37459g00M2O49j726o64J609P97j165J191k09R6n43J382j877j01m42P03j890K014f18
38514a305O44p5o28J764K38r11M24j406l01J535n16j453K155j643J334q29R62b31
39517b264J404n72M78M35k44J049q29l5j219N46Q62r71J968j395l13P21k81l71a018
40572f04o58J418j300J535q73J34k87L69n53r34M45P30P29j125l06L22J113k03b88
41627a066M6L38j22Q35j703l1p2l70N56O02j86J560j578J008j641J539M74r48g13
$$ plain form
34452 -608 -88 -1394 -2075 -2340 -417 -402 -1021 -602 128 -601 337 115 -1071 -955 -1344 123 77 -1153 -1391
35507 -1207 -1087 1694 -72 -1318 -1976 -760 -932 -1865 -420 -1095 -2452 -1358 -1121 -1240 -984 -2303 -1769
36457 -1320 123 -524 -804 -1285 -965 558 -1940 843 298 -2014 -618 215 -522 -500 1007 -1255 -347 -675
37459 -700 -658 -9 -1735 -2399 -790 7 -1158 33 -176 -80 -623 759 -1118 -1219 -1661 -958 -2848 -834 -618
38514 -1305 -661 -736 -1364 400 638 -273 151 -1255 -1556 -21 -537 -1990 165 -1478 -144 -973 -11 -231
39517 -2264 -860 -1432 -954 -519 -763 286 -543 -578 -1797 -1251 -389 -1360 608 -787 -1100 -379 -660 -1031 -1018
40572 -604 -1262 156 -1144 391 -482 -348 -635 -266 -819 -1753 -1308 -578 151 -974 -1280 -958 155 -48 -288
41627 -1066 -1020 -682 -804 31 -1672 -1703 -1775 -2145 -1589 -987 -1173 387 -1191 -183 -1824 -285 189 -759 -713
42682h94m9l77J549n90l76O39j249K78J405j033M32L0o24o16l6m15J586l46L18f02
43790c48k17K19p2O6j175J587K68k120J743p57O11j578O81Q02j327J280r74O13i55
44845el22l47K33o73J467j948J785k49n05K78L35Q00k615J166J17k71n13J58B83
45901g76J98L27j215O84P22j643k51J927r04N01n05j31n6n28N55J5r51K265k175e22
47009h74J461j492Q56j570J276J47j213l31N40J053o93Nm35P18N44j243k54M20a999
48064B37j34l22j14o46j91n92J904j258L36l33J0j02K82J26o93RL783m508K330g95
49172a095j31Q34j956J728K28j88m62o19J17j12M32M12q66N17n41J193N59r47F6
50227a281L39M3K9K096j511j94k62k85K96n69J518o16m51K88m00n34K86J493b037
$$ plain form
42682 -894 -943 -1320 229 -361 -737 -98 -1347 -1069 336 -697 -265 -235 -859 -1475 -1511 -1926 -340 -686 -368 -602
43790 -348 -565 -346 -418 -352 -1527 60 328 -1792 -49 -806 -195 -1773 -1092 -290 -1617 -337 -1311 -698 -955
44845 -5 -327 -674 -441 -1114 353 -1595 190 -59 -564 -286 49 849 -1766 -600 -483 -754 -1267 -1109 283
45901 -776 -578 -251 -1466 -782 -60 -1703 -1954 -27 -931 -430 -935 -1066 -1122 -1650 -1095 -1080 -2031 234 -1941 -522
47009 -874 587 -905 -49 -1619 -343 -196 -1409 -1740 -1200 -147 -840 -835 -1270 -552 -8 -1251 -1505 -1085 -1999
48064 237 103 -219 -333 -979 -1170 -1762 142 -1116 -780 -1113 -1103 -1205 -923 -797 -1490 -1481 2302 -2206 124 -795
49172 -1095 -1226 -392 -2348 -620 -392 -580 -1042 -1661 -1544 -1656 -1224 -812 -1678 -1161 -1702 -509 50 -897 66
50227 -1281 -942 -899 -870 1226 -285 -479 -741 -1026 -730 -1299 219 -397 -848 -560 -960 -1494 -1208 285 -2037
51282d20M3l24M2j71J228k164J204P31m30M10l68Q14j081P34j799J691j690L19a125
52337A02r01Mj55n71J734r91k74l31R06j332J593k33r55l01J833j548R28L8L35D29
53445E0k21n78P28j81n46m14l36K360q51p35K39p6N08L80m34j24j8k37O28j115a762
54606a104J298j101m10Q8P75J23J8q9q94k6K1J13J873q41K78p53n09K88l52J416a565
55767a009q72J750q7o24R59p64O10r36J36J245r67n77J061k09l37j019J610j565e27
56822C14q57N93j173l40J166L58n27N91n35p5L30j684M92n29J896r70k43K19D40
57877f43O80j868K343j095j02K74j014J06N22J007o66p63J91j17J333P04j545D1
58879H65q92j348N95r65J142K97J40m04k02O06N78m62m80q8m52J667j885j0P72f27
$$ plain form
51282 -420 -377 -701 -659 -830 398 -1766 -562 169 -261 149 -219 595 -486 248 -1551 140 -1550 -1231 -1125
52337 102 -799 -795 -950 -1521 213 -778 -1052 -1383 -477 -1809 -216 -449 -1404 -1705 128 -1420 -492 -454 -119 429
53445 50 -171 -749 -21 -202 -748 -1162 -1498 862 11 -724 -485 -561 -53 327 -107 -231 -249 -486 142 -973 -1762
54606 -1104 194 -907 -1317 -1229 -454 -331 -313 -402 -1296 -1322 -1301 -1188 685 -156 122 -631 -1140 -852 -1204 212 -1565
55767 -1009 -1881 -131 -218 -842 117 -647 -37 -973 -837 408 -559 -1136 -75 -284 -621 -1640 -30 -1595 -527
56822 314 -543 50 -1123 -1463 -297 61 -466 125 -410 -485 -155 -1839 -1347 -1876 20 -950 -1193 -974 440
57877 -643 37 -1831 512 -583 -685 -411 -1425 -1319 -797 210 -456 -1219 -1028 -1145 188 892 -653 41
58879 865 -27 -1375 -780 -1745 -603 -306 -166 -570 -772 -166 412 -50 -530 -618 -1070 597 -1288 -1298 -526 -627
59987g19L65o28J219l94j10o77N85j120O31R59m51J127p75o48L4O2K64O36k45b422
61095a22n19M57j87j335J034P57j92J3p09m36L39p1L24n85n65J575J92k5l89a20
62203c92L55j307J699j399N33p21Q60m10J192k085J633j035M81Q21l24O31j936a221
63206A34n40J69j028J122j210M58J363m30j062J375j145J59O40m95J365q05j612c33
64208a463k4R99K91K37m24m05j67J224n16P02r73j583K131j077J5O10R26j007a354
65263c79Q08l43j119j79M02j178J268K15l54K0J9Q36m16J066j066r8n74J742h03
66318c27k89o51Q86p49N26q85QN35O07j158J691j178M42k54K67o59R94j78j161g80
67426A65k76m17L2L04N96j846J902K63j162l68m24P15R16o23M27j367R74j69A233
$$ plain form
59987 -719 -354 -982 237 -157 -267 -944 -359 -1479 -848 111 -340 787 12 -636 -602 -540 -276 360 115 -2422
61095 -122 -641 -184 -371 -1706 -672 85 -107 -94 -803 -1239 -900 -971 -647 -1232 -1797 -222 -30 -55 -444 -120
62203 -392 -37 -1344 355 -1044 -511 -1232 -372 -782 410 -1675 -42 -1077 -596 225 -99 532 -1404 -1221
63206 134 -406 -237 -1265 -143 -1353 -895 468 38 -1024 351 -794 -635 5 -490 875 70 -1542 -333
64208 -1463 -1487 -488 -197 40 -384 -789 -956 268 -248 454 -519 -2102 29 -1048 -1033 -423 503 -504 -1354
65263 -379 429 86 -1033 -1212 -810 -1988 -720 -505 -859 -839 -820 16 -400 666 -400 -498 -1072 670 -803
66318 -327 -616 -1267 -381 -1130 -604 -1489 -1481 -946 -339 -1497 194 -984 -542 -796 -529 -1188 -194 -372 -1533 -780
67426 165 -111 -528 -496 -192 404 -1442 460 723 -439 -807 -1231 -516 400 -223 204 -1163 -189 -358 1233
68482e95J239j386K19O02j043k34J342r4M06l93r36J480L95o94m61l92J2J152H73
69537h3K86j445J775M60j692k37N71l50K05J638k11q19j890J927k08j050J363E93
70539h36o81M82O50l25l12O0N05R51j280J015L68L36j104j002P23L58P3J110f28
71594D7K48k77J317j503P86M13m11j623J145P29k599O48l47J940l88J174j298f93
72597F87j210J0R86j138J554n10k54j232J863L31j626P83o3R27p08J57j67j828C
73652A152r96J79k470J579P11P82j000j96J158k61M66j628Q27P69j253n6M54B51
74654A108l60l28mp55Q17n39J70Q06j077J157Q59k120J829p65J188m55j750K089A1
75710A59R87n52j968J364N62k44r22n58J593m87J591k649j72J91J610j312Q70D56
$$ plain form
68482 -595 644 -742 -523 79 -964 -1198 144 50 456 63 -873 607 1002 308 -153 -545 -533 619 873
69537 -83 203 -1242 533 993 -699 -936 -365 -715 -510 1128 917 98 -1792 135 -73 -1123 240 593
70539 -836 -1517 -1035 -385 -710 -1022 -962 -457 494 -786 229 597 933 -171 -1173 -450 -92 -19 1091 -628
71594 47 295 18 1335 -168 618 1031 620 -1003 142 871 -1728 -1080 -1427 513 125 1299 1 -693
72597 687 -523 -513 473 -665 889 379 125 -1107 756 1087 -539 244 181 1108 400 557 390 -1438 3
73652 1152 156 335 -2135 -556 155 937 -63 -259 899 638 1104 -524 303 1072 -181 -237 217 251
74654 1108 748 420 416 -339 478 -61 109 915 -162 995 1854 -266 1563 798 1986 1531 -219 1870 11
75710 159 1146 594 -1374 -10 552 308 -614 -1172 421 -66 1525 -1124 -1296 -1105 505 -807 63 456
76712e41P6p79J256M63M5r59p18L012j504Q1J81J01L56M14r29P37j771K062N10d58
77820B69j326M1O34n89J314j570J203j79n66J394M91p04J295k232k57J254K4d62
78822a637J590J98j237J782J21j88J29L15J16Q79n78R4p11l95J96m79J10j374a165
79878g11m2N27j056J53L64M2k75P53l74j216K376j261P93m62j838J481l45J26d08
80933c97j004J120r34J081pJ48M08j138j291J807j292K75k36J464q86N89n05i04
81935F77j784Q61L81n39j505J075p80J271O5P59k049J638l90j241J327J55j063F61
82938F09r22Q50j738J411k6K55n27j091k25K665j477N04m05J100j028r2k70P46a174
83993a83L25K1j453J708M41p80J92K42j225J411n28P11m61R8o92k22R6j07N5G30
$$ plain form
76712 -541 -465 -1244 12 475 520 -439 -1157 1855 351 432 613 714 1070 1484 555 1292 -479 1583 2093 -458
77820 269 -1057 -1016 -382 -971 343 -1227 -24 -203 -769 625 1116 412 1707 -525 -782 472 496 -462
78822 -1637 -47 151 -1086 696 817 629 758 1073 1189 2068 1490 1584 873 478 674 195 305 -1069 -1165
79878 -711 -753 -226 -1282 -1129 -765 -723 -998 -245 -619 -1835 541 -720 73 -389 -2227 -746 -1091 -965 -408
80933 -397 -1401 -281 -1215 -134 -141 7 415 -723 -2014 -207 -1499 -1224 -1460 4 -882 -293 -798 -904
81935 677 -1107 -246 135 -404 -1909 -834 -1614 -343 -278 481 -1568 70 -320 -1561 -234 -79 -1142 661
82938 609 -313 537 -1201 210 184 439 -88 -1179 -1404 1261 -216 288 -117 983 -45 -137 -407 339 -1174
83993 -183 142 163 -1290 418 859 79 271 513 -712 699 171 882 421 519 -173 -395 -299 -406 -351 730
85101a102L4N95j004M14R91M5J68j656Q54J386q72q89K41r19J746o98P12r98c80
86156b78L07k5Q63j202n03o2J192L85j443P66N22j699K270j441O79j714P83O49B06
87211E2j449J120J20L34n82J593m5j675r50R57m98L90j059J246j349P52L81q05a177
88266H30j495J746k182J474j448K01M14j4l30k29l74K36j78N32Q34r14J96j531b06
89322G80k94j769J171P00l129J781J351j088m81r48J769r83J644L51j715R79i30
90271b21j99N40R7j901R70J256n24k9K56j089n50J712j35p27K22N89j695J707a27
91326a389K117o10q29k28n4N89k52j30Q8r54j3J357J306r51N34j239M81k01K42h8
92434cr41J422m00r93j35O10n90O67k92n80J805j034p35j52O30j286J132J24a065
$$ plain form
85101 -1102 -1068 -473 -1477 -1063 -72 -27 141 -1515 -661 725 -147 -1036 -795 -1714 32 -666 46 -952 -380
86156 -278 29 4 867 -335 -838 -900 292 677 -766 0 522 -1177 1093 -348 331 -1383 -600 49 206
87211 52 -1397 -277 -157 177 -405 1188 1143 -532 -1482 -525 -1023 -633 -1692 -446 -1795 -1043 -662 -1467 -1177
88266 830 -665 1081 -1101 373 -1075 -874 -460 -474 -804 -1033 -1407 -1171 -1349 -817 17 -897 -701 -2232 -206
89322 780 486 -1283 -112 588 -2541 -760 591 -497 -978 -1926 -157 -1140 504 855 -860 119 -930
90271 -221 -420 120 217 -1684 -714 542 18 -11 245 -844 -1394 318 183 -544 -322 267 -1428 279 -127
91326 -1389 728 118 -711 -939 -993 -404 -656 -786 -698 -1652 -1665 -308 998 47 581 -658 -177 -378 -136 -88
92434 -3 -944 478 78 -915 -1050 -440 -1030 -363 -655 -1235 570 -464 -1199 -1351 -721 -2007 -875 -751 -1065
93490a202J642j923R55m4K44q02J0J222j930L15k22Q65m17J747j213m05R34r80b153
94545a34p27q91P32L51J395l14r7j293j04O8K1R99Rp71K60M54M4o58N75l58K26e58
95758D32q21Q42j782J143j93o07M20J013q82O8j196k71J307M12K80j0L24l84A24
96813e90O67l58p8J66n75L83M74j790m70K283Q18k644M36O28J051r40J38m63i89
97869a368J414q04j59j5K12M38K07J08o63n74l50J630p31K94j10j81L16P00r28g43
98976c59l68o61Q85r90J621n95l22J172j013l9J360j447r86J340m60Q07J99q20c58
100032g39j90j635J881M03o20j47p33M12K395o7k196J443l41K189j16L99r70Q1H30
101087f36J096l57L95L9k170J261k43Q27j320N45n64K24k52J288P5j060k1p74f78
$$ plain form
93490 -1202 440 -1483 -528 -572 -328 -1130 -1120 102 -1828 -1513 -1735 -870 -1287 460 -753 -1158 -224 -1204 -2153
94545 -134 -861 -1752 -1020 -669 726 412 315 -978 -1082 -1014 -993 6 15 -756 -496 -42 2 -656 -81 -439 -213 -558
95758 432 -389 453 -1329 -186 -379 -986 -566 447 -435 -367 -1563 -1834 -527 -115 165 155 479 95 124
96813 -590 77 -281 -359 -193 -768 -385 89 -1701 -2171 112 930 -1714 -1278 -650 401 -539 -401 -864 -989
97869 -1368 46 -758 -917 -932 -720 -282 -75 33 -630 -1204 -1554 76 -655 -361 -471 -652 -336 364 -564 -743
98976 -359 -727 -1388 -503 -1493 128 -467 -789 383 -630 -669 691 -756 -1742 -402 -862 -55 144 -676 -358
100032 -739 -929 -2564 -683 -280 -900 -1047 -1780 -1368 1027 960 -1236 207 -134 2055 1939 2338 1368 1449 830
101087 -636 460 103 498 537 -1633 -372 -615 212 -1108 -563 -1127 -903 -1155 133 208 -852 -873 -1647 -678
102142g18J412j226R12k570J225m89L33N57N83p66Q9j74P8J640k88r57o59J004C0
103197c78J711k52k41o60j463J282R15Q34k79R55j195r12K1L77j685K208n17j065A316
104252B05o97l18Q51J25q00j68N15M26q53j671J555M4K34l50J099j227J682j372a376
105308b231J245J619Jn79O21L04j403Q43N44j278k88j115K03K191j813J531o94A387
106310fm46R53Q00l35j099m21O48J87k45k37P5j01J511j659L44M78n93j322J780C41
107418A07L07j516J469l1J248k137J499j601J324R55q87K9M83p65k567L065N12H12
108420e85m93P59K724l36j636J159k49l1o2j39N32j480K525M72L8q15R53J230B786
109476C559q72J417j520p26j68k5Q51p09n83l0j239K27m74P21N11k29K34m06R60C63
$$ plain form
102142 -718 694 -532 380 -2190 -965 -1454 -1121 -564 19 -747 -658 -832 -754 886 598 -359 -1018 -14 30
103197 -378 1333 1081 840 180 -1283 -1 914 1748 1469 2424 1229 317 338 715 -970 1238 721 -344 1316
104252 205 -492 -810 41 166 -634 -802 -287 139 -714 -2385 -830 -786 -552 -902 197 -1030 652 -720 -1376
105308 -2231 -986 633 634 55 676 980 -423 420 964 -314 -602 -1717 -1514 677 -1136 395 -299 1387
106310 -6 -452 501 1301 966 -133 -554 94 281 36 -201 -126 -227 1284 -375 -31 447 -146 -1468 312 341
107418 107 414 -1102 367 336 1584 -553 946 -655 669 1624 737 766 1249 484 -2083 982 1494 812
108420 -585 -1078 -319 2405 2069 433 1592 1343 1312 1250 1111 1643 163 2688 3160 3198 2383 3336 4566 2786
109476 3559 2687 4104 2584 1858 1690 1665 2516 1807 1224 1194 -45 182 -292 429 940 711 945 539 1499 363
110584f68J507k78k70K08L94j053j236J481K54N0J7o76j9P53J103r73M86q41K02G04
111691A269k57j0q36l75M29m80m99J853k120J492k19K22o90P51j316J000j252H11
112694F64j739J148j658J071K91j687K514m23K67p48Q86k368J564M41j12j149E98
113644h01J995o34n80K49M08o22m94L56J66p89k10K30O81o09M06m08l7J320r55D23
114751c11P6j0j84j49p02j07j98J279j042K015j447P66N18j441R79K0P23n05m75D61
115859A217j146L3r05Q34q07J105j91Q90k339K005j321O65j603J205L0J500r72d71
116862E7j148K102k72l20p12r3K57o47J12J580j955K94R37o72K14n69M84j95m42h08
117970i98Q60j418r8k79O01J044J193j897K710j030M4j115K63q28J982M87j531b040
$$ plain form
110584 -668 839 561 291 499 893 -160 -1396 85 339 389 406 -270 -289 464 1567 594 1080 239 441 704
111691 1269 1012 1002 166 -209 220 -260 -759 1094 -1026 466 247 469 -221 530 -786 214 -1038 811
112694 664 -1075 73 -1585 -514 -223 -1910 604 181 448 -300 586 -1782 -218 223 111 -1038 598
113644 -801 1194 560 -20 229 637 15 -479 -123 43 -746 -956 -726 -45 -654 -248 -656 -693 627 -328 423
114751 -311 -235 -245 -429 -578 -1280 -1387 -1585 -306 -1348 667 -780 -14 504 -937 42 62 785 280 -195 461
115859 1217 71 104 -801 33 -774 331 140 1030 -1309 696 -625 40 -1563 -358 -328 1172 200 -471
116862 57 -1091 1011 739 419 -293 -386 -129 -776 -664 916 -1039 -745 192 -480 -266 -835 -351 -546 -988 -808
117970 -998 -138 -1556 -1654 -1933 -1332 -288 905 -992 1718 688 732 -383 -120 -948 1034 1521 -10 -2040
118972B58o87K82L70n08o88n54N10Q74j359J753j020m19K014j469Q47p40n32P08h57
120027b40n87N86l30N97j331L16J421p93M15Q74j728n94J614j099n1m77J902m51H4
121083c38L04l69M35K38j683P77O00j68k33k93M81N0j463J305k80R64k26j205a781
122138a483Q81m63J449j206J108j85L53r83J266j965k5J198l88m4q39R33j501a001
123140F39m68q55P62k84J862k619J01M36J60M43n11o90N76R29r80J270k242N88d05
124195i55o0O89l8LJ53r16J323p79j358R85j267N29J075J210j057J518j450Q26d52
125251a29j696J416J160o56j109Q06r83p15J253n48R96j60p78J427Q8o69M8L33c04
126306a120O85j01J324j189J99K25J135k195J43J12J33q79J219m25J439j741P77G25
$$ plain form
118972 258 -429 -147 223 -285 -973 -1527 -1017 -143 -1502 251 -769 -1188 826 -643 204 -536 -1068 -360 -857
120027 -240 -827 -241 -571 26 -1305 -989 432 -361 54 928 -800 -1394 220 -879 -930 -1407 495 44 84
121083 -338 -34 -403 32 270 -1413 -636 -36 -204 -437 -730 -249 -199 -1662 -357 -637 327 101 -1104 -1781
122138 -1483 -602 -1065 384 -822 286 101 454 -529 737 -1228 -1253 -55 -443 -487 -1326 -393 -1894 -1001
123140 639 171 -684 78 -206 1656 -963 -862 -426 -266 177 -334 -1024 -448 481 -499 771 -1471 -883 -405
124195 -955 -1015 -326 -364 -361 -208 -1124 199 -580 -1938 -953 -2220 -1691 -616 594 -463 1055 -395 431 -452
125251 -129 -1825 -409 751 95 -1014 -208 -1191 -1906 -653 -1201 -205 -365 -1143 284 372 -297 -249 84 -304
126306 -1120 -435 -536 788 -401 -202 23 1158 -1037 -894 -782 -649 -1528 -309 -734 705 -1036 -259 725
127308i83m14N07q00J287P9j072R76j537K089r82L09O07K39K42p97m01N62J605h48
128363A86j073J422q80j39l30J416k136m1M51J24r68l26K668J23L48q71n97m42e23
129419a346J174j534J207n61R06n07k99J187q31K129j884l65r5J518j543l97K092a110
130421i68N83l27m94K650l142K072K2j691K492n38q67j78N2r9j042J518Q34r08d07
131476A47m58M6k18N59o77n47J173N91j704j12Q21K73p33J270k054J638k388J899e37
132531G38p05L60j469N38j547J709j80k90J367j022K74r6j16J50j255Q01L33l56a509
133587f18m94M16n64K418p64o80l4n0j503K246p23M11j977J562j621J55K0J403a994
134642a388O05n46J82J028o90J286k77p08Q75q84J378j532r61O75J334j703J460a160
$$ plain form
127308 -983 -1397 -890 -1690 -403 -324 -1396 -420 -1957 132 -850 -541 66 305 547 -250 -651 -89 1516 -848
128363 186 -887 535 -345 -484 -814 602 -1534 -1575 -1124 -1000 -1968 -2294 374 497 845 -26 -623 -1065 -523
129419 -1346 -172 -1706 -499 -1060 -154 -661 -960 227 -604 1525 -359 -724 -819 699 -844 -1241 851 -1110
130421 -968 -385 -712 -1206 1444 -1698 374 396 -1295 1197 659 -208 -386 -334 -433 -1475 43 877 -31 -407
131476 147 -311 -265 -483 76 -601 -1148 25 616 -1088 -1200 -379 -106 -839 431 -1623 15 -2373 -474 -537
132531 738 33 393 -1076 -538 -2085 -376 -556 -846 521 -501 -227 -323 -439 -289 -1544 -743 -410 -766 -1509
133587 -618 -1112 -696 -1260 1158 394 -286 -320 -370 -1873 373 -350 61 -1916 -354 -1975 -1820 -1800 -397 -1994
134642 -1388 -783 -1329 -1147 -119 -809 477 200 -508 367 -517 861 -671 -1632 -957 377 -1326 134 -1160
135644i58k14p6oQ76L76o16J472j223P08qj286L36R11j432N45m83N23k93R03q8i23
136805a072n45j27M97N37J33J050j699J335q35J301r60n18j99N93k012K215p66a582
137807a141R04j006R21k297J314m5j545K586q94O79o22N07K85m92m73R35K35R4C5
138863f65j107J173k51j34J190n13j103J071j322J354j473J644L51m77L24m66g35
139812I7N36q09J049j930K16N12J203O5j029K7m89L17j253J011mJ226j314O20D38
140867G71J13r07j263J256j342K208n23L92L71j093l65q95J931j386J359o61n30b504
141870a222J839K32j383k47P87o43J070n94J49N46p83L59K15k19m98N07m8j513c58
142925F30o57J221j120Q7m48N93j61M08j11m26Q34p82J49r13P67K57JP71p56j639C99
$$ plain form
135644 -958 -1172 -1248 -1254 -378 -2 -618 854 -369 339 331 -955 -619 292 -1140 -595 -1078 -555 -848 55 -33 -923
136805 -1072 -1617 -1744 -1247 -710 -577 473 -1226 109 -726 575 -385 -903 -1102 -509 -2521 -306 -1072 -1582
137807 -1141 -237 -1243 -322 -2619 -1305 -1350 -2895 -309 -1203 -524 -1146 -639 -354 -846 -1319 -384 -149 -55 35
138863 -665 -1772 -599 -850 -984 206 -307 -1410 -339 -1661 -307 -1780 -136 215 -262 62 -404 -735
139812 97 633 -176 873 -1057 -841 -329 874 939 -90 -63 -552 -235 -1488 -477 -481 745 -569 51 438
140867 771 884 -23 -1286 -30 -1372 836 313 705 1076 -17 -382 -1277 654 -732 627 -34 -564 -2504
141870 -1222 617 849 -534 -781 6 -637 433 -161 -12 534 -249 110 325 106 -392 115 67 -1446 -358
142925 630 -27 1194 74 161 -287 306 145 553 442 16 850 68 217 -696 71 328 329 1100 344 -1295 399
144086C52k8q56J787m79p17J609j409j22J344n03j238n83K379l95k17k355J052B54
145088e35O45j720K058k466J339J354j444q4L4o07K626p78P67k38j84q36J240I74
146091D37P95q51m4q06N28l79J76J111n4o51R45l33K64j805J859j272J468k92F94
147146E09j54Q38j203J614q68K48p87N24k65J542j613Q05l36k84P4Q43m49p6n13G68
148254F12L33k56j318P39J588l556M75K379L93j169P53J13l51p53J074o96M41A546
149256E49K15k59K72J81Jk22P25p55l9M05M56j456L54R33k47J154j569J650j764f23
150364I65j15O81m95m03m48J730r54j28j009J521k72L73M39m21q9n73O38j581A194
151419B011J20J57j35M90J66j388Q28j514O62Q18n21n03q19j84Q60m7M13j011e48
$$ plain form
144086 352 324 -532 1255 776 59 1668 259 137 1481 978 -260 -843 1536 1141 924 -1431 -379 254
145088 -535 110 -1610 448 -2018 -679 675 -769 -853 -819 -1426 1200 422 1189 951 767 -69 1171 974
146091 437 1232 381 337 -469 59 -320 -144 967 913 262 1207 874 1138 -667 1192 -80 1388 1096 694
147146 509 355 1193 -10 1604 736 984 197 721 456 1998 385 1190 854 570 644 1487 1038 962 449 768
148254 612 945 689 -629 110 1698 -1858 -1383 996 1389 220 973 1086 735 -18 1056 360 801 1546
149256 549 764 505 777 958 959 737 1462 707 668 1073 1529 73 427 1360 1113 2267 698 2348 584 -623
150364 965 850 1531 1036 633 185 1915 961 833 -176 1345 1073 1446 1885 1464 1375 802 1440 -141 1194
151419 2011 2131 2288 2153 2643 2809 1421 2249 735 1397 2215 1694 1191 372 188 1048 1001 1414 403 -548
152474H81r8J076K57j198j61M51l31p56J288J94m01J27j61L72J459j590L68r96B544
153530I75O53J096j114k29Q96j297K58j004K76k77K47j61J100l38J03P66l32rA482
154585A907k9p42n2M25J20j999J320L46n6L66K025j531j390J96J42m92P33N18I05
155640H96m46l56l39K61J268j067K269L52k109nM41L83j25O31l11J295n22n26B709
156695B478K6N86j460N8M06j6k35p10R7r88M68Q71p80k228J606o54j786L214n60E66
157803A814q60J107o30k78l94J766j053j609N43m02p14P96j074J035q62J084j312e38
158806I91j072r11O28j54J066n39o91j82O56J035l46l67J331j006qO35n65m15G47
159861F41P3K91p28j022J635j988J040q77O38L87j006J142j011m75j189J987O41a036
$$ plain form
152474 881 783 1859 2116 918 757 1208 877 121 1409 1603 1202 1329 1168 1540 2999 1409 1777 781 2544
153530 975 1628 2724 1610 1381 2277 980 1238 234 510 233 480 319 1419 1081 1184 1950 1618 1609 1482
154585 1907 1878 1136 1084 1509 1629 -370 950 1296 1240 1606 3631 2100 710 906 1048 556 1289 1807 905
155640 896 450 94 -245 16 1284 217 2486 2838 729 724 1165 1548 1423 2054 1743 3038 2516 1990 2709
156695 2478 2504 3090 1630 1688 2094 2078 1843 1133 1230 242 710 1581 801 -1427 179 -475 -2261 953 393 566
157803 1814 954 2061 1431 1153 759 2525 1472 -137 406 4 -710 86 -988 47 -815 269 -1043 -538
158806 991 -81 -992 -364 -518 548 9 -682 -864 -208 827 481 114 1445 439 431 1066 501 86 747
159861 641 714 1005 277 -745 890 -1098 -58 -935 -297 90 -916 226 -785 -1260 -2449 -462 179 -1036
160863c46k85p14N11J231q18n60P23j989J372O3Q25p02l03R4j120N58J98J378a119
161918f42l38Q24j257O8J12J502p83K54m20o37m56K558l131J171L97J03j86K98F2
162974A98o49q27R52j556K47J730K26k1n08P02o93N59q48L67q31J24Q3J113j803A97
164081C49j508J281O99j084R00j540J310j024L1o5M3O68o65N22k12o94J350j295a040
165137C31M28k23j858N83K7K087j75j214m23Q66q86Q25L72M69o36R3q87J921j433A7
166245C46K2J487o26n58Lj201K117j639N42o11J543q25j021r73J832L19l41l88H60
167300d13J36J71L93J1J12l64N07J79M99j034J456n39N4j447R42l03p8k71J269A086
168408A607J251j258p29R24q43k7R34q87l23l44R46K65J685k351j41O75j08k92B381
$$ plain form
160863 -346 -631 -1345 -834 397 -421 -981 -258 -2247 -875 -812 13 -689 -992 -898 -2018 -1460 -1262 116 -1119
161918 -642 -980 -156 -1413 -1345 -1233 269 -514 -260 -680 -1317 -1773 785 -2346 -1175 -778 -675 -861 -563 62
162974 198 -451 -1278 -326 -1882 -1635 95 321 300 -208 494 -199 360 -488 -121 -952 -828 -745 368 -1435 197
164081 349 -1159 122 821 -263 637 -903 407 -617 -586 -651 -608 60 -605 -83 -295 -989 361 -934 -1040
165137 331 759 536 -1322 -739 -712 1375 1200 -14 -437 429 -457 368 740 1209 573 666 -221 1700 267 17
166245 346 368 1855 1229 671 674 -527 1590 -49 493 -118 1425 600 -421 -1394 438 757 416 28 860
167300 -413 -277 -106 287 298 410 46 553 732 1231 197 1653 1114 1168 -279 663 360 282 11 1280 1086
168408 1607 2858 1600 871 1795 952 925 1859 972 649 305 1251 1516 3201 850 709 1384 1276 984 2381
169463A621j418P17K67j062J58J25P03J88j24R89j23j33l39K036k135p8n58l57D29
170518A610n96R52l06M33J837j403O00k33k46J068j464L79J057j801Q02J029o60C329
171521B901J78J08n50m96K45Q96p89J51Q75n67q43J44L50J564j517J53j87J360C202
172576D134O84O4K91j630J523k09q04R68j788J761l05N83k28k37N21M26J41o55E913
173631C722K52J523o40J104m29P85P88M97m86p94J604m15J017j623J734k450J925H892
174633H722r47l16J064J008k179K741o14Q29o80m33n14K907n77l35R37o38L56A0355
175636A3401j825O11J35K47J129J175p16K48N45N57n67Q42L27P42o33n66J173A8032
176638A8973N61j48L359L57J310K949P063P104J4094J7818J4201P057j824q590G5266
$$ plain form
169463 1621 203 920 1187 125 283 408 1111 1299 1175 2164 2041 1908 1569 3605 1470 1392 834 477 429
170518 1610 1014 1966 1660 2093 3930 2527 3127 2894 2648 3716 2252 2631 3688 1887 2689 3718 3058 3329
171521 2901 3079 3187 2637 2141 2386 3282 2493 2644 3519 2952 2109 2253 2603 4167 2650 2803 2616 3976 3202
172576 4134 4818 4882 5173 3543 5066 4857 4053 5021 3233 4994 4689 5272 5044 4807 5328 5754 5895 5240 5913
173631 3722 3974 5497 4857 5961 5532 6317 7105 7602 7116 6322 7926 7511 8528 6905 8639 6189 8114 8892
174633 8722 7775 7459 8523 9531 7352 10093 9479 10308 9628 9195 8681 11588 11011 10676 11613 10975 11331 10355
175636 13401 11576 12187 12322 12569 13698 14873 14157 14405 14950 15507 14940 15782 16109 16851 16218 15652 16825 18032
176638 18973 19534 19386 22745 23102 24412 27361 34424 41528 55622 73440 87641 94698 92874 84284 75266
177482F9835J179R909J3122N925n53r538j4641j1869j0210r559m441m061j931C2166
178274C1649m13J325j332K469j421J309M66O27P71K778L098N525L985J318j384D9400
179171D3787k548j286j362K53j137K351O85J187Q20n2K653J154M861J084J0724G7313
180068I9295K9166K5527J8175K607l913j1164j3185n849K207J7088K1653K4889B34833
180806B57114K7241K5451J3085L736j6247l4563l3440l2303k0997p687m309q763A51022
181545A30266j9306j3607j4561o105n889j684k458j134J061K705M198N354J902H5331
182336H5760j201j647k736N20L860O673M987J250l074q486n029m444j759o44K419H1559
183233H9698J1831J8967K7005L8346L7604K9797J7234M149m457l764R52M529J2103C04309
$$ plain form
177482 69835 71014 80923 94045 99970 99417 89879 75238 63369 53159 43600 39159 35098 33167 32166
178274 31649 31236 32561 31229 33698 32277 33586 34052 34679 35450 38228 41326 46851 50836 52154 50770 49400
179171 43787 41239 39953 38591 38844 37707 40058 40743 41930 42750 42698 45351 46505 51366 52450 63174 77313
180068 99295 128461 153988 172163 174770 170857 159693 146508 140659 142866 159954 181607 206496 234833
180806 257114 284355 309806 322891 326627 310380 275817 242377 210074 189077 181390 177081 168318 151022
181545 130266 110960 97353 82792 76687 70798 69114 66656 65522 66583 69288 73486 78840 80742 85331
182336 85760 84559 82912 80176 80696 84556 91229 96216 97466 94392 85906 80877 76433 74674 74030 76449 81559
183233 89698 101529 120496 147501 185847 223451 253248 270482 274631 270174 266410 267362 271891 283994 304309
184024C26280R466M635n81Q714J8536M1193N2371L2271J4755k7693n6341n9737C05811
184763B45046n3280l6589k8754j6766r525p722m92Q05M116l7j962n717m692o872G2364
185607G0678l654p29j869J658L516N520Q414N572K394K506O009M495N37l837p751I1500
186504H7796k360L88N80L200J1095J6985K4494K6416K3410K6118K9611L0036J2647B94256
187296B82330j2714J1143K1767K4759J4536Q305Q111P640n517j8929k7432l3384B43520
188034B01027m5041l3200k5638j8055j3419q152n314l830l191q81k284m59k191C8096
188826C7079P42O74L371M434N410L896O58n826o541o168l374k977k607j212L151C3510
189722C4302r56R4l488j209l081o77P62M96M417K725L795O390J2968K1444L0795A30574
$$ plain form
184024 326280 335746 340381 339800 348514 367050 408243 460614 492885 507640 479947 423606 363869 305811
184763 245046 191766 155177 126423 109657 100132 92410 91918 92723 96839 96802 94840 89123 84431 77559 72364
185607 70678 67024 66295 64426 66084 69600 75120 83534 89106 91500 94006 100015 104510 105047 101210 93459 91500
186504 87796 85436 85824 86404 89604 100699 117684 142178 168594 192004 218122 247733 277769 290416 294256
187296 282330 269616 280759 302526 327285 341821 350126 358237 365877 360360 341431 313999 280615 243520
188034 201027 155986 122786 97148 79093 65674 57522 52208 48378 45187 44306 42022 41563 39372 38096
188826 37079 37821 38495 41866 46300 51710 55606 56264 50438 43897 37729 34355 31378 28771 27559 30710 33510
189722 34302 33346 33440 29952 28743 25662 24985 25747 26243 30660 33385 37180 43570 56538 77982 108777 130574
190619A42094O72j5564j2988j580P846J5329J0606l097j4384k6383k2366k2076D4806
191358C4644r185m174l765j235j609Q43j507j118m94k002J645k055l30j546O91F916
192255G268j017L8J052k021N80j52M97k345J277j001n33Q82j246L96R99L61q89C260
193257C906k5j95m95P27o60o33m30q61P21k12K75K26j485J330k127K370j749J97A365
194313B335L10j49j41r78J08l46j8L44r85K06J682J25k062J574r36J458m65m08A771
195368I67J107j373J439j232J627j609P70K8P29j202J569q89q89J340p12j149I12
196317A262J99m09N50j062J222J79L90l8j22n34M51k202J951j448R81j00j38J000C111
197373D197p20l64q5k27R17L78l59k372J655k282J791R11m57r38m57q9Q94j345B204
$$ plain form
190619 142094 142766 127202 114214 112634 120480 135809 146415 143318 128934 102551 80185 58109 44806
191358 34644 25459 21285 17520 16285 14676 15519 14012 12894 12400 10398 12043 9988 9658 8112 8803 6916
192255 7268 6251 6289 7341 5320 5900 5748 6245 3900 5177 4176 3643 4525 3279 3675 4674 5035 4146 3260
193257 3906 3881 3686 3191 3918 3258 2625 2195 1334 2055 1843 2118 2344 859 2189 62 2432 683 880 1365
194313 2335 2645 2496 2355 1377 1485 1139 1121 1465 480 686 2368 2493 431 2005 1069 2527 2062 1654 1771
195368 967 2074 701 2140 908 2535 926 1696 1724 2453 1251 2820 1931 1042 2382 1670 521 912
196317 1262 1461 1052 1602 540 1762 1941 2331 2293 2171 1637 2088 -114 1837 389 1370 1270 1132 2132 3111
197373 4197 3477 3113 3028 2801 3718 4096 3737 1365 3020 738 2529 3440 2983 2045 1588 1499 2393 1048 2204
198428B381J738k742J839j383r90Q18J79j682o71J014j371R94j005N91N60L95A572
199377A063K28k28P66m35J185q56R45k039J123n77J90k08J125l98J20L16j5n2D039
200433D065j730k89l72J116l64K67N03j854j52J395n22j3m98L86O88j825J670A689
201435A828P96O0K32J492j938m83J187J128j030j455n12q6Q09q5J710k408J723A507
202437B220k598K61R17l78rJ175j01M44P68M41Q70Q58l15M89L34l22j183n60J326D603
203545D775K3r36L99k50n88O33K21k330l16J848JJ98o11L16J049j94P89j445n86E459
204653E373l71j37Q57j97j622J516k13j82r94O08O28L17N0j99j93K73P55m62l98F863
205761C412J335O62l27J289m05M11k28K89j214K659j057J106N04n05L6R6R65n51I156
$$ plain form
198428 2381 4119 1377 3216 1833 843 1661 1840 158 -513 501 -870 124 -881 -290 270 665 1572
199377 1063 1291 1063 1829 1394 2579 1723 2668 629 1752 1175 1365 1157 2282 1884 2004 2320 2305 2253 4039
200433 4065 2335 2046 1674 2790 2426 2693 3196 1342 1190 2585 2063 2050 1552 1938 2626 801 2471 1689
201435 1828 2624 2684 2916 4408 2470 1987 3174 4302 3272 1817 1305 1219 2028 1943 3653 1245 2968 1507
202437 2220 -378 -117 800 422 413 1588 1487 1931 2699 3140 4010 4868 4553 5042 5376 5054 3871 3311 4637 4603
203545 4775 4798 3862 4261 4011 3423 4056 4277 1947 1631 3479 3480 3678 3067 3383 4432 4238 5027 3582 2996 5459
204653 5373 5002 4865 5722 5525 3903 5419 5206 5024 4030 4638 5266 5583 5633 5434 5241 5514 6269 5807 5409 6863
205761 3412 4747 5409 5082 6371 5966 6377 6149 6438 5224 7883 6826 7932 8436 7931 7967 8063 9028 8477 9156
206817H246j02R21N71n59m81J246O40j793o02Q93l00j11q5J174o6k6j397K338A0377
207872A0352l06j44O43J500J70P3J337J012j722J127p7K51K70K255j338m33L05A5837
208874A6561n74J898j42j07J998j963J430J578k245J08J460j070J660p00K230B2597
209771B2869J968N73O29J420j045M42K073J836j91L88K9P90K25J390J555Q06O14C6801
210773C6285J163L29J51N46J850r60K423J418m85k44K442P88L16J147l85J814D5803
211723D7186Q0J459J056J323J127K813J676L932L251N466L547P416P702J5553A23733
212567A58405N5026P8884R9881R9677P4372L3795J0378N790M508k829k1138m6933D78102
213306C89826q5395o8237n0548l7648k1733j5542o587n319l791j280J267K036A01508
$$ plain form
206817 8246 8144 9065 9636 9077 8596 9842 10482 8689 8087 8980 8680 8569 8484 9658 9592 9566 8169 10507 10377
207872 10352 10046 9902 10545 12045 12215 12288 13625 14637 12915 14042 13965 14216 14486 16741 15403 14970 15275 15837
208874 16561 15987 17885 17743 17636 19634 17671 19101 20679 18434 18542 20002 18932 20592 19892 22122 22597
209771 22869 24837 25410 26039 27459 26414 26856 28929 30765 30574 30962 30991 31781 32006 33396 34951 35757 36371 36801
210773 36285 37448 37777 37928 38474 40324 39364 41787 43205 42720 42476 44918 45706 46022 47169 46784 48598 45803
211723 47186 47266 48725 49781 51104 52231 55044 56720 60652 63903 69369 72916 80332 88034 103587 123733
212567 158405 213431 292315 392196 491873 566245 600040 610418 616208 620716 617887 596749 549816 478102
213306 389826 304431 236194 185646 147998 126265 110723 104136 98817 95026 93746 95013 97049 101508
214045A06689N214M513o95L303J538M474Q414P298Q660L769j037m439q322r553A18408
214889A07901q312o172o327k816k364P36j08j165k92j181j19p64J607K749N777A00030
215786A17489L3989N2883P1765Q2270O5246K6257j6304l3679l4202q999K8438D65942
216471E84782J27380J01347N5591k073n5801q6581j01763j02502r6356q6957p3583B07918
217157A66145k9167k1297j3472j0253o155o250l233m555m000n9l130j530j128F2807
217949F3054K14J580L243J843j120Mj148m287j039j800m614l600j160l065k667D2210
218846C7390Q3j131p36K550l40j66J64K766J934K551N102P910J1550K0904L4803A79371
219743B44198O1788L7511O471k1474l0319k1231L600J7879K2040O267j6859l8675B20773
$$ plain form
214045 106689 111903 116416 115721 119024 120562 125036 133450 140748 149408 153177 152140 147701 139379 129826 118408
214889 107901 99589 93417 87090 84274 81910 82646 82538 81373 81081 79900 79781 79017 80624 83373 89150 100030
215786 117489 151478 204361 276126 358396 423642 449899 433595 399916 365714 356715 385153 465942
216471 584782 712162 813509 869100 867027 811226 724645 622882 520380 424024 337067 263484 207918
217157 166145 136978 115681 102209 91956 85801 79551 76318 71763 67763 67704 64574 63044 61916 62807
217949 63054 63268 64848 68091 69934 68814 68818 67670 63383 62344 60544 55930 52330 51170 48105 45438 42210
218846 37390 37473 36342 35606 38156 37816 37650 37814 40580 42514 45065 50167 58077 69627 90531 125334 179371
219743 244198 305986 343497 349968 328494 298175 276944 280544 298423 320463 326730 309871 271196 220773
220481A68371m0944l3312k4265j4802j0094n988m498j664m252j385j836p30q04B3178
221273B1052j488j631J517l425N58j948j403k98n41r96q36n62j348J75K92j754G082
222222G806k46j516J265l12r98J38L45j178J13n0o13j77m05Q22p49p09J004p94C320
223277B310J812j121o73k73K808k580Q2J533k218P07J081j740q0J446j611J33A677
224227A364q19J92L6qJ090j685Q02p57M64m4Q24q13J234r05O56L13m49O86j183A866
225335A788r53N58J30k22o20L18L09l0K80n45M58R42q06J051j802o2R33j587Q62C94
226443D6l45o8J189k83p2j328K697r75r42J697k04Q3m88k65J062l46j525M74L02c43
227551e93J068j204K54m38J152j852J938k558J610J183q13j20n40K714j948J81G15
$$ plain form
220481 168371 127427 94115 69850 55048 44954 38966 34468 32804 28552 27167 25331 24601 23797 23178
221273 21052 19564 17933 19450 16025 16583 14635 13232 12934 12393 11397 10561 9999 8651 8826 9118 7364 7082
222222 7806 7560 6044 7309 6997 5999 6137 6482 5304 5417 5367 4754 4577 4172 4994 4245 3536 4540 3746 3320
223277 2310 4122 3001 2328 2055 4863 2283 2365 3898 1680 2387 3468 1728 1648 3094 1483 1616 1677
224227 1364 545 737 773 765 1855 170 972 215 679 635 1459 646 1880 975 1631 1944 1495 2181 998 1866
225335 1788 835 1393 1523 1301 681 999 1308 1278 1558 1013 1471 2413 1607 2658 856 794 1727 140 1002 394
226443 46 -299 -367 822 539 467 -861 1836 861 -81 1616 1412 1495 1007 742 1804 1458 -67 407 709 -343
227551 -593 475 -729 -475 -913 239 -1613 325 -2233 -623 560 -253 -373 -913 1801 -147 34 715
228501H01J255j010J464k677J943j076Q87j583J131o91p8K32o16K90J13o81J241F8
229503H93k135K311j157M54N98L45p95J264j54k55O91m60m36P02j051j165M52D05
230505A913n71K93k75j441R58j283p52L27l70j79J126m97k09P04M25o11L1R50D62
231561A296o756O181j44L51p91o00L6J406m38l70N33j556M30J363L33K43j506b57
232563E04p46R3R61M78j497n32J433j057J24J637j862O72Q6M49j420R14k92p01F15
233618c87J96K38J117j452R13K83j594P8r12J518l29L49k02R02L84k333p03K162d18
234673h15k27O82O51J46k23j172l12J1J433j130j461J509R8M49M7m73O08j07J096b72
235781a316L75q3R8J416r61R45n23n62M36J33N53j47k62j08l69K32O50m9p92L18A387
$$ plain form
228501 801 2056 1046 2510 -167 1776 700 1587 4 1135 444 366 598 -18 272 385 -296 945 68
229503 893 -1242 1069 -88 366 964 1309 514 1778 1624 1369 2060 1600 1164 1866 815 -350 102 405
230505 1913 1342 1635 1360 -81 877 -406 -1158 -831 -1201 -1380 -254 -751 -960 -256 169 -442 -411 539 462
231561 1296 -5460 721 577 928 137 -463 -427 979 541 171 704 -852 -422 941 1274 1517 11 -257
232563 504 -242 -149 812 1290 -207 -739 694 -363 -239 1398 -464 208 294 743 -677 237 -55 -756 615
233618 -387 -191 47 1164 -288 625 908 -686 -608 -1520 -2 -331 18 -184 718 1102 -1231 -1934 228 -418
234673 -815 -1042 -360 291 437 214 -958 -1270 -1259 174 -956 -2417 -908 -810 -361 -314 -787 -179 -286 810 -272
235781 -1316 -941 -1024 -926 490 -471 474 -49 -611 -175 -42 511 364 102 -6 -375 -143 507 458 -334 -16 1387
236942g8n9J252o48j238j33J101n11J50p14J361o53o58n5K84J336j586J36Q20f64
237997c38J713j070j78P67J03o54j243J514M25k83j403J886n01j96J005K235j266C142
239000B327J21o2m64J91p60M50j333j293K006j262p77Q30j575J713L47l69P89h28
240002B36L81j87K40p71j86R14r78L44m33J289L15q13KJ514l458K682k66p72L85B51
241110B56l54J020J59Q00l45m12o68J923Q3J549j31O82J56r13Q85J372k482j443C265
242165B866j434p0J19J140O64j826N62J003J27N10R98j625k01j070K64j71k03a00
243168A30j362J416m68K23j395N25o13J070K77R66j171l84J560R83j851m59J076B77
244170a53j083J43q66K093R26j668K40K71Q65n86k16k35J844q37Q38J165k28M73A778
$$ plain form
236942 -78 -137 1115 467 -771 -904 197 -314 -164 -878 483 -170 -828 -883 -599 737 -849 -713 107 -664
237997 -338 1375 305 127 894 997 343 -900 614 1039 756 -647 1239 738 542 1547 3782 2516 3142
239000 2327 2448 2386 1922 2113 1353 1803 470 -823 1183 -79 -856 -26 -1601 112 459 90 879 -828
240002 236 617 430 670 -101 -287 627 -351 -7 -440 849 1164 351 353 1867 -1591 1091 825 53 438 251
241110 256 -98 922 1081 1881 1536 1124 456 2379 2462 4011 3880 4562 4718 3805 4690 6062 3580 2137 3265
242165 2866 1432 1362 1481 2621 3285 1459 2021 3024 3151 3661 4659 3034 2833 1763 2027 1856 1653 -100
243168 130 -1232 184 -284 -61 -1456 -931 -1544 -474 -197 769 -402 -786 774 1757 -94 -553 523 277
244170 -153 -1236 -1093 -1959 134 1060 -608 -368 -97 768 182 -34 -269 1575 738 1576 2741 2513 2986 1778
245225B581J778j54R76m35P40r90r91r18L5j45r24o21J127N12j989J210K69k77A258
246280A395J312p07l75j078J69j262R39j191L21j089Q06L97k92o83J691q55j406e23
247283a135n82J175O6k107J221j180R58K12j05k75j131J466N5L55J137l91M28g37
248285a571J570j064J884l55o37Q3J011J625j295Q29K88o54k12j510J85r39O65F1
249288F8p44k75N30o32m71J026m44q7P1k98l80J775j287J621L27p55j227R49O58a254
250396a071L3j66r17J690k325J86Q61j494J835k450L223k932O04J036Mo34j6j223c648
251451b691N40O42O5j020K376j277Q60Q22j446N8O78j870R38J156p66q09J742b097
252453a366R79r28K109k581j011K868p34l45j52j02L34j739Q73L07m00Q34j08h7
$$ plain form
245225 2581 4359 4205 5181 4746 5486 4496 3505 2587 2622 2477 1553 932 2059 2571 582 1792 2061 1784 1258
246280 1395 2707 2000 1625 547 716 -546 393 -798 -477 -1566 -760 -363 -655 -1338 353 -502 -1908 -523
247283 -1135 -1717 -542 -476 -2583 -1362 -2542 -1584 -1372 -1477 -1752 -2883 -1417 -1362 -1007 130 -261 167 -737
248285 -1571 -1 -1065 819 464 -173 -90 921 2546 1251 2080 2368 1714 1502 -8 177 -762 -97 61
249288 68 -676 -951 -421 -1053 -1524 -498 -942 -1029 -958 -1256 -1636 139 -1148 473 800 45 -1182 -233 425 -1254
250396 -1071 -1038 -1204 -2121 -431 -2756 -2570 -1709 -3203 -1368 -3818 -595 -3527 -2923 -1887 -1883 -2517 -2533 -3756 -3648
251451 -2691 -2151 -1509 -1444 -2464 -88 -1365 -505 317 -1129 -1071 -393 -2263 -1325 -169 -935 -1744 -2 -2097
252453 -1366 -387 -1315 794 -1787 -2798 70 -664 -1009 -1161 -1263 -929 -2668 -1795 -1488 -1888 -1054 -1162 -87
253456a088J354o09j594m66Q64k46l87J413m34k64J538j184j109J326L68l20j532b440
254458i35j812Q67O3l50K278j19n53n97L35J58j024N34J049j243O65j97N24n36a717
255513A84j197P01K8n59j521J117J81J949k618J748j715J137r29J378K50j240e17
256463F8k150Q01m88M92P77j611J877P92k493M9L51K000q03J05p1j022N60K506D92
257518B28m7j244P27j059K74K90M95p82r26R31R72j58L50j313Q02p50P53k26K63b204
258626e2o10p56Q45J56j100M00M70o56J017Q9k22p6J72L81o91P06j82j198J25b83
259734c64N46r72J463p81j434J494j643J179R74j40q21l72K94l9K71k62j055J054B63
260789b9j703J923j53l02q50Q12k94l63O69j422J581o21j69J12p73K139p21m72d32
$$ plain form
253456 -1088 266 -343 -1937 -2403 -1539 -1785 -2172 -759 -1193 -1457 81 -1103 -2212 -886 -518 -838 -2370 -2440
254458 -935 -2747 -1880 -1817 -2167 111 -8 -561 -1158 -823 -665 -1689 -1155 -106 -1349 -684 -881 -357 -893 -1717
255513 184 -1013 -312 -284 -843 -2364 -1247 -1066 883 -1735 13 -1702 -565 -1494 -116 134 -1106 -517
256463 68 -2082 -1281 -1769 -1277 -500 -2111 -234 558 -1935 -1886 -1535 465 -338 -233 -304 -1326 -766 1740 492
257518 228 181 -1063 -336 -1395 -1121 -831 -336 -1118 -2044 -1113 -141 -299 51 -1262 -460 -1210 -457 -683 -420 -2204
258626 -52 -662 -1418 -573 -417 -1517 -1117 -647 -1303 -286 -197 -419 -495 -323 58 -633 73 -109 -1307 -1182 -283
259734 -364 182 -790 673 -108 -1542 -48 -1691 -512 462 322 -499 -871 -577 -616 -345 -607 -1662 -608 263
260789 -29 -1732 191 38 -264 -1114 -302 -596 -959 -290 -1712 -131 -752 -921 -809 -1582 557 -164 -636 -432
261844H3j088J485j203O66j024J441n55p54R4Q8J075j757J350n59P83j308R14c77
262847A600k694J820R02j610O76j929J161Q05j357J173M42k62r81m00j08J392e41
263797F00r83j028J425r6j019J61J133p08o87J42J320k73q27M28L52j074m52R72f66
264852b44L56O22j939K48J753p51o82J01k53J5P12J96o1j113J471L81j641K275A811
265907c34Q00j863R52J943q37P84j518n82J126k42Q2J029k22l84o48r30J161K84B02
266962h1j35J11j0R86o62n95O29p40l97J036j111J931j096k59Q80l33j61m14J426G60
268070f16k00R95N66j392O91p92Q02j251J266k31O49P99j755J302j10k71Q74r74G62
269125H60j87O46o43m44n42Q79r80M11J65N50nR28j736P45q62J341J82q41j122g11
$$ plain form
261844 83 -1005 480 -723 -57 -1081 360 -195 -949 -855 -767 308 -1449 -99 -658 125 -1183 -269 -377
262847 1600 -1094 726 1628 18 694 -1235 -74 731 -626 547 989 727 -254 -654 -762 630 -541
263797 600 -383 -1411 14 -82 -1101 -940 193 -515 -1202 -1060 260 -13 -840 -412 -60 -1134 -1586 -614 -666
264852 -244 112 734 -1205 -957 796 45 -637 -536 -789 -774 -62 134 73 -1040 431 812 -829 1446 1811
265907 -334 466 -1397 -445 1498 661 1445 -73 -655 471 229 311 1340 1118 734 86 -844 317 601 202
266962 -81 -216 -105 -115 871 209 -386 243 -497 -894 142 -969 962 -134 -393 487 154 -7 -421 1005 760
268070 -616 -816 179 745 -647 44 -748 54 -1197 69 -162 487 1286 -469 833 723 452 1326 352 762
269125 860 673 1319 676 232 -310 569 -411 0 165 715 710 1638 -98 647 -215 1126 1308 467 -655 -711
270233C84P98L30p39k87O19o92m96n36j19Q96L47r23Q01L99p87J149J64n80o0B85
271341B98J75J67q86M23l62K966J59j549J913R63q41K955k092m28j97J295k172C214
272344B126o28K97L44j774j28P72O98n77p0K82Q1M4j588N96J398j364O19r15Q86A054
273452B098j895L75j38R82q16J243R82j852O91j550J678p71N94l74o99o90j99G24
274454H84M12M29m73K501q08N82k224P14J643P80J230l28N12n11k91N63j154J8C806
275509D649q28l60m04l28j89q70N6p82N00k66p83L23N40o46Q08j120J113l87Q54I0
276617H42O1j54J10Q01J0j123J014k039L90j024j841R90q95n36J208L63n19R57i95
277672d36Q0k21R36k15j596L027K01j42J044j13O45j200Q78j341n4J570N81m257A467
$$ plain form
270233 384 1182 1512 773 486 1105 413 -83 -619 -738 158 505 -418 383 782 -5 1144 1308 728 668 285
271341 298 473 640 -246 177 -185 2781 2940 1391 3304 4267 3426 6381 4289 3861 3664 4959 2787 3214
272344 2126 1498 1795 2139 365 237 1009 1707 1130 1060 1342 1423 1467 -121 475 1873 509 1128 213 1099 1054
273452 2098 203 578 440 1422 606 1849 2831 979 1670 120 1798 1027 1621 1247 548 -142 -341 724
274454 884 1296 1725 1252 3753 2945 3527 1303 2017 3660 4440 5670 5342 5854 5343 5052 5615 4461 4479 3806
275509 4649 3821 3461 3057 2729 2540 1670 1726 944 1444 1178 395 718 1258 612 1420 300 1413 1026 1880 90
276617 842 903 749 859 1660 1670 547 1561 -478 -88 -1112 -2953 -1963 -2858 -3394 -2186 -1823 -2342 -1385 -995
277672 -436 -356 -577 359 144 -1452 1575 1776 1634 2678 2565 3210 2010 2888 1547 1493 3063 3644 -613 1467
278727A793j870J279K73j97m46J58j482J598Q2j095j019Q09Q24l86k0o85R49K60i15
279783g75j067J800j155O39L66j993j77M44o71j460J944k093J5Q05J22n12r7J527b818
280838a793j645K214l4J099k426O96J203M44o52J19j055O44P11j72j045K1R43d18
281840e56j059R57r49R1M63L21O10m52J085j246J036k28j459J253Q27k272J950i97
282843e91J683j037L98m36L94j004j083Q67j968R57j393l70Q52o9j246L82J867b253
283845a661j514N68K8K084j505J395j221K153j728J64Q80o12j29L93k05j267J198a494
284848a177J348n50kl99J55P62j751P26J431L40j482L35J25n99p72M86N46k34i63
285903E67J10m70j304O32Q16n37P37j809K517j609k65P17J74K87j059K68J721e29
$$ plain form
278727 1793 -77 1202 1475 1278 832 990 -492 1106 1188 93 -926 -117 707 321 301 -384 565 825 -915
279783 -775 -1842 -42 -1197 -558 -192 -2185 -2362 -1918 -2589 -4049 -2105 -4198 -4183 -3378 -3256 -3768 -3865 -2338 -2818
280838 -1793 -3438 -1224 -1258 -159 -2585 -1889 -686 -242 -894 -775 -1830 -1186 -475 -647 -1692 -1671 -728 -418
281840 -556 -1615 -658 -1607 -1516 -1053 -732 -122 -574 511 -735 301 73 -1386 -133 694 -1578 372 -997
282843 -591 1092 55 453 17 411 -593 -1676 -809 -2777 -1820 -3213 -3583 -2731 -2800 -4046 -3664 -1797 -2253
283845 -1661 -3175 -2607 -2579 -495 -2000 -605 -1826 327 -1401 -1237 -357 -969 -1098 -705 -910 -2177 -979 -1494
284848 -1177 171 -379 -381 -780 -625 137 -1614 -888 543 883 -599 -264 -139 -738 -1510 -1024 -478 -712 -963
285903 567 677 207 -1097 -465 351 -186 551 -1258 1259 -350 -615 102 276 563 -496 -228 1493 -529
286905f06J059j10j182J175m13j43k79J173j113N57n28j016J322J75k88l51J002b71
287908E3Q07j475QK78p71J423k03J305j516M68q0p82P7J439M6j169J548p75k82B
289016E23J00m96j193Q80o53J401l437K536j48r93J838l74J242Q44n45k05q51I74
290018f23KJ021k36m56J147p64R47Q6j567O74O28j259K150j462O72J21l69P7j50B424
291126B66Q72J107o52J282k00j793K593k196N58R19m40k88P8j558J761r9k255A69
292128A203j164K307j458l06j686K67Q27o93m62R25K43J424j226p09J087L23R89B401
293131B375l86J01q46J6R19l50J143j179q05O08K032j404l98o9k78N89K24L04A591
294186A951M07j063P44L30J359k133J371p87R14j38N16O28l59m12L68J500K53E706
$$ plain form
286905 -606 453 343 -839 336 -77 -220 -499 674 -439 118 -410 -1426 -104 71 -217 -568 434 -271
287908 53 860 -615 -607 -329 -1100 323 120 1425 -91 377 297 -485 -408 1031 1077 -92 1456 681 399 2
289016 523 623 127 -1066 -186 -839 562 -2875 -339 -487 -1480 358 -16 1226 2070 1525 1320 469 974
290018 -623 -621 400 164 -292 855 91 1038 1124 -443 231 859 -400 1750 288 960 1081 712 789 639 2424
291126 266 1138 2245 1593 2875 2675 882 3475 1279 1837 2756 2316 2028 2106 548 2309 2210 -45 169
292128 1203 39 2346 888 582 -1104 -837 -10 -703 -1165 -240 3 1427 201 -508 579 902 1891 2401
293131 2375 1989 2090 1244 1260 2179 1829 2972 1793 988 1596 3628 2224 1826 1757 1479 2068 2292 2596 1591
294186 1951 2358 1295 2039 2369 3728 1595 2966 2179 3093 2955 3471 4099 3740 3328 3696 5196 5449 5706
295188D689J62J68p48j371M96q19j57J540j767J561L88J9j42M23P16j88N77R31E273
296244E780O43j566P91K28R94m50P00N00l83r23Q46L88l51R48j853k83J54m20E155
297299F808M20r9j01M10K66k516J541J112o09J41K16R07n93P87n39J89N90J497I062
298354I175P20J169L19k038P83M74K227r36J698j701J767o34j94R39j404J626A4353
299304A3744Q81K35l94J172r48J436M04o03Q38P36m93J190n5O82l10r71K201K436B1319
300359B1783J71J529Q49N23r24J574O85J134o38L362q7O18K79N49J9K834J589C5088
301361C6520N25P60K641o03k51k32J635j13n05R0O76j79K84Q46j162K481q46K392D5543
302416D8936K436N761K389N058P055O561Q113J3994K1844L3311N4849P5847R3502D70877
$$ plain form
295188 4689 4851 5019 4271 2900 3396 2577 2420 3960 2193 3754 4142 4161 4019 4442 5158 4970 5547 6478 5273
296244 5780 6423 4857 5648 5876 6870 6420 7120 7620 7237 6314 7160 7548 7197 8145 6292 6009 6163 5743 5155
297299 6808 7228 7129 7028 7438 7704 5188 6729 7841 7232 7373 7589 8496 7903 8690 8151 8340 8930 10427 9062
298354 9175 9895 11064 11383 9345 10128 10602 12829 11893 13591 11890 13657 13023 12829 13768 12364 13990 14353
299304 13744 14625 14860 14466 15638 14690 16126 16530 15927 16765 17501 17008 18198 18143 18825 18515 17544 19745 22181 21319
300359 21783 21954 23483 24332 24855 23931 25505 26190 27324 26686 30048 29961 30579 30858 31407 31426 34260 35849 35088
301361 36520 37045 37805 40446 39843 39592 39360 40995 40882 40377 40467 41143 40964 41248 42094 40932 43413 42567 44959 45543
302416 48936 51372 57133 59522 64580 71635 78196 86309 100303 122147 155458 210307 286154 379656 470877
303208E44729N5659L1023R802k2311n1354p5744q7366q7557p3448n4445l9848A24728
303894A10043j0291m495l376m536m86M14r15J206J940r5r24o69J834J62m53K131I4262
304843I7856M311L487J882J718Q70k044n179m931l427l972k405k600R27K824P242A08622
305740A28988L1384M5347M9887M7091M3081L8985M4713N6383N9365N2568M3252F80517
306426G19784K7124J7035k341k6925n3685p0843p4872p7009p4894o9230n7190B07722
307112A69556l0258j6518j1593r039n691k776K403J920M810J699L946j387L86A05286
307903A00829n837o899o845o672n062m553m322l506j097k872l415j360l137q89D6116
308747D7914K648L012L450M415N557P219J3329K2334L5897N6696P4091Q2465P9221E00425
$$ plain form
303208 544729 600388 631411 641213 618902 567548 491804 404438 316881 243433 188988 149140 124728
303894 110043 99752 95257 91881 87345 86859 87273 86358 87564 89504 89409 88485 87816 89650 89812 89359 91490 94262
304843 97856 102167 105654 107536 109254 110124 108080 102901 97970 94543 90571 88166 85566 86493 89317 96559 108622
305740 128988 160372 205719 255606 302697 345778 384763 429476 485859 545224 597792 641044 680517
306426 719784 746908 763943 761602 734677 680992 610149 535277 458268 383374 314144 256954 207722
307112 169556 139298 122780 111187 102148 96457 93681 96084 98004 102814 104513 108459 107072 107458 105286
307903 100829 94992 88093 81248 74576 69514 64961 60639 57133 56036 53164 49749 48389 45252 44363 46116
308747 47914 50562 53574 57024 61439 66996 74215 87544 109878 145775 202471 276562 359027 438248 500425
309539E42447K1851j212l0490n9207p6927q5190p5293o3463m4842l1994j9766F4538
310225E5451o160n213k643m440j738k594j672k211k218k473j13j608r65k975l97A5878
311122A6239j043j686j777J139j185K34j492j390Om21K09M31k381K339j595N59G223
312071A0140j928j551O59j28k33m85l99M91o11n27Q81n69o1m67l67J59j310J152C502
313127D319r47L0J80j487k95J82N06j9j065J92q24K86k14J840n90Q02j241O78B170
314182A416j316K284k30r05J59RJ088j135L67L11j147J246J55K25O2J85k494K009A863
315237B743l49j136L97P54Q66k028j89m38J540j637l35K061j295p21m81J038J010B008
316239A934o80J098p33p00P82N49j006L98L15q44M42j308J318l11J082J7k04m09A562
$$ plain form
309539 542447 564298 563086 532596 473389 396462 311272 235979 172516 127674 95680 75914 64538
310225 55451 49291 44078 41435 36995 35257 32663 30991 28780 26562 24089 23976 22368 21403 18428 18031 15878
311122 16239 15196 13510 11733 12872 11687 11921 10429 9039 9045 8624 8833 9264 6883 9222 7627 8186 7223
312071 10140 8212 6661 7320 7192 6959 6474 6075 6566 5955 5428 6309 5740 5679 5212 4845 5004 3694 4846 3502
313127 4319 3372 3402 3582 2095 1800 1982 2488 2469 1404 1596 772 1058 844 2684 2094 2896 1655 2333 2170
314182 1416 100 2384 2154 1249 1408 1417 2505 1370 1737 2048 901 2147 2302 2527 2589 2774 280 2289 1863
315237 2743 2394 1258 1655 2409 3275 1247 1058 620 2160 523 188 2249 954 233 -248 790 1800 2008
316239 1934 1254 2352 1619 919 1701 2250 1244 1642 1957 1113 1555 247 1565 1254 2336 2353 2149 1740 1562
317295A870N64p74k27L15L3O26m04o79k28k14K96q6j569J060L00J88Q0m48O72H96
318402f87J893n81m01J129Q6j543P63n15J077j00j199N74R27P90j827o6p4k51A280
319458A536k92m33N72l68m50r4p40J487K24o00l89l7P1m12J194n07J29l19L7J038A441
320618A610r97Q62k34m52M1M26n92r88N89j071J599j298J123j489Q51j547J231b67
321621A136j089j165K346j775Q94q16O7K6j261K631j514n76N5L21K20O56L1J17f36
322676a312O51P8L34R61l54M85j234n52K84l6J898k314J390N33Q16k92j081p98d82
323731B75j44J799k505R98k46m84p09n01R75K61K08K45j331J027j55q39k89J013d14
324786a337J006j490K405j589Q73L87M28J47j715j205K386j39j438K2J913l81a512
$$ plain form
317295 1870 2434 1660 1433 1748 1781 2407 2003 1324 1096 882 1178 1092 -477 583 883 1071 1151 703 1375 896
318402 -687 1206 625 224 1353 1439 -104 659 144 1221 1121 -78 496 1423 2213 386 320 246 -5 1280
319458 1536 1244 811 1383 1015 565 471 -269 1218 1442 842 453 416 487 75 1269 762 891 572 609 1647 1441
320618 1610 613 1475 1241 789 830 1256 664 -324 265 -806 793 -505 618 -871 -20 -1567 -336 -267
321621 1136 47 -1118 1228 -547 347 -469 -402 -376 -1637 994 -520 -1096 -1041 -720 -500 156 187 304 -636
322676 -1312 -661 -583 -249 712 358 843 -391 -943 -659 -695 1203 -1111 279 812 1628 1336 255 -543 -482
323731 275 131 1930 -575 423 177 -307 -1016 -1517 -542 -281 -73 172 -1159 -132 -287 -1126 -1415 -402 -414
324786 -1337 -331 -1821 584 -1005 -132 255 683 830 -885 -2090 296 157 -1281 -1259 654 273 -1512
325736a472O83p0N50l92o23q86K284K80k060K016j632J582r32J438k12k4r75n22e75
326791b25P1M55k87k47L24n59J064j103j00jp95J946j48J72r14N21K79o8j777c32
327899b46Q91j599O66l38M0J516o84o35J28M90j277J965N30n6m42j253J044Q3A066
328954A344l12n81M41M87J692J749j910R85j936Q08p95J233k648J069k164P19F9
329904A56k84j030K31O94Q96k351R91J348q52O16j640K207p87O63j211Q69p1j289c26
330959a036L23J344J80K62k43j307J020o8j043J460j12k98O31n34j85j054L095B52
331962A142L33k39K39P43p43J420o22K893k912N63K94K64j974K225j582l6j300E96
332964A148k318N37O66j813J457l06mn64Q69J20O35l89Q3k18O49r27J265k11J47B523
$$ plain form
325736 -1472 -789 -859 -309 -701 -1324 -2210 74 354 -1706 310 -1322 260 -672 766 554 530 -445 -967 -575
326791 -225 -154 301 14 -233 91 -468 596 -507 -607 -608 -1403 543 395 567 -347 174 453 385 -1392 -332
327899 -246 645 -954 -288 -626 -586 930 246 -389 -261 229 -1048 917 1447 1391 949 -304 740 823 1066
328954 1344 1032 451 892 1379 3071 4820 2910 3895 1959 2767 1972 3205 557 1626 -538 181 69
329904 156 -128 -1158 -927 -233 663 -1688 -697 651 -201 415 -1225 982 195 858 -353 516 445 -844 -326
330959 -1036 -713 631 811 1073 830 -477 543 475 -568 892 780 482 1113 579 394 -660 2435 252
331962 1142 1475 1236 1475 2218 1475 2895 2273 5166 2254 2817 3111 3375 1401 3626 2044 2008 708 596
332964 1148 -1170 -633 33 -1780 -323 -629 -633 -1197 -328 -208 427 38 121 -97 552 -375 890 679 826 2523
334072B809J049j913M02J141k766J310L26J33j477K17j173q69M30Q0M34R97j812g03
335074a129J379j135J184K76j12J332p99J512q66k65r14K61J394j755q29R09l88b411
336077d71M11j621P23P17j291P45K36K97q2j708J471q24J291J12O47J15M05p72A627
337132A236K068j020R80j174J329p36r33r7J34j85k84n07k86o67M88j620k54Q19a826
338187b30j596J535k06K84j91l78K00L02K031k686o2J58p1n05O17N84j172O68a402
339242H18r22j687O6M00M94L44R97j903O67l62q15K178j883K76J341n29O83q63D76
340298D49M10L11K76m17m11M02q05l33l75R31j730j168j64O24J184L71k79j265a409
341353a420j460R34O10P90j437m55J617N59j193P01P49j505J683j92p57Q75l2a0
$$ plain form
334072 2809 3858 1945 2347 3488 722 2032 2358 2491 1014 1231 58 -811 -381 -301 133 1130 -682 -703
335074 -1129 250 -885 299 575 463 1795 996 2508 1642 1377 463 724 2118 363 -466 443 55 -2411
336077 -471 -60 -1681 -958 -241 -1532 -787 -551 -254 -336 -2044 -573 -1397 -106 6 653 768 1173 401 1627
337132 1236 3304 2284 3264 2090 3419 2683 1750 1653 1787 1602 1318 811 525 -142 346 -1274 -1528 -709 -1826
338187 -230 -1826 -291 -497 -213 -404 -782 -582 -280 1751 -935 -997 -839 -910 -1415 -798 -214 -1386 -718 -1402
339242 818 -104 -1791 -1725 -1325 -831 -487 510 -1393 -726 -1088 -1903 275 -1608 -1332 9 -520 163 -700 476
340298 449 859 1170 1446 1029 618 1020 215 -118 -493 438 -1292 -2460 -2624 -2000 -816 -445 -724 -1989 -1409
341353 -1420 -2880 -1946 -1336 -546 -1983 -2438 -821 -262 -1455 -754 -5 -1510 173 -19 -776 99 67 -10
342355b95r09J232r79j362P36R34N7j76n50l42L77K04l8m80K54o43J406M24o54a537
343463a256Q49P08l64P42o17P8P40j469J316J245J79q18J843j167k603J512J077a96
344466B610j126Q01p10o10n60k20J488j683J581k426J090J19l31j542J307M50I4
345415G07r10R74r27n45R33r64K20J327j743J194q95j0n50j34m17J654j81Q90e89
346470b93j162q0J001j33q21M57n1J393m98r11J014J317j261j505K713j146n46a066
347473D36J71Q60O39Q39R6m73n34J42k38L3K02M70l72m99k36m66j397J60R74m47A934
348634e51J446J30r77J572l30o51J212j195m16R32r01L9J72k75m53J94M59J411B99
349689c07k35O15j606J294l39n56K106k914J772J63j69R14j635j92K368j849M42B77
$$ plain form
342355 -295 -1204 28 -951 -2313 -1577 -643 -586 -762 -1312 -1654 -1277 -1073 -1111 -1591 -1337 -1980 -574 -150 -804 -1537
343463 -1256 -407 301 -63 679 62 140 880 -589 727 1972 2151 1333 3176 2009 -594 918 1995 -196
344466 2610 1484 2285 1575 965 405 185 1673 -10 1571 -855 235 354 23 -1519 -212 238 94
345415 707 -203 771 -156 -701 232 -732 -512 815 -928 266 -629 -639 -1189 -1323 -1740 -86 -267 623 -589
346470 -293 -1455 -1535 -534 -667 -1488 -1031 -1082 311 -187 -1098 -84 1233 -28 -1533 1180 34 -512 -1066
347473 436 607 1467 2106 2945 3041 2568 2034 2176 1938 1971 2173 2643 2271 1772 1536 1070 -327 -167 807 360 1934
348634 -551 895 1025 48 1620 1290 639 1851 656 240 1172 271 310 482 207 -246 -52 407 1818 299
349689 -307 -542 73 -1533 -239 -578 -1134 972 -1942 -170 -7 -176 738 -897 -1089 1279 -570 -128 277
350691E94N79n1j524K164L64M82J482j548o62J410j56j0J647j800J230k084L027D688
351694D215J232j413q66n7R4j618p03R35k36j80k121Q98o51k325jK67J787j341a091
352749a654o02J824m50j77L75r24O35J194j115j097J438l25K01j516J638j143a969
353698a906j966J190m476M669J7650k7816N798R807l034P37o61K4q42J301n72i66
354595a59r23L53N10k67J85J174R76k201M96j19o57J207m50n81q66J813p76K39C7
355651d6m71j41L3R49j027J021j384J184r31o9p75K769o05m47N3n53Q63n15L79h39
356758c81j22K03R85m15K39j346J99O63r7j513L7l0p0L47r26O48P00j951r52J057c043
357919b471R44l7o9J239k298J551KR35j011J118M98r32J720j049n43r7K45m71d87
$$ plain form
350691 594 1173 1122 -402 1762 2126 2608 4090 2542 1880 3290 3134 3124 4771 2971 4201 2117 5144 4688
351694 4215 5447 4034 3168 3111 3205 1587 884 1819 1583 1403 -718 180 -471 -2796 -2797 -2530 -743 -2084 -1091
352749 -1654 -2256 -432 -882 -1059 -684 -1608 -973 221 -894 -1991 -553 -878 -677 -2193 -555 -1698 -1969
353698 -1906 -3872 -2682 -7158 -2489 15161 -12655 -6857 2950 -84 653 -8 16 -826 475 -97 -966
354595 -159 -1082 -729 -219 -486 -301 873 1849 -352 144 25 -632 575 125 -456 -1322 491 -285 -46 37
355651 -46 -517 -658 -625 324 -703 318 -1066 118 -813 -882 -1657 1112 507 60 113 -440 423 -92 287 -839
356758 -381 -503 -300 685 270 509 -837 -638 25 -72 -1585 -1548 -1578 -1648 -1301 -2227 -1579 -879 -2830 -3782 -2725 -3043
357919 -2471 -1527 -1564 -1633 -394 -2692 -1141 -1139 -204 -1215 -97 401 -531 1189 140 -403 -500 -255 -726 -487
358974i04J288j242j226M45K60n13r88J98j66K97k90N01m74j248J093l89K349a713
359977c151M29J179j91K013p04j61j303N43J111QK29k9k34j56m32n1P13j69J396a35
361085F75k43k696J340r45l35n51n30J161j006Q53r14N02Rk13J399n56N89j094a354
362140e00k034K709k104J23K77m19K075j243n86R32J98j587K115k57q66J073n82a545
363142f80K37O5k457L124j903J50Q66m27Q3m32J496K64L70p17j320K583j599K77d70
364198a169N98m50m97O65L30m90m03K77o05J166j245J480r3N49j37j72k38K84c69
365253c88n03L36J759o26r16J97Q18j559J533k13m34J217r38q22J419r05Q44j68d61
366308D41r17N69N65m93P19j719j13J708l50J892k28j475n88L01J445r5j836N48A077
$$ plain form
358974 -904 384 -858 -2084 -1639 -1379 -1892 -2880 -2682 -2848 -2551 -2841 -2340 -2814 -4062 -2969 -3358 -1009 -1713
359977 -3151 -2722 -1543 -1734 279 -425 -586 -1889 -1346 -235 -227 2 -27 -261 -417 -849 -900 -187 -356 1040 -135
361085 675 432 -2264 -924 -1869 -2204 -2755 -3285 -2124 -3130 -2277 -3191 -2689 -2680 -2893 -1494 -2050 -1461 -2555 -1354
362140 -500 -2534 175 -1929 -1806 -1529 -1948 127 -1116 -1702 -770 -572 -2159 -44 -301 -1167 -94 -676 -1545
363142 -680 -443 -378 -2835 289 -1614 -1464 -598 -1025 -942 -1374 122 386 756 39 -1281 1302 -297 -20 -470
364198 -1169 -571 -1021 -1518 -853 -523 -1013 -1416 -1139 -1744 -578 -1823 -343 -436 113 -24 -196 -434 -150 -369
365253 -388 -891 -555 1204 578 -338 -141 677 -882 651 438 4 1221 283 -539 880 -25 819 651 -461
366308 441 -476 93 658 165 884 -835 -948 760 410 2302 2074 599 11 312 1757 1662 -174 374 1077
367363E67O51o73M66N3p29M90Q45M04j28j163l36j736K781m18j261L4J130p99F72
368418g91J741l8K06N82l36R7J40j323K57J096n25P55N44n29L12m16l89k67K02B025
369526A251R33j174r75L21J381j168L41P98n24P9L47N05q03o39J039J022l88j419B977
370581A519J230q78Q41k11R95M14q06N69j334j420K245O37j727M82j049Q38L72B075
371584A114Q85J262j610K867k289J435Q28r68Q76q99J377j004Q61j089l49N30E469
372533F109j158l79l2M61k89R68j000m13K348p45P70j632P89N40q71j679J150E328
373536E372J60O7J166j30j25r8P20K397k469K609l97N97J119j024o57K34o64J294A0829
374591A0179Q6m57K791o84r12O15r8n36j99J025L56n85Q60J497j135K158J32p19A5213
$$ plain form
367363 567 1218 545 1011 1064 335 825 1670 2074 1946 783 447 -1289 1492 1074 -187 -153 977 178 672
368418 -791 950 912 1118 1700 1364 1461 1601 278 535 1631 1106 1861 2405 1876 2188 1772 1383 1116 1318 2025
369526 1251 2184 1010 35 356 1737 569 910 1708 1184 1263 1610 2115 1312 673 1712 2734 2346 927 2977
370581 1519 2749 1871 2712 2501 3496 3910 3104 3673 2339 919 3164 3801 2074 2556 1507 2345 2717 2075
371584 1114 1999 3261 1651 4518 2229 3664 4492 3524 4400 3501 4878 3874 4735 3646 3297 3827 5469
372533 6109 4951 4572 4540 5001 4712 5680 4680 4267 6615 5870 6640 5008 5797 6337 5466 3787 4937 5328
373536 5372 5532 5599 6765 6635 6510 6412 7132 9529 7060 9669 9272 9869 10988 9964 9307 9541 8877 10171 10829
374591 10179 10265 9808 12599 11915 11003 11618 11520 10984 10785 11810 12166 11581 12441 13938 12803 14961 15093 14374 15213
375646A4871R84n76K053l21J593J150L56J406k55N55J99J490J147M26J248r9o32B8948
376649B7137n64J438Q34N09N44N07o17l25m56J413P28j122k31n43M14J593P94C2936
377651C4161K474P76L700O042O528J0767J8707K9282M1038N3734O1544N4305N5254D11250
378443D31434J3203J0630J3053K770j5756l9656m6737o5587o5256n5956m7371A02580
379128G9806j3693q219n523l016l813k16j683k663j821l1j302K17k496r62k734C0726
380025C0746k36l018K20l64k74O36j264J46j17J269j146M20J197J501R8J062K117C1440
381028C2021J229j03J40J889L01p35L293j677J386j22K280J044j84j357K737j399D1759
381977D4267k408M19K146j688j169J222L72m17Q71o7J987J040K567J466J386L101E8845
$$ plain form
375646 14871 15855 15279 17332 17011 18604 19754 20110 21516 21261 21816 22015 23505 24652 25078 26326 26227 25595 28948
376649 27137 26573 28011 28845 29354 29898 30405 29788 29463 29007 30420 31148 30026 29795 29252 29666 31259 32053 32936
377651 34161 36635 37411 41111 47153 53681 64448 83155 112437 153475 207209 268753 323058 378312 411250
378443 431434 444637 455267 468320 471090 455334 415678 368941 303354 238098 182142 134771 102580
379128 79806 66113 57894 52371 49355 45542 45326 43643 40980 39159 39128 37826 38043 35547 34585 31851 30726
380025 30746 30510 27492 27712 27348 27074 27710 26446 26592 26475 27744 26598 27018 28215 29716 29814 30876 32993 31440
381028 32021 33250 33147 33287 35176 35477 34742 38035 36358 37744 37622 39902 40946 40762 39405 42142 40743 41759
381977 44267 41859 42278 44424 42736 41567 42789 43161 42744 43615 43548 45535 46575 49142 50608 51994 55095 58845
382927F2175N744N650P329J0559J4577K3257L9457N9800Q0831Q6645O5977K9608D82573
383666D61973j0796J1181J3256r450l9716o1409o7633o4646n1582l7274k5741A01715
384352I2258p852l354k722l110J178j622J836K061M240M537J0431J5997K5629A77646
385143B28415O0928N8444N5129L7924K2061K1655J8612J5466J1317j739l3015D43987
385829C75533p4798o4348n5003m0867k7645j7591j2468o522n954j992k699j381F5161
386567F3836q22M84L79n16j110K462P59M256P371P731J5473K6351M2410O5819C23045
387412D15084O7548J8831j9823k7202j5492L608L844j6362m4012o2156o7223o0843A47808
388150A12148k4099j7033j0133n776n471m144j474m548r27l081k998l27l56j139B8008
$$ plain form
382927 62175 67919 73569 80898 91457 106034 129291 168748 228548 309379 396024 462001 491609 482573
383666 461973 451177 462358 475614 466164 426448 365039 297406 232760 181178 143904 118163 101715
384352 92258 84406 81052 78330 75220 76398 74776 76612 78673 82913 87450 97881 113878 139507 177646
385143 228415 289343 347787 402916 440840 462901 484556 503168 518634 529951 528212 495197 443987
385829 375533 300735 236387 181384 140517 112872 95281 82813 76291 70337 68345 65646 64265 65161
386567 63836 63014 63498 63877 63361 62251 64713 65472 69728 77099 84830 100303 126654 169064 234883 323045
387412 415084 482632 501463 481640 454438 438946 442554 446398 430036 386024 323868 256645 195802 147808
388150 112148 88049 71016 60883 55107 49636 45492 44018 39470 38543 35462 32464 32137 31781 30642 28008
388994B6187j465o71p77l655j59k426N21l334j102n47j07j966R98j180l49k66I570
389944H739o42n78K38P2m21k43P25o30j215O35j09J036j301J18Q80p98j027J965G339
390999D908J178l42M51j909J187j338J57m07m57N20j012L59k66r16R57j662K72C089
392002A421p64N68P92j39Q99k204Q03J171k32p25L47J73j56J026j03l35J54K14B927
393057C067j47j254J089j281R75k00j421k4R1p79N98N88K84l9m76j19k23K09n92f11
394165A323j87j080R32R1j629K94J339p75L0R59K27j660L48M92J54j114P04J380F18
395220E79J541r40p10J1J374j821J972p63P31p71P72L66m71q99O28j679M60J202A033
396275B97N13k66q53J810j012J49K86K25p23p23J67O0J917k504J200L32l03j02B37
$$ plain form
388994 26187 24722 24051 23274 19619 19460 17034 17555 14221 13119 12572 12465 10499 11497 10317 9968 9702 9570
389944 8739 8097 7519 7757 7829 7408 7165 7890 7260 6045 6680 6571 7607 6306 6424 7304 6506 5479 7444 7339
390999 4908 6086 5744 6195 4286 5473 4135 4292 3885 3428 3948 2936 3295 3029 2113 3070 1408 1680 3089
392002 1421 657 1225 2017 1878 2777 573 1376 2547 2315 1590 1937 2110 1954 2980 2877 2542 2696 2910 2927
393057 3067 2920 1666 2755 1474 2449 2249 828 804 895 116 714 1302 1586 1547 1071 952 729 938 346 -611
394165 1323 1136 56 988 1079 -550 -256 1083 308 338 1297 1524 -136 212 704 858 -256 448 1828 618
395220 579 2120 1180 470 481 1855 34 2006 1243 1974 1203 1975 2341 1870 971 1599 -80 380 1582 1033
396275 297 810 544 -309 1501 489 638 924 1149 426 -297 -130 -70 1847 -657 543 875 572 470 237
397330a75Q86j261K953m21j622J184q76Q76o03n27N75l86k68R36J7M50p62k52f73
398386A217j357J355L14j034o20r86J259j33m23J616m75j450L04m71j8J487L38A508
399388c74J546j867j29J399j523J123m2N22o31M53n91j01r44J334k069J897M78B214
400390f59R08q04M44k77O01o75P04P21j595J103q29k75M44r40J484k32l67K11A72
401446D65p41J045m95K42k48M96j421J033r18K48K76J61R32k680J740n73p03m12d01
402501I80j447j597K673j717m01J388p57K96J2n86J704j104l65J279M4p34j85c28
403503d16Q68Q82j189o61J719q10j127J284K3L99k9J078k045J393k14k84l73M53A500
404558A987j89q49J435m25j037j81r71K086k549l75l71K121j807N87m8j93o24F25
$$ plain form
397330 -175 711 -550 2403 1982 360 1544 668 1544 941 414 989 603 335 1271 1288 1738 976 724 -673
398386 1217 -140 1215 1529 495 -125 -1111 148 15 -408 1208 733 -717 -413 -884 -902 585 923 1508
399388 -374 1172 -695 -824 575 -948 175 133 655 24 477 -114 -215 -1159 175 -1894 3 481 2214
400390 -659 249 -555 -111 -388 213 -462 242 963 -632 471 -358 -633 -189 -1129 355 123 -244 -33 172
401446 465 -276 769 274 516 268 764 -657 376 -542 -294 -18 143 1075 -1605 135 -438 -1141 -1553 -401
402501 980 -467 -2064 609 -1108 -1509 -121 -878 -582 -570 -1156 548 -556 -921 358 402 -332 -517 -328
403503 -416 452 1334 145 -516 1203 393 -734 550 573 972 943 2021 -24 1369 1155 871 498 951 1500
404558 1987 1798 949 2384 1959 922 741 -230 1856 -693 -1068 -1439 682 -1125 -538 -586 -779 -1403 625
405561b36o16J44m71K195j607J86p81j43K88O43M82o26Q20p41n27R05l37P69q34a024
406669c12l62L88q60J203p78O76k140Q06J94J012k49k31j99o33M07J641l17k48a434
407724g2M17m39p34K88N44L80j16L91R0q86j384J351L88J95j213N73j197J386A502
408779A05j563N89K231j770N94p53J820q51j364K517k05J114r44j16J166P90p00C210
409782B072o13N73j091J013j947J294n36r18k46J258j327j205K64K051o39j29e51
410731c22o7J48N53m57o81P6J858J038o69R37n35N54J71l70r17n75J832k10K53A041
411839D30N2p57N0q4J42J520j584j61k06J579j116J361m65K22l17K19N62q60oa117
412947b56l63K39J45o52J45O94l19O51m84J457j45J22L50q9K08j118K06r48J265A903
$$ plain form
405561 -236 -852 -708 -1179 1016 -591 -405 -1186 -1329 -1041 -398 84 -542 278 -463 -990 -85 -422 347 -487 -1024
406669 -312 -674 -286 -1146 57 -721 -45 -2185 -1379 -1185 -173 -422 -653 -852 -1485 -1078 563 246 -2 -1434
407724 -72 345 -94 -828 -540 4 384 268 659 749 -137 -1521 -170 218 413 -800 -227 -1424 -38 1502
408779 105 -1458 -869 1362 -408 186 -567 1253 402 -962 1555 1350 2464 1520 1404 2570 3360 2660 3210
409782 2072 1459 2032 941 1954 7 1301 765 -153 -399 859 -468 -1673 -1409 642 3 -126 -551
410731 -322 -389 -241 312 -145 -826 -750 1108 2146 1477 2414 1879 2433 2604 2234 1317 742 2574 2364 2617 1041
411839 430 482 -275 -225 -309 -167 1353 -231 -392 -598 981 -135 1226 761 983 666 885 1447 587 581 -1117
412947 -256 -619 -380 -235 -887 -742 -48 -367 284 -200 1257 1112 1234 1584 1495 1703 585 791 -157 1108 1903
414055d74K77l691L319j695K063r40j373Q96p94M83j04J093j346J620o06j01r56b59
415058b329J987j582O02Q04k81o54J002j222J839n13r85Q80k418K138q42j70J662B14
416060a833P64J020j999R79n34R9O51M6k44M07p20M50K77j211L75J088l60J17a652
417115a370o89J807L24j530J7K26K24K20n85R21n05m49K73P13p59M77q27O97l03a559
418223a912j176J569P81p51J250j202N57J718j740M64n03J084J503r56M08J214B672
419173C442j818K558J95m70q7j610J088n68m65j149J39R25k871J117j833L50M45a036
420175f80p40n64O04Q49l36p20J346m94mQ49J29j564M59M6l33R92j415M57J899i02
421283d20j36p07n18J478q2j180Q99L90J64p3o04R45k92J7m50R23j925M64n6p66h82
$$ plain form
414055 -474 -197 -3888 -569 -2264 -201 -1141 -2514 -1618 -2412 -1929 -2033 -940 -2286 -666 -1272 -1373 -2329 -259
415058 -2329 -342 -1924 -1322 -518 -799 -1453 -451 -1673 166 -347 -1332 -452 -2870 -732 -1574 -1744 -82 214
416060 -1833 -1069 -49 -2048 -1069 -1603 -1504 -853 -807 -1051 -644 -1364 -914 -637 -1848 -1473 -385 -745 -628 -1652
417115 -1370 -2059 -252 72 -1458 -1441 -1215 -991 -771 -1356 -435 -940 -1389 -1116 -403 -1162 -685 -1512 -815 -1118 -1559
418223 -1912 -3088 -1519 -738 -1489 -239 -1441 -884 834 -906 -442 -945 139 1642 686 1094 2308 2672
419173 3442 1624 4182 4377 3907 3820 2210 3298 2730 2265 1116 1255 2180 -691 426 -1407 -1057 -612 -1036
420175 -680 -1420 -1984 -1380 -531 -867 -1587 -241 -735 -739 110 239 -1325 -866 -820 -1153 -161 -1576 -1119 780 -902
421283 -420 -556 -1263 -1781 -303 -385 -1565 -666 -276 -112 -185 -789 156 -136 -119 -569 354 -1571 -1107 -1163 -1929 -882
422444d50k657J221j8J55J813J79Q95j5K67o50Q99M57J64j880J257j606J938k704b41
423499f24Q56r94J71p3j348K133r41OR57r3o51l12k9J484k637R29j18J382q84a656
424607A36k333J572m28J219j136N45m29k30R60m70k35q7m46J406p25M33l03l03h12
425662g97p95K112j641J56r2n67J287j507J348K029j925m0L62k076L04N74j590d85
426665A39L66k123J108j490J382n97K49R5P5l04Q6J368M20k573J011p74Q14j498a21
427720b41p83M12j35N0L67O2l95r23J604j090m48M46J245m18j536Q82P62j084f87
428775g6L01j061O27r84K09N08K68j029R93q07R47o81Q69j608j237J144J463j118f61
429830g9j583J216K89j085l29J146l14L88n88M31m63l72J034m9N0p42o44L26N48A047
$$ plain form
422444 -450 -3107 -1886 -1904 -1749 64 243 1138 1123 1390 740 1639 2096 2260 380 1637 31 1969 -735 -241
423499 -624 232 -762 -591 -664 -2012 121 -820 -814 143 50 -601 -913 -942 542 -2095 -1166 -1284 98 -786 -1656
424607 136 -2197 -625 -1053 166 -970 -425 -854 -1084 -124 -594 -829 -916 -1362 44 -681 -248 -551 -854 -812
425662 -797 -1592 520 -1121 -965 -1057 -1624 -337 -1844 -496 1533 -392 -432 -70 -2146 -1842 -1268 -2858 -485
426665 139 505 -1618 -510 -2000 -618 -1215 -966 -871 -796 -1100 -1014 354 774 -1799 -788 -1562 -748 -2246 -121
427720 -241 -1024 -612 -747 -697 -330 -268 -663 -1586 18 -1072 -1520 -1074 171 -247 -1783 -901 -139 -1223 -687
428775 -76 225 -836 -209 -1193 -984 -476 -208 -1237 -244 -1051 -104 -785 84 -1524 -2761 -1617 -154 -1272 -661
429830 -79 -1662 -446 -157 -1242 -1571 -425 -739 -351 -939 -508 -971 -1343 -309 -358 -308 -1050 -1694 -1368 -820 1047
430938h42n21R84l51O95j316K5J808l08Lp61j039j62k06J185J89l50K10J98j144B48
432046h85j1k66m01K38k82N78M23m51K74j743K065j774Q38J543k826J390l53J674a92
433101b150J978j7r17j005J727n11N77k44j459k88K91J570j487R72o60k21J998h31
434104B91j839K55J145l45q82J406j167N13L94m51L89O61j348JR3K71K19P1J72a062
435212c82j499J367L51j36J09j438Q80p95J129n40J69m12o64J219m32K1J112j114C
436267B75k228J314Q17j87j395O45J029r16l4k04o80R88n75L64N40n12p19J537A06
437322C1o36k49j106J021J882k539J479K03n5L55K2j099J038j335O32o83M86K97C43
438377A72m79k31Q13m17o2q39K31m11K904j390k75j022p19N96j40l27M73K99K64b129
$$ plain form
430938 -842 -1363 -379 -730 -35 -1351 -1326 482 174 177 -584 -1623 -1785 -1991 -806 -617 -967 -757 -559 -1703 248
432046 -885 -896 -1162 -1563 -1325 -1607 -1029 -606 -1057 -783 -2526 -461 -2235 -1397 146 -2680 -1290 -1643 31 -192
433101 -2150 -172 -189 -1106 -2111 -384 -895 -318 -562 -2021 -2309 -2018 -448 -1935 -963 -1623 -1844 154 -831
434104 291 -1548 -1293 -148 -493 -1375 31 -1136 -623 -229 -680 -291 370 -978 -977 -884 -613 -394 -323 -151 -1062
435212 -382 -1881 -514 -163 -299 -190 -1628 -748 -1543 -414 -954 -785 -1197 -1861 -642 -1074 -1053 59 -1055 3
436267 275 -1953 -639 178 -9 -1404 -759 270 -646 -680 -884 -1564 -576 -1151 -787 -247 -759 -1478 59 106
437322 31 -605 -854 -1960 -939 943 -1596 -117 86 31 386 408 -691 347 -988 -356 -1039 -553 -256 343
438377 172 -307 -538 275 -142 -204 -1043 -812 -1223 1681 291 16 -1006 -1725 -1129 -1269 -1596 -1123 -824 -560 -2129
439485a940K114l83j068n27J767p51Q5j659J692r26O95M26M9M9o0o25M87O73r28b061
440593i00L98O37j360k62J609j91j437J120J048j312O27j73N18j019N33j91M93a536
441595a519Q92Q69q61L59L05j926J792m01J22o92J836j209n44N72K68o40P00k39i19
442651a020J072j208P70j325O5J539q14j013J472j52l93J272K06n28k222J343h14
443600c17J34n05K96J87q31K149j82j686l52J411j815L7P95l79L84K15L95j726g86
444655h10j155J335m74K27M89k24J096j636L17M46o96L52N13J698l257N7L36J82d98
445711a538J107o31P36k41J094j975J762r92M94o13J006p80l13j218L644o02j754a935
446713a851m62J142J517k436K093J67j002R72m91L00n69P25l99L88j504Q43p07a386
$$ plain form
439485 -1940 174 -209 -1277 -1804 -37 -788 -703 -2362 -670 -1596 -901 -475 -426 -377 -437 -1062 -575 98 -830 -2061
440593 -900 -502 135 -1225 -1487 122 -69 -1506 -386 662 -650 -23 -196 322 -697 -164 -355 138 -1536
441595 -1519 -627 242 -619 -260 45 -1881 -89 -490 -368 -1060 776 -433 -977 -405 -137 -777 -77 -316 -919
442651 -1020 52 -1156 -386 -1711 -1646 -107 -921 -1934 -462 -614 -1007 265 471 -57 -2279 -936 -814
443600 -317 -183 -688 -392 -205 -1036 1113 931 -755 -1107 304 -1511 -1474 -679 -1058 -674 -459 -64 -1790 -786
444655 -810 -1965 -630 -1104 -877 -388 -612 484 -1152 -835 -389 -1085 -733 -220 1478 -1779 -1722 -1386 -1204 -498
445711 -1538 -431 -1062 -326 -567 527 -1448 314 -678 -184 -797 209 -571 -884 -2102 1542 940 -814 -1935
446713 -1851 -2313 -1171 346 -2090 3 170 -832 140 -351 -51 -620 105 -294 94 -1410 -567 -1274 -1386
447716a391P49R45k456K575k331k62K109p07J67l65K74O23n00J96l86M87r19J478b60
448771f49Q96q90j736J655R96q52L17R4j544R40J478j728L36L36M20p75l77j115a576
449826a815J247j609Q75n92J226j401N50j080K189o52K24J06j08o92J028j574f33
450776c84k74p07N36J97N17j92o53O66j289J364r9N85j426J47m37N73M1j22P64c50
451883f31j85j39L44M73o72j114M33J473J423j762j150J428n96q7m6J91j2J8L54a489
452991a13j1j075m07M91K79J0n49J605j373P21o11m33p86O15m07J282m40L78n66h83
454099a287R3J070q68N9j802P64M94J727p43m84N62R8j93J694k212P16m17L60b014
455155b79n84Mj658K264m16k60k09J169j655K140j355n35L02j78K106j373M88a145
$$ plain form
447716 -1391 -642 303 -2153 422 -1909 -2171 -62 -769 -602 -967 -693 -70 -570 -374 -760 -273 -1192 286 -260
448771 -649 247 -643 -2379 -724 272 -580 -263 -169 -1713 -773 705 -1023 -687 -351 69 -706 -1083 -2198 -1576
449826 -1815 -568 -2177 -1302 -1894 -668 -2069 -1519 -2599 -410 -1062 -838 -732 -840 -1532 -504 -2078 -633
450776 -384 -658 -1365 -829 -632 -115 -307 -960 -294 -1583 -219 -318 267 -1159 -1012 -1449 -876 -835 -957 -193 -350
451883 -631 -816 -955 -611 -138 -810 -1924 -1491 -18 1405 -357 -1507 -79 -675 -762 -808 -617 -629 -611 -257 -1489
452991 -113 -124 -1199 -1606 -1115 -836 -826 -1375 230 -1143 -422 -1033 -1466 -2252 -1637 -2044 -762 -1202 -824 -1390 -883
454099 -1287 -1194 -124 -992 -933 -2735 -1971 -1477 250 -493 -977 -415 -317 -510 1184 -1028 -312 -729 -369 -2014
455155 -279 -863 -859 -2517 -253 -669 -929 -1138 31 -1624 516 -839 -1374 -1072 -1250 856 -517 -29 -1145
456157c40j22o80L64k03m24O87J47j61j85J09k95J311l30j489J948J314j54j096c36
457212A05l08P19l21j14j005j85R2O86k26j767K624p51J58n38k86J069r36m01a055
458267A96p25m33Jk5k46J011j90O3L62K08k236M50o25J773J106j203J47R92m74a143
459375h02L9R6l09O16P7J10j095K766j341j677J118K14o82J48J081q86k19o49a372
460431f5j859P4J608k90J90o25p18L82J066j674J045p98J039j28j030j57R12M21b238
461486a160j41k85Q68P84J139j050n81j57l40J382k93k11L11O2j108R72J095m77A216
462541g09K87j11R48m86j46m4M56O35o88K024j816O92J60k276J118k28J34n79I34
463596B72l59j88Q00o44q8Q66q40m9K86m58J439m66n85j869K614r11k46k242J508e49
$$ plain form
456157 -340 -462 -1142 -778 -981 -1405 -718 -571 -732 -917 -808 -1103 208 -122 -1611 337 1651 1497 401 -336
457212 105 -203 516 195 81 -924 -1109 -1017 -331 -557 -2324 300 -451 -293 -831 -1117 -48 -984 -1385 -1055
458267 196 -529 -962 -961 -986 -1232 -221 -411 -348 14 222 -2014 -1564 -2189 -416 690 -513 -366 626 152 -1143
459375 -802 -763 -667 -976 -360 -283 -173 -1268 1498 157 -1520 -402 -188 -870 -722 359 -527 -746 -1395 -1372
460431 -65 -1924 -1850 -242 -532 -342 -967 -1685 -1303 -237 -1911 -866 -1664 -625 -753 -1783 -1940 -1028 -607 -2238
461486 -1160 -1301 -1586 -718 66 1205 155 -426 -583 -923 459 166 -45 266 328 -780 192 1287 810 1216
462541 -709 -422 -533 415 -71 -217 -261 195 830 142 2166 350 1042 1202 -1074 44 -184 -50 -629 934
463596 272 -87 -275 525 -119 -207 659 -181 -230 56 -402 1037 571 -14 -1883 731 -180 -426 -2668 -1160 -549
464704b99N31m94m72L72L86k577K747j227N69L86n58j251M14M10M77K34j964J608a499
465759F45j522J726k237J840m57J914k166L22p00Q16J12m17K99O56K45j013K89e32
466762e89L61L8k01j08m52L23k02J119n00k4j055O57m73M5L73K083k687N30k60a51
467870c4j116M62N84n23q83J193P8j101L71j83r4N68R64n79K99l43j4j316J234h26
468978a562K320l93j053P41o10J609j261k79m02J06J182j150K4R51J127k459Q63a02
469980B0R71j426j148J188R81j087J19j46J4N61l9P50k54o35l0o90J259M15j129a500
471088H06j908P8J214j29N20j193L1q73J080l20j13j47j277J546K069k394L60d74
472090h7L12m82n35r01K99J786K96j268m49Q14j828J279J407r63j75L72r45J4c28
$$ plain form
464704 -299 232 -262 -734 -362 24 -2553 194 -1033 -464 -78 -636 -1887 -1473 -1063 -586 -352 -2316 -708 -1499
465759 645 -877 849 -1388 452 -5 1909 -257 65 -635 181 293 -124 175 831 1076 63 352 -532
466762 -589 -228 -190 -391 -499 -951 -628 -830 289 -211 -235 -1290 -633 -1106 -1061 -688 1395 -1292 -762 -1022 -151
467870 -34 -1150 -688 -104 -627 -1510 -317 -239 -1340 -969 -1152 -1246 -678 286 -293 6 -337 -351 -1667 -433 -826
468978 -1562 758 365 -688 53 -557 1052 -209 -488 -890 -784 398 -752 -728 223 1350 -1109 -246 -102
469980 20 991 -435 -1583 -395 586 -501 -382 -528 -514 47 8 758 504 -131 -161 -851 408 823 -306 -1500
471088 806 -1102 -1024 190 61 581 -612 -581 -1454 -374 -694 -807 -954 -2231 -685 1384 -1010 -650 -474
472090 -87 225 -257 -792 -1693 -1394 392 688 -580 -1029 -215 -2043 -764 643 -320 -495 -123 -1068 -1054 -328
473146a280m19N13J78o09K085k318K100m12l9m62k0m6M74j668K085j349J05o55C86
474201a519J619p32M67q21p21J056O19j374J520j391J259j645n84K513p97L1k38a075
475203c27l21r17J982j268J296o24j388J298M92n24j603L05J287q66P78j122P35a35
476206a507J069Q19q14P62o69R63j744j03J259K08j375J308j322O08j62J89m19a586
477208E6j146J903j830m04K152l850K130O33N7m94J061J65j279m53P39N57q05d47
478210a569l69K130j484M12p42P21j256L612k517J23J589k349J263L99j666J019C28
479160a535lJ342o07Q33j586J653j755n25M25J183O52J54P48j764M96j283J219a34
480162a325N81n5K93p18J219P62j696J173n40j822K274ro54j31L78J66k74M07d68
$$ plain form
473146 -1280 -1699 -1186 -1008 -1617 468 -1850 250 -162 -201 -663 -683 -729 -255 -1923 162 -1187 -1082 -1737 386
474201 -1519 100 -632 -165 -986 -1707 -651 -32 -1406 114 -1277 -18 -1663 -2247 266 -531 -500 -738 -1075
475203 -327 -648 -1565 417 -851 445 -179 -1567 -269 223 -301 -1904 -1599 -312 -1178 -400 -1522 -787 -135
476206 -1507 -438 381 -433 329 -340 623 -1121 -1224 35 243 -1132 176 -1146 -538 -700 -511 -930 -1586
477208 56 -1090 813 -1017 -1421 731 -3119 -989 -356 -299 -793 268 433 -846 -1299 -560 -3 -808 -447
478210 -1569 -1938 192 -1292 -880 -1622 -901 -2157 1455 -1062 -939 650 -1699 -436 -37 -1703 -684 328
479160 -1535 -1538 -196 -803 30 -1556 97 -1658 -2183 -1758 -575 77 231 979 -785 -289 -1572 -353 -134
480162 -1325 -744 -799 -506 -1224 -5 757 -939 234 -306 -2128 146 137 -517 -648 -270 -104 -378 29 -468
481218C96l01j075M00j171J839J06k164J107r91j025K021m88Q30L71l07L13k54i59
482220B20L41q65K09L89k403J791j9l30Q47k32N0Q67j679P8N4m9Q64j137K54j64c49
483381f9j23j5n0j26q92M41K44J6l89m41P47J044k30j055j16J049M81j068R01a201
484489A76j028O67m34j687J812N80J14j550N25j526J603l28J71Q51q93m24J872A159
485491d4j174K23o47J010M80q98L49J87j538K54J208M36m59J67r17J130n34r48c54
486546e90p89J056M39M6k58O9l140K073J40l30J496k41j90q8J44j670K103N92b92
487602h80P53j927K335j088m48n08M83Q67j273R82oL25l47K81q02O1m60K427l44a147
488710h36k88N33N13j814K219j054J46Q17q05K0j611K078m88J199k160K056l66F40
$$ plain form
481218 396 95 -980 -580 -1751 88 194 -1970 -863 -1854 -2879 -858 -1346 -516 -145 -452 -139 -393 -959
482220 220 561 -304 -95 294 -2109 -318 -337 -667 180 -52 -2 865 -814 -736 -682 -731 133 -1004 -750 -914 -349
483381 -69 -192 -207 -257 -383 -1275 -834 -590 -574 -963 -1404 -657 387 157 -898 -1014 35 516 -552 349 -1201
484489 176 -852 -185 -619 -2306 -494 86 200 -1350 -825 -2351 -748 -1076 -905 -54 -947 -1371 501 1159
485491 -44 -1218 -995 -1642 -632 -152 -1050 -701 -514 -2052 -1798 -590 -154 -613 -446 -1363 -233 -767 -1715 -354
486546 -590 -1379 -323 116 162 -96 -27 -3167 -1094 -954 -1284 212 -29 -219 -307 -163 -1833 270 862 -292
487602 -880 -127 -2054 281 -807 -1255 -1763 -1280 -413 -1686 -704 -710 -385 -732 -451 -1253 -1192 -1652 775 431 -1147
488710 -836 -1124 -591 -78 -1892 327 -727 -581 236 -569 -549 -2160 -82 -570 629 -1531 525 159 640
489712D37j391J763m34j026K83P56j64o94j15L51o03Q18j516l10P75K44K36P53E2
490767g8k97n63m2N90R39k430K327k408J677J547p20j72o67L71Q13j003o1p34D06
491822a351R59n47K92N22N33j396k50j82M52J75L18l43J101o58j679O13J513j259A357
492877d53P15j594Q06J17J68j413J917n42o6j051p37O82R54J292j199m63J212e85
493880f7j93K38o39Q45p72n77j61O62J010j853l71m8J565o20J316j112j431J087G02
494935e17J632k316J549r49Q70j003J137O59k069R54N46p40k99O66r9j543J97a178
495938a182m43J375k8J492o42n99r87J31k47J495o68P58j918p36J577J54M48j350a510
496993d52R73o61M2O0j721O56l87J606j114Q07N72q04l08p52K155p24j824J510e55
$$ plain form
489712 437 -954 809 375 -651 -368 388 224 -470 -585 -234 -837 -19 -1535 -1845 -1070 -826 -590 163 52
490767 -78 -375 -938 -980 -390 549 -1881 446 -1962 -285 1262 542 370 -297 74 887 -116 -177 -911 406
491822 -1351 -392 -939 -647 -125 408 -988 -1238 -1420 -968 -793 -475 -818 283 -375 -2054 -1441 72 -1187 1357
492877 -453 262 -1332 -526 -409 -241 -1654 263 -279 -345 -1396 -2133 -1451 -497 795 -404 -867 345 -585
493880 -67 -260 -22 -661 184 -588 -1165 -1326 -664 346 -1507 -1878 -1926 -361 -981 335 -777 -2208 -1121 702
494935 -517 1115 -1201 348 -601 269 -734 403 1062 -1007 -53 493 -247 -546 120 21 -1522 -1325 -1178
495938 -1182 -1625 -250 -278 1214 572 -27 -1014 -883 -1130 365 -303 455 -1463 -2199 -622 -468 -20 -1370 -1510
496993 -452 521 -140 -98 -38 -1759 -1103 -1490 116 -998 -191 381 -423 -731 -1483 672 -52 -1876 -366 -555
498048a007Q61j392J2J763J197k332R84j240j193J200M87M54j92l28q39Q4J308d87
499050d81N38j587M77l8O97k52r61M63O1q08Q41L09N06l15K3j258L18Q92L76n73b380
500211B95j324N1J003j488N62M60j065J562o80O53l73N0l75j213J101Q52K24j482c89
501266d21p91M24J503k528J781r92J703k133J491k9j019J208q73J87j64q04J543c21
502269b43m36q0m44o36P25J324r74j53j133J825n55L89k01n59J81J271l117J554f73
503324c82O15J69j219p78J228m19m20J709q75k81J41j119K438k152J303q60l97b130
504326h16N68n35J13O33j709K103j226j205J908r97J237M59k158J346m23J345e6
505276i48k71r98R16%J8L17P48q14J17m97J051j136M77L54M64p14j14m51K71L55a288
$$ plain form
498048 -1007 -146 -1538 -1526 237 1434 -898 86 -1154 -2347 -1147 -660 -206 -398 -726 -1565 -1481 -173 -487
499050 -481 57 -1530 -1053 -1091 -394 -646 -1607 -1144 -1083 -1891 -1050 -741 -235 -550 -527 -1785 -1467 -575 -199 -772 -2380
500211 295 -1029 -978 25 -1463 -901 -441 -1506 56 -624 29 -344 -294 -669 -1882 -781 71 295 -1187 -389
501266 -421 -1212 -788 715 -1813 -32 -1024 679 -1454 37 8 -1011 197 -676 -489 -653 -1457 86 -321
502269 -243 -679 -759 -1203 -1839 -1114 210 -764 -917 -2050 -225 -780 -391 -592 -1151 -970 301 -2816 -1262 -673
503324 -382 233 402 -817 -1595 -367 -786 -1206 503 -372 -653 -512 -1631 807 -1345 -42 -902 -1299 -2130
504326 -816 -248 -783 -670 -37 -1746 357 -869 -2074 -166 -1163 74 533 -1625 -279 -702 643 -56
505276 -948 -1219 -2217 -1301 -1301 -1283 -966 -218 -1032 -915 -1412 -361 -1497 -1020 -666 -202 -916 -1030 -1481 -1210 -855 -1288
506437b380J064J652m59k029K114j87O02r96J23m11J352j497L14j94M70n20o94b064
507439i68l38J81o32J163j34j788J719n57m06J12J238m95l90j68J627r55o43K37f93
508494f20L65J223k281r83J007K90k75J591p25r73M47K40M38k29j253O12r9J093B87
509549c09l45O23R91r99j18Q1j609J096r3j72o38K022j287O91l22k29P16k128h56
510605a560J82J287j145N34l33J97J458j430J932j309j172P64l14M1M57l00r11h01
511607d80N79K12j640K243j805P33J296j456J030l53j541M05N73j590J266Q2M77A472
512609a016J014n93k03O41n62Q52o12N0j107J273p90Q3O93l55M27j627J219o80f79
513665f8K07j066l80l33J90K42j969L283j196N4J424j104L13J538j158o7j470A55
$$ plain form
506437 -2380 -1316 336 -123 -2152 -38 -225 377 -619 -496 -907 445 -1052 -738 -932 -462 -982 -1676 -2064
507439 -968 -1306 -1125 -1757 -594 -728 -2516 -797 -1354 -1760 -1648 -410 -905 -1295 -1463 164 -791 -1434 -1197 -693
508494 -620 -255 968 -1313 -2296 -1289 -999 -1274 317 -408 -1381 -934 -694 -256 -485 -1738 -1126 -1225 -132 287
509549 -309 -654 -31 960 -39 -157 -76 -1685 -589 -682 -854 -1492 530 -757 -66 -388 -617 99 -2029 -856
510605 -1560 -1378 -91 -1236 -702 -1035 -838 620 -810 1122 -187 -1359 -595 -909 -868 -411 -711 -1622 -801
511607 -480 99 311 -1329 914 -891 -158 1138 -318 712 359 -1182 -777 -204 -1794 -528 -446 31 1472
512609 -1016 -2 -595 -798 -157 -719 133 -479 -429 -1536 -263 -1053 -970 -277 -632 -205 -1832 -613 -1293 -679
513665 -68 139 -927 -1307 -1640 -1450 -1208 -3177 106 -1090 -1036 388 -716 -403 1135 -23 -90 -1560 155
514667a449K80L7K233j556o89J67J00N9M66j04K93q75N15O80p03K74j39q60m7h84
515775H99n96q92L2O8J81K94J15O55j144MJ17n52L20N23j156J134j242q18K495D58
516883a818J384L59j828J144R55Q6r03k00N21R19p88l66O73p54l81J211n63j005a221
517938a167L82L48n39j56K59J007j12k47N54j281J606n65j400J050l20n5O55N70e03
518993a618M67p67J065J011M41k218P50J280j106p2N3J670j676O92p17K72K97e51
519996a143R39O86j407M40j98k28J093j072p92K04M69J837o63M11q10n18j22P57i44
521051c26j212J609q28J039j942J355j002Q47L3Ro7K4P30j020L71n98K401j246h71
522106d98M63o35k33N97R45r65O16m44l21K12J90j059J069R5q06J218l10o50j035a359
$$ plain form
514667 -1449 -1169 -1132 1101 -455 -1144 -977 -877 -818 -352 -456 -163 -1038 -523 157 -546 -272 -411 -1271 -1318 -884
515775 899 303 -589 -557 -489 -308 -14 101 756 -388 -384 -267 -819 -499 24 -1132 2 -1240 -2058 437 458
516883 -1818 -434 -75 -1903 -759 196 282 -621 -821 -300 619 -169 -535 138 -616 -997 214 -349 -1354 -1221
517938 -1167 -785 -437 -976 -1132 -873 134 22 -225 329 -952 654 89 -1311 -261 -581 -636 19 589 -503
518993 -1618 -1151 -1918 -853 158 599 -1619 -869 411 -695 -767 -714 956 -720 -28 -745 -473 -176 -551
519996 -1143 -204 482 -925 -485 -683 -911 182 -890 -1682 -1478 -1009 828 165 576 -234 -752 -874 -117 -944
521051 -326 -1538 71 -757 282 -1660 -305 -1307 -460 -427 -418 -485 -461 269 -751 -380 -978 1423 177 -871
522106 -498 -35 -670 -903 -306 639 -326 290 -154 -475 -263 -73 -1132 -63 32 -774 444 134 -516 -1551 -1359
523214b66r6J334q00j596l27J183J065o23j882M59J170J85j56m28J610r14p2p98b32
524269g84J197j977J987P11j760j089N46N36J64n53M33M68K95j192m35J89r3M66c56
525324a872K107p61m75m64J254j117J60P77r78R46K67p4j084J786j486P50q66B96
526327a375r2K022m76j716J547n64O25j182J730O78p66N23j874J224J60k149J112f08
527329C05l68p65O33k64l85p19j96J299o90J001n36K47r78R09n83J598k021R68b09
528385a329p75J773K40m5o23j043j97P57n23Q47p47J011o3O02j589J459j216K52a399
529440a491J140k33J178k251j40N78l83J943j828N39n72Q11N58l72K19o90q05b63
530442a497R63j663J552p55J56P30j07p72j194J900n95k51J93j79l15J120j90a737
$$ plain form
523214 -266 -362 972 172 -1424 -1751 -568 497 -126 -2008 -1549 -379 -194 -350 -778 832 -82 -154 -952 -232
524269 -784 413 -1564 423 1134 -626 -1715 -1169 -633 -469 -1022 -589 -121 174 -1018 -1453 -1264 -1357 -891 -356
525324 -1872 235 -526 -1001 -1465 -211 -1328 -1168 -391 -1369 -423 -156 -230 -1314 472 -1014 -264 -1130 296
526327 -1375 -1467 555 79 -1637 -90 -654 -29 -1211 519 1197 431 954 -920 304 464 -1685 -573 -608
527329 305 -63 -828 -195 -459 -844 -1563 -1759 -460 -1150 -149 -685 -438 -1416 -507 -1090 508 -1513 -545 -209
528385 -1329 -2104 -331 -91 -136 -759 -1802 -1999 -1242 -1765 -918 -1665 -654 -717 -115 -1704 -245 -1461 -1209 -1399
529440 -1491 -351 -584 594 -1657 -1797 -1219 -1602 341 -1487 -948 -1520 -709 -151 -523 -304 -994 -1799 -263
530442 -1497 -534 -2197 -645 -1400 -1244 -514 -621 -1393 -2587 -687 -1282 -1533 -1340 -1519 -1834 -714 -904 -1737
531445a632K584k178J164q14j73Q02k97q69L34j75k72Q71m16K51K42J5p38j40a13
532500e03L53j491J057J745k334j1N07P60j28j310J006O87j049j246J819p69k65A93
533502a281J64N99p02M13j006P42P15n86P18O79j833P07p02Q19P35o78j194N96b15
534557b07r79O09L32J46q71J909j190n3m80j83J154q99M55p18k58q86J35O3J029f64
535665a362J006o38M07Q11j374R68j407K058j79J69j257J563m33j780O32j87K77c37
536668a41k222J025J182m63J139p39q62O27q09j94K6Q33N08n80Q92m78l59J91a580
537723a223l11O38n67r3J191Q71j940M21P11N8r99q2o33J541j69p91o90J306N73b306
538831a442J50J338k05K7P38k188J770k123K269j138P80l95j324J430J11qJ19A126
$$ plain form
531445 -1632 952 -1226 -62 -876 -1049 -247 -544 -1413 -1079 -1254 -1526 -655 -1071 -820 -578 -563 -1301 -1441 -113
532500 -503 -150 -1641 -584 1161 -1173 -1184 -677 83 -45 -1355 -349 338 -711 -1957 -138 -907 -1172 193
533502 -1281 -1117 -518 -1220 -807 -1813 -1071 -356 -942 -224 455 -1378 -671 -1373 -554 181 -497 -1691 -1095 -215
534557 -207 -1186 -577 -245 -99 -970 939 -251 -304 -784 -967 187 -712 -257 -975 -1233 -2119 -1984 -1921 -892 -664
535665 -1362 -356 -994 -587 224 -1150 -182 -1589 469 290 459 -798 765 332 -1448 -816 -1003 -726 -337
536668 -141 -2363 -1338 -156 -619 520 -219 -1081 -454 -1263 -1457 -1431 -598 -90 -670 222 -256 -615 -424 -1580
537723 -1223 -1534 -896 -1463 -1556 -365 506 -1434 -1013 -302 -244 -1243 -1325 -1958 -417 -586 -1377 -2067 -761 -188 -2306
538831 -1442 -1292 46 -159 -132 606 -1582 188 -1935 334 -804 -24 -419 -1743 -313 -202 -210 -91 1126
539833a606J402p15J548j217O1j393J572m70J392j864J165j213O02n50J372O23C79
540783e27K17j340J290J07Q36j517R12M71n73Mo29J023j44j688N56n52J580n59d64
541838g04L25o65j33N80n61N26r93J047m50L68j089P11P90j796Q81n21O01J14D72
542893c46k78J459k335K717k702O26J320j006J51j612K310M50j321Q16k485P59a95
543843b02l04J396j209j184J086j068O57J05J70j056L80J542n52o0m07j174J638a012
544845a255K381j931j046J576N1J0j335K412j804Q07O2K17l64p10l43M87L42n46B21
545901d56P29l53j75P01l424K571n53N60j508J847j025J466j210K37J9L93j859B94
546903a565K20j93J833j728L53Q46K35q21q4n52J000j67j071Q20j527O70K162a126
$$ plain form
539833 -1606 -204 -919 629 -588 -527 -1920 -348 -818 574 -1290 -125 -1338 -736 -1286 86 709 379
540783 -527 -310 -1650 -360 -253 583 -934 -22 449 -124 -120 -749 274 130 -1558 -1002 -1554 26 -533 -464
541838 -704 -379 -1044 -1177 -597 -1158 -632 -1625 -578 -1028 -660 -1749 -1038 -248 -2044 -1163 -1684 -1083 -969 472
542893 -346 -624 835 -1500 1217 -1485 -859 461 -545 -394 -2006 304 754 -567 249 -2236 -1477 -195
543843 -202 -506 890 -319 -1503 -417 -1485 -828 -723 -553 -1609 -1229 313 -239 -299 -706 -1880 -242 -1012
544845 -1255 1126 -805 -1851 -275 -224 -214 -1549 863 -941 -134 -72 145 -219 -929 -1272 -785 -443 -989 221
545901 -456 273 -80 -255 446 -2978 -407 -960 -400 -1908 -61 -1086 380 -830 -593 -574 -181 -2040 294
546903 -1565 -1345 -1538 295 -1433 -1080 -234 1 -820 -904 -1456 -456 -623 -1694 -874 -2401 -1731 431 -1126
547905a343J053o01o01J029N04p20n02L05l78J296k56n04o63J397k72j707J871i10
548908a57k2q37P0P94n05pj088K327j099r25J03k36R61M65j418J565O17j371j304h11
550016i04r17R15J151q54p59J854j29q85M87j842J236O10N95k83m14r66J50Q62a292
551071i09M9M26p94l13j77K037j587p8R82R99j310Q69Q25k928K34M51R16mk97a208
552179a072N29Q10j157P97P59j888R18J20j210m58Q46R52q72P16m09K41k056K273a190
553234f90j418K848p33k28k37m62J200o09P29j315J741k706J188n42J300n84j34b097
554237e89n89J644q40q3n89j491K92K073k85q64R2P80j37M99l34l34j324K299a747
555292f83m20K3r51J42K763j105j489P16j06P99P40k128J415j195k66P81j072B99
$$ plain form
547905 -1343 -290 -891 -1492 -463 41 -679 -1181 -876 -1254 42 -214 -718 -1381 16 -256 -1963 -92 -910
548908 -157 -179 -1016 -946 -152 -657 -664 -1752 575 -524 -1449 -1346 -1582 -621 -156 -1574 -9 608 -763 -2067 -811
550016 -904 -1821 -906 245 -609 -1368 486 357 -528 -41 -1883 -647 -37 558 275 -139 -1105 -955 -93 -1292
551071 -909 -860 -434 -1228 -1541 -1718 319 -1268 -1346 -364 635 -675 194 1019 -1909 -1675 -1224 -308 -312 -609 -1208
552179 -1072 -543 267 -890 -93 666 -1222 -304 -184 -1394 -1852 -1006 -54 -926 -210 -619 -378 -2434 -161 -1190
553234 -690 -2108 740 7 -221 -458 -920 280 -329 400 -915 826 -1880 -692 -1234 66 -518 -652 -2097
554237 -589 -1178 466 -374 -457 -1046 -2537 -2245 -172 -457 -1321 -1229 -449 -586 -87 -421 -755 -2079 220 -1747
555292 -683 -1103 -1080 -2031 -1889 874 -231 -1720 -1004 -1110 -311 429 -1699 -284 -1479 -1745 -964 -2036 299
556294c21J049j339P95j81p21P15p92L99n44p49K765j368m11M5j84J312j231J402c36
557349f73P31p14j08q54K634L6j862q9K8J115l2j284K40J702n37m8q41Q30K93g73
558457a085J107m33q6p4j071Q15k49K96K88p08r67Q72j612M85J975N28J70r74h51
559512d21N42j117m30P1J18J63J083n60Q09l61j001N64n46L18J513j711R85j491a646
560568i30Q21O48j532R29j616O54r7P86p94J788q18j268J476j157n85K90J042F4
561570b028J737l53K31M53M23j732L0R66o89L44n41k58P44N32j323p3J292l84H61
562625d28j683J36P70k59M49K65R91k400J058M63k29M5m75J341j261L39Q38j001e51
563680h30r4Q17O85j078L5P75K91k065j32Q83j033N25Q18r04R26p16J296j699E53
$$ plain form
556294 -321 728 -611 184 3 -718 -3 -795 -396 -940 -1689 1076 -292 -703 -658 -842 470 -761 641 -336
557349 -673 58 -656 -764 -1618 1016 1052 -810 -899 -871 244 212 -1072 -832 870 333 285 -556 274 567 -773
558457 -1085 22 -411 -497 -571 -1642 -827 -1076 -780 -492 -1200 -2167 -1295 -2907 -2422 -447 81 251 -723 -851
559512 -421 121 -996 -1426 -1355 -1237 -1074 9 -551 258 -103 -1104 -540 -1086 -768 745 -966 19 -1472 -1646
560568 -930 -109 539 -993 -64 -1680 -1026 -1123 -337 -1131 657 -161 -1429 47 -1110 -1695 -1405 -363 64
561570 -2028 -291 -644 -413 40 463 -1269 -1239 -273 -962 -618 -1159 -1417 -673 -141 -1464 -1537 -245 -629 861
562625 -428 -2111 -1975 -1205 -1464 -1015 -750 241 -2159 -1101 -638 -867 -822 -1297 44 -1217 -878 -40 -1041 -551
563680 -830 -924 -107 578 -500 -465 310 601 -1464 -1596 -713 -1746 -1221 -403 -1307 -381 -1097 199 -1500 553
564736a754J994p99l68n15j403L020j035J193l20j009j27O29J5o70K91j072J752h97
565738a604O16j523M36J454k16J1N09l65rj314J695l87m00P73l82K95k267J021b07
566793a996N4J898p4O15r27l41N56p24n29K172j802L64J204n3r97l42R2Q7J85a7
567901i7P6q32j402K84N16M19M72J914j733m18p67K470J6j946P95q50N94j50l12a155
569009e34K26j9j018p88K142k97j66R97j352l95J019J39o02o42m00m0J275Km17e92
570117c74Q06n36k62l83J085J081j820J210j738p7j30Q10J040L71k369J699q27a106
571120e82M60R00j035o35N86J569k03k54J365j213j56M63j136P49O13j564r72e67
572122H18j054m42o10P47j62J193j074n41M19O55k99L99j75j244O40k0J330j006c67
$$ plain form
564736 -1754 240 -559 -927 -1442 -2845 175 -860 333 13 -996 -1123 -494 -479 -1149 -858 -1930 -178 -897
565738 -1604 -988 -2511 -2075 -621 -837 -826 -317 -682 -691 -2005 -310 -697 -1097 -324 -706 -411 -2678 -1657 -207
566793 -1996 -1942 -44 -118 497 -430 -771 -215 -939 -1468 704 -1098 -734 470 417 -580 -922 -830 -743 -558 -17
567901 -97 -21 -853 -2255 -1971 -1455 -1036 -564 1350 -383 -801 -1568 902 918 -1028 -233 -1083 -489 -639 -951 -1155
569009 -534 -308 -327 -1345 -2133 9 -288 -454 543 -809 -1204 -185 -46 -648 -1290 -1690 -1730 -455 -453 -870 -592
570117 -374 432 -104 -366 -749 336 1417 -403 807 -931 -1008 -1138 -328 712 1083 -1286 413 -414 -1106
571120 -582 -122 778 -257 -892 -306 1263 1060 806 2171 958 802 1265 129 878 1491 -73 -1045 -567
572122 818 -236 -678 -1288 -541 -703 490 -584 -1125 -706 -51 -350 49 -126 -1370 -730 -750 580 -426 -367
573177h19j07Q59j69N68K18l85Q83j781o44K374q15O17r46j20j8m13j33m42L39I
574285A00j72j66j469K9R18Q85j399J83J746O76j557J005j422K22M33j71j69J280I40
575340A48J045O28j020K75p25J834J05j199k096J678j055r71K000r97M50p9q09A059
576343h24pN45k32J64m71Q79p25M95n48k11q16N09J058L14n40M45O32r46K28j811i18
577503a268l53J896J33j71o62j085Q36Q87j990Q35p9Q13p89P14Q53K6o13J745B161
578559A216R07p93j861J677j465J324j49j195Q10q20j035J250p98J032N9j46r37i0
579561c81n5o9L24M60n02J512j226l90Q73j150P71N88j523K89j33K25P67n68j251f62
580669c0K56o81L62r41J170m35r8j594P88M51J213m90M32j364L44pR22m53j529E76
$$ plain form
573177 -819 -926 -67 -236 332 550 165 1048 -733 -1377 997 182 799 -147 -267 -285 -698 -831 -1273 -934 9
574285 100 -72 -238 -1707 -1678 -760 125 -1274 -1091 655 1331 -226 779 -643 -421 12 -159 -328 952 940
575340 148 1193 1821 801 1076 351 2185 2290 1091 -1005 673 -382 -1353 647 -350 100 21 -788 1059
576343 -824 -831 -286 -518 -354 -825 54 -671 -176 -724 -935 -1751 -1242 -184 130 -410 35 667 -279 -51 -1862 -918
577503 -1268 -1621 275 408 237 -425 -1510 -674 213 -1777 -942 -1021 -208 -997 -283 570 596 -17 1728 2161
578559 1216 2123 1330 -531 1146 -319 1005 856 -339 471 -349 -1384 -134 -932 100 159 13 -924 -90
579561 -381 -436 -505 -181 279 -223 1289 63 -327 546 -604 167 755 -768 -479 -612 -387 380 -188 -1439 -662
580669 -30 226 -455 -93 -1034 136 -299 -397 -1991 -1203 -752 461 -29 403 -961 -617 -624 298 -155 -1684 576
581777a165J210L01j126J80j85K004p57j155J148J397j265Q0R4J096p75p49Q47c17
582779d09O09N82j354J334p32k04j163J164k57P89j540J517Q60j884J52l96k51a911
583782i4j575l64p1K8J543o40J39J37M73m99Q99P45j392M30l86M12P7j026K21E90
584890h52K03Q73j892L96O52K40K126l677K086j055M86p30O8J056j15p27K246D37
585892C0M30P8j783P87L43n67J17L74k41K35O43o85o11L47N43j208J366p4P8r22A036
587053B04l16n33P94k18j63N41j248J62j36M26j797K367p77l66o38K89O20J33a122
588108b001M66J197o34J74r3k53J94j80Q68o06K03o59k65R57O72K07j679J280e92
589163c4k69n67r82K86K93N56L14q31K589j698J6l88l70R25j347R51J484p12p14a853
$$ plain form
581777 -1165 45 346 -780 -600 -785 1219 462 -693 455 1852 587 667 761 1857 1082 333 1180 -317
582779 -409 200 782 -572 762 30 -174 -1337 -173 -430 359 -1181 336 1196 -688 -536 -932 -1183 -1911
583782 -94 -1669 -2033 -2104 -2076 -533 -1173 -1034 -897 -424 -923 -24 721 -671 -241 -627 -215 -138 -1164 -943 590
584890 -852 -649 224 -1668 -1272 -620 -380 1746 -1931 155 -900 -414 -1144 -1076 -20 -135 -862 1384 437
585892 30 460 538 -1245 -458 -115 -682 -565 -191 -432 -197 446 -239 -850 -503 40 -1168 198 124 202 -720 1036
587053 204 -112 -645 149 -69 -232 309 -939 -777 -913 -487 -2284 83 -694 -1060 -1698 -1409 -789 -656 -1122
588108 -2001 -1535 -338 -972 -798 -891 -1144 -950 -1130 -262 -868 -665 -1324 -1589 -632 40 247 -1432 -152 -592
589163 -34 -303 -870 -1852 -1566 -1273 -717 -403 -1234 1355 -343 -327 -715 -1085 -160 -1507 -556 928 216 -498 -1853
590271a166J855j705J353J116k755J367j310J79o5j008R01J74k31j42O20j121a854
591221g71j035K521j784J60J391o60j05q42k55K04L32j726J288J550n41j59j260f20
592223E38k081J881j064M55NQ74o10o74k48j161J639k49J005P9r13J663j615n3a286
593278e63O38o91o20K66J569j095K8k20J768r21j34J56q57k82k41J256j29M33a214
594334D11q13p9J704k432L15J74N97j132q97O6J487m06q2m40K025j933J22K672a599
595389a29J057J66l210J720r4n74L96k29Q85l260L208k606J717N34r27J113O42a228
596391h14P06o23J728p81j067J658m87m85j026P94n82Q87J66q99J097j410L23A001
597394a48k31j50P25r6N47r77K49J058j351Q24j552K131j047J022j986R50N81A834
$$ plain form
590271 -1166 689 -1016 337 1453 -1302 65 -1245 -1066 -1131 -2139 -1238 -1064 -1295 -1437 -817 -1938 -1854
591221 -771 -1806 715 -1069 -909 482 -178 -283 -1125 -1380 -1176 -844 -2570 -1282 268 -273 -432 -1692 -620
592223 538 -1543 338 -726 -271 -266 608 -2 -676 -924 -2085 -446 -695 310 389 -524 1139 -476 -529 -1286
593278 -563 75 -616 -1236 -970 599 -496 -468 -688 1080 159 25 181 -676 -958 -1199 57 -72 361 -1214
594334 411 -402 -481 1223 -1209 -894 -720 -123 -1255 -2152 -2086 -599 -1005 -1087 -1527 498 -1435 -1313 1359 -1599
595389 -129 928 1094 -2116 -396 -490 -1064 -668 -897 -12 -3272 -64 -2670 -953 -419 -1346 -233 409 -1228
596391 -814 -108 -731 997 216 -851 807 320 -165 -1191 -397 -979 -92 74 -825 272 -1138 -815 1001
597394 -148 -379 -529 196 100 647 -330 -81 977 -374 450 -1102 1029 -18 1004 -982 -32 549 1834
598396b97O14J205k224j067K772O20j477Q46l07j54j181q91J950P09q96O43l68A20
599399a22M10J9K380j911j717R90m10j281J076q8J441j522m93R88j17K29K51R0E09
600454A891j680N05L80j14m91m75L8l42j091J352K49J522j171J105j55j703K88B391
601456C73m52K92M01l1j706K861o82J32p29R52j152O28J342j356j83k29J076j339B566
602511G42R82q11K150l119J292j110J460j874J917P67n28p75M57R72n25P53m67B435
603514B002J591m95r35j461L78J445J22j8R67o9j268j51L20k08L25j599Q93J062A668
604569B016J203o61m25J272p4M78j937K571l03j900J074L43o28J28K84K122M11D885
605571E424l03J47L18j544J032P76J39k064J07P86Q22n34n20J61J747j011r3K17E228
$$ plain form
598396 -297 317 1522 -702 -1769 1003 1623 146 992 685 531 -650 -1541 409 1118 222 865 497 120
599399 -122 288 307 2687 776 -941 49 -361 -1642 -566 -654 787 -735 -1228 -240 -357 -128 123 213 509
600454 1891 211 716 1096 982 491 16 54 -288 -1379 -27 222 1744 573 1678 1523 -180 108 2391
601456 373 -79 213 614 583 -1123 1738 1056 1188 459 1411 259 887 2229 873 690 461 1537 198 2566
602511 742 1724 913 3063 -56 1236 126 1586 -288 1629 2396 1868 1093 1550 2522 1997 2750 2283 2435
603514 2002 3593 3098 2163 702 1080 2525 2647 2629 3596 3527 2259 2108 2428 2220 2545 946 1839 2901 1668
604569 2016 3219 2558 2133 3405 3331 3809 1872 4443 4140 2240 3314 3657 3029 3157 3441 5563 5974 4885
605571 5424 5121 5268 5586 4042 5074 5850 5989 3925 4032 4818 5640 5106 4586 4747 6494 5483 5390 5607 5228
606627E474M87J357j035L62j89o74K465j186L60O20O28J83J033k31l60M81M19A2440
607629A1558J21R22M08L02j60j10P12r48n75J133M33m7M30J56j112r7J294N05A4459
608684A4268J014K38J90O15m96K565P95J558J157J520J365M300M620R275J1937G4334
609581I7319K7568K9908K6317K7183K6063J5871M070r059j8970k2498k6237k7894A21441
610320I4520k0153j9151j0371p565m705k928j830j776r88m7q15j602m1n16k087B0389
611217A9716oo8l37K09k534J272o16J826l615L83R70O53p62K55m96K89N26Q68A8033
612272A6730J670n61r76O50o4Q05p44J781r35p23J323K269j166K158K41J648J892B8617
613274C1942M450Q573J3643J7248K5243K7614K7561K6923L0565K0540J5024q66B41083
$$ plain form
606627 5474 5961 7318 6283 6645 6456 5782 8247 7061 7421 8041 8669 8852 9885 9654 9294 9775 10194 12440
607629 11558 11679 12601 13009 13311 13151 13041 13753 12805 12230 13363 13796 13749 14179 14335 13223 13126 14420 14925 14459
608684 14268 15282 15520 15710 16325 15829 18394 19189 20747 21904 23424 24789 29089 33709 42984 54921 74334
609581 97319 124887 154795 181112 208295 234358 250229 254299 245240 226270 203772 177535 149641 121441
610320 94520 74367 55216 44845 37280 32575 29647 27817 26041 25053 25006 24191 22589 22548 22032 19945 20389
611217 19716 19710 19642 19305 19514 16980 18252 17636 19462 15847 16230 17200 17853 17091 17346 16850 17139 17665 18533 18033
612272 16730 18400 17839 16863 17513 17449 18254 17510 19291 18356 17633 18956 21225 20059 22217 22458 24106 25998 28617
613274 31942 36392 44965 58608 75856 101099 128713 156274 183197 213762 234302 249326 248460 241083
614013B22660k4280k6261k9677k6169k6032k1057j4331j0895n901m108m079m30B7706
614752B9950k886N04j231Q04k036R43j903p79m59j207j254J61n33m6j853K92r9A7216
615754A7857L44r79J604j26K462M29R48M42K301K931N830N352J0306J7437K0481A12137
616651A39147K7192K8234K4365J7030O432o587j3366k1517k4734k7178k7582k7056G2906
617389E5007j1716q055n077j724l043j146j753k61r36j217R05k124J256j517p22A6743
618286A6022m7q94O54j274J417j519j284J273k24O26j070J102o22L20r29N73O67A5209
619289A5357p0K84j146J30n30k95K41P45J83l42k54J821K5J774K261R73J013K154B9875
620344C7014J0555J6721K0999K3556K4376K4866K6147K2107J6104M307o583j5231A81793
$$ plain form
614013 222660 198380 172119 142442 116273 90241 69184 54853 43958 38057 33949 29870 29440 27706
614752 29950 27064 27568 26337 27141 25105 26048 24145 23366 22907 21700 20446 20607 20074 20028 18175 18467 18368 17216
615754 17857 18201 17222 18826 18700 21162 21591 22539 22981 25282 28213 34043 39395 49701 67138 87619 112137
616651 139147 166339 194573 218938 235968 242400 235813 222447 200930 176196 149018 121436 94380 72906
617389 55007 43291 35236 30159 28435 25392 24246 22493 22232 21296 20079 20984 18860 20116 18599 17877 16743
618286 16022 15975 15081 15735 14461 15878 14359 13075 14348 14124 14750 13680 14782 14160 14480 13551 14124 14791 15209
619289 15357 15287 15571 14425 14555 14025 13730 13971 14716 14899 14557 14303 16124 16149 17923 20184 21157 22170 24324 29875
620344 37014 47569 64290 85289 108845 133221 158087 184234 206341 222445 226752 220169 204938 181793
621083A59921k5536k7114k4513k1449j5937j0102o730m527l179k487j765o52j36A4827
621874A4195n63j514j047k63l05j786J225r77j913M30j854k88k08Q9j069L97o0C044
622876D339j666J099j094L20J47m30m71Q41j518J027j079J074k70J059q69J13A920
623826B434M47j221Q69j595R45j61n98J248m75K60j177K69L26j60j070R80n76F30
624829B17P21r12o16J374j91M0M64L47j346j812J756J24o0P26N7P1j414J207l86D90
625936F72j5j134R60J40P08M55j069P07P90j383j519J459m92J219m88M09j574G16
626939a245K227j723L79K198k236J26n25J75q23J593m21R40o23j144O13K630j735B2
627941e62j319J151J746n69L84j639m45J069Q36M2j283P46r40j22J025j68n49g58
$$ plain form
621083 159921 134385 107271 82758 61309 45372 35270 28540 24013 20834 18347 16582 15930 15794 14827
621874 14195 13632 12118 11071 10808 10503 8717 9942 8965 7052 7482 5628 5340 5132 5221 4152 4549 4489 3044
622876 4339 2673 3772 2678 2998 3145 2715 2244 3085 1567 2594 1515 2589 2319 3378 2509 2622 1920
623826 2434 2881 1660 2529 934 1879 1718 1120 2368 1893 2153 976 1245 1571 1411 341 1321 745 630
624829 217 938 26 -590 784 593 633 1097 1444 98 -1714 42 166 106 832 889 960 -454 753 367 490
625936 672 657 -477 483 623 1331 1786 717 1424 2214 831 -688 771 279 1498 1010 1419 -155 716
626939 -1245 982 -741 -362 1836 -400 -274 -799 -624 -1447 146 -275 665 42 -1102 -489 2141 406 22
627941 -562 -1881 -730 1016 447 831 -808 -1253 -184 652 694 -589 157 -783 -905 120 -48 -597 -758
628944E31j519O45Q16j597l3J668q99q66K711j578j86P07p75o55Q91L7m83J476G12
629999g56R97k91R7p38K431k036Q39Pr92J105j642Q86j050J460q22N64o20J011I92
631054d3p65K659k351j48Q31j400K076j121L42M32k059J262K69j717K216l50j54c50
632057b69o6K7r54N5J854j36j711J192J371r85k217J952j251O55J486n87o74R27A04
633112B29J82q32O61k98k41j022J043q03R35j216J946j203J130r52j304J229L77C35
634114B5m13l92K45J369o49O33k44j446p1K95Q84O67k050J28J617m52j72O97j097d39
635222B43M56m14K38o40l31J260m92j17n0L60M28l01o45Q77j31q8J265k712J606a36
636330F52n11j042N63n59j813K557M00n12q25o82K307j243P02p35K3l29K53j5D95
$$ plain form
628944 531 -988 -343 473 -1124 -1157 511 -388 -1254 1457 -121 -307 400 -375 -1030 -139 -102 -585 891 712
629999 -756 241 -50 47 -691 1740 -296 543 550 -442 663 -979 -93 -1143 317 -505 59 -561 450 992
631054 -43 -808 1851 -500 -648 183 -1217 859 -262 80 512 -1547 -285 -16 -1733 483 133 -21 -350
632057 -269 -335 -308 -1262 -1207 647 511 -1200 -8 1363 378 -1839 113 -1138 -483 1003 416 -258 669 104
633112 229 411 -421 240 -58 -299 -1321 -278 -1081 -146 -1362 584 -619 511 -441 -1745 -516 -139 335
634114 25 -388 -780 -535 834 185 818 574 -872 -943 -648 236 903 -1147 -1019 598 146 -26 671 -426 -439
635222 243 699 285 523 -117 -448 812 320 203 153 513 941 640 -5 872 741 653 1918 -794 812 -136
636330 652 141 -901 -338 -897 -2710 -153 247 -265 -1090 -1772 535 -708 -6 -741 -718 -1047 -794 -809 495
637385a458J622m87R10j040R69l54m1K33j119J118M1p5r81P06M37o09Q01o2K09G68
638493a11n23L75k26n72O61O37Q2k01J97m2r44K424j511o74J843k104O66j43J076G85
639601F66n08J728J025k047O49K013j326M72j737O0Q91j765N39l13o8j24j26J10H33
640656A37k24p81N98K7J984k816J140J87j077Q55N30p85p3J705N67j926J026L91A940
641712D44L495J137O571J0595J9890k57j1994q195q012o760k521l200j79N28j808c4
642608B701j779J045j094m53J072k54L60m33j365O19l04j476Q14J132p74p9m89a11
643611a59j303J186r37O66l01O55j014J239q13J387p55r53J00J776j162K26L18d67
644613i14Q66j214j25q11L082r95j319J811J86l07p56J252l72n21m54J60j108E41
$$ plain form
637385 -1458 164 -323 587 -453 516 162 121 354 -765 353 394 319 -662 44 481 -128 673 611 820 768
638493 -111 -634 -259 -485 -1057 -396 241 323 122 319 277 -667 1757 246 -428 1415 -689 -23 -166 910 785
639601 666 158 1886 2911 864 1513 3526 2200 2672 935 995 1886 121 660 347 279 155 29 139 833
640656 137 -87 -868 -270 -243 1741 -1075 65 252 -825 30 560 -225 -298 1407 1974 48 1074 1465 1940
641712 444 3939 5076 11647 22242 42132 41875 29881 21686 13674 6914 4393 1193 1014 1542 -266 -34
642608 2701 922 1967 873 420 1492 1238 1598 1165 -200 419 115 -1361 -547 585 -189 -268 -757 -111
643611 -159 -1462 -276 -1213 -547 -848 -193 -1207 32 -781 606 -149 -1102 -1002 774 -388 -162 156 -467
644613 -914 -48 -1262 -1387 -2198 884 -111 -1430 381 567 260 -496 756 384 -137 -591 -431 -1539 541
645616FM13k57O02q36J9j300R61J843j824J497j251J3l08r66J680N23j510J95B1
646671B57M61K70L72k58j810J677L78o94J58q10p09n22J161j446O98J401K31k79A211
647726B69J083J8K4k056J172r22J306m46j99M95j462J114p55k97J63R0j199K07a310
648781a189j59J740j007j91J112K30j395J22n8O64m19j37j013j29J442J147j898b05
649784h77j75J094R96p71k443K189r49r30K149k712K242j108M03J339m03j71k01a279
650786d05j005J20J535r62p4J092p04M4k81K66l92O79l42R95o50K37r56K674j296I21
651894B78k11q3J171j349R53j356K11L82n38m25Q32o37L42j550J935m34p68K026f11
652949g62m31J295j354J849k196R85o86M97P58J522r72p14j291M74j006J639n63I71
$$ plain form
645616 6 419 162 764 -72 -53 -1353 -392 1451 -373 1124 -127 -114 -422 -1388 292 815 -695 -500 21
646671 257 718 988 1360 1102 -708 969 1347 653 811 1 -708 -1230 -69 -1515 -817 584 815 536 1211
647726 269 1352 1370 1394 -662 510 -412 894 448 249 744 -718 396 -359 -656 -493 -403 -1602 -1395 -1310
648781 -1189 -1348 392 -615 -806 306 536 -859 -737 -795 -131 -550 -687 -1700 -1829 -387 760 -1138 -205
649784 -877 -1052 42 1038 267 -2176 13 -936 -1866 283 -2429 -187 -1295 -892 447 44 -127 -328 -1279
650786 -405 -1410 -1290 245 -717 -791 301 -403 -359 -640 -374 -766 -87 -429 566 -84 153 -803 1871 575 921
651894 278 67 -16 1155 -194 759 -597 -386 -4 -542 -967 -135 -772 -430 -1980 -45 -479 -1247 779 -611
652949 -762 -1193 102 -1252 597 -1599 -614 -1300 -803 -45 1477 505 -209 -1500 -1026 -2032 -393 -956 971
653952E10j252n94K270k029J085l13N4j33K53P23l64q76O90L9O61k82O70J98r05A269
655060i0l32J773j737R45r90K5J04M31j097Q83j08O59j178L89J109j682J922j628A061
656115D78j007L46k1j126J184l07n45R61L38o28n36J66k25n06k46K030j14n36a548
657170a354J157K1o06m68J34J468p30O11j577N00K022j568L52Q28r23k57j48J215e79
658225D85j253N65O02j568J657J137k12j646O10J323l49q80n64J127n51R54k604G51
659228g1O70k537K086l39p85m41J065K61o79j311K017j527J740j333J897r00j445g80
660230E16r61n70P32q69m07P38K7J83j41r98K077n35N94o10j290P14J091j019E3
661285a257p04J633p41N84O22L01P50p74j101J66N49L4j59Q09k642J277l77n86E0
$$ plain form
653952 510 -742 -1336 934 -1095 -10 -323 -269 -402 -149 574 210 -666 24 63 724 442 1112 1310 405 1269
655060 -90 -422 1351 -386 559 -431 -406 -302 129 -968 -85 -193 466 -712 -323 786 -896 1026 -602 1061
656115 478 -529 -183 -204 -1330 -146 -453 -998 -37 301 -327 -863 -697 -922 -1428 -1674 356 242 -294 -1548
657170 -1354 -197 -176 -782 -1250 -1116 352 -378 233 -1344 -844 1178 -390 -38 790 -133 -390 -538 677 -579
658225 485 -768 -203 399 -1169 488 1625 1413 -233 377 1700 1351 471 -93 1034 483 1437 -1167 751
659228 -71 599 -1938 148 -191 -976 -1417 -352 -91 -770 -2081 -64 -1591 149 -1184 713 -187 -1632 -780
660230 516 -445 -1015 -283 -1152 -1559 -821 -794 -611 -752 -1750 327 -208 386 -224 -1514 -800 291 -728 53
661285 -1257 -1961 -328 -1069 -485 137 438 1188 414 -687 -521 28 62 -97 712 -1930 -653 -1030 -1616 50
662340a109j74j63L11L23L95J91L40n34J50j003J472o33m11j09P82q82M34Kq07A57
663448a162J119l9n93J005j727L82k62J276o88k55l79J339q81P74j388O55p45C15
664451h82N06m59L51k10M70K81m78j480J181J076j204J653j822R68R13j443K02a567
665453a63q79p10K446j706k12n5q13J845R1o67K89m24R51l87k8q84K183j639L79c46
666561f64P3l32L01N63j218j79J667r71K68p9m21l9J382n57q28O88K45n5o81r41a169
667722b023J926k944L088j168K778k229j01J95o57J139l77M23p22j0j02r72J562e81
668724g15O14k159J359n98N38J271n88j660Q25j357K112J22K29j356O54j047K297c3
669727b394K009m70N94q8o11N25L17k00P23j548N51K34q03N04K48R13R4k107J979g3
$$ plain form
662340 -1109 -1283 -1446 -1135 -812 -417 -226 114 -420 -270 -1273 199 -434 -845 -954 -172 -1054 -620 -618 -1425 157
663448 -1162 -43 -82 -675 330 -1397 -1015 -1277 -1 -689 -944 -1323 16 -865 -91 -1479 -824 -1569 315
664451 -882 -376 -835 -484 -694 -224 57 -421 -1901 -720 356 -848 805 -1017 -49 864 -579 -377 -1567
665453 -163 -1042 -1752 694 -1012 -1224 -1279 -2092 -247 -156 -823 -534 -958 -7 -394 -422 -1306 877 -762 -383 -346
666561 -664 -591 -923 -622 -59 -1277 -1456 211 -760 -492 -571 -992 -1031 351 -206 -1034 -346 -101 -156 -837 -1778 -1169
667722 -2023 -97 -3041 47 -1121 1657 -572 -673 -478 -1135 4 -373 50 -672 -682 -784 -1756 -194 -581
668724 -715 -101 -2260 -901 -1499 -961 310 -278 -1938 -1113 -2470 -358 -236 -7 -1363 -709 -1756 541 -33
669727 -2394 -385 -855 -261 -349 -960 -435 -118 -318 405 -1143 -592 -358 -1161 -657 -409 504 598 -1509 470 -73
670835g51j87l51J506j188o3J69m65o23J153o45j83J674o40P59m11j086O62J154h64
671890a045P30K82o92K76o59J595j335p81k08J024n54Q44jM95L13k501J548L71D67
672945a580Q19p59O17J103l08j336J245o08k96j118K383K68l85j636J854j106A86
673895f75p51K507j226p2M06k744K029J67R33j373r96J301K47l89Q32R9L85n32h19
674950E65k239J598j02l72j459j2K779k391m94J836M89k37j60j983J040K62l59g67
675952E44j225N95l10m96q21Q79J362m98j766Q82J081J027j828N94Q22k773K005g81
676955B84Q5j289M71j206Q86k34L58J09j189j94J600O39j198O81k61o15j5K11e71
678010h31P87N99j726J215r67J232j768K111k106OR88j087L67J507r11j088J184a620
$$ plain form
670835 -751 -938 -1289 217 -971 -1034 -865 -1330 -1953 -800 -1445 -1628 46 -594 165 -246 -1332 -670 484 -864
671890 -1045 -315 -33 -725 -449 -1108 487 -848 -1629 -1837 -813 -1367 -523 -524 -29 284 -2217 -669 -298 467
672945 -1580 -761 -1520 -903 200 -108 -1444 -199 -807 -1103 -2221 162 430 45 -1591 263 -843 186
673895 -675 -1426 1081 -145 -217 189 -2555 -526 -359 574 -799 -1795 -494 -247 -636 196 295 680 148 -819
674950 565 -1674 -76 -178 -550 -2009 -2021 758 -1633 -2127 -291 198 -39 -199 -2182 -1142 -880 -1239 -767
675952 544 -681 -86 -396 -892 -1713 -834 528 30 -1736 -854 227 1254 -574 20 842 -1931 74 -781
676955 284 369 -920 -449 -1655 -769 -1003 -645 -536 -1725 -1919 -319 320 -878 -197 -458 -1073 -1088 -877 -571
678010 -831 -44 555 -1171 44 -923 309 -1459 652 -1454 -1448 -460 -1547 -1180 327 -584 -1672 -488 -1620
679012A24Q54k995Q40J728j404Q5Q06J5K46n7J86o80r55J075O53l262J466R82g28
680068c21K06j429J30J369Q6k73J32k05j30k26Q20q48j373K765j483O15o02P36d06
681123c77J28j93J141k417J336o48N71j522R55N69j491J518O38q43Q7K75n9r9a48
682178a000o7M63P2L0M91j264L92r4K6J312K73m08m75j56Or54N46P08k50o38J57e18
683391C0k94n97M18O28M88j335k63J027j931J588m26l05J102l96j65Q28j428K07a519
684447a362J392r65N39N26m09q30J440m80j290J202K59j458O36p23N23J451j743a120
685449d47j970J747O17p85m82L6J285o35J128j051J26N12j371M50M79j082J461a520
686451a020k5J427p94J50L11j403L86R51n67k02q4M47M3J13k23K03p37o62k61D9
$$ plain form
679012 124 978 -2017 -1177 551 -853 -768 38 53 299 242 428 -252 -1207 -132 521 -2741 -1275 -293 -728
680068 -321 -115 -1544 -1414 -45 41 -232 -100 -305 -435 -661 159 -689 -2062 703 -780 -165 -767 -31 -406
681123 -377 -249 -442 699 -1718 -382 -1030 -459 -1981 -1026 -457 -1948 -430 208 -635 -548 -273 -332 -431 -148
682178 -1000 -1067 -604 -532 -502 -11 -1275 -883 -977 -951 361 634 226 -249 -405 -399 -1353 -807 -99 -349 -987 -830 -518
683391 30 -264 -861 -443 185 673 -662 -925 102 -1829 -241 -667 -972 130 -266 -431 397 -1031 -824 -1519
684447 -1362 30 -935 -396 130 -279 -1109 331 -149 -1439 -237 22 -1436 -800 -1523 -1000 451 -1292 -1120
685449 -447 -2417 -670 -53 -838 -1320 -1284 1 -634 494 -557 -431 81 -1290 -840 -361 -1443 18 -1520
686451 -1020 -1045 382 -412 -262 49 -1354 -968 -17 -584 -786 -870 -423 -380 -267 -490 -287 -1024 -1686 -1947 49
687559A83n83J727j165k73j15K45j248J220K54K10n70k04Q93o80J072j653J16a189
688562A48J019j989J625j450R31j129O85M43k28o01l81o70P54R31p67k63L58m43A60
689617b46l94P91o20M81j95q42o1J774j637K50o33J355j135P47N81l03j843L08b44
690672f79J047q41r87J309j50p71N85K24j350K41J545p57M1J175j084Q26j149e93
691675A41q38J085n33M29o21J179j931l3K49Q40P95j975O93o98j85K164l68p28a233
692730A704k543L81J556m01j314J155n76o37Q90n32R6K76l42n67N22r28J516j350F18
693785f77o14R25K69K47J11J3K11j568J410r56j168J119J114j357LM89P34n59a01
694840a079L33J581j688P05n47R22K07j073J38L81m59J354j316J112m74n68j091E82
$$ plain form
687559 183 -400 1327 162 -111 -226 19 -1229 -9 245 455 -115 -319 574 -106 966 -687 -571 -1189
688562 148 1167 -822 803 -647 284 -845 -160 283 55 -546 -927 -1597 -843 88 -679 -942 -584 -1027 160
689617 -246 -640 151 -469 12 -183 -1025 -1086 688 -949 -699 -1332 23 -1112 -365 216 -87 -1930 -1622 -244
690672 -679 368 -473 -1460 -151 -301 -1072 -487 -263 -1613 -1372 173 -584 -543 632 -452 374 -775 -593
691675 141 -697 388 -145 284 -337 842 -1089 -1122 -873 -33 762 -1213 -520 -1218 -1403 761 393 -335 -1233
692730 1704 -839 -458 1098 697 -617 538 -38 -675 215 -317 -221 55 -287 -854 -332 -1260 256 -1094 618
693785 -677 -1291 -366 -97 150 261 274 485 -1083 327 -629 -1797 -678 436 -921 -918 -429 305 -254 -101
694840 -1079 -746 835 -853 -148 -695 227 434 -639 -501 -120 -579 775 -541 571 97 -471 -1562 582
695843a2o38o10J282o48J383k365N90q02K160r79P16m5n86k20n51L37p0n54J770B86
696951E40k68k263K76K026q04n71J026k67k82N88L24N66j797J90J86L39j070J676a401
698006e99M52j080J807j174r86N31K90Q72j431Q06j82Q04r38K02m28o0O90R43a364
699061D71p64q9N97n89J8k95R52p1N22p86R61m44m01J8m22j223J804r64M58Jj45b49
700274C86m17r39J439j153Q0K208k417P24p68p37q17K735L36j195O78j082p39a608
701277a93j080P51L67j055K86J192Qj158m69Q02J19q40J252j96k71k89L44q79d90
702332b51N36j090J186j600j359J340O08j595N97J376J30k92L61m91l95O87K11b46
703334d88O22j41m02O23p99j452J440l38L65J361j533j298Q71k60N20Q76J188a242
$$ plain form
695843 -12 -650 -1260 22 -626 757 -1608 -1018 -1820 340 -639 77 32 -554 -774 -1325 -988 -1058 -1612 158 286
696951 540 272 -1991 -1715 311 -493 -1064 -38 -305 -587 1 325 891 -906 -716 -530 -191 -1261 415 -1401
698006 -599 -147 -1227 580 -594 -1580 -1049 -759 113 -1318 -512 -694 110 -828 -626 -1054 -1114 -424 519 -1364
699061 471 -293 -382 215 -374 -356 -651 301 230 752 -34 927 483 82 100 -322 -1545 259 -705 -247 -246 -391 -249
700274 386 -31 -970 469 -684 -604 1604 -813 -89 -857 -1594 -2411 324 660 -535 143 -939 -1678 -1608
701277 -193 -1273 -522 -155 -1210 -924 268 276 -882 -1351 -549 -430 -1270 -18 -214 -485 -774 -430 -1309 -490
702332 -251 285 -805 381 -1219 -2578 -1238 -630 -2225 -1628 -252 -122 -414 -53 -544 -939 -252 -41 -246
703334 -488 134 -7 -409 214 -585 -2037 -597 -935 -570 791 -742 -2040 -1169 -1429 -909 -33 1155 -1242
704337a003P06O7J356j319j296n23J390J05P2R77j416Q22p39Q49r76N57j90r27a422
705392a635R30P04n10Q42j747q1j219K012q18Q97Q6l43R14j081Q28M54k171J824b21
706447f8j367K254k192J752j936L077j240j784P30Q06r7J497j845M08K36j743d76
707397b80p78R28r36o56N36j88J106n26J108l600K719J95l71J268j026j820O46e6
708399a756L21J343m77K02k32L11p9p1p14R32l00Q17m42m12J52J011l6j219q36D9
709507C53j1n75L5J50O03m0K66p73r11J102j441J872j219M03M11j459J195N3r84D22
710615i49J33j56m66K005q85J92q6l12n62K38J419j484j05O12o40J180rj110P91g64
711723i55J427k013K330l260L678l046K484l699K787m32J39n46L80p23K02J635a94
$$ plain form
704337 -1003 -297 -230 1126 -193 -1489 -2012 -622 -517 -445 532 -884 -62 -801 48 -928 -371 -561 -1488 -1422
705392 -1635 -705 -1 -511 331 -1416 -1497 -2716 -704 -1522 -625 -539 -882 32 -1049 -221 233 -1938 -114 -221
706447 -68 -1435 819 -1373 379 -1557 1520 280 -1504 -774 32 -65 1432 -413 -5 231 -1512 -476
707397 -280 -1058 -130 -1066 -1722 -1186 -1374 -268 -794 314 -3286 -567 -372 -743 525 -501 -2321 -1675 -56
708399 -1756 -1435 -92 -569 -367 -599 -288 -367 -438 -1152 -220 -520 297 -145 -557 -405 606 570 -649 -1485 49
709507 353 342 -233 -198 -48 555 515 781 8 -903 199 -1242 630 -589 -186 225 -1234 -39 14 -970 422
710615 -949 -816 -972 -1438 567 -318 -126 -212 -524 -1086 -848 571 -913 -1018 -406 -1046 134 125 -985 -194 -764
711723 -955 472 -1541 789 -2471 1207 -1839 645 -3054 -267 -699 -560 -1106 -726 -1449 -1247 388 -194
712673h37r60J014j45O48P29K61k81j332J32Q5L5j49p38N21R80j570P11l72K22i82
713781h50KJ263j477J147J26k20j138R61l51K70o17J198l6j113Q07n72J56O31E97
714836A22l59l41N5N99m64k22P40N26j181l23k13J315j289m85J060m2k84J651a232
715891A033k704K088j255J275O5j886M80P34m67K26N7L6J173r99k73j51j077J384a177
716946i80M59J90M20q06k80Q80J516j933K39Q24J5j768J816j191P1q36J565p33b64
718001E0j460J342O19p79m19j34N24q82L1M46R53J146j968M72K32N7j049l04R56c09
719109i54l00J19K19M24q04l59J014J7M81j42j474O70j9K107p52n87Q66j134q37h16
720217b687J815j251J874O68j573q32R62j89m66R56o98J625n94K08n81Q06N96E2
$$ plain form
712673 -837 -1797 -783 -928 -280 449 710 429 -903 -771 -686 -651 -800 -1538 -1017 -37 -1607 -896 -1268 -1046 -982
713781 -850 -848 415 -1062 85 211 -9 -1147 -186 -537 -267 -884 314 278 -835 -28 -600 -444 187 597
714836 122 -237 -578 -523 76 -388 -610 130 656 -525 -848 -1061 254 -1035 -1520 -460 -502 -786 865 -1232
715891 1033 -1671 417 -838 437 502 -1384 -904 -170 -637 -411 -354 -318 855 -144 -417 -568 -1645 -261 -1177
716946 -980 -521 -331 89 -717 -997 -117 1399 -534 -295 529 544 -1224 592 -599 -528 -1364 201 -532 -264
718001 50 -1410 -68 551 -228 -647 -781 -257 -1139 -1108 -662 291 1437 -531 -59 173 230 -819 -1123 -167 -309
719109 -954 -1254 -1135 -916 -492 -1296 -1655 -641 -624 -143 -285 -1759 -1089 -1108 999 247 -340 526 -608 -1445 -816
720217 -2687 -872 -2123 -249 419 -1154 -1986 -1024 -1213 -1679 -723 -1421 204 -390 -182 -763 43 639 52
721220I64j152q66J096r78Q89n47p65J992N9r44m40N35r86P38k34j24J036q54a302
722275i75M44m3j329K165j963J854p96K00l45O19J24m40k94J651n07q15q17M34b00
723330F52r62k0J32o53p40J037o48J073q10J03PR67j121M65j425J560P47k05K80d20
724438a492j07J120o81m21O27R45k220K502j506J941k204Q60M67j483Q38K69K73F06
725441a690N98N67o32N95k52J309j203q07J249J6j433J414j1l77O7p28R65M23a311
726496a786P19o42J270m17L09Q03p82k49pj08O6l28M82Q20n43M28M21j033j94A15
727604a68O63r45k032J947j24J48j224J408N58q54J041j973NJ620J7r81J13J839e75
728659a116J65m44P97k60Q02M40j357P25p17N66J383j781L67R09j346O91m10j588C8
$$ plain form
721220 964 -188 -1054 42 -936 -47 -594 -1359 633 692 -252 -692 -157 -1143 -405 -639 -763 273 -581 -1302
722275 -975 -531 -574 -1903 262 -1701 153 -643 -443 -788 -169 -45 -485 -779 872 365 -450 -1267 -833 -200
723330 652 -310 -330 -198 -851 -1591 -554 -1202 -129 -939 -836 -829 138 -983 -518 -1943 -383 364 159 439 -420
724438 -1492 -1599 -479 -1160 -1581 -954 -9 -2229 273 -1233 708 -1496 -636 -169 -1652 -814 -545 -272 606
725441 -1690 -1092 -525 -1157 -562 -814 495 -708 -1515 -266 -250 -1683 -269 -280 -657 -590 -1318 -353 70 -1311
726496 -1786 -1067 -1709 -439 -856 -547 256 -526 -775 -782 -890 -824 -1152 -670 150 -393 35 456 -577 -771 115
727604 -168 495 -450 -2482 -535 -659 -511 -1735 -327 231 -623 418 -1555 -1550 70 87 -894 -781 1058 -575
728659 -1116 -951 -1395 -598 -858 -56 384 -973 -248 -965 -399 984 -797 -430 479 -867 -176 -586 -2174 38
729714a189R11j096P07O03J95q09K71R55j574O1O29M70p80J053p81p81J786o29a535
730769g20q0M88L42k265K689q12k55n39l43J142L34k14j290p92J272r10J764l89e1
731824d31J885j623l73J065j212k12O38j615K314J3m60j062N92q8L670o617Q66a596
732827B20j625j217J593J67N7R25j726P24m57Q03j18o66j57N04K0O60j324P70d76
733882a644R41q77J832j235O61l07J27J34n96L62j199J979q45R30j30r73J464H9
734884h92M79j764J192J74L73q70P88n68J098j128J44O23j250J819j164j67K15g27
735887a559J588k24o29p53J713m42l70J092p08k34l93Q7K78p78L63J399m19j154A87
736942g66R32r88J123j532K57J81R56k335J241K97L13M00q16M47M67p60P45j255h83
$$ plain form
729714 -1189 -278 -1374 -667 -64 131 -678 -407 548 -1026 -965 -336 134 -646 407 -374 -1155 631 2 -1535
730769 -720 -800 -312 30 -2235 454 -358 -613 -1152 -1495 -353 -19 -233 -1523 -2315 -1043 -1953 -189 -578 -51
731824 -431 1454 -169 -542 523 -689 -901 -263 -1878 436 449 -11 -1073 -481 -569 3101 -3516 -2650 -1596
732827 220 -1405 -2622 -1029 -862 -805 120 -1606 -882 -1339 -536 -654 -1320 -1477 -973 -953 -293 -1617 -847 -476
733882 -1644 -703 -1580 252 -983 -322 -629 -502 -368 -964 -602 -1801 178 -667 263 133 -840 624 89
734884 -892 -413 -2177 -985 -811 -438 -1308 -520 -1088 10 -1118 -974 -351 -1601 218 -946 -1113 -898 -727
735887 -1559 29 -195 -824 -1577 136 -306 -676 416 -292 -526 -919 -832 -554 -1332 -969 430 11 -1143 187
736942 -766 166 -822 301 -1231 -974 -793 163 -2172 -931 -634 -321 79 -737 -290 177 -583 162 -1093 -883
737997H44o26j503J534r41l85J186j175J529j490R89j232R94p18J033o08l6j140b302
739000a57r54j096J902J55k138J645Q68J97o92Q89j220J69J34n83K32J625k354A45
740002a493K0N08L45L97r19K18n7j12Q12j794J140r76L65J090j68q72J331M64a060
741057g2j36m08R4p38P00K87J70j593J673P18m18k360K353k000J105L41p52j83d61
742112c48m41RJ652j117mN29j542J373j058J247k014N36K034j540n58R0n32J27e54
743168h4O03m25l81M12J23n87J049j665M91m43m47J052j515J219n21j96J222J078i42
744223A11j080J106j414M95K28L3O26m30q7j012J46r4Q31l64M51m11P90j529J833b03
745331b187R23J839o55O50r95K10j73L23N02n49P30k85j830R70L20j142K317k365b057
$$ plain form
737997 844 218 -1285 249 -692 -1077 109 -1066 463 -1027 -38 -1270 -276 -994 39 -569 -605 -1745 -2302
739000 -157 -1111 -2207 -305 -150 -2288 -643 225 422 -270 619 -601 -432 -298 -881 -649 976 -1378 145
740002 -1493 -1473 -965 -620 -223 -1142 -924 -981 -1093 -281 -2075 -935 -1911 -1546 -456 -624 -1496 -165 299 -1060
741057 -72 -208 -616 -522 -1260 -560 -273 -103 -1696 -23 695 277 -2083 270 -1730 -625 -284 -1036 -1219 -461
742112 -348 -789 -780 872 -245 -249 280 -1262 111 -947 300 -1714 -1178 856 -684 -1242 -1152 -1684 -1557 -554
743168 -84 519 94 -287 125 248 -339 710 -955 -464 -907 -1354 -302 -1817 -598 -1119 -1315 -93 985 -942
744223 111 -969 137 -1277 -782 -554 -521 105 -325 -412 -1424 -1278 -1372 -541 -905 -454 -865 -75 -1604 229 -203
745331 -2187 -1264 575 -80 570 -425 -215 -388 -65 437 -112 618 333 -1497 -527 -207 -1349 968 -1397 -2057
746386d26j114J314o32j24L02r39O01K7P12J31r75J458j655O5Q73N74j116K75h10
747441a383J96K56j054J770j352J144%r67L56J624n44j184J96j208K388j629R58a298
748444g73j159J050r8q48R67J463j548J755j190l80K032j493n40k89J651j308a84
749393e81R0j004M22J892j918O96Q62m14p24O97Q77r64j206M18mR49r31J532o44a170
750501e02M56q60J69J50N42m44M59L10j913Q41j59J97o1j7N23K05R46k178P82b91
751609a548J812j033Q57p50J398j444R7N07j98J2j186J937j65j091o7J347p28a123
752612A328k009O7j47L05K19q32Q79n13O84r08N97p94J151M86r50O03l68q90O49C50
753720C11j709p5J732l31j08K29j114o82J147r25N39K037q81r33j92N55q71K77a268
$$ plain form
746386 -426 -1540 -226 -858 -982 -680 -1619 -1018 -991 -279 -148 -1123 335 -1320 -1255 -382 192 -924 -649 -810
747441 -1383 -1187 -931 -1985 -215 -1567 -423 -423 -1390 -1034 590 46 -1138 -942 -2150 238 -1391 -433 -1298
748444 -773 -1932 -882 -980 -1828 -861 602 -946 809 -381 -761 1271 -222 -762 -1051 600 -708 -184
749393 -581 -491 -1495 -1073 819 -1099 -403 459 45 -679 18 895 -69 -1275 -857 -861 88 -843 689 45 -1170
750501 -502 -46 -906 -737 -587 -45 -489 -30 280 -1633 -792 -951 -754 -815 -832 -309 -104 842 -1336 -554 -291
751609 -1548 264 -769 88 -662 736 -708 -611 -104 -302 -290 -1476 461 296 -795 -862 485 -243 -1123
752612 1328 -681 -614 -761 -456 -237 -1069 -190 -703 -19 -927 -330 -1124 27 513 -437 166 -202 -1092 -443 350
753720 311 -1398 -1473 259 -72 -180 49 -1065 -1747 -600 -1525 -986 1051 170 -763 -955 -400 -1271 -994 -1268
754775c36m96J235j779o29J544M78q92J061l243J391K57J942j825J266o44Jq3a042
755777a468Q49J24m18J926k966M42j77J230P36j944J250Q18j457O30k93R77p54a807
756780D7q05J168k584J680o19j78R82p76m2P98p69N46j721J825j79Q08o35o93A12
757835a67j362k73J069P43J5l94n4J248k148J16J481K9o72K8L31l55k35j00O65i98
758943a042J363j446Q65M01M98k181J796o25l6Q27j464P35M07o0p46Q74J04J02f69
759998c95N4M60L5j258J287o32P87k84N19j509K72J223j097J635j773m4l33j72c36
761053a270J408o86j06q32J947j552J917j652N77o55J613K55k381K448j515M40d
762003B89r03l72J006k74L61p14J174j70j459J739j219j260J096K279l679K679g9
$$ plain form
754775 -336 -832 403 -1376 -2005 -461 17 -875 186 -3057 -1666 -1409 533 -1292 -26 -670 -669 -752 -1042
755777 -1468 -619 -495 -913 1013 -1953 -1511 -1688 -458 278 -1666 -416 402 -1055 -425 -718 259 -495 -1807
756780 47 -758 410 -2174 -494 -1113 -1291 -309 -1085 -1127 -329 -1098 -552 -2273 -448 -627 181 -454 -1147 112
757835 -167 -1529 -1802 -733 10 25 -369 -423 825 -1323 -1207 274 303 -369 -341 -10 -365 -600 -700 -35 -998
758943 -1042 321 -1125 -260 141 639 -1542 254 -371 -407 420 -1044 -309 98 38 -708 166 270 372 -669
759998 -395 -341 119 154 -1104 183 -449 338 54 573 -936 -664 559 -538 1097 -676 -720 -1053 -1225 -336
761053 -1270 138 -548 -654 -1486 461 -1091 826 -826 -249 -904 709 964 -1417 1031 -484 -44 -4
762003 289 -614 -986 20 -254 107 -607 567 397 -1062 677 -542 -1802 -706 1573 -2106 573 -79
762952a229q5J27Q18P4k0J48j69q21L06l62M71j5R64j063N60j101L37L94q4o09A74
764113a208K92O30n54j486L135j305K45K73j477N85J725j468l3Q33j089j332J878c26
765116e59n21J234L41j567q52M91P70r6J76L40n88K31R47j014O51o27o87O66N47a252
766223e64n98O2J365j255O25l44J709l099N32K148k65o11j562L256j157J126k714h68
767226i65M29M09N94j364L32J096O1j422J174l93j199O98R72p86O33k548J696i90
768228A168j866J6K20l11J29N73p63j061J224K7l09l0O52p32N01M62L71j92j272D76
769336d06O91m05O6j154O80j304K384p45q44o73P69N63m45K030j833j51K89J059a86
770391A03n66o17R46o72k16N61L17L25n55p75m01J223q52J439j650Q65j502J138d83
$$ plain form
762952 -1229 -1314 -1187 -369 -295 -315 -167 -336 -1157 -851 -1213 -742 -757 207 -856 -296 -1397 -1060 -666 -750 -1359 174
764113 -1208 -916 -286 -840 -2326 809 -496 -251 22 -1455 -870 855 -613 -646 187 -902 -2234 -356 -326
765116 -559 -1080 154 495 -1072 -1924 -1433 -663 -759 -583 -243 -831 -600 347 -667 -16 -643 -1330 -664 -117 -1252
766223 -564 -1162 -1100 265 -990 -365 -709 1000 -2099 -1567 581 316 -295 -1857 1399 242 1368 -1346 -868
767226 -965 -536 -127 467 -897 -565 531 592 -830 344 -49 -1248 -550 422 -364 269 -2279 -583 -990
768228 1168 -698 -682 -462 -773 -644 -71 -834 -1895 -671 -644 -953 -983 -331 -1063 -562 -100 271 79 -1193 476
769336 -406 285 -120 -54 -1208 -528 -1832 552 -193 -1037 -1710 -941 -378 -823 1207 -626 -777 -488 571 -186
770391 103 -463 -1080 -134 -806 -1022 -461 -144 181 -374 -1149 -1550 -327 -1179 260 -1390 -525 -2027 -889 -483
771447B55m53K00K22k008J725m71J177q44r90j09J324j264N27O43N05m20K58r18i90
772502i00K51q07J078o74n52R02O39r65K64n50R41m98J090O04j611K0o12J776f58
773557b11L97j123K87K31n82L52j321J88K366l27j377k9M54n16J599n51J90l72a354
774612g86O24l78L5J345K84j059p56J346J2j571Q87q56m12J683j160J98J399r94g53
775667E9j196l72L92k34P99J588j005p51J85J103r78J6j112P64K04Q23p72j94b73
776723A09L24j519N03N09m62M15o81O91q81Q36l69j57K93l99J227j442J546j208E59
777778f76o08O13J245j709J343M82p63K58m44m9j094O36J68l04K29P01j166J237a521
778833b14q8m61J2M5J184j158L0j33N86j114O26M64l19j717J287n94J614j348A25
$$ plain form
771447 255 -198 2 224 -1784 -59 -530 647 -197 -1187 -1296 28 -1236 -709 -66 439 19 277 -641 -990
772502 -900 -649 -1456 -378 -1052 -1604 -702 -63 -1028 -764 -1314 -373 -871 219 823 -788 -768 -1380 396 -658
773557 -211 186 -937 -650 -419 -1001 -649 -1970 -1782 584 257 -1120 -1149 -695 -1211 388 -163 27 -345 -1354
774612 -786 -162 -540 -505 840 1124 65 -691 655 667 -904 -17 -873 -1285 398 -762 -564 835 -159 -753
775667 59 -1137 -1509 -1117 -1351 -552 1036 31 -720 -535 568 -410 -394 -1506 -742 -538 285 -487 -681 -273
776723 109 433 -1086 -583 -74 -536 -121 -802 -111 -992 -156 -525 -682 -389 -788 439 -1003 543 -665 559
777778 -676 -1284 -671 574 -1135 208 690 -73 185 -259 -308 -1402 -766 -598 -902 -673 28 -1138 99 -1521
778833 -214 -302 -763 -751 -706 478 -680 -650 -783 -197 -1311 -685 -221 -540 -2257 -970 -1564 50 -1298 125
779888a222J304j313M91l90M76n01p06J835p91O86j233m38J730j46Q4o75R9n32a497
780943i22J775j648r42J822p12P68J030j820L82k35r81J712o65P2O48j512O49@
781946h30O97j554P01O19K17o20N00o01m2J79M96p63o31J814j991k91K355M47b75
783001a562M86L37L34O23j750M82L60n78J278m56P92o46Q06k139J685P91j056d77
784003b19n53q1O73O25k143K441j243P78j439k55L28M06R35M71j087m2n63R9P68a430
785111e86l8O81j06m08J273k079P32k1J159j029M12P0j690N49M46k78P76j217a19
786167H9k91j355J208J37r16J099j96j202O53N11L95m58j028J598j780J101N91g51
787169f94r25P40R92J33p98J68k37l28O22J196k535R31K86M18p35q8r31R67K3A83
$$ plain form
779888 -1222 82 -1231 -740 -1130 -654 -1155 -1861 -26 -817 -131 -1364 -1802 -72 -218 -134 -809 -710 -1242 -1497
780943 -922 853 -795 -1737 85 -627 141 1171 -649 -267 -502 -1483 229 -436 -364 284 -1228 -579 0
781946 -830 -133 -1687 -986 -367 -150 -770 -270 -871 -913 -734 -238 -1001 -1632 182 -1809 -2100 255 702 -275
783001 -1562 -1076 -739 -405 218 -1532 -1050 -690 -1268 10 -446 346 -300 506 -1633 52 843 -213 -477
784003 -219 -772 -853 -180 445 -1698 743 -500 278 -1161 -1416 -1088 -682 253 724 -363 -405 -968 -869 -101 -1430
785111 -586 -624 57 -49 -457 816 -1263 -531 -552 607 -422 -10 60 -1630 -1081 -635 -913 -137 -1354 -119
786167 89 -202 -1557 -349 -212 -1128 -29 -225 -1427 -774 -263 132 -326 -1354 244 -1536 -435 156 -751
787169 -694 -1619 -879 113 246 -552 -384 -621 -949 -327 869 -1666 -735 -449 -31 -766 -854 -1785 -818 -795 183
788277h1q02J79o05P50Q54l63p02M81o16J141j216K41J62o4r96K398j018K78j48A310
789385c22j693K180j606J324Q94r77o27m08j85J463j343k88L34m9J101K45j296h91
790387C34j388Q25J039j921j63J255m55j310K350r08j34j065J561j272J15J282a073
791337d96O73j074n9P47J21p24o54R58j306J278l90L80J08P23P67J60k129n21a005
792392a479J270Q40n36j189J010M51j076L70L46M93J090k800J66L64o56p3L096a954
793395h48m10O87L04l16l12j32J12L88n0r38m73N65J164p19k79J62j80K365j379h29
794502A08j204L93j63J390j123R82r84Q57r45R07o20r96P81J489k175M01O80p81A97
795558g68J069m1j414M39O21r94l67J637p04r61R16K27n23N02R78j760J636K76g41
$$ plain form
788277 -81 -883 -704 -1309 -559 295 -68 -770 -289 -905 236 -980 -739 -577 -641 -1637 761 -257 21 -127 1310
789385 -322 -2015 165 -1441 -117 777 -200 -827 -1235 -1420 43 -1300 -1588 -1254 -1303 -202 43 -1253 -891
790387 334 -1054 -229 810 -1111 -1274 -19 -474 -1784 566 -342 -476 -1541 20 -1252 -1137 145 -1073
791337 -496 177 -897 -956 -209 -88 -812 -1466 -508 -1814 -536 -926 -546 -438 285 1052 1212 -917 -1438 -1005
792392 -1479 -209 631 95 -1094 -84 367 -709 -339 7 500 1590 -1210 -1044 -680 -1336 -1409 1687 -1954
793395 -848 -1258 -571 -267 -583 -895 -1027 -915 -527 -577 -1515 -1988 -1423 -259 -978 -1257 -1095 -1275 1090 -289 -829
794502 108 -1096 -703 -866 524 -599 383 -601 256 -689 218 -402 -1398 -617 872 -1303 -902 -222 -1003 197
795558 -768 301 260 -1154 -715 -94 -1088 -1455 182 -522 -1483 -567 -340 -863 -361 617 -1143 493 769 -741
796613c63j071J689m76L49j148k03J262j356j54Q52j223L7J451M4J006o35O39G53
797615a31L21n60r7J021k36M23q12l22n10n20J031Q9p66j59M31M9o49P57k32q66c
798776i59O50m52M70j77l36J69J144L23k948J522O69j305P48N22Rj336M15K06d75
799831I3j960J051o89J140J21J14m48j816J919R55k063J060L90M78k86L33j279c49
800834i15K81J548k190M38M51q46K386j726P69q92m80o4R71l76J318j395R2r26a83
801889c73m04J22r60R25J161k017R43M81p29J129O4n68r27K14J3M17o18J177j599F61
802997g9j050N26Q45r21R87m84N38j035p02J639O57j370j04j038J502j42J71j275e4
804052a527J248j331J346j196J920n11q15N06L55k74P8o83L67r84K023m22l70E27
$$ plain form
796613 -363 -1434 255 -221 128 -1020 -1223 39 -1317 -1471 -619 -1842 -1805 -354 -310 696 61 700 753
797615 -131 190 -370 -467 554 318 741 -71 -393 -903 -1423 -392 -303 -1069 -1228 -797 -748 -1397 -640 -872 -1738 -3
798776 -959 -309 -761 -291 -468 -804 -635 509 832 -2116 -594 75 -1230 -482 40 49 -1287 -872 -666 -475
799831 93 -1867 -816 -1505 -365 -244 -130 -578 -2394 -475 480 -1583 -523 -133 345 59 392 -887 -349
800834 -915 -634 914 -1276 -838 -387 -1233 1153 -573 196 -696 -1176 -1240 -269 -645 673 -722 -630 -1556 -183
801889 -373 -777 -655 -1615 -690 471 -1546 -603 -122 -851 278 342 -226 -1153 -939 -926 -509 -1127 50 -1549 661
802997 -79 -1129 -603 242 -679 308 -176 362 -673 -1375 264 921 -449 -553 -1591 -89 -231 -60 -1335 -54
804052 -1527 -279 -1610 -264 -1460 460 -51 -866 -360 -5 -279 -201 -884 -517 -1501 522 100 -270 527
805054e46J47R5n74p08O31M58M43n96R65j358N96R7n6l44J695k665L73n77J342g55
806162i41j23N12ll13L00l42Q76j73q20l99P75K47m23M13O17j525K064r13K94e29
807270e30j73M14r06n84J724P77j071l56J68N78o31J31j685J601P59j741Q19M71A94
808325a26M62k51p85k7R11k16J16m32J325j816q5l17O92k34J57n78P10K4K71k07b04
809486e37o51K202j516P66k65r4l83o21k16J549K27j104K32J2j318K231j676J449i80
810541a316J278j338j584J986j326K250p97O15j558J729j153J718r62pm49O96a053
811491B30j72Q0o06L96j225J204o50K21O09J20j189l15J312o34N32m68Q91j196F36
812546C80J61k167J737K3r21Q3j21M14n43M32o9M87p15O29r73R80o30j30J14M0b95
$$ plain form
805054 -546 -399 -304 -878 -1586 -955 -497 -54 -650 315 -1043 -447 -350 -406 -750 945 -1720 -1347 -1924 -582 -755
806162 -941 -1064 -552 -555 -868 -568 -910 -34 -207 -1027 -1426 -651 -404 -827 -414 203 -1322 742 -171 123 -529
807270 -530 -703 -289 -1195 -1779 -55 722 -349 -705 -537 41 -590 -459 -2144 -543 216 -1525 -706 -235 194
808325 -126 336 85 -700 -727 184 -32 84 -348 977 -839 -924 -1241 -549 -783 -626 -1204 -494 -470 -199 -406 -204
809486 -537 -1188 1014 -502 264 -1 -95 -478 -1099 -1315 234 461 -643 -411 -399 -1717 514 -1162 287 -980
810541 -1316 -38 -1376 -2960 -974 -2300 -50 -847 -232 -1790 -61 -1214 504 -458 -465 -914 -218 -1053
811491 230 58 138 -468 -72 -1297 -93 -743 -522 87 207 -982 -1297 15 -619 -87 -555 336 -860 636
812546 380 541 -1626 111 134 -787 -704 -825 -411 -954 -522 -591 -104 -819 -190 -1163 -183 -813 -943 -829 -789 -295
813707b023K821k829J460j049Q40Q24K1N75j391o01K125j750L34n91J011j87j239b635
$$ plain form
813707 -2023 798 -2031 -571 -1620 -780 44 65 640 -751 -1352 773 -977 -643 -1234 -223 -410 -1649 -2635
$$ [...]
885196c15  $$checkpoint
##END=
