##TITLE= urea
##JCAMP-DX=5.01
##DATA TYPE= LINK
##BLOCKS= 2
##TITLE= urea
##JCAMP-DX= 5.01
##DATA TYPE= INFRARED SPECTRUM
##DATA CLASS= XYDATA
##BLOCK ID=1
##ORIGIN= Department of Chemistry, UWI, JAMAICA
##OWNER= public domain
##LONGDATE= 2012/02/18 12:31:56.0440 -0500 $$ export date from JSpecView
##SPECTROMETER/DATA SYSTEM= from scan
##$MODELS=
<Models>
<ModelData id="urea" type="MOL">
urea
RLDSViewer          3D                             0

  8  7  0  0  0  0  0  0  0  0999 V2000
    0.0000    0.0000    0.1422 C   0  0  0  0  0  0  0  0  0  1
    0.0000    1.3164   -0.6178 N   0  0  0  0  0  0  0  0  0  2
    0.0000    2.2430   -0.0828 H   0  0  0  0  0  0  0  0  0  3
    0.0000    1.3164   -1.6878 H   0  0  0  0  0  0  0  0  0  4
    0.0000   -1.3164   -0.6178 N   0  0  0  0  0  0  0  0  0  5
    0.0000   -2.2430   -0.0828 H   0  0  0  0  0  0  0  0  0  6
    0.0000   -1.3164   -1.6878 H   0  0  0  0  0  0  0  0  0  7
    0.0000    0.0000    1.4172 O   0  0  0  0  0  0  0  0  0  8
  1  8  2  0  0  0
  1  2  1  0  0  0
  1  5  1  0  0  0
  2  4  1  0  0  0
  2  3  1  0  0  0
  5  7  1  0  0  0
  5  6  1  0  0  0
M  END
</ModelData>
<ModelData id="C1" type="XYZVIB" baseModel="urea" vibrationScale=".5">
8
Model[1]: Convg=0.3171D-08;-V/T=2.0087;Energy=NaN;Range=M.O.s;E(RHF)=-223.906773830 A.U.;PATH=Calculation 1;Input
C     0.00000    0.00000    0.00000
N     0.00000    0.00000    1.52000
H     0.92665    0.00000    2.05500
H    -0.92665    0.00000    2.05500
N    -1.31636    0.00000   -0.76000
H    -1.31636    0.00000   -1.83000
H    -2.24301    0.00000   -0.22500
O     1.10418    0.00000   -0.63750
8
Model[2]: Convg=0.3171D-08;-V/T=2.0087;Energy=-223.90677;Range=M.O.s;E(RHF)=-223.906773830 A.U.;PATH=Calculation 1;Standard
C     0.00000    0.00000    0.14219
N     0.00000    1.31636   -0.61781
H     0.00000    2.24301   -0.08281
H     0.00000    1.31636   -1.68781
N     0.00000   -1.31636   -0.61781
H     0.00000   -2.24301   -0.08281
H     0.00000   -1.31636   -1.68781
O     0.00000    0.00000    1.41719
8
Model[3]: IRIntensity=29.5625 KM/Mole;ReducedMass=4.4137 AMU;ForceConstant=0.6449 mDyne/A;Frequency=497.9774 cm^-1;FrequencyLabel=A1;PATH=Calculation 1;FrequenciesFrequencies
C     0.00000    0.00000    0.14219    0.00000    0.00000   -0.04000
N     0.00000    1.31636   -0.61781    0.00000    0.35000    0.06000
H     0.00000    2.24301   -0.08281    0.00000    0.26000    0.23000
H     0.00000    1.31636   -1.68781    0.00000    0.50000    0.06000
N     0.00000   -1.31636   -0.61781    0.00000   -0.35000    0.06000
H     0.00000   -2.24301   -0.08281    0.00000   -0.26000    0.23000
H     0.00000   -1.31636   -1.68781    0.00000   -0.50000    0.06000
O     0.00000    0.00000    1.41719    0.00000    0.00000   -0.11000
8
Model[4]: IRIntensity=11.6433 KM/Mole;ReducedMass=6.1797 AMU;ForceConstant=1.1526 mDyne/A;Frequency=562.6389 cm^-1;FrequencyLabel=B2;PATH=Calculation 1;FrequenciesFrequencies
$$ [...]
8
Model[20]: IRIntensity=66.7664 KM/Mole;ReducedMass=1.1128 AMU;ForceConstant=6.4169 mDyne/A;Frequency=3128.4011 cm^-1;FrequencyLabel=A1;PATH=Calculation 1;FrequenciesFrequencies
C     0.00000    0.00000    0.14219    0.00000    0.00000    0.00000
N     0.00000    1.31636   -0.61781    0.00000    0.03000    0.05000
H     0.00000    2.24301   -0.08281    0.00000   -0.46000   -0.27000
H     0.00000    1.31636   -1.68781    0.00000   -0.01000   -0.46000
N     0.00000   -1.31636   -0.61781    0.00000   -0.03000    0.05000
H     0.00000   -2.24301   -0.08281    0.00000    0.46000   -0.27000
H     0.00000   -1.31636   -1.68781    0.00000    0.01000   -0.46000
O     0.00000    0.00000    1.41719    0.00000    0.00000    0.00000
</ModelData>
</Models>
##$PEAKS=
<Peaks type="IR" xUnitsExpected="1/cm"  >
<PeakData id="1" title="A1-asymm stretch of N-H group (~3450 cm-1)" peakShape="broad" model="C1.20" xMax="3470" xMin="3450"    />
<PeakData id="2" title="B2-asymm stretch of N-H group (~3445 cm-1)" peakShape="broad" model="C1.19" xMax="3450" xMin="3420"    />
<PeakData id="3" title="A1-sym stretch of N-H group  (~3345 cm-1)" peakShape="broad" model="C1.18" xMax="3370" xMin="3350"    />
<PeakData id="4" title="B2-sym stretch of N-H group  (~3340 cm-1)" peakShape="broad" model="C1.17" xMax="3350" xMin="3320"    />
<PeakData id="5" title="A1-sym bend of N-H group (~1683 cm-1)" peakShape="broad" model="C1.16" xMax="1710" xMin="1683"    />
<PeakData id="6" title="B2-sym bend of N-H group (~1683 cm-1)" peakShape="broad" model="C1.15" xMax="1680" xMin="1645"    />
<PeakData id="7" title="A1- C=O stretch (~1601 cm-1)" peakShape="broad" model="C1.14" xMax="1620" xMin="1580"    />
<PeakData id="8" title="B2-(~1366 cm-1)" peakShape="broad" model="C1.13" xMax="720" xMin="670"    />
<PeakData id="9" title="A1 (~1256 cm-1)" peakShape="broad" model="C1.12" xMax="600" xMin="550"    />
<PeakData id="10" title="B1-(~996 cm-1)" peakShape="broad" model="C1.11" xMax="3120" xMin="3080"    />
<PeakData id="11" title="B2- (~960 cm-1)" peakShape="broad" model="C1.10" xMax="3100" xMin="3060"    />
<PeakData id="12" title="A2-  (~947 cm-1)" peakShape="broad" model="C1.9" xMax="1610" xMin="1570"    />
<PeakData id="13" title="B1- (~914 cm-1)" peakShape="broad" model="C1.8" xMax="1320" xMin="1280"    />
<PeakData id="14" title="B1-  (~708 cm-1)" peakShape="broad" model="C1.7" xMax="1243" xMin="1203"    />
<PeakData id="15" title="A1- (~701 cm-1)" peakShape="broad" model="C1.6" xMax="880" xMin="840"    />
<PeakData id="16" title="A2- (~670 cm-1)" peakShape="broad" model="C1.5" xMax="785" xMin="740"    />
<PeakData id="17" title="B2-(~562 cm-1)" peakShape="broad" model="C1.4" xMax="720" xMin="670"    />
<PeakData id="18" title="A1 (~497 cm-1)" peakShape="broad" model="C1.3" xMax="600" xMin="550"    />
</Peaks>
##XUNITS= 1/CM
##YUNITS= TRANSMITTANCE
##XFACTOR= 1E0
##YFACTOR= 8.787E-7
##FIRSTX= 422.439
##FIRSTY= 0.8137
##LASTX= 3991.775
##NPOINTS= 297
##XYDATA= (X++(Y..Y))
422.439I26027l7897l7555n7813p6704p1583n7813n1781N349q080j2177D62615
567.144E12120m7798J96882J05383P4997M8139K8679J9916J4795J2973I67338
699.788I66086j252J0926J2860L0954J4795P739j9802J1039L4141K390A072380
844.493A073745l755l756m893p056o942o601o373r446j1266j1609j3087I77239
1001.256I70297p056o031n577n007k845k732O715J1153J479r673k2420H21668
1158.011F82713Q6150J02083N6333L3458K4924R787R559P625O942N691A026516
1302.716A027768k27k504Tk503k504k390r901j2860k3785l6531r1271G21407
1459.479E58439k32731M34847J38728L7214m438j9233m8253n4057r9352E34995
$$ y = [926027, 888130, 850575, 792762, 716058, 644475, 586662, 534881, 540230, 532150, 519973, 462615, 512120, 464322, 661204, 766587, 841584, 889723, 918402, 938318, 953113, 966086, 967338, 966086, 964834, 975760, 988620, 1019574, 1034369, 1042108, 1022306, 1033345, 1067486, 1069876, 1072380, 1073745, 1069990, 1066234, 1061341, 1054285, 1047343, 1040742, 1034369, 1024923, 1013657, 1002048, 988961, 977239, 970297, 963241, 957210, 951633, 946626, 943781, 941049, 947764, 958917, 960396, 950723, 928303, 821668, 682713, 768863, 870946, 927279, 960737, 985661, 995448, 1005007, 1012632, 1019574, 1025265, 1026516, 1027768, 1027541, 1025037, 1022533, 1020030, 1017526, 1015136, 1005235, 992375, 968590, 932059, 840788, 721407, 558439, 325708, 760555, 899283, 936497, 932059, 912826, 864573, 810516, 711164, 534995]
1592.124B32730j51018Q9336p1810P8183K05303P284k46842k6630K71765F60066
1724.769G98794J00489M4839K9134K2875J4794J2860Q422Q307P398O942A061113
1869.465A064869L641K845J252TJ138U%k048r11n69j252j251l42j14A071242
2074.466A071811O82N69N70N69r11k162k049k162k048k28J252J365J252A069762
2255.341A071014J935J934J821J935TJ138n69m56n69Um55n69Vm55n69A075111
2496.512A075111%TJ14m55k846k731k845Uk732k845Tk731k390N69O83A048936
2713.564A049505N69Tl073l528Ul527L072L756L755L528J935TJ934L301A062251
2918.564A067941N691o83m780m894m779m894Tm779m894m780r559j0243A004211
$$ y = [232730, 81712, 171048, 99238, 177421, 382724, 390008, 143166, 116536, 388301, 660066, 798794, 899283, 944122, 973256, 996131, 1010925, 1023785, 1032207, 1040514, 1047912, 1054854, 1061113, 1064869, 1068510, 1071355, 1072607, 1073859, 1074997, 1076135, 1077273, 1077273, 1075225, 1074314, 1073745, 1072493, 1071242, 1070900, 1070786, 1071242, 1071811, 1072493, 1073062, 1073632, 1074201, 1073290, 1071128, 1069079, 1066917, 1064869, 1064641, 1065893, 1067258, 1068510, 1069762, 1071014, 1072949, 1074883, 1076704, 1078639, 1080574, 1081712, 1081143, 1080687, 1080118, 1079549, 1078980, 1078525, 1077956, 1077387, 1076818, 1076249, 1075794, 1075225, 1075111, 1075111, 1075111, 1075111, 1075225, 1074770, 1071924, 1069193, 1066348, 1063503, 1060658, 1057926, 1055081, 1052236, 1049505, 1047115, 1047684, 1048367, 1048936, 1049505, 1050074, 1050643, 1047570, 1044042, 1040514, 1036986, 1033459, 1036531, 1040287, 1044042, 1047570, 1049505, 1051440, 1053374, 1056675, 1062251, 1067941, 1073632, 1072949, 1068169, 1063275, 1058496, 1053602, 1048708, 1043929, 1039035, 1034255, 1024696, 1014453, 1004211]
3087.379I88847j7071j8891j9233k5834k0484j9006k8223n5992q2964F38785
3220.025F09423j9119m5181k8678k7086K0144l301o6234q1029q2963B51166
3352.669B81780Q9336N4285j593l2093j44532r4344l6758L41Q5809Q9336D49642
3497.374E38978J23706N4967N1554N3715K7882K0827J8777J7071J6843I42984
3630.018I61193J2632J2746R787P511TP625K504J366J252J251J252J138A027768
3798.833A027768%J14%VJ14%UP97J365J252TA033914
$$ y = [988847, 971776, 952885, 933652, 907818, 887334, 868328, 840105, 784113, 701149, 638785, 609423, 590304, 545123, 516445, 489359, 509503, 506202, 439968, 358939, 275976, 251166, 281780, 371116, 425401, 423808, 391715, 247183, 152839, 116081, 116422, 202231, 291567, 449642, 538978, 662684, 717651, 769205, 822920, 850802, 871629, 890406, 907477, 924320, 942984, 961193, 973825, 986571, 996358, 1003869, 1011380, 1019005, 1021509, 1022875, 1024127, 1025378, 1026630, 1027768, 1027768, 1027768, 1027768, 1027882, 1027882, 1027882, 1027882, 1027882, 1027996, 1027996, 1027996, 1027996, 1028793, 1030158, 1031410, 1032662, 1033914]
3991.775A035279  $$checkpoint
##END=$$ End of the data block
##TITLE=urea $$ Begin of the data block
##JCAMP-DX=5.00 $$ ACD/DocManager Library v 5.00
##DATA TYPE=RAMAN SPECTRUM
##DATA CLASS=XYDATA
##BLOCK ID=2
##DATE=19 Feb 2012 10:29:22
##ORIGIN= Department of Chemistry, UWI, Jamaica
##OWNER= public domain
##SPECTROMETER/DATA SYSTEM=from scan
##$MODELS=
<Models>
<ModelData id="urea" type="MOL">
urea
RLDSViewer          3D                             0

  8  7  0  0  0  0  0  0  0  0999 V2000
    0.0000    0.0000    0.1422 C   0  0  0  0  0  0  0  0  0  1
    0.0000    1.3164   -0.6178 N   0  0  0  0  0  0  0  0  0  2
    0.0000    2.2430   -0.0828 H   0  0  0  0  0  0  0  0  0  3
    0.0000    1.3164   -1.6878 H   0  0  0  0  0  0  0  0  0  4
    0.0000   -1.3164   -0.6178 N   0  0  0  0  0  0  0  0  0  5
    0.0000   -2.2430   -0.0828 H   0  0  0  0  0  0  0  0  0  6
    0.0000   -1.3164   -1.6878 H   0  0  0  0  0  0  0  0  0  7
    0.0000    0.0000    1.4172 O   0  0  0  0  0  0  0  0  0  8
  1  8  2  0  0  0
  1  2  1  0  0  0
  1  5  1  0  0  0
  2  4  1  0  0  0
  2  3  1  0  0  0
  5  7  1  0  0  0
  5  6  1  0  0  0
M  END
</ModelData>
<ModelData id="C2" type="XYZVIB" baseModel="urea" vibrationScale=".5">
8
Model[1]: Convg=0.3171D-08;-V/T=2.0087;Energy=NaN;Range=M.O.s;E(RHF)=-223.906773830 A.U.;PATH=Calculation 1;Input
C     0.00000    0.00000    0.00000
N     0.00000    0.00000    1.52000
H     0.92665    0.00000    2.05500
H    -0.92665    0.00000    2.05500
N    -1.31636    0.00000   -0.76000
H    -1.31636    0.00000   -1.83000
H    -2.24301    0.00000   -0.22500
O     1.10418    0.00000   -0.63750
8
Model[2]: Convg=0.3171D-08;-V/T=2.0087;Energy=-223.90677;Range=M.O.s;E(RHF)=-223.906773830 A.U.;PATH=Calculation 1;Standard
C     0.00000    0.00000    0.14219
N     0.00000    1.31636   -0.61781
H     0.00000    2.24301   -0.08281
H     0.00000    1.31636   -1.68781
N     0.00000   -1.31636   -0.61781
H     0.00000   -2.24301   -0.08281
H     0.00000   -1.31636   -1.68781
O     0.00000    0.00000    1.41719
8
Model[3]: IRIntensity=29.5625 KM/Mole;ReducedMass=4.4137 AMU;ForceConstant=0.6449 mDyne/A;Frequency=497.9774 cm^-1;FrequencyLabel=A1;PATH=Calculation 1;FrequenciesFrequencies
C     0.00000    0.00000    0.14219    0.00000    0.00000   -0.04000
N     0.00000    1.31636   -0.61781    0.00000    0.35000    0.06000
H     0.00000    2.24301   -0.08281    0.00000    0.26000    0.23000
H     0.00000    1.31636   -1.68781    0.00000    0.50000    0.06000
N     0.00000   -1.31636   -0.61781    0.00000   -0.35000    0.06000
H     0.00000   -2.24301   -0.08281    0.00000   -0.26000    0.23000
H     0.00000   -1.31636   -1.68781    0.00000   -0.50000    0.06000
O     0.00000    0.00000    1.41719    0.00000    0.00000   -0.11000
8
Model[4]: IRIntensity=11.6433 KM/Mole;ReducedMass=6.1797 AMU;ForceConstant=1.1526 mDyne/A;Frequency=562.6389 cm^-1;FrequencyLabel=B2;PATH=Calculation 1;FrequenciesFrequencies
C     0.00000    0.00000    0.14219    0.00000    0.05000    0.00000
N     0.00000    1.31636   -0.61781    0.00000   -0.21000    0.27000
H     0.00000    2.24301   -0.08281    0.00000   -0.28000    0.38000
H     0.00000    1.31636   -1.68781    0.00000   -0.10000    0.28000
N     0.00000   -1.31636   -0.61781    0.00000   -0.21000   -0.27000
H     0.00000   -2.24301   -0.08281    0.00000   -0.28000   -0.38000
H     0.00000   -1.31636   -1.68781    0.00000   -0.10000   -0.28000
O     0.00000    0.00000    1.41719    0.00000    0.37000    0.00000
8
Model[5]: IRIntensity=0.0000 KM/Mole;ReducedMass=1.2536 AMU;ForceConstant=0.3322 mDyne/A;Frequency=670.6105 cm^-1;FrequencyLabel=A2;PATH=Calculation 1;FrequenciesFrequencies
C     0.00000    0.00000    0.14219    0.00000    0.00000    0.00000
N     0.00000    1.31636   -0.61781    0.10000    0.00000    0.00000
H     0.00000    2.24301   -0.08281   -0.51000    0.00000    0.00000
H     0.00000    1.31636   -1.68781   -0.48000    0.00000    0.00000
N     0.00000   -1.31636   -0.61781   -0.10000    0.00000    0.00000
H     0.00000   -2.24301   -0.08281    0.51000    0.00000    0.00000
H     0.00000   -1.31636   -1.68781    0.48000    0.00000    0.00000
O     0.00000    0.00000    1.41719    0.00000    0.00000    0.00000
8
Model[6]: IRIntensity=5.7893 KM/Mole;ReducedMass=4.6112 AMU;ForceConstant=1.3360 mDyne/A;Frequency=701.2391 cm^-1;FrequencyLabel=A1;PATH=Calculation 1;FrequenciesFrequencies
C     0.00000    0.00000    0.14219    0.00000    0.00000   -0.24000
N     0.00000    1.31636   -0.61781    0.00000   -0.13000    0.22000
H     0.00000    2.24301   -0.08281    0.00000   -0.28000    0.46000
H     0.00000    1.31636   -1.68781    0.00000    0.14000    0.23000
N     0.00000   -1.31636   -0.61781    0.00000    0.13000    0.22000
H     0.00000   -2.24301   -0.08281    0.00000    0.28000    0.46000
H     0.00000   -1.31636   -1.68781    0.00000   -0.14000    0.23000
O     0.00000    0.00000    1.41719    0.00000    0.00000   -0.29000
8
Model[7]: IRIntensity=745.6021 KM/Mole;ReducedMass=1.4085 AMU;ForceConstant=0.4162 mDyne/A;Frequency=708.1559 cm^-1;FrequencyLabel=B1;PATH=Calculation 1;FrequenciesFrequencies
C     0.00000    0.00000    0.14219   -0.10000    0.00000    0.00000
N     0.00000    1.31636   -0.61781    0.11000    0.00000    0.00000
H     0.00000    2.24301   -0.08281   -0.49000    0.00000    0.00000
H     0.00000    1.31636   -1.68781   -0.49000    0.00000    0.00000
N     0.00000   -1.31636   -0.61781    0.11000    0.00000    0.00000
H     0.00000   -2.24301   -0.08281   -0.49000    0.00000    0.00000
H     0.00000   -1.31636   -1.68781   -0.49000    0.00000    0.00000
O     0.00000    0.00000    1.41719    0.01000    0.00000    0.00000
8
Model[8]: IRIntensity=1.8859 KM/Mole;ReducedMass=4.0206 AMU;ForceConstant=1.9804 mDyne/A;Frequency=914.3435 cm^-1;FrequencyLabel=B1;PATH=Calculation 1;FrequenciesFrequencies
C     0.00000    0.00000    0.14219    0.49000    0.00000    0.00000
N     0.00000    1.31636   -0.61781   -0.07000    0.00000    0.00000
H     0.00000    2.24301   -0.08281   -0.54000    0.00000    0.00000
H     0.00000    1.31636   -1.68781   -0.27000    0.00000    0.00000
N     0.00000   -1.31636   -0.61781   -0.07000    0.00000    0.00000
H     0.00000   -2.24301   -0.08281   -0.54000    0.00000    0.00000
H     0.00000   -1.31636   -1.68781   -0.27000    0.00000    0.00000
O     0.00000    0.00000    1.41719   -0.14000    0.00000    0.00000
8
Model[9]: IRIntensity=0.0000 KM/Mole;ReducedMass=1.0155 AMU;ForceConstant=0.5370 mDyne/A;Frequency=947.4043 cm^-1;FrequencyLabel=A2;PATH=Calculation 1;FrequenciesFrequencies
C     0.00000    0.00000    0.14219    0.00000    0.00000    0.00000
N     0.00000    1.31636   -0.61781    0.02000    0.00000    0.00000
H     0.00000    2.24301   -0.08281   -0.46000    0.00000    0.00000
H     0.00000    1.31636   -1.68781    0.54000    0.00000    0.00000
N     0.00000   -1.31636   -0.61781   -0.02000    0.00000    0.00000
H     0.00000   -2.24301   -0.08281    0.46000    0.00000    0.00000
H     0.00000   -1.31636   -1.68781   -0.54000    0.00000    0.00000
O     0.00000    0.00000    1.41719    0.00000    0.00000    0.00000
8
Model[10]: IRIntensity=346.9897 KM/Mole;ReducedMass=4.2659 AMU;ForceConstant=2.3184 mDyne/A;Frequency=960.4193 cm^-1;FrequencyLabel=B2;PATH=Calculation 1;FrequenciesFrequencies
C     0.00000    0.00000    0.14219    0.00000    0.49000    0.00000
N     0.00000    1.31636   -0.61781    0.00000   -0.09000    0.04000
H     0.00000    2.24301   -0.08281    0.00000    0.12000   -0.31000
H     0.00000    1.31636   -1.68781    0.00000   -0.50000    0.05000
N     0.00000   -1.31636   -0.61781    0.00000   -0.09000   -0.04000
H     0.00000   -2.24301   -0.08281    0.00000    0.12000    0.31000
H     0.00000   -1.31636   -1.68781    0.00000   -0.50000   -0.05000
O     0.00000    0.00000    1.41719    0.00000   -0.16000    0.00000
8
Model[11]: IRIntensity=1.8732 KM/Mole;ReducedMass=1.0793 AMU;ForceConstant=0.6316 mDyne/A;Frequency=996.6588 cm^-1;FrequencyLabel=B1;PATH=Calculation 1;FrequenciesFrequencies
C     0.00000    0.00000    0.14219    0.03000    0.00000    0.00000
N     0.00000    1.31636   -0.61781    0.02000    0.00000    0.00000
H     0.00000    2.24301   -0.08281    0.50000    0.00000    0.00000
H     0.00000    1.31636   -1.68781   -0.49000    0.00000    0.00000
N     0.00000   -1.31636   -0.61781    0.02000    0.00000    0.00000
H     0.00000   -2.24301   -0.08281    0.50000    0.00000    0.00000
H     0.00000   -1.31636   -1.68781   -0.49000    0.00000    0.00000
O     0.00000    0.00000    1.41719   -0.06000    0.00000    0.00000
8
Model[12]: IRIntensity=136.4412 KM/Mole;ReducedMass=2.0031 AMU;ForceConstant=1.8635 mDyne/A;Frequency=1256.5988 cm^-1;FrequencyLabel=A1;PATH=Calculation 1;FrequenciesFrequencies
C     0.00000    0.00000    0.14219    0.00000    0.00000    0.18000
N     0.00000    1.31636   -0.61781    0.00000    0.01000    0.05000
H     0.00000    2.24301   -0.08281    0.00000    0.29000   -0.41000
H     0.00000    1.31636   -1.68781    0.00000   -0.45000    0.06000
N     0.00000   -1.31636   -0.61781    0.00000   -0.01000    0.05000
H     0.00000   -2.24301   -0.08281    0.00000   -0.29000   -0.41000
H     0.00000   -1.31636   -1.68781    0.00000    0.45000    0.06000
O     0.00000    0.00000    1.41719    0.00000    0.00000   -0.19000
8
Model[13]: IRIntensity=84.8313 KM/Mole;ReducedMass=1.3670 AMU;ForceConstant=1.5046 mDyne/A;Frequency=1366.8012 cm^-1;FrequencyLabel=B2;PATH=Calculation 1;FrequenciesFrequencies
C     0.00000    0.00000    0.14219    0.00000   -0.12000    0.00000
N     0.00000    1.31636   -0.61781    0.00000    0.04000    0.07000
H     0.00000    2.24301   -0.08281    0.00000    0.34000   -0.42000
H     0.00000    1.31636   -1.68781    0.00000   -0.44000    0.07000
N     0.00000   -1.31636   -0.61781    0.00000    0.04000   -0.07000
H     0.00000   -2.24301   -0.08281    0.00000    0.34000    0.42000
H     0.00000   -1.31636   -1.68781    0.00000   -0.44000   -0.07000
O     0.00000    0.00000    1.41719    0.00000    0.03000    0.00000
8
Model[14]: IRIntensity=315.5395 KM/Mole;ReducedMass=2.4338 AMU;ForceConstant=3.4682 mDyne/A;Frequency=1555.1929 cm^-1;FrequencyLabel=A1;PATH=Calculation 1;FrequenciesFrequencies
C     0.00000    0.00000    0.14219    0.00000    0.00000    0.30000
N     0.00000    1.31636   -0.61781    0.00000   -0.04000   -0.08000
H     0.00000    2.24301   -0.08281    0.00000   -0.32000    0.37000
H     0.00000    1.31636   -1.68781    0.00000    0.44000   -0.08000
N     0.00000   -1.31636   -0.61781    0.00000    0.04000   -0.08000
H     0.00000   -2.24301   -0.08281    0.00000    0.32000    0.37000
H     0.00000   -1.31636   -1.68781    0.00000   -0.44000   -0.08000
O     0.00000    0.00000    1.41719    0.00000    0.00000   -0.12000
8
Model[15]: IRIntensity=64.5503 KM/Mole;ReducedMass=1.1080 AMU;ForceConstant=2.1250 mDyne/A;Frequency=1804.2269 cm^-1;FrequencyLabel=B2;PATH=Calculation 1;FrequenciesFrequencies
C     0.00000    0.00000    0.14219    0.00000    0.01000    0.00000
N     0.00000    1.31636   -0.61781    0.00000   -0.06000    0.03000
H     0.00000    2.24301   -0.08281    0.00000    0.20000   -0.42000
H     0.00000    1.31636   -1.68781    0.00000    0.53000    0.02000
N     0.00000   -1.31636   -0.61781    0.00000   -0.06000   -0.03000
H     0.00000   -2.24301   -0.08281    0.00000    0.20000    0.42000
H     0.00000   -1.31636   -1.68781    0.00000    0.53000   -0.02000
O     0.00000    0.00000    1.41719    0.00000    0.00000    0.00000
8
Model[16]: IRIntensity=32.4194 KM/Mole;ReducedMass=1.0948 AMU;ForceConstant=2.1735 mDyne/A;Frequency=1835.6135 cm^-1;FrequencyLabel=A1;PATH=Calculation 1;FrequenciesFrequencies
C     0.00000    0.00000    0.14219    0.00000    0.00000    0.00000
N     0.00000    1.31636   -0.61781    0.00000    0.05000   -0.03000
H     0.00000    2.24301   -0.08281    0.00000   -0.21000    0.42000
H     0.00000    1.31636   -1.68781    0.00000   -0.53000   -0.02000
N     0.00000   -1.31636   -0.61781    0.00000   -0.05000   -0.03000
H     0.00000   -2.24301   -0.08281    0.00000    0.21000    0.42000
H     0.00000   -1.31636   -1.68781    0.00000    0.53000   -0.02000
O     0.00000    0.00000    1.41719    0.00000    0.00000    0.00000
8
Model[17]: IRIntensity=77.4655 KM/Mole;ReducedMass=1.0422 AMU;ForceConstant=5.5120 mDyne/A;Frequency=2996.0922 cm^-1;FrequencyLabel=B2;PATH=Calculation 1;FrequenciesFrequencies
C     0.00000    0.00000    0.14219    0.00000    0.00000    0.00000
N     0.00000    1.31636   -0.61781    0.00000    0.03000   -0.02000
H     0.00000    2.24301   -0.08281    0.00000   -0.39000   -0.23000
H     0.00000    1.31636   -1.68781    0.00000    0.00000    0.54000
N     0.00000   -1.31636   -0.61781    0.00000    0.03000    0.02000
H     0.00000   -2.24301   -0.08281    0.00000   -0.39000    0.23000
H     0.00000   -1.31636   -1.68781    0.00000    0.00000   -0.54000
O     0.00000    0.00000    1.41719    0.00000    0.00000    0.00000
8
Model[18]: IRIntensity=6.8483 KM/Mole;ReducedMass=1.0430 AMU;ForceConstant=5.5395 mDyne/A;Frequency=3002.4755 cm^-1;FrequencyLabel=A1;PATH=Calculation 1;FrequenciesFrequencies
C     0.00000    0.00000    0.14219    0.00000    0.00000    0.00000
N     0.00000    1.31636   -0.61781    0.00000    0.03000   -0.02000
H     0.00000    2.24301   -0.08281    0.00000   -0.40000   -0.24000
H     0.00000    1.31636   -1.68781    0.00000    0.00000    0.53000
N     0.00000   -1.31636   -0.61781    0.00000   -0.03000   -0.02000
H     0.00000   -2.24301   -0.08281    0.00000    0.40000   -0.24000
H     0.00000   -1.31636   -1.68781    0.00000    0.00000    0.53000
O     0.00000    0.00000    1.41719    0.00000    0.00000    0.00000
8
Model[19]: IRIntensity=89.5505 KM/Mole;ReducedMass=1.1102 AMU;ForceConstant=6.3946 mDyne/A;Frequency=3126.6110 cm^-1;FrequencyLabel=B2;PATH=Calculation 1;FrequenciesFrequencies
C     0.00000    0.00000    0.14219    0.00000    0.00000    0.00000
N     0.00000    1.31636   -0.61781    0.00000   -0.03000   -0.05000
H     0.00000    2.24301   -0.08281    0.00000    0.47000    0.28000
H     0.00000    1.31636   -1.68781    0.00000    0.01000    0.45000
N     0.00000   -1.31636   -0.61781    0.00000   -0.03000    0.05000
H     0.00000   -2.24301   -0.08281    0.00000    0.47000   -0.28000
H     0.00000   -1.31636   -1.68781    0.00000    0.01000   -0.45000
O     0.00000    0.00000    1.41719    0.00000    0.00000    0.00000
8
Model[20]: IRIntensity=66.7664 KM/Mole;ReducedMass=1.1128 AMU;ForceConstant=6.4169 mDyne/A;Frequency=3128.4011 cm^-1;FrequencyLabel=A1;PATH=Calculation 1;FrequenciesFrequencies
C     0.00000    0.00000    0.14219    0.00000    0.00000    0.00000
N     0.00000    1.31636   -0.61781    0.00000    0.03000    0.05000
H     0.00000    2.24301   -0.08281    0.00000   -0.46000   -0.27000
H     0.00000    1.31636   -1.68781    0.00000   -0.01000   -0.46000
N     0.00000   -1.31636   -0.61781    0.00000   -0.03000    0.05000
H     0.00000   -2.24301   -0.08281    0.00000    0.46000   -0.27000
H     0.00000   -1.31636   -1.68781    0.00000    0.01000   -0.46000
O     0.00000    0.00000    1.41719    0.00000    0.00000    0.00000
</ModelData>
</Models>
##$PEAKS=
<Peaks type="RAMAN" xUnitsExpected="1/cm"  >
<PeakData id="1" title="A1-asymm stretch of N-H group (~3450 cm-1)" peakShape="broad" model="C2.20" xMax="3470" xMin="3450"    />
<PeakData id="2" title="B2-asymm stretch of N-H group (~3445 cm-1)" peakShape="broad" model="C2.19" xMax="3450" xMin="3420"    />
<PeakData id="3" title="A1-sym stretch of N-H group  (~3345 cm-1)" peakShape="broad" model="C2.18" xMax="3370" xMin="3350"    />
<PeakData id="4" title="B2-sym stretch of N-H group  (~3340 cm-1)" peakShape="broad" model="C2.17" xMax="3350" xMin="3320"    />
<PeakData id="5" title="A1-sym bend of N-H group (~1683 cm-1)" peakShape="broad" model="C2.16" xMax="1710" xMin="1683"    />
<PeakData id="6" title="B2-sym bend of N-H group (~1683 cm-1)" peakShape="broad" model="C2.15" xMax="1680" xMin="1645"    />
<PeakData id="7" title="A1- C=O stretch (~1601 cm-1)" peakShape="broad" model="C2.14" xMax="1620" xMin="1580"    />
<PeakData id="8" title="B2-(~1366 cm-1)" peakShape="broad" model="C2.13" xMax="720" xMin="670"    />
<PeakData id="9" title="A1 (~1256 cm-1)" peakShape="broad" model="C2.12" xMax="600" xMin="550"    />
<PeakData id="10" title="B1-(~996 cm-1)" peakShape="broad" model="C2.11" xMax="3120" xMin="3080"    />
<PeakData id="11" title="B2- (~960 cm-1)" peakShape="broad" model="C2.10" xMax="3100" xMin="3060"    />
<PeakData id="12" title="A2-  (~947 cm-1)" peakShape="broad" model="C2.9" xMax="1610" xMin="1570"    />
<PeakData id="13" title="B1- (~914 cm-1)" peakShape="broad" model="C2.8" xMax="1320" xMin="1280"    />
<PeakData id="14" title="B1-  (~708 cm-1)" peakShape="broad" model="C2.7" xMax="1243" xMin="1203"    />
<PeakData id="15" title="A1- (~701 cm-1)" peakShape="broad" model="C2.6" xMax="880" xMin="840"    />
<PeakData id="16" title="A2- (~670 cm-1)" peakShape="broad" model="C2.5" xMax="785" xMin="740"    />
<PeakData id="17" title="B2-(~562 cm-1)" peakShape="broad" model="C2.4" xMax="720" xMin="670"    />
<PeakData id="18" title="A1 (~497 cm-1)" peakShape="broad" model="C2.3" xMax="600" xMin="550"    /></Peaks>
##XUNITS= 1/CM
##YUNITS= RAMAN INTENSITY
##XFACTOR= 1
##YFACTOR= 1.187500E-06
##FIRSTX= 3.989050E+03
##FIRSTY= 1.250000E-02
##LASTX= 1.274600E+02
##NPOINTS= 861
##MINY= 1.250000E-02
##MAXY= 1.200000
##XYDATA= (X++(Y..Y))
3989.05A0526%Z1Q5%TK52K53K52K53TK52K53TK52K53K52K53O74O73A5663
3540.026A6253O73O74N89O74Q42J011P58J010J937K190K021UK105J768C8821
3463.692D3200M884M632M631M716TN810L706k274m379l621l032j600F0211
3400.829E8442j010J263K105M21K947J0779J3390J3642J3810J0527m211A12674
3342.456A09474n06k779k189k779m884n558n137n221m968m969n389m548E8863
3279.592E8105j179Vj178j179J600N221%Tn221Tm464j600k526k779Tk610B8716
3189.788B6947k021j768p58n89n90o74o73o74Tn89n05m21m22m21k52A5663
3113.454A5326k52k53l37k52l37j69j68k53j68j69j68Tj69j68j69j68A1789
$$ y = [10526, 10526, 10526, 10526, 10526, 10526, 10526, 10526, 10526, 10526, 10526, 10526, 10526, 10526, 10526, 10526, 10526, 10526, 10526, 10526, 10526, 10526, 10526, 10526, 10526, 10526, 10526, 10526, 10526, 10526, 10526, 10526, 10526, 10526, 10526, 10526, 10526, 10526, 10526, 10526, 10526, 10526, 10526, 10526, 10526, 10526, 10526, 10526, 10526, 10526, 10526, 10526, 10526, 10526, 10526, 10526, 10526, 10526, 10526, 10526, 10526, 10526, 10526, 10526, 10526, 10526, 10526, 10526, 10526, 10526, 10526, 10526, 10526, 10526, 10526, 10526, 10526, 10526, 10526, 10526, 10526, 10526, 10611, 10611, 10611, 10863, 11116, 11368, 11621, 11874, 12126, 12379, 12632, 12884, 13137, 13389, 13642, 14316, 14989, 15663, 16253, 16926, 17600, 18189, 18863, 19705, 20716, 21474, 22484, 24421, 26611, 28632, 30653, 32674, 34779, 36547, 38821, 43200, 48084, 52716, 57347, 62063, 66779, 72589, 76295, 74021, 69642, 66021, 62989, 61389, 60211, 58442, 57432, 58695, 60800, 61221, 64168, 74947, 88337, 101979, 115789, 126316, 122105, 112674, 109474, 108968, 106189, 104000, 101221, 96337, 90779, 85642, 80421, 75453, 70484, 65095, 60547, 58863, 58105, 56926, 55747, 54568, 53389, 52211, 51032, 52632, 57853, 57853, 57853, 52632, 47411, 42947, 41347, 38821, 36042, 33263, 30653, 28716, 26947, 24926, 23158, 22400, 21811, 21221, 20547, 19874, 19200, 18526, 17937, 17432, 17011, 16589, 16168, 15916, 15663, 15326, 15074, 14821, 14484, 14232, 13895, 13726, 13558, 13305, 13137, 12968, 12800, 12632, 12463, 12295, 12126, 11958, 11789]
3032.63A1874Q4%Q4TK53Q4K53J68J69J68T%q4%Tj68j69j68Tj69j68A2126
2929.354A1958q4q5j68%U1q4Q4UQ5J68K53K52L37K53K52L37TJ69Q4q4A4232
2695.862A4147k52k53Tk52k53k52k53Tq4j68j69q4TQ4%U2Q4%Q4Q5Q4A2042
2457.88A2126Q5Q4UJ69Q4TJ68J69J68J69J68J69J68TJ69J68J69Q4%A4737
2359.094A4737%Wq4j69j68j69j68k53j68k53j68q4j69q4Q4J69J68TJ69A3726
2251.329A3895K52J69J68J69J68K53L37L36L37TK53L37L36%Vk52k53A6589
2157.034A6337k53l37j68k53q4%UK53K52L37K53L37K52K53TJ68Q4TJ69A7937
2058.249A7937%S4l37Tk52l37q42j011j179o74N90R26Q42P58M21N06A7516
$$ y = [11874, 11958, 11958, 12042, 12126, 12379, 12463, 12716, 12884, 13053, 13221, 13389, 13389, 13305, 13305, 13305, 13137, 12968, 12800, 12632, 12463, 12295, 12126, 11958, 11874, 11789, 11621, 11621, 11621, 11621, 11621, 11621, 11621, 11621, 11621, 11621, 11621, 11621, 11621, 11621, 11621, 11621, 11621, 11621, 11621, 11621, 11621, 11621, 11621, 11621, 11621, 11621, 11621, 11621, 11621, 11621, 11621, 11621, 11537, 11621, 11705, 11789, 11874, 12042, 12295, 12547, 12884, 13137, 13389, 13726, 14063, 14232, 14316, 14232, 14232, 14147, 13895, 13642, 13389, 13137, 12884, 12632, 12379, 12126, 12042, 11874, 11705, 11621, 11537, 11621, 11621, 11621, 11621, 11621, 11621, 11621, 11621, 11621, 11621, 11621, 11621, 11621, 11621, 11621, 11621, 11621, 11621, 11621, 11621, 11621, 11621, 11621, 11621, 11621, 11621, 11621, 11621, 11621, 11621, 11621, 11621, 11621, 11705, 11705, 11789, 11874, 11958, 12042, 12126, 12211, 12295, 12379, 12463, 12632, 12716, 12800, 12968, 13137, 13305, 13474, 13642, 13811, 13979, 14147, 14316, 14484, 14653, 14737, 14737, 14737, 14737, 14737, 14737, 14737, 14737, 14737, 14653, 14484, 14316, 14147, 13979, 13726, 13558, 13305, 13137, 13053, 12884, 12800, 12884, 13053, 13221, 13389, 13558, 13726, 13895, 14147, 14316, 14484, 14653, 14821, 15074, 15411, 15747, 16084, 16421, 16674, 17011, 17347, 17347, 17347, 17347, 17347, 17095, 16842, 16589, 16337, 16084, 15747, 15579, 15326, 15242, 15242, 15242, 15242, 15495, 15747, 16084, 16337, 16674, 16926, 17179, 17432, 17600, 17684, 17768, 17937, 17937, 17937, 17937, 17937, 17937, 17937, 17937, 17937, 17937, 17937, 17937, 17937, 17937, 17937, 17937, 17937, 17600, 17263, 17011, 16674, 15832, 14821, 13642, 12968, 13558, 14484, 15326, 16084, 16505, 17011, 17516]
1923.542A7937%S2k53l37j68l37q42j011j178o74M21R26P58O74O73N90A7937
1797.815A8526M21K53M21K53k53l37Tl36j69j68j69j68q4Q4q4Q4K52A8526
1712.501A8779L37N89N90N05N89Q43J010%J937P495J9958K1052J3727H4211
1645.147F3158j1790k779l200l368l621O821j0610q5n89P58j348q4j68C2926
1577.794C8905%q000Q42P579J3306K1052J0527j0527j0526j5326n727C8063
1519.421C4611m211l368p58Q4m21k53L37N05N06L36%j68Q4k52M547J0526C1579
1438.596B1726n05l37n05m21j69q4Tj68m21n90n05Tj69q4j68j69%T8M21A7768
1227.555A8105N90J684K021J600K189L790M295M631L537Q4j010q4o74C8653
$$ y = [17937, 17937, 17937, 17937, 17937, 17937, 17937, 17937, 17937, 17937, 17937, 17937, 17937, 17684, 17347, 17179, 16842, 16000, 14989, 13811, 13137, 13558, 14484, 15242, 15916, 16589, 17179, 17937, 18526, 18947, 19200, 19621, 19874, 19621, 19284, 18947, 18611, 18442, 18274, 18105, 17937, 17853, 17937, 17853, 17937, 18189, 18526, 18779, 19116, 19705, 20295, 20800, 21389, 22232, 23242, 23242, 25179, 32674, 52632, 73684, 87411, 84211, 63158, 51368, 48589, 45389, 42021, 38400, 45221, 34611, 34526, 33937, 34695, 33347, 33263, 33095, 32926, 38905, 38905, 30905, 31747, 39326, 52632, 73684, 84211, 73684, 63158, 47832, 42105, 38063, 34611, 30400, 27032, 26274, 26358, 25937, 25684, 26021, 26526, 27032, 27368, 27368, 27200, 27284, 27032, 31579, 42105, 31579, 21726, 21221, 20884, 20379, 19958, 19789, 19705, 19621, 19453, 19032, 18442, 17937, 17432, 17263, 17179, 17011, 16842, 16842, 16842, 16842, 16842, 16842, 16842, 16842, 16842, 16842, 16842, 16842, 16842, 16842, 16842, 16842, 16842, 16842, 16842, 16842, 16842, 16842, 16842, 16842, 16842, 16842, 16842, 16842, 16842, 17263, 17768, 18105, 18695, 20379, 22400, 24000, 26189, 29979, 34274, 38905, 42442, 42526, 41516, 41432, 40758, 38653]
1160.202C5958k526k274j516j263j516j263n05j69m21k52K52M21K53B5516
1092.848B6105N90N89N90R26J011P57J179K358K695J347L706J1031J3390F3326
1025.495I0779J18989J49558J69263M81937m93558j80968j63453j28336C3684
980.594C3347n979m884j768q42j432j179o74n05Tn90n05m21n05Tl37A2379
904.262A1874k53q4Q4%T0q4Q4K53M21L37K52K53J68K53J68%Q5Q4TL37A4737
724.654A5158K53J68Q4T%S3K53J68J69K52Q43R26P58Q42J263J347R27B5095
589.949B8716M379L368M716Q337R684R853Q252J7432J05263o3158m9347G3937
531.577E5747j7600j4147l705l37k274j852n90k53n89k53K53M21TL37A5663
$$ y = [35958, 33432, 31158, 29642, 28379, 26863, 25600, 25095, 24926, 24505, 24253, 24505, 24926, 25179, 25516, 26105, 26695, 27284, 27874, 28800, 29811, 30568, 31747, 34105, 36800, 38147, 41853, 52884, 66274, 63326, 90779, 209768, 359326, 528589, 1010526, 516968, 336000, 172547, 44211, 33684, 33347, 27368, 22484, 20716, 19874, 18442, 17263, 16589, 16084, 15579, 14989, 14484, 14063, 13558, 13053, 12716, 12379, 11874, 11621, 11537, 11621, 11621, 11621, 11621, 11621, 11621, 11621, 11621, 11621, 11621, 11621, 11621, 11621, 11621, 11621, 11621, 11621, 11621, 11621, 11621, 11621, 11537, 11621, 11874, 12295, 12632, 12884, 13137, 13305, 13558, 13726, 13726, 13811, 13895, 13979, 14316, 14737, 15158, 15411, 15579, 15663, 15747, 15747, 15747, 15747, 15747, 15747, 15747, 15747, 15747, 15747, 15747, 15747, 15747, 15747, 16000, 16168, 16337, 16589, 17432, 18358, 19116, 19958, 21221, 22568, 23495, 25095, 28716, 33095, 36463, 41179, 49516, 59200, 69053, 77305, 94737, 200000, 136842, 87495, 73937, 55747, 38147, 24000, 20295, 19958, 17684, 15832, 15242, 14989, 14400, 14147, 14400, 14821, 15242, 15579, 15663]
459.734A5663Q4%J69Q4UL37VP58Q42TO74M21K52M969%n137j095j010A8189
356.46A7684l37m21Tj68j69k52j69%Xq4Q4O74P58N89Q43J431J600B2989
253.185B4758K695L115K779L116M379M716L874N136R264J0526R095I4063
194.813A09558J7010J7685J4821O400L621n895J5916K8800L5537K5347C07874
140.931C88295R4063E91411
$$ y = [15663, 15747, 15747, 15916, 16000, 16084, 16168, 16505, 16842, 17179, 17516, 18274, 19116, 19958, 20632, 21053, 21305, 26274, 26274, 21137, 20042, 19032, 18189, 17684, 17347, 16926, 16505, 16337, 16168, 15916, 15747, 15747, 15747, 15747, 15747, 15747, 15747, 15663, 15747, 16421, 17179, 17768, 18611, 20042, 21642, 22989, 24758, 27453, 30568, 33347, 36463, 40842, 45558, 49432, 54568, 63832, 74358, 83453, 94063, 109558, 126568, 144253, 159074, 165474, 169095, 163200, 179116, 207916, 243453, 268800, 307874, 388295, 482358, 591411]
127.46F56842  $$checkpoint
##END= $$ end of Raman
##END= $$ end of file