##TITLE= Tartrazin, 1.1944mg/100ml
##JCAMP-DX= 5.01
##DATA TYPE= UV/VIS SPECTRUM
##DATA CLASS= XYDATA
##ORIGIN= Converted from PECSS
##OWNER= public domain
##LONGDATE= 2012/03/11 16:02:51.0803 -0500 $$ export date from JSpecView
##$MANUFACTURER= na
##SPECTROMETER/DATA SYSTEM= PERKIN-ELMER 4444 UV
##RESOLUTION= 1.0000
##PATHLENGTH= 1
##XUNITS= NANOMETERS
##YUNITS= ABSORBANCE
##XFACTOR= 1
##YFACTOR= 5.247000E-07
##FIRSTX= 214
##FIRSTY= 2.548898E-01
##LASTX= 510
##NPOINTS= 297
##MINY= 6.090193E-03
##MAXY= 5.307902E-01
##XYDATA= (X++(Y..Y))
214 485782 443663 407261 376958 352563 333886 320545 311778 307014 305108 305870 308538
226 313303 319402 327406 336935 347989 361140 375624 392014 410311 430513 452811 477778
238.000096 505794 535525 567162 600133 634439 667982 700953 733162 763846 794721 826167
249.00012 857614 885820 908691 926415 940137 951382 962055 973680 984544 991595 991023
259.999848 981494 964151 942996 921650 900877 880865 860854 839318 816638 792434 767658
271.000056 742119 716581 690852 665123 639775 615380 590985 566209 541243 516467 490738 463484 435468
284.00008 408214 381532 355422 330455 306251 282428 259177 236688 215342 195521 177416
295.000104 161025 146160 132438 120812 110330 101372 93939 87650 81742 77168 73356 70307
307.000104 67448 65352 63636 62493 61540 61159 60968 61159 61731 62683 64018 65542 67639 70116 72784
321.999904 75834 79074 82504 86125 90128 94321 99085 104040 109186 114332 119668 125195 130722 136440 142348
336.99996 148256 154355 160263 166362 172651 179322 185992 193044 200286 207909 215723 223728 232304
349.999944 241262 250600 259939 269849 280141 291004 302439 314256 326644 339413 351992 364761
362.00004 377339 390109 403068 415647 428416 440804 453764 466914 479493 492643 505984
373.000064 519135 532285 545817 559539 573261 587364 601468 616143 630246 644349 657881 671603 685134
386.000088 698856 712960 726872 740213 753364 765942 777949 789766 800820 811683 822165
397.000088 832457 842558 852087 861426 870574 879912 888489 896874 905070 913074 920888 928512 935944
410.000112 943187 950238 957099 963389 969678 975967 981875 987212 992167 996360 999981 1003030 1005889 1008176
424.000096 1009891 1010844 1011607 1011607 1011225 1010463 1009320 1007795 1005698 1003411 1000553 997313 993882 989880 985115
438.999856 979970 974443 967772 960339 953097 944711 935373 924700 912693 899733 885630 870955
451.000136 855517 839508 823309 806918 790337 773756 756032 738879 721917 704765 687231 670078
462.999864 652354 635392 618620 601277 584124 566781 549819 532476 514942 497408 479684 461387
474.999888 442138 421936 401544 381342 360759 340366 319783 299581 279950 261273 243358
485.999888 225443 207719 190947 174747 159310 144444 130722 117381 105374 94130 83648
496.999912 74119 65542 57728 50677 44387 38670 33715 29140 25138 21517 18468 15990 13512
510A1607  $$checkpoint
##END=