##TITLE= Tartrazin, 1.1944mg/100ml
##JCAMP-DX= 5.01    $$ exported from JSpecView
##DATA TYPE= UV/VIS SPECTRUM
##DATA CLASS= XYDATA
##ORIGIN= Converted from PECSS
##OWNER= public domain
##LONGDATE= 2006/04/07 11:30:24.0513 -0500 
##$MANUFACTURER= na
##SPECTROMETER/DATA SYSTEM= PERKIN-ELMER 4444 UV
##RESOLUTION= 1.0000
##PATHLENGTH= 1
##XUNITS= NANOMETERS
##YUNITS= ABSORBANCE
##XFACTOR= 2.96E-4
##YFACTOR= 5.247E-7
##FIRSTX= 214
##FIRSTY= 0.25489
##LASTX= 510
##NPOINTS= 297
##XYDATA= (X++(Y..Y))
722973D85782m2119l6402l0303k4395j8677j3341q767m764j906P62K668M765O099C27406
773649C36935J1054J3151J4484J6390J8297K0202K2298K4967K8016K9731L1637F00133
817568F34439L3543L2971L2209L0684L0875L1446L1447K8206K2871J7724J3722I51382
861486I62055J1625J0864P051n72r529j7343k1155k1346k0773k0012k0011k1536H16638
908784G92434k4776k5539k5538k5729k5729k5348k4395k4395k4776k4966k4776D90738
952703D63484k8016k7254k6682k6110k4967k4204k3823k3251k2489k1346j9821A77416
996622A61025j4865j3722j1626j0482q958p433o289n908m574l812l049k859k096F3636
1047297F2493r53l81j91J91N72R52J335J524K097K477K668L050L240L430L621M003I4321
$$ y = [485782, 443663, 407261, 376958, 352563, 333886, 320545, 311778, 307014, 305108, 305870, 308538, 313303, 319402, 327406, 336935, 347989, 361140, 375624, 392014, 410311, 430513, 452811, 477778, 505794, 535525, 567162, 600133, 634439, 667982, 700953, 733162, 763846, 794721, 826167, 857614, 885820, 908691, 926415, 940137, 951382, 962055, 973680, 984544, 991595, 991023, 981494, 964151, 942996, 921650, 900877, 880865, 860854, 839318, 816638, 792434, 767658, 742119, 716581, 690852, 665123, 639775, 615380, 590985, 566209, 541243, 516467, 490738, 463484, 435468, 408214, 381532, 355422, 330455, 306251, 282428, 259177, 236688, 215342, 195521, 177416, 161025, 146160, 132438, 120812, 110330, 101372, 93939, 87650, 81742, 77168, 73356, 70307, 67448, 65352, 63636, 62493, 61540, 61159, 60968, 61159, 61731, 62683, 64018, 65542, 67639, 70116, 72784, 75834, 79074, 82504, 86125, 90128, 94321]
1108108I9085M955N146N146N336N527N527N718N908N908O099N908O099O289O671A85992
1162162A93044P242P623P814Q005Q576Q958R338R339R910J0292J0863J1435J1817C26644
1212838C39413J2579J2769J2578J2770J2959J2579J2769J2388J2960J3150J2579D92643
1256757E05984J3151J3150J3532J3722J3722J4103J4104J4675J4103J4103J3532F71603
1300676F85134J3722J4104J3912J3341J3151J2578J2007J1817J1054J0863J0482H32457
1344595H42558R529R339R148R338Q577Q385Q196Q004P814P624P432P243P051O861I63389
1398649I69678O289N908N337M955M193L621L049K859K287J715R53P63%l82p62j143A007795
1459459A005698k287k858l240l431m002m765n145n527o671p433p242q386r338j0673I12693
$$ y = [99085, 104040, 109186, 114332, 119668, 125195, 130722, 136440, 142348, 148256, 154355, 160263, 166362, 172651, 179322, 185992, 193044, 200286, 207909, 215723, 223728, 232304, 241262, 250600, 259939, 269849, 280141, 291004, 302439, 314256, 326644, 339413, 351992, 364761, 377339, 390109, 403068, 415647, 428416, 440804, 453764, 466914, 479493, 492643, 505984, 519135, 532285, 545817, 559539, 573261, 587364, 601468, 616143, 630246, 644349, 657881, 671603, 685134, 698856, 712960, 726872, 740213, 753364, 765942, 777949, 789766, 800820, 811683, 822165, 832457, 842558, 852087, 861426, 870574, 879912, 888489, 896874, 905070, 913074, 920888, 928512, 935944, 943187, 950238, 957099, 963389, 969678, 975967, 981875, 987212, 992167, 996360, 999981, 1003030, 1005889, 1008176, 1009891, 1010844, 1011607, 1011607, 1011225, 1010463, 1009320, 1007795, 1005698, 1003411, 1000553, 997313, 993882, 989880, 985115, 979970, 974443, 967772, 960339, 953097, 944711, 935373, 924700, 912693]
1513514H99733j4103j4675j5438j6009j6199j6391j6581j6581j7724j7153j6962G04765
1557432F87231j7153j7724j6962j6772j7343j7153j7343j6962j7343j7534j7534D79684
1601351D61387j9249k0202k0392k0202k0583k0393k0583k0202j9631j8677j7915B25443
1645270B07719j6772j6200j5437j4866j3722j3341j2007j1244j0482r529q577p814E0677
1692568D4387n717m955m575m002l621l049k478A3512
$$ y = [899733, 885630, 870955, 855517, 839508, 823309, 806918, 790337, 773756, 756032, 738879, 721917, 704765, 687231, 670078, 652354, 635392, 618620, 601277, 584124, 566781, 549819, 532476, 514942, 497408, 479684, 461387, 442138, 421936, 401544, 381342, 360759, 340366, 319783, 299581, 279950, 261273, 243358, 225443, 207719, 190947, 174747, 159310, 144444, 130722, 117381, 105374, 94130, 83648, 74119, 65542, 57728, 50677, 44387, 38670, 33715, 29140, 25138, 21517, 18468, 15990, 13512]
1722973A1607  $$checkpoint
##END=