##TITLE=Imported from UXNMR. $$ Begin of the data block
##JCAMP-DX=5.00 $$ ACD/DocManager Library v 5.00
##DATE=15 Sep 2005 21:56:16 
##DATA TYPE=NMR SPECTRUM
##DATA CLASS=NTUPLES
##ORIGIN=  Dept of Chemistry, UWI, Mona, Jamaica
##OWNER=  public domain
##.OBSERVE FREQUENCY=50.329
##.ACQUISITION TIME=2.608
##.ZERO FILL=0
##$$.SHIFT REFERENCE=INTERNAL,  ,1, -4.8001
##.OBSERVE NUCLEUS=^13C
##.ACQUISITION MODE=SIMULTANEOUS
##SPECTROMETER/DATA SYSTEM=Bruker AVANCE
##SOLVENT NAME=CHLOROFORM-D
##$MODELS=
<Models>
 <ModelData id="acetophenone" type="MOL">
acetophenone
  DSViewer          3D                             0

 17 17  0  0  0  0  0  0  0  0999 V2000
   -1.6931    0.0078    0.0000 C   0  0  0  0  0  0  0  0  0  1
   -0.2141    0.0078    0.0000 C   0  0  0  0  0  0  0  0  0  2
    2.5839    0.0872    0.0000 C   0  0  0  0  0  0  0  0  0  3
    0.4615    1.2373   -0.0005 C   0  0  0  0  0  0  0  0  0  4
    0.5257   -1.1809    0.0001 C   0  0  0  0  0  0  0  0  0  5
    1.9188   -1.1393    0.0005 C   0  0  0  0  0  0  0  0  0  6
    1.8539    1.2756   -0.0001 C   0  0  0  0  0  0  0  0  0  7
   -0.1262    2.1703   -0.0009 H   0  0  0  0  0  0  0  0  0  8
    0.0144   -2.1556    0.0002 H   0  0  0  0  0  0  0  0  0  9
    2.4947   -2.0764    0.0009 H   0  0  0  0  0  0  0  0  0 10
    2.3756    2.2439   -0.0001 H   0  0  0  0  0  0  0  0  0 11
    3.6838    0.1161    0.0003 H   0  0  0  0  0  0  0  0  0 12
   -2.3403    1.0639    0.0008 O   0  0  0  0  0  0  0  0  0 13
   -2.3832   -1.3197   -0.0010 C   0  0  0  0  0  0  0  0  0 14
   -2.0973   -1.8988    0.9105 H   0  0  0  0  0  0  0  0  0 15
   -2.0899   -1.9018   -0.9082 H   0  0  0  0  0  0  0  0  0 16
   -3.4920   -1.1799   -0.0059 H   0  0  0  0  0  0  0  0  0 17
  1  2  1  0  0  0
  2  5  4  0  0  0
  2  4  4  0  0  0
  3 12  1  0  0  0
  4  7  4  0  0  0
  5  6  4  0  0  0
  6 10  1  0  0  0
  6  3  4  0  0  0
  7  3  4  0  0  0
  7 11  1  0  0  0
  8  4  1  0  0  0
  9  5  1  0  0  0
 13  1  2  0  0  0
 14 16  1  0  0  0
 14  1  1  0  0  0
 14 15  1  0  0  0
 17 14  1  0  0  0
M  END
  </ModelData>
</Models>
##$PEAK_LINKS=
<PeakList type="13CNMR" xUnits="ppm" yUnits="arbitrary units" >
<Peak id="1" title="methyl group ~27" peakShape="singlet" model="acetophenone" atoms="14" xMax="28" xMin="26"  yMax="10000" yMin="0" />
<Peak id="2" title="C3,C5 aromatic ~128" peakShape="multiplet" model="acetophenone"  atoms="6,7" xMax="129" xMin="127"  yMax="10000" yMin="0" />
<Peak id="3" title="C2,C6 aromatic ~129" peakShape="multiplet" model="acetophenone" atoms="4,5" xMax="130" xMin="128"  yMax="10000" yMin="0" />
<Peak id="4" title="C4 aromatic ~133" peakShape="multiplet" model="acetophenone" atoms="3" xMax="134" xMin="132"  yMax="10000" yMin="0" />
<Peak id="5" title="C1 aromatic ~137" peakShape="multiplet" model="acetophenone" atoms="2" xMax="134" xMin="132"  yMax="10000" yMin="0" />
<Peak id="6" title="carbonyl ~200" peakShape="multiplet" model="acetophenone" atoms="1" xMax="134" xMin="132"  yMax="10000" yMin="0" />
</PeakList>
##NTUPLES=NMR SPECTRUM
##VAR_NAME=       FREQUENCY,     SPECTRUM/REAL, SPECTRUM/IMAG
##SYMBOL=         X,             R,             I,             N
##VAR_TYPE=       INDEPENDENT,   DEPENDENT,     DEPENDENT,     PAGE
##VAR_FORM=       AFFN,          ASDF,          ASDF,          AFFN
##VAR_DIM=        32768,         32768,         32768,         2
##UNITS=          HZ,            ARBITRARY UNITS,ARBITRARY UNITS
##FIRST=          12321.22949219,1228534.12500,500291.81250000,1
##LAST=           -241.58496094, 1251661.62500000,7704493.50000000,2
##MIN=            -241.58496094, -37451500.000,-3201867520.00000000,1
##MAX=            12321.22949219,2678036479.99999968,1252630656.00000000,2
##FACTOR=         1.0000000000,  83688.64062500,100058.3593750000,1
##PAGE=N=1
##DATA TABLE=(X++(R..R)),  XYDATA
$$ [...]
$$ plain form
11233.2 60 10 -79 66 13 -40 67 -49 -47 -51 2 -70 33 -56 19 -37 -34 -15 -1 62 53 101 21 -37 -12 -85 -40 -33 34 7 4 -10 74
11220.9 74 21 -34 18 -90 90 51 60 -66 9 5 58 -88 20 -25 -18 23 15 20 6 -18 -69 33 -3 43 -66 -72 -81 57 -142 -79
11209.4 -79 24 -49 -15 21 -78 -27 6 -74 58 15 -95 51 27 77 73 -2 -92 15 28 104 6 -23 9 -29 -3 5 10 -2 132
11198.3 132 -137 -17 -45 71 17 51 -61 53 -37 3 -43 -56 7 -28 42 26 -26 -77 -105 -64 -80 48 4 8 -52 -28 -4 30
11187.5 30 70 -9 48 -14 -47 25 66 -58 2 0 3 55 -4 46 -22 -19 20 -12 -69 -91 -49 78 -42 -5 -7 -71 11 10 10 75 -7 -148
11175.2 -148 18 60 -13 -31 40 40 -19 -18 -58 -26 17 -34 -98 30 9 35 -13 88 85 -88 7 5 -32 -52 -56 0 35 -28 -67 16 145
11163.3 145 28 -27 3 -1 4 -72 -47 -66 2 30 -18 54 -23 -88 -13 43 -68 74 -13 -48 -32 11 -27 -31 42 -66 12 16 41 8
11151.8 8 1 9 -3 104 -16 13 45 6 -47 -39 -13 -57 14 9 -32 -54 -41 79 45 49 -61 -9 -16 142 -52 -33 28 28 76 -63 44
$$ packed form
11233.2F0n0q9J45n3TJ07j16KmN3p2J03q9P5n6LJ9J4O3rM8q0n8K5p3M5PO7k7lj4Q4
11220.9G4n3n5N2j08J80l9Rj26P5mN3j46J08m5PM1qNj4k4n1J02l6M6j09orJ38j99O3
11209.4g9J03p3L4L6r9N1L3q0J32m3j10J46k4N0mp5r0J07J3P6r8k9L2l8K6QNj2J34
11198.3A32k69J20k8J16n4L4j12J14r0M0m6j3O3l5P0j6n2n1k8M1j6J28m4Mo0K4TL4
11187.5C0M0p9N7o2l3P2M1j24O0kLN2n9N0o8LL9l2n7k2M2J27j20L7ko4Q2j%O5q2j41
11175.2a48J66M2p3j8P1%n9Jm0L2M3n1o4J28k1K6m8J01lj73R5kl7k0mN6L5o3l9Q3J29
11163.3A45j17n5L0mNp6K5j9O8K8m8P2p7o5P5N6j11J42q7l5J6M3l8mP3j08P8MK5l3
11151.8HpQj2J07j20K9L2l9n3QK6m4P1nm1k2J3J20l4Mj10N2pJ58j94J9O1%M8j39J07
$$ plain form
11139.9 44 -28 -4 -15 56 38 -13 -99 -77 -1 41 -83 -25 4 -43 -95 -116 66 13 -103 18 -55 -19 10 16 53 18 13 -55 -17 -19
11128.4 -19 -29 -50 -5 -5 78 44 -25 -27 59 66 13 45 -10 -60 17 12 -16 -28 22 119 -44 -48 -66 -119 -24 -61 -106 -13 138 -67 75
11116.5 75 75 15 -34 26 8 60 30 14 -15 -27 -118 -3 30 -93 -52 14 17 -21 -25 -24 29 28 51 -57 -97 5 -29 75 40 -18 5
11104.6 5 -39 88 -24 -31 18 30 0 14 -17 -1 -2 20 3 61 -8 43 -85 -11 -70 25 -85 -16 -40 -101 -38 -68 -32 -10 -114 -52
11093.1 -52 81 57 105 -45 -32 -86 -101 -44 -8 -34 23 -30 -52 -35 -36 -24 -66 52 66 90 5 25 -37 -46 -22 -4 -88 -46 -11 19
11081.6 19 -92 -17 -31 -44 -14 41 59 -61 -58 62 -79 -32 19 -103 -57 -8 -31 40 51 -80 -21 47 -83 -56 -7 45 -59
11071.2 -59 -35 -36 -56 -82 30 14 30 -22 59 -28 -58 37 -2 14 20 -7 -77 17 -46 -46 -8 -43 -3 -74 -42 -30 34 72 60 41 -11 -47
11058.9 -47 -54 4 40 -78 -31 -71 -41 28 35 -57 -121 -35 -50 65 -59 -41 38 13 -15 -6 -7 -84 11 18 -119 18 -80 -6 77 73 -6
$$ packed form
11139.9D4p2K4j1P1j8n1q6K2P6M2j24N8K9m7n2k1J82n3j16J21p3L6K9OL7l5no8L8k
11128.4a9j0k1M5%Q3l4o9kQ6Pn3L2n5n0P7nk8j2N0R7j63mj8n3R5l7m5R3J51k05J42
11116.5G5%o0m9O0j8N2l0j6k9j2r1J15L3j23M1O6Ll8mJN3jK3j08m0J02l4J04l5n8K3
11104.6Em4J27j12pM9J2l0J4l1J6jK2j7N8o9N1j28P4n9R5j10O9k4o1O3l0L6K2j04O2
11093.1e2J33k4M8j50J3n4j5N7L6k6N7n3k2J7jJ2m2J18J4K4q5K0o2rK4J8q4M2L5L0
11081.6A9j11P5j4j3L0N5J8j20LJ20j41M7N1j22M6M9k3P1J1j31N9O8j30K7M9N2j04
11071.2e9K4jk0k6J12j6J6n2Q1q7l0R5l9J6Ok7p0R4o3%L8l5M0p1L2J2O4L8j2j9n2l6
11058.9d7pN8L6j18M7m0L0O9Pr2o4Q6j5J15j24J8P9k5k8Rjp7R5Pj37J37r8P4Q3mp9
$$ plain form
11047 -6 9 40 10 2 -83 -49 -48 34 39 -87 33 57 -2 -123 2 -56 -17 -47 -58 -16 -44 3 40 29 38 23 -6 37 -109 -28 -44 -102
11034.8 -102 -30 -85 23 10 -56 -9 29 11 -35 54 26 55 -97 -28 -11 -62 -90 -9 -119 -103 64 -35 17 55 -2 -18 148 27
11024 27 -34 -39 -4 -34 -40 92 29 18 62 -88 91 -44 -52 -39 12 25 -76 -24 -36 8 -62 -32 -92 -10 -57 -27 -6 -46 -75 -68 -49
11012.1 -49 -51 8 -78 -70 -9 -31 -9 -6 66 44 -37 29 6 -57 -80 -37 -39 55 132 51 -99 62 -71 -33 0 11 -20 -74 46 17 -28
11000.2 -28 -60 39 71 11 -114 62 -31 -57 99 -7 -65 -86 4 7 -88 44 -3 29 88 28 -108 21 -21 -26 53 19 86 126
10989.5 126 -18 63 -54 -55 -11 -32 -52 30 -7 7 52 36 -15 0 -115 -43 -21 -55 -24 -67 18 17 -75 -49 -8 1 47 -54 27 -92
10978 -92 10 26 28 -7 -106 -51 28 -17 44 -22 -53 -33 1 -167 -68 18 -24 -2 -32 -27 -59 -5 -4 -27 -10 45 20 18 28 -16 -86 -6 -57
10965.3 -57 -9 -50 26 -36 -6 18 61 -36 13 58 -67 53 -57 -76 157 -50 -70 -71 19 128 -36 -9 -30 -141 43 -122
$$ packed form
11047fJ5L1l0qq5L4JQ2Nj26J20K4n9j21J25n8L9l0j1M2k8M7L7j1Rj5k9M3j46Q1j6n8
11034.8a02P2n5J08j3o6M7L8j8m6Q9k8K9j52O9J7n1k8Q1j10J6J67r9N2L8n7j6J66j21
11024B7o1nL5l0oJ32o3j1M4j50J79j35qJ3N1J3j01N2j2M4p0L0o0Q2m7L0K1m0k9PJ9
11012.1d9kN9q6QO1k2K2LP2k2q1O6k3o3k3M3kR4P7q1j50J61j33L8L3J1l1n4J20k9m5
11000.2b8l2R9L2o0j25J76r3k6J56j06n8k1R0Lr5J32m7L2N9o0j36J29m2nP9l4O7M0
10989.5A26j44Q1j17jM4k1k0Q2l7J4M5j6n1J5j15P2K2l4L1m3Q5jr2K6M1RM6j01Q1j19
10978i2J02J6Kl5r9N5P9m5O1o6l1K0L4j68R9Q6m2K2l0Nl2N4Jk3J7N5k5kJ0m4p0Q0n1
10965.3e7M8m1P6o2L0K4M3r7M9M5j25J20j10j9K33k07k0jR0J09j64K7k1j11J84j65
$$ plain form
10955.3 -122 54 80 -56 13 38 53 30 1 -43 -90 -17 69 -14 -8 9 24 -77 17 -23 25 -72 -18 11 36 -14 -7 -15 48 -37 15
10943.8 15 -6 47 -8 -132 -19 -68 -13 -26 -57 84 -38 16 31 -16 37 -18 99 -36 98 -10 -43 -16 -5 -44 -54 59
10933.8 59 123 -92 61 37 84 22 -38 15 -2 -24 10 -64 -40 -82 50 -63 -4 -22 -24 13 11 -127 58 -26 48 45 -69 -70 35
10922.7 35 -85 -40 140 -2 -8 32 37 8 -7 19 33 63 -71 7 -44 -26 -45 -30 -80 -3 -2 88 15 -86 65 -4 -54 -7 -18
10911.6 -18 61 -9 -16 -88 13 53 -8 34 -79 -96 50 -103 -48 8 -20 -126 48 15 53 -18 29 60 -9 -91 -20 -14 78 -28
10900.8 -28 -34 -34 10 55 -194 -83 -92 -65 -20 52 -39 -70 12 -1 -114 19 -5 -53 17 -148 41 -8 50 -21 31 -46 -41 35 -42 69
10889.3 69 -3 -21 -67 9 -114 -26 -115 -27 -41 16 -5 13 20 -72 -23 -104 36 -28 -52 -13 1 60 -1 24 -37 -140 -66 -40 -52 -95
10877.8 -95 -26 49 -79 55 -42 -37 -26 -37 -44 61 -63 44 46 10 -55 9 -11 -2 -88 65 108 -8 52 -42 110 -7 142 37
$$ packed form
10955.3a22J76K6j36O9K5J5k3k9m4m7P3Q6q3OJ7J5j01R4m0M8r7N4K9K5n0PqO3q5N2
10943.8A5k1N3n5j24J13m9N5j3l1J41j22N4J5m7N3n5J17j35J34j08l3K7J1l9j0J13
10933.8E9O4k15J53k4M7o2o0N3j7k2L4p4K4m2J32j13N9j8kL7kj38J85q4P4lj14jJ05
10922.7C5j20M5J80j42oM0Nk9j5K6J4L0j34P8n1J8j9J5n0P7JR0p3j01J51o9n0M7j1
10911.6a8P9p0pp2J01M0o1M2j13j7J46j53N5N6k8j06J74l3L8p1M7L1o9q2P1OR2j06
10900.8b8o%M4M5k49J11rK7M5P2r1l1Q2j3j13J33k4m8P0j65J89m9N8p1N2p7NP6p7J11
10889.3F9p2j8m6P6j23Q8q9Q8j4N7k1J8Pr2M9q1J40o4k4L9J4N9o1K5o1j03P4K6j2m3
10877.8i5O9P5j28J34r7NJ1j1pJ05j24J07Kl6o5O4k0Rq6J53M3j16O0r4J52j17J49j05
$$ plain form
10867.1 37 49 86 95 -40 -13 20 -72 -45 -84 100 -43 4 -23 60 31 2 -30 -57 29 -33 -14 64 -3 -94 -76 -30 -40 9 -29 -48
10855.5 -48 24 -37 -28 15 -67 -25 -3 -28 -78 0 -52 -45 -18 23 -18 -22 -10 -121 43 -29 -21 -28 -37 -19 7 99 -1 -56 -27 -14 -67 -2
10843.3 -2 -48 17 -61 -24 -24 7 -8 91 34 62 7 34 28 125 74 -73 32 -53 -38 16 -91 -16 -104 -33 26 -68 -16 -9 60 -127 33
10831.4 33 -8 -35 1 12 20 -77 -23 -34 -35 -8 -21 -48 6 -9 30 -39 35 -63 52 38 -5 97 -83 53 5 -11 7 44 -103
10820.2 -103 -23 -55 15 -19 -9 1 49 46 -47 89 34 -41 49 25 -72 -36 6 -91 -20 -69 33 118 56 9 77 13 -26 3 -93 -13
10808.7 -13 -31 6 -15 -44 95 53 40 -32 -21 75 19 44 -19 39 -59 47 -36 -42 27 23 25 -3 -5 30 -19 16 -27 -46 10 -49 34 -48
10796.4 -48 44 9 4 86 55 17 15 -16 -23 6 -108 -33 5 21 -19 -61 77 78 -41 -15 -49 -106 36 60 -67 -9 11 37 71 -52
10784.9 -52 -23 19 10 23 114 -30 -20 -32 37 -106 94 -96 -30 -37 -4 112 -63 -16 52 56 -7 -10 30 -64 103 -36 -44 -52 -61 44
$$ packed form
10867.1C7J2L7Rj35K7L3r2K7l9J84j43M7k7Q3k9Tl2k7Q6o2J9P8o7r1J8M6j0M9l8j9
10855.5d8P2o1RM3q2M2K2k5n0P8n2PK7M1m1mJ2j11J64p2QprJ8K6R2j00n5K9J3n3O5
10843.3bm6O5p8L7%L1j5R9n7K8n5K7oR7n1j47J05q5J5N4j07P5q8P1N9r4N2PO9j87J60
10831.4C3m1k7L6J1Qr7N4j1jK7j3k7N4j5L9o9P4r8J15j4m3J02j80J36m8j6J8L7j47
10820.2a03Q0l2P0l4J0TM8lr3J36n5p5R0k4r7L6M2r7P1m9J02Q5o2m7O8o4l9K9r6Q0
10808.7a3j8L7k1k9J39m2j3p2J1R6n6K5o3N8r8J06q3oO9mKk8kL5m9L5m3j9N6n9Q3q2
10796.4d8R2l5nQ2l1l8kl1pK9j14P5L8J6m0m2J38Jj19K6l4n7J42K4j27N8K0K6L4j23
10784.9e2K9M2rJ3R1j44J0j2O9j43K00j90O6pL3J16j75M7O8Mo3lM0r4J67j39qTrJ05
$$ plain form
10773.4 44 19 -38 -7 -11 -8 -55 56 -86 -48 -11 -75 45 -28 -4 36 7 -21 -2 -22 47 62 -101 8 42 7 -25 46 9 -53
10762.3 -53 2 0 28 -51 78 -38 32 -43 64 33 -98 21 -94 -99 24 -78 85 38 86 70 -9 59 11 -62 -3 32 -20
10751.9 -20 -73 -31 88 46 21 20 13 -16 9 -31 -2 4 -9 88 -19 -39 -61 -33 -74 -130 3 -20 11 13 2 14 46 11 -72 38 -44
10740 -44 -52 -15 -13 -2 5 10 -59 6 20 38 14 69 -93 -56 -51 -52 17 -82 -16 -92 -8 -2 -23 -33 93 -86 24 -24 -50 -28 33 19 -107
10727.4 -107 65 -4 -132 2 16 45 25 -16 72 -10 -101 -57 26 -112 20 1 53 -80 39 14 70 36 -41 -63 13 -10 75
10717 75 59 -83 -25 26 -46 -28 -16 -36 -91 0 -21 -41 -61 -5 16 -55 -60 47 42 -36 -60 21 11 -21 -166 53 -72 -38 41 -6 -43
10705.1 -43 -4 -38 26 13 -61 46 -36 91 -69 -114 -99 78 17 -34 22 -8 -11 21 15 -31 0 -4 -54 -25 41 8 -125 11 -136
10694 -136 -46 -72 -6 27 -21 41 -8 55 3 -33 24 135 -22 30 55 62 8 -64 37 -5 -140 5 94 -15 2 -69 44 -15
$$ packed form
10773.4D4k5n7L1mLm7J11j42L8L7o4J20p3K4M0k9k8J9k0O9J5j63J09L4l5l2P1l7o2
10762.3e3N5kK8p9J29j16P0p5J07l1j31J19j15nJ23j02J63m7M8j6p9O8m8p3N9L5n2
10751.9b0n3M2J19m2k5jpk9K5m0K9Oj3R7j07k0k2K8m1n6J33k3L1Kj1J2L2l5q3J10q2
10740d4qL7KJ1PNo9O5J4J8k4N5j62L7NjO9r9O6p6Q4Ok1j0J26j79J10m8k6K2O1j4j26
10727.4a07J72o9j28J34J4K9k0m1Q8q2r1M4Q3j38J32j9N2j33J19k5N6l4p7k2P6k3Q5
10717G5j6j42N8N1p2J8J2k0n5R1k1k0TN6K1p1nJ07np8k4Q1j0l2j45K19j25L4P9m7l7
10705.1d3L9l4O4j3p4J07q2J27j60m5J5J77o1n1N6l0lL2om6L1mn0K9O6l3j33J36j47
10694a36R0k6O6L3m8O2m9O3n2l6N7J11j57N2K5Pn4p2J01m2j35J45Q9j09J7p1J13n9
$$ plain form
10683.2 -15 42 27 21 3 -14 36 -20 26 102 -5 -59 88 18 -90 24 -5 -34 -35 45 91 -57 -16 -51 -60 -40 137 65 -33 33 -35
10671.7 -35 -93 -22 61 18 51 -100 15 -51 23 -33 41 94 4 13 -69 -17 -42 28 -8 56 18 -6 27 28 61 92 -71 12 -13 46
10660.2 46 -95 -72 -45 44 -95 36 -67 -45 88 -100 -142 67 -5 -95 -77 -41 64 42 116 -36 -28 -2 -25 -94 -64 -17 10
10649.8 10 -44 -54 36 -108 -1 75 39 2 -71 -27 -139 11 68 -100 30 10 33 -1 98 19 -26 -165 -18 82 -10 4
10639.8 4 19 49 -38 43 -49 65 -14 52 26 -41 -24 3 -67 -38 -99 25 -23 -16 3 1 -28 6 -7 50 -89 43 -14 -36 55 42
10628.3 42 -22 -82 -33 -38 30 33 10 131 -34 32 59 10 29 -73 27 79 -75 -17 -52 -51 -5 41 -7 -48 36 -109 -35 -136 -30
10617.2 -30 61 48 127 -23 87 8 -37 -4 39 16 5 -37 -20 -115 -59 -9 -6 -37 3 12 12 44 35 82 -9 -4 -59 -13 -24 -38 -30 -89 48
10604.5 48 14 62 -18 -104 -75 95 -7 -64 67 46 18 -24 -12 80 40 -17 -54 -82 -105 -17 -9 -31 13 22 -2 24 -127 -48 -6 89
$$ packed form
10683.2a5N7j5oj8j7N0n6M6P6j07n4J47p0j08J14k9TjQ0M6j48M1l5rK0J77p2r8O6o8
10671.7c5n8P1Q3m3L3j51J15o6P4n6P4N3r0Rq2N2k5P0l6O4l8k4L3JL3L1j63Q3k5N9
10660.2D6j41K3K7Q9j39J31j03K2J33j88m2K09p2r0J8L6J05k2P4j52QK6k3o9L0M7K7
10649.8A0n4j0R0j44J07P6l6l7p3M4j12J50N7j68J30k0K3l4R9p9m5j39J47J00r2J4
10639.8DJ5L0q7Q1r2J14p9O6k6o7J7K7p0K9o1J24m8PJ9kk9L4j3N7j39J32n7k2R1j3
10628.3D2o4o0M9nO8Lk3J21j65O6K7m9J9j02J00N2j54N8l5JM6Tm8m1Q4j45P4j01J06
10617.2c0R1j3P9j50J10p9m5L3M3k3j1m2J7r5N6N0Ll1M0R%L2rM7r1Nn5M6j1j4Qn9J37
10604.5D8l4M8q0q6K9J70j02n7J31k1k8m2J2R2m0n7l7k8k3Q8Qk2M4Rk4K6j51P9M2R5
$$ plain form
10593 89 43 36 11 -30 62 -18 -45 -120 43 13 59 -93 14 58 -42 81 -77 36 -70 -65 -35 -133 25 -82 63 39 -75
10582.7 -75 -124 -1 -9 27 -14 54 8 -32 -73 -34 -38 62 -1 -17 -20 13 70 28 -62 95 3 -69 -108 -7 10 -3 5 54 -76 -66
10571.2 -66 -23 71 -12 -31 76 -22 -42 -6 45 18 20 -62 -63 -67 -38 -85 -59 -57 -5 27 -32 -89 64 -35 2 87 -75 -34 26 34 5 -7
10558.9 -7 17 59 -79 62 37 85 40 -6 -67 -10 40 40 -53 42 -104 -56 -52 -11 89 14 -1 -61 -72 -32 -73 -76 32 0 18 -82
10547.4 -82 39 -87 -5 14 -31 -51 37 -21 -48 -15 109 -71 -5 48 -19 27 7 -41 -21 47 14 13 7 -15 -28 -164 -53 -17 -26
10536.2 -26 -93 14 -57 -40 51 28 -91 107 -24 -146 32 -1 6 -72 -7 -21 57 -67 9 -69 -15 -37 91 11 10 3 -32 63
10525.5 63 -61 -25 -53 -5 58 -102 20 25 -28 21 26 -10 121 -2 59 -4 52 103 13 17 -3 24 9 0 -16 66 -22 7 -10 -34
10514 -34 -4 37 49 -19 18 -25 35 -44 -58 -40 -51 34 24 59 125 38 -9 21 -5 -78 0 -76 79 -17 29 -47 46 -44 -157 -33
$$ packed form
10593H9m6pk5m1R2q0k7p5J63l0M6j52J07M4j00J23j58J13j06NL0r8J58j07J45k4j14
10582.7g5m9J23qL6m1O8m6m0m1L9mJ00o3j6lL3N7m2r0J57r2p2l9J01J7j3QM9j30J0
10571.2f6M3R4q3j9J07r8k0L6N1k7Kq2jmK9m7K6KN2L2n9n7J53r9L7Q5j62M1O0Qk9j2
10558.9gK4M2j38J41k5M8m5m6o1N7N0%r3R5j46M8MM1J00p5j5o0j1M0m1lJ08l2J8j00
10547.4h2J21j26Q2J9m5k0Q8n8k7L3J24j80O6N3o7M6k0m8K0O8l3jok2j3j36J11L6r
10536.2b6o7J07p1J7R1k3j19J98j31j22J78l3Pp8O5j4P8j24P6p8N4k2J28q0jpl5R5
10525.5F3j24L6k8M8O3j60J22Nn3M9Nl6J31j23O1o3N6N1r0Mk0K7j5rj6Q2q8K9j7k4
10514c4L0M1J2o8L7m3O0p9j4J8j1Q5j0L5O6q7m7L0k6p3P8p6J55r6M6p6R3r0j13J24
$$ plain form
10502.5 -33 -24 87 -65 -6 -36 28 -25 -64 -29 77 -75 0 -43 -2 56 -7 27 -96 36 66 53 -17 22 33 -48 -44 -37 33 47
10491.3 47 -38 -12 -31 -17 19 53 -57 12 -116 59 58 -97 69 -39 37 -1 -86 -119 6 5 -5 -42 -163 -20 -94 37 42
10481 42 -30 -41 70 -38 -59 4 -10 -89 34 -7 -2 -14 63 -50 -64 38 44 -60 -34 -56 34 -8 53 37 58 22 -46 -17 -62 -25
10469.4 -25 27 4 3 -3 -40 -18 -42 -52 90 63 43 -58 -77 5 44 -15 135 58 -97 103 -81 -37 3 -31 -132 37 -4 -4
10458.7 -4 -31 39 7 -51 -33 -3 41 -3 -71 27 -30 -33 -42 -7 -2 69 30 3 -29 42 -30 33 -104 78 -36 -65 -71 -33 123 22 -3
10446.8 -3 -49 -16 48 87 -34 77 44 -38 -19 18 -18 -37 -70 21 -21 40 -90 -2 -84 -88 46 -53 -51 -17 38 9 60 -42 25 -14
10435.3 -14 -115 11 -62 95 -97 23 17 -56 -41 -62 -27 -32 -14 43 68 24 27 0 -134 13 -35 -27 98 26 55 57 -24 37 -1
10424.2 -1 -82 42 -42 -115 106 13 0 18 41 -134 18 -6 49 1 -22 10 38 -13 -38 -39 40 -132 -40 -42 -36 38 7 81 21 -2
$$ packed form
10502.5c3RJ11j52N9l0O4n3l9L5J06j52P5m3M1N8o3L4j23J32L0j3p0L9J1q1MPP0J4
10491.3D7q5K6j9J4L6L4j10O9j28J75jj55J66j08P6l8q5l3J25jj0l7j21J43p4J31N
10481D2p2j1J11j08k1O3j4p9J23m1Nj2P7j13j4J02Oj04K6k2R0m2O1j6K1l6o8K9m5L7
10469.4b5N2k3jol7K2k4j0J42k7k0j01j9Q2L9n9J50p7j55K00j84M4M0l4j01J69m1%
10458.7dk7P0l2n8J8L0M4m4o8R8n7lrL5NP1l9k7l2P1p2O3j37J82j14k9oL8J56j01k5
10446.8cm6L3O4L9j21J11l3q2J9L7l6j9l3R1m2O1j30Q8q2mJ34r9KL4N5k9N1j02O7l9
10435.3a4j01J26p3J57j92J20op3J5k1L5nJ8N7K5m4Lk7j34J47m8QJ25p2K9Kq1O1l8
10424.2aq1J24q4p3K21r3j3J8K3j75J52k4N5m8k3L2K8n1k5jP9j72R2kOP4l1P4o0k3
$$ plain form
10412.6 -2 22 30 71 66 -22 -73 65 -132 -100 133 -4 56 37 14 -6 38 -4 -20 12 -79 -23 9 -94 97 -75 97 -85 -75
10401.9 -75 32 -29 -125 3 -31 -103 -14 -71 14 -66 -17 -122 36 32 8 -71 31 -65 11 -71 4 60 33 -42 -25 -31 -6 9 59
10390.8 59 -75 18 25 34 -133 -38 27 -152 -116 -10 30 -69 12 105 -121 25 14 -94 -32 -53 -48 15 -43 -27 3 10 -37 -2 63
10379.6 63 -111 50 24 -29 43 -40 -45 -21 12 -16 -38 -86 50 15 -40 -43 -81 56 9 17 -88 -33 -16 -29 -36 76 54 92 37 -17
10368.1 -17 -97 -94 132 -45 -32 -15 37 -52 -9 -44 91 -59 58 35 -4 -9 -52 -6 9 -58 149 -7 37 73 -44 -39 -2 41
10357.4 41 -22 -29 -6 16 10 50 -101 8 -121 26 -87 -20 37 -26 -27 47 -34 -14 76 127 -121 -10 -20 -62 -48 -31 38 62 72
10346.3 72 17 -138 50 6 15 -3 3 21 20 16 -17 -57 -25 -53 23 77 39 9 -21 -17 57 44 -170 -5 -114 -2 31 11 22 -84
10334.7 -84 10 -32 -98 19 -68 -49 5 7 -22 -29 25 -59 38 48 -4 72 68 22 -10 41 -82 -96 60 7 -20 73 -12 -29 -23 52 -112
$$ packed form
10412.6bK4QM1nq8n1J38j97L2K33j37O0j9k3k0M4m2j6L2r1N6L2j03J91j72J72j82J0
10401.9g5J07o1r6J28l4p2Q9n7Q5q0M9j05J58mk4p9J02r6P6q2P5N6k7p5J7oK5J5N0
10390.8E9j34R3PRj67R5O5j79L6J06M0r9Q1R3k26J46j1j08O2k1NO3n8J6L0Pm7L5O5
10379.6F3j74J61k6n3P2q3nK4L3k8k2m8J36l5n5ll8J37m7Qj05N5J7j3pJ12k2L8n5n4
10368.1a7q0LK26j77J3J7N2q9M3l5J35j50J17k3l9nm3M6J5o7K07j56M4L6j17NL7M3
10357.4D1o3pK3K2oM0j51J09j29J47j13O7N7o3jP4q1K0R0N1k48J11j0m2J4J7O9K4J0
10346.3G2n5j55J88m4Rj8OJ8jml3m0L2k8P6N4l8l0TMP4j3k14J65j09J12L3k0J1j06
10334.7h4R4m2o6J17q7J9N4Kk9pN4q4R7J0n2P6mm6l2N1j23j4J56n3k7R3q5j7OP5j64
$$ plain form
10322.8 -112 -7 -23 -8 17 -52 119 -79 4 -9 -68 42 134 -7 -21 -32 -93 74 32 -36 43 -3 10 43 -43 11 -11 -27
10312.5 -27 -66 -17 -26 36 25 13 -10 -73 -7 -38 2 -64 -25 97 -51 -18 8 -58 -86 41 54 -105 50 -44 -63 -46 -15 -2 -87
10301.3 -87 73 2 -141 9 -68 -18 -23 -101 53 -24 -52 -27 -24 75 35 -9 71 52 -8 -31 -48 -30 -28 -37 -92 -12 -55 -69 -34 6 10
10289.5 10 -109 -92 -41 -14 -39 -36 10 -74 -2 32 77 56 -21 -78 -41 60 1 52 -5 -16 -78 -12 30 102 5 49 -98 62 -9
10278.3 -9 36 -93 6 -47 -28 -36 -99 -10 -1 47 -42 -127 18 4 -16 76 -85 -60 -1 -11 -77 -21 130 -17 47 -23 51 -70 93
10267.2 93 -35 -10 -47 60 -9 -17 -15 6 -37 15 10 -37 15 28 22 50 20 -71 -70 90 -20 50 -86 30 105 -62 25 -54 -106 -89
10255.7 -89 -13 -43 10 26 92 96 4 19 144 19 -11 -70 46 -61 142 -76 6 -11 -7 -36 -97 -30 -7 2 27 -55 -9 -39 -5
10244.5 -5 35 62 10 43 99 -37 14 -60 6 -58 86 -31 36 21 67 40 -30 -46 20 -46 90 -41 -88 -23 71 25 -13 140
$$ packed form
10322.8a12J05j6J5K5o9J71j98Q3j3n9J10R2j41j4j1o1J67m2o8P9m6J3L3q6N4k2j6
10312.5b7l9M9rO2j1j2k3o3O6l1M0o6L9J22j48L3K6o6k8J27J3j59J55r4j9J7L1J3q5
10301.3h7J60p1j43J50p7N0np8J54p7k8K5LR9m0m4Q0j9o0k3j7J8Krn5Q0m3j4L5M0M
10289.5A0j19J7N1K7k5LM6q4P2L4M5k1p7n7L7J01n9N1n7j1o2O6M2P2r7M4j47J60p1
10278.3iM5j29R9n3J9qo3Q9RM8q9q5J45j4k0R2j61K5N9j0o6N6J51j47O4p0P4j21J63
10267.2I3j28K5l7J07o9qKK1m3N2nm7N2J3oK8l0r1JJ60j10P0j36J16P5j67Q7p9n2J7
10255.7h9P6l0N3J6O6Mr2J5J25j25l0n9J16j07K03k18Q2j7Mk9o1O7K3RK5q2M6l0L4
10244.5eM0K7n2L3N6j36N1p4O6o4J44j17O7j5M6k7p0j6O6o6J36j31m7O5R4m6l8J53
$$ plain form
10233.8 140 -101 -9 129 16 -45 -5 -3 2 -80 52 -92 12 3 -73 -46 -4 -87 -28 -35 -31 -10 -56 -67 4 -35 -2 2 -29 -13 -22 23
10221.9 23 -77 -29 50 -62 -128 -7 38 -14 4 -52 -38 39 27 30 -55 -47 40 -77 -41 21 -50 8 29 32 -6 9 -74 -41 -79 4
10210.4 4 -96 28 91 17 -16 -60 -62 8 33 -56 32 90 -57 2 69 -99 -110 25 -23 -26 27 24 24 76 -2 10 67 -61 30 -58
10198.9 -58 24 -2 -8 -140 -35 -28 6 -98 15 -119 -2 -25 -21 -34 -17 18 -47 96 -20 -58 -30 -15 28 29 34 -39 -17 -61 -16
10187.7 -16 -48 7 87 -19 -25 97 -72 41 80 -61 59 32 -52 35 -15 5 8 -12 134 36 1 -26 38 -35 -122 22 -31 20
10177 20 -32 -35 -151 -127 68 43 74 -67 -67 -19 -71 -55 -14 -71 64 13 39 100 -8 -34 -34 13 51 -22 -9 41 75 -37 14 -20
10165.5 -20 -69 -15 83 -42 -78 51 7 -55 -39 -14 -28 46 56 -77 53 -26 38 -112 10 56 27 120 -77 56 25 -61 -61
10155.1 -61 -80 -1 -85 55 65 18 -27 -55 -4 -42 -123 -79 69 -36 -32 -77 -12 30 -76 -79 -1 105 -72 -5 -80 10 -56 79
$$ packed form
10233.8A40k41R2J38j13o1M0KNq2J32j44J04rp6K7M2q3N9pMK1m6j1P1l9L3Ml1J6rM5
10221.9B3j00M8P9j12o6J21M5n2J8n6J4P7j2Lq5QQ7j17L6O2p1N8K1Ll8J5q3L3l8Q3
10210.4Dj00J24O3p4l3m4kP0K5q9Q8N8j47N9O7j68j1J35m8lN3l%N2p8J2N7j28R1q8
10198.9e8Q2k6oj32J05PL4j04J13j34J17k3Mj3J7L5o5J43j16l8K8J5M3JNp3K2m4M5
10187.7a6l2N5Q0j06oJ22j69J13L9j41J20k7q4Q7n0K0Lk0J46r8l5k7O4p3q7J44n3N1
10177B0n2lj16K4J95k5L1j41%M8n2J6M1n7J35n1K6O1j08k6%M7L8p3J3N0L4j12N1l4
10165.5b0m9N4R8j25l6J29m4o2J6K5j4P4J0j33J30p9O4j50J22M6k9R3j97J33l1q6%
10155.1f1j9P9q4J40J0m7m5k8N1l8q1M4J48j05Mm5O5M2j06lP8J06j77O7p5R0o6J35
$$ plain form
10144.4 79 -23 21 30 -45 -46 69 -29 107 -39 26 47 -41 -21 60 -66 20 50 33 2 48 89 -45 30 -74 20 -38 98 159
10133.6 159 -143 -74 39 9 7 -28 -34 -31 -45 10 67 19 -23 -65 0 -42 -25 29 -94 -114 26 -42 -8 -16 78 28 -9 22 -39 57 40
10121.7 40 -47 162 -16 -92 -86 -44 2 -28 4 37 -17 -1 -56 -6 7 -141 12 37 -22 -134 -81 -38 -90 -105 64 -7 -54 -15
10111 -15 -70 37 -12 13 -9 -39 -54 -21 4 -44 14 49 -29 23 -19 12 -38 -138 4 -26 51 80 1 -31 -20 50 -16 -69 -44 20
10099.5 20 41 42 -64 65 18 37 -31 122 -106 -29 22 40 40 -19 52 37 -39 -33 -58 -113 63 -34 44 -59 -14 -4 -63 7 -19
10088.3 -19 -27 -15 136 -65 -34 -17 -31 -51 -62 5 -36 -36 -146 86 6 -21 47 3 25 -69 -112 -146 -57 39 90 78 -38 39 -69
10077.2 -69 -6 -18 38 -6 -3 -22 -53 39 57 -50 -80 -53 -110 -46 -46 -12 -94 -18 38 0 -40 -61 -72 -54 -4 -102 0 36 -13 9 -13
10065.3 -13 115 -20 -31 -65 -34 26 5 -11 -53 -36 -48 -32 -4 -84 -46 -2 38 -11 -67 8 -27 -41 -58 33 -81 -63 -30 28 -29
$$ packed form
10144.4G9j02M4Rp5jJ15r8J36j46O5K1q8K0Q1j26Q6L0j7l1M6M1j34P5j04R4n8J36O1
10133.6A59l02O9J13l0kl5oLj4N5N7m8m2TO5m2J7N4j23k0J40o8L4qR4n0l7L1o1R6j7
10121.7D0q7K09j78p6OM2M6l0L2L3n4J6n5N0J3j48J53K5n9j12N3M3n2j5J69p1m7L9
10111a5n5J07m9K5k2l0j5L3K5m8N8L5p8N2m2L1n0j00J42l0P7K9p9l2J1P0o6n3K5O4
10099.5B0K1Jj06J29m7J9o8J53k28P7N1J8%n9P1j5p6Ok5n5J76r7P8j03M5J0n9P0k6
10088.3a9qJ2J51k01L1J7j4k0j1O7m1%j10K32q0k7O8m4K2r4m3l4Q9R6N1j2j16P7j08
10077.2f9O3j2N6m4Lj9l1R2J8j07l0K7n7O4%L4q2P6N6l8m0k1j1J8N0r8J02L6m9K2k2
10065.3a3J28j35j1l4L1O0k1j6m2J7j2J6K8q0L8M4M0m9n6P5l5j4j7R1j14J8L3N8n7
$$ plain form
10054.2 -29 50 -32 -32 -70 17 -129 -61 50 -3 -22 19 -46 -6 -42 64 -121 -36 1 6 -97 -88 63 -26 2 10 71 70 53 113 -65
10042.7 -65 -52 -40 63 -83 -80 -32 5 -111 29 -33 -54 116 6 -15 -62 -15 48 44 -53 -45 -92 -18 -10 -21 -24 -26 2 -40 24 50 73
10030.8 73 51 36 -54 63 80 -19 -39 0 1 -62 -72 8 -90 -72 -28 14 26 -35 20 -32 108 -7 -26 25 -44 -34 -33 -6 -18 -76
10019.3 -76 -74 -89 15 -32 -64 -80 1 2 -61 75 -74 6 3 -49 -109 -49 -50 -15 32 -60 51 -35 51 48 -27 35 -67 -31 -119 -1
10007.7 -1 -38 53 -17 83 -23 90 -137 -40 -54 90 -38 59 -18 5 -97 -132 19 -14 72 40 34 13 -85 -45 14 -22 -56 86
9997 86 -1 -7 -27 -105 -65 -29 -29 -61 -25 7 -13 -43 63 -70 -34 21 -51 -60 3 -1 -36 0 -17 -20 -99 -2 9 0 -52 -15 29 -42 25 -19
9984 -19 8 -50 -64 -56 9 7 84 -10 -17 -39 -14 -65 -47 -46 81 0 -13 -79 -67 -38 7 -53 8 -127 -29 -40 -112 -54 -65 -19 87 51 62
9971.3 62 -61 36 -77 3 84 -83 43 85 -52 -17 -15 -92 -23 -90 57 -82 -50 43 -62 1 -67 46 21 -21 0 106 10
$$ packed form
10054.2b9P9q2%l8Q7j46O8J11n3j9M1o5M0l6J06j85Q5L7Nj03RJ51q9K8QO1jj7O0j78
10042.7f5J3J2J03j46LM8L7j16J40o2k1J70j10k1m7M7O3mr7Qm7P4Qj1lkK8m2O4K6K3
10030.8G3k2j5r0J17J7r9k0L9Jo3j0Q0r8J8M4M2J2o1N5n2J40j15j9N1o9J0JK7j2n8
10019.3g6Kj5J04m7l2j6Q1Jo3J36j49Q0ln2o0O0jL5M7r2J11q6Q6lp5O2j02L6q8J18
10007.7al7R1p0J00j06J13k27R7j4J44j28R7p7K3j02l5J51l3Q6l2ok1r8M0N9l6l4J42
9997H6q7ok0p8M0L6%l2L6L2k0l0J06j33L6N5p2rO3ml5L6j7lp9R7J1rn2L7M4p1O7m4
9984a9K7n8j4QO5kP7r4pk2K5n1J8JJ27q1j3o6J2K9M5o0O1j35R8j1p2N8j1M6J06l6J1
9971.3F2j23R7j13Q0Q1j67J26M2j37L5Kp7O9o7J47j39L2R3j05O3o8J13k5m2K1J06r6
$$ plain form
9960.9 10 -80 -14 -96 10 -9 -75 19 -71 8 -71 -44 3 -34 79 -86 -149 -91 59 -95 -87 -44 -42 -40 -103 -142 -31 -62 -77 -100 -93
9949.4 -93 -87 -109 -71 -136 -155 -152 -246 -198 1150 2048 2155 1518 1351 1315 1378 1373 1543 1426 1260 1023 649 416 282 178 232 66
9939.4 66 146 148 69 124 161 38 86 93 51 40 65 141 103 107 70 70 32 82 89 24 100 13 33 19 95 58 41 81 -23 51 -35 -4 16
9926.8 16 20 47 -45 54 -45 53 0 -9 79 86 79 -64 59 -12 55 65 55 55 69 50 -81 38 -93 42 -34 27 -20 33 -75 25
9915.3 25 29 20 19 44 11 -70 -2 -46 13 16 31 80 -14 -3 -20 -35 87 54 36 -14 24 -8 -62 -21 41 -20 -8 97 2 6 -108 17
9903 17 -78 4 -7 72 -6 34 40 59 16 -11 19 30 -6 -78 -92 12 -77 -25 18 -120 -53 -57 -28 2 -59 40 -143 -90 3 -95 28
9891.1 28 31 53 7 -43 -33 -19 -23 5 25 -148 34 35 14 -23 47 -42 -68 15 -27 -31 -31 -14 -1 51 59 0 -29 54 54 -83 -55 -47 46 -56
9878 -56 20 -16 69 72 54 25 -20 -26 37 -74 54 -74 -40 89 -43 61 44 44 50 6 11 -81 -39 15 -24 -57 -98 -39 -50 -59 45 27
$$ packed form
9960.9A0r0O6q2J06j9o6R4r0P9p9K7M7l7J13j65o3N8J50j54QM3KTo3l9J11l1j5k3P
9949.4i3Ok2L8o5j9Lr4M8J348Q98J07o37j67l6O3nJ70j17j66k37l74k33j34j04N4j66
9939.4F6Q0Kp9N5L7j23M8Pm2j1K5P6l8Ml7%l8N0Po5P6q7K0j4P6l7j7M0j04P4q6L1K0
9926.8A6MK7r2R9r9R8n3rQ8Ppj43J23p1O7J0j0%J4j9j31J19j31J35p6O1m7N3j08J00
9915.3B5MrjK5l3q1O8m4N9LJ5M9r4J1j7j5J22l3j8n0L8l2n4M1O2o1J2J05r5Mj14J25
9903A7r5Q2j1P9p8M0OJ9m3k7L0J1l6p2j4J04q9N2M3j38O7mK9L0o1R9j83N3R3r8J23
9891.1B8LK2m6n0J0J4mK8K0j73J82Jk1l7P0q9k6Q3m2m%J7J3N2Qn9k9Q3%j37K8QR3j02
9878e6P6l6Q5Lj8k9m5oO3j11J28j28L4J29j32J04j7%Om4Nr2M2N4l9l3m1N9j1rJ04j8
$$ plain form
9865.7 27 41 72 -2 -41 66 22 -2 23 5 2 -44 -9 36 114 27 65 -48 -48 -27 -2 -30 -48 36 82 -31 -33 21 19 -73 -4 121
9853.8 121 56 -6 2 -78 -13 -41 -56 12 3 50 19 52 33 56 44 -46 -7 -25 42 10 17 19 61 -12 -62 -15 -95 -25 -72 -52 54 -55
9841.6 -55 104 89 -94 108 -45 12 1 87 75 97 9 -106 -7 -66 -21 9 42 -37 22 105 10 40 -68 107 -30 -35 12 -24
9830.8 -24 155 -61 21 113 -13 9 17 20 12 21 -78 13 -15 -69 -54 7 3 73 25 -52 -20 -26 -97 102 -88 -42 -32 -46 22 36 89 13
9818.5 13 17 -82 -102 26 -81 -38 -101 42 -47 -25 -60 -177 31 105 -62 73 -30 -3 -15 33 -36 1 52 -28 -55 18 6 29
9807.8 29 -39 -72 -50 -120 32 -64 -77 77 -51 38 -9 10 11 -29 3 -76 -44 12 28 8 -54 -88 -2 20 -25 125 -31 24 4
9796.7 4 -12 63 -15 -10 -5 -62 -8 49 -39 28 47 -11 -11 -2 1 -21 -36 51 80 64 1 70 104 -36 -9 -46 37 -83 3 5 48 -12 15 -15
9783.6 -15 12 -164 9 30 -22 52 24 -5 -34 -25 49 -32 0 -32 -16 30 22 -14 40 -15 -14 -12 -103 -4 48 30 -56 -32 60 -41 115 37
$$ packed form
9865.7B7J4L1p4l9J07m4k4K5j8lm6L5M5P8q7L8j13%K1K5k8j8Q4M6j13kN4kr2O9J25
9853.8A21o5o2Qq0O5k8j5O8rM7l1L3j9K3j2r0L9j8O7l2PKM2p3n0M7q0P0m7K0J06j09
9841.6e5J59j5j83K02j53N7j1Q6j2K2q8j15R9n9M5L0L3p9N9Q3r5L0j08J75j37nM7l6
9830.8b4J79k16Q2R2j26K2QLqRr9R1k8n4J5O1mP0m8p7L2op1J99j90M6J0j4O8J4N3p6
9818.5A3Mr9k0J28j07M3o3J43q9K2l5j17K08P4j67J35j03K7j2M8o9L7N1q0k7P3j2K3
9807.8B9o8l3K2p0J52r6j3J54j28Q9m7J9Jm0L2p9L2N6J6k0o2l4Q6K2m5J50j56N5k0
9796.7Dj6P5p8NTn7N4N7q8O7J9n8%RLk2j5Q7K9j6o3O9L4j40K7l7Q3j20Q6KM3o0K7l0
9783.6a5K7j76J73K1n2P4k8k9TRP4q1L2l2J6M6ql6N4n5JKr1R9N2j8q6K4R2j01J56p8
$$ plain form
9771.3 37 -17 28 -42 42 -62 66 -104 64 13 -68 4 42 -28 -5 -26 25 -19 45 33 51 51 47 4 -68 -76 -29 62 5 20 -19 -43
9759.4 -43 40 60 -46 5 -98 119 22 62 -61 3 -49 -11 -14 -15 49 -67 1 -98 -43 -54 -40 13 64 109 8 48 89 22 34
9748.3 34 -5 48 40 -20 -49 47 20 34 -35 99 -41 38 -55 -67 1 -54 -92 22 5 -31 51 0 15 -54 -43 -8 -19 17 1 -48
9736.8 -48 10 109 -8 -15 9 -4 -55 -6 -198 41 -17 10 -49 -22 -97 36 0 66 59 6 -21 -19 -103 26 83 44 52 -49 8 80
9725.3 80 -66 -45 1 -34 -50 -71 49 -42 -5 -11 49 11 -72 72 48 -83 96 -29 91 3 30 21 5 40 27 -7 -25 42 -39
9714.2 -39 20 86 -128 144 -6 3 -40 46 -43 113 -19 -62 -102 -76 -44 -37 -28 -48 -41 28 -82 -29 -53 -38 -103 14 -95 -46 -13
9703 -13 -26 44 57 -27 38 -36 -12 -5 -171 -52 94 -101 18 5 -72 85 23 -1 -84 47 -38 -7 -45 106 -67 -66 4 32 -6
9691.9 -6 -55 -47 57 -42 -62 34 61 -26 -28 44 20 23 21 -4 10 -48 -27 -95 7 13 32 -43 -1 -86 -96 -36 54 -14 38 11 60 125 -6
$$ packed form
9771.3C7n4M5p0Q4j04J28j70J68n1q1P2L8p0K3k1N1m4O4j2J8%mm3p2qM7R1n7J5l9k4
9759.4d3Q3K0j06N1j03K17r7M0j23O4n2L8ljO4j16O8r9N5j1J4N3N1M5j01M0M1o7J2
9748.3C4l9N3qo0k9R6k7J4o9J34j40P9r3j2O8n5l8J14j7l6Q2n1J5o9J1L5j1L6j6m9
9736.8d8N8R9j17pK4j3n1M9j92K39n8K7n9K7p5J33l6O6pn3k7Kq4J29N7l9Qj01N7P2
9725.3H0j46K1M6l5j6k1J20r1L7oO0l8q3J44k4j31J79j25J20q8K7rj6L5j3l4j8O7q1
9714.2c9N9O6k14K72j50Rm3Q6q9J56j32m3m0K6L2PRk0PO9j10N3k4J5o5J17j09M9L3
9703a3j3P0J3q4O5p4K4Pj66J19J46j95J19j3p7J57o2k4q3J31q5L1l8J51j73JP0K8l8
9691.9fm9QJ04r9k0R6K7q7kP2k4Lkk5J4n8K1o8J02OJ9p5M2q5j0O0R0o8N2k7M9O5j31
$$ plain form
9679.2 -6 -27 -53 -38 23 -46 55 -114 22 -21 49 -43 -22 -31 20 41 38 61 -37 15 63 -9 -50 86 -71 -56 -2 -35 10 73 -40
9667.7 -40 -85 15 -49 -47 70 -37 42 -25 121 -9 17 108 -60 0 34 -49 72 -111 86 -98 59 5 79 42 -22 -58
9657.7 -58 -10 44 33 -63 -6 -13 -82 31 0 41 26 -56 28 -26 -16 -43 -86 -12 -99 -69 -5 -20 35 -31 -47 40 -85 -5 -122 -32
9646.2 -32 42 28 -39 -40 -83 -102 33 112 -30 2 -37 -33 -34 -83 8 11 48 54 20 101 -42 -82 -67 59 -6 1 -86 -22 -91 20 -21 0
9633.9 0 75 -35 -48 -28 0 -52 20 3 -145 -70 -10 -12 -26 -75 -50 23 -23 -31 82 6 -70 65 45 57 -5 -42 -4 1 16 10 34 20
9621.7 20 -93 51 4 13 -98 89 83 -57 -51 83 95 16 -17 58 88 -78 -63 -15 5 1 32 -48 97 -56 61 -12 6 26
9610.9 26 -34 1 -138 -108 -38 134 -25 -10 35 17 43 104 1 85 11 -4 -20 -39 -21 74 -65 -51 -69 36 -18 29 -1 11
9600.2 11 59 56 24 69 -81 -15 -2 -13 -57 35 11 61 1 -97 13 10 -7 -29 -19 -25 -88 -126 48 -61 -48 32 -44 38 24 -11 -20
$$ packed form
9679.2fk1k6J5O1o9J01j69J36m3P0r2K1rN1K1lK3r8N2M8p2m1J36j57J5N4l3M5O3j13
9667.7d0m5J00o4KJ17j07P9o7J46j30K6R1j68O0L4q3J21j83J97j84J57n4P4l7o4l6
9657.7e8M8N4j1r6N7po9J13l1M1j5q2Q4n4J0k7m3P4q7L0O4j5N5o6j6Q7j25Q0j17R0
9646.2c2P4j4o7jm3j9J35P9j42L2l9Mjm9R1LL7Ol4Q1j43m0J5J26o5Pq7O4o9J11m1K1
9633.9@P5j10j3K0K8n2P2j7j48P5O0kj4m9K5P3m6qJ13p6TJ35k0J2o2l7L8NJ5oK4j4
9621.7B0j13J44m7Rj11J87oj40OJ34J2p9l3P5L0j66J5M8K0mL1q0J45j53J17p3J8K0
9610.9B6o0L5j39L0P0J72j59J5M5j8K6O1j03Q4p4j5j6j9J8R5j39J4j8J05n4M7l0J2
9600.2A1M8ll2M5j50O6J3j1m4R2k4N0o0r8J10lj7k2J0oo3l8J74j09J3Q0p6Q2j4l5r
$$ plain form
9588.3 -20 -23 14 16 -38 38 -9 -80 186 54 40 -2 6 84 55 9 71 26 85 -19 -48 -34 4 -88 29 -65 80 20 50 31 -26
9576.8 -26 -78 34 54 22 -88 -59 -18 -22 -145 -14 18 75 68 15 -30 -30 -52 -40 -72 -9 5 70 -32 -27 -62 -35 -15 -132 149 0
9565.2 0 10 -34 -27 -14 11 8 29 -3 96 -65 -54 -73 -107 -55 -69 33 -65 -37 -60 -56 -14 -114 -39 35 -51 77 11 -28 47 30 24 7
9553 7 -7 14 22 -15 9 -31 22 -60 3 -12 86 64 -3 -28 -104 -25 30 -10 84 42 -13 34 47 -52 78 83 44 -17 -89 -46 -72 -61 -13
9540.3 -13 14 42 42 -67 -33 -48 -66 11 19 -24 -62 8 -89 68 -44 -5 -21 46 21 40 48 -22 5 -62 -37 -14 -11 20 -21 -9 49 -28
9528 -28 -28 -81 55 -69 -10 26 -72 79 28 -52 56 30 25 7 53 56 -57 20 2 -36 9 0 -69 8 88 26 -14 -29 40 -106 2
9516.1 2 -54 19 -47 -56 -22 7 -8 -15 -26 104 24 -33 -53 -34 16 -9 20 -26 -15 -65 -22 17 17 -166 33 -25 13 6 -75 118 -16
9504.2 -16 76 46 -69 41 105 40 -34 30 -4 -39 -33 -1 -132 -76 42 -52 23 31 79 35 -41 14 24 87 87 -28 4 -47 68 -98
$$ packed form
9588.3b0lL7Kn4P6m7p1K66j32j4m2QP8k9m6O2m5N9j04k9J4L8r2J17r4J45o0L0j9n7
9576.8b6n2J12K0l2j10K9M1mj23J31L2N7pn3m5%k2J2l2O3J4O5j02Nl5K7K0j17K81j49
9565.2@J0m4PJ3K5lK1l2R9j61J1j9l4N2j4J02r8K8k3MM2j00P5P4q6J28o6l9P5j7oj7
9553Gj4K1Ql7K4m0N3q2O3j5R8k2o7k5p6P9N5m0R4m2n5M7J3r9J30Nl9o1p2M3k6J1M8
9540.3a3K7K8%j09L4j5j8P7Qm3l8P0r7J57j12L9j6O7k5J9Qp0K7o7K5K3LL1m1J2N8p7
9528b8%n3J36j24N9L6r8J51n1q0J08k6nj8M6Lj13P7j8l8M5ro9P7Q0o2m0j5O9j46J08
9516.1Bn6P3o6rL4K9j5pj1J30q0n7k0J9N0k5K9m6J1n0M3L9%j83J99n8L8pq1J93j34
9504.2a6R2l0j15J10O4o5p4O4l4l5OL2j31N6J18r4P5QM8m4p6N5J0O3%j15L2n1J15j66
$$ plain form
9492.7 -98 -46 -76 -47 -104 76 8 -24 14 -3 13 -24 -31 -1 66 -91 69 38 -10 -10 -15 -48 -60 -44 30 -49 -97 -4 -51 -60 -90 143
9480.8 143 -38 -10 83 43 2 98 -57 -4 -33 23 36 -97 22 11 -72 11 -76 17 60 -49 31 -30 64 -39 25 -20 26 -23
9470.1 -23 -10 -22 38 -89 -45 -24 -85 39 33 76 -20 -35 32 63 -17 -13 20 8 -30 56 -28 -119 -29 -95 -19 13 -109 37 -29 97
9458.5 97 8 -41 -4 -105 -39 166 -18 45 -5 -104 -11 -81 -6 18 -28 -42 -25 -18 6 0 -52 29 2 26 -42 -78 -48 -8 -20 -21 38
9446.6 38 -35 84 -12 -8 12 -19 46 -61 -59 -80 -17 -6 -98 -8 19 -72 128 114 -118 -41 24 -55 -21 -40 31 -46 87 50 -65
9435.5 -65 -51 -16 14 73 17 -7 30 92 -77 49 5 -6 -92 -109 54 2 -60 -66 -33 -70 9 -68 -39 74 99 18 -8 11 11 -64
9424 -64 -51 15 -90 -11 -40 -6 45 43 -20 -48 53 -9 -1 -14 -32 -11 -111 -74 -90 0 -52 14 37 -55 18 17 23 21 -68 6 55 -36 -39 -30
9411 -30 15 -43 14 91 16 7 -13 -65 21 84 -94 -15 -59 7 -27 1 -64 3 58 -19 38 -52 100 -8 -71 -10 15 -55 32 -83 -69
$$ packed form
9492.7i8N2l0K9n7J80o8l2L8j7J6l7pL0O7j57J60l1m8%nl3j2J6P4p9m8R3m7rl0K33
9480.8A43j81K8R3m0m1R6j55N3k9N6J3j33J19j1q3Q3q7R3M3j09Q0o1R4j03O4m5M6m9
9470.1b3J3j2O0j27M4K1o1J24oM3r6j5O7L1q0ML3j2l8Q6q4r1R0o6P6L2j22J46o6J26
9458.5I7q9m9L7j01O6K05j84O3n0r9R3p0P5K4m6j4J7PK4on2Q1k7K4o8l6L0M0j2jN9
9446.6C8p3J19r6MK0l1O5j07Kk1O3J1r2R0K7r1K00j4k32P7O5p9L4j9P1p7J33l7j15
9435.5f5J4L5L0N9n6k4L7O2j69J26m4j1q6j7J63n2o2oL3l7P9p7K9J13K5q1k6J9%p5
9424f4J3O6j05P9k9L4N1ko3k8J01o2Qj3j8K1j00L7j6R0n2O6K3r2P3jOkq9P4M9r1lR
9411c0M5n8N7P7p5rk0n2Q6O3j78P9m4O6l4K8o5O7N5p7N7r0J52j08o3O1K5p0Q7j15J4
$$ plain form
9399.1 -69 3 -62 7 72 -8 -2 50 31 7 42 57 -9 -54 -46 42 -15 -34 3 123 22 -18 -90 -86 11 15 61 -114 15 -28 -54 37
9387.2 37 -83 -33 -50 14 -65 -14 15 36 -78 -40 -86 -18 -4 -44 -23 11 70 -58 16 30 -26 -35 36 42 -16 50 82 -40 -11 19
9375.6 19 -121 8 -85 92 -24 -133 -74 -70 -43 -97 -53 17 25 13 -52 -4 -67 50 111 39 -18 -1 -10 32 -40 -45 -8 53 48 60 6
9363.8 6 -56 -21 22 88 -57 -28 -79 -87 5 -78 43 -34 -4 28 -4 -56 60 25 -27 83 -52 17 -21 33 6 -63 19 -145 74
9352.6 74 -26 77 53 -21 44 26 49 -56 -8 17 102 -67 -77 12 -28 -50 13 -114 -48 -15 -25 -34 -88 65 -12 -39 -31 -51 1
9341.5 1 -42 31 -25 -49 103 6 2 6 -6 -124 -16 -48 102 103 -42 -2 39 -7 -59 27 -81 -24 60 52 -63 -27 -89 28 -80
9330.4 -80 -10 -27 -51 -33 42 86 41 -85 -16 -70 -22 -17 86 -67 -110 -43 -59 38 -73 -23 -16 -6 -124 -4 75 -42 -70 -101 -5
9319.2 -5 -21 74 15 45 -44 -1 -33 63 -36 66 -44 17 119 -132 11 33 -107 -11 54 -114 35 10 -118 44 62 78 -11
$$ packed form
9399.1f9P2o5O9O5q0ON2j9k4L5J5o6m5QQ8n7j9L7J20j01m0p2MR7MM6j75J29m3k6R1
9387.2C7j20N0j7O4p9N1K9K1j14L8m6O8J4m0K1L4N9j28P4J4n6rP1On8O6L2j22K9L0
9375.6A9j40J29r3J77j16j09N9MK7n4M4P0Qj2o5M8o3J17O1p2n7J7rM2p2nL7O1nJ2n4
9363.8Fo2L5M3O6j45K9n1qR2q3J21p7L0L2l2n2J16l5n2J10j35O9l8N4k7o9Q2j64K19
9352.6G4j00J03k4p4O5j8K3j05M8K5Q5j69j0Q9m0k2O3j27O6L3j0rn4J53p7k7Qk0N2
9341.5Am3P3n6k4J52r7mMj2j18J08l2J50Jj45M0M1m6n2Q6j08N7Q4qj15L6o2J17j08
9330.4h0P0j7k4J8P5M4m5j26O9n4M8NJ03j53m3O7j6R7j11N0PJ0j18J20P9j17k8l1R6
9319.2ej6R5n9L0q9M3l2R6r9J02j10O1J02k51J43K2j40R6O5j68J49k5j28J62J8J6q9
$$ plain form
9308.9 -11 -38 -25 -49 -54 23 23 61 63 -15 -101 -8 3 -12 38 -42 -16 -30 64 -69 -9 -59 25 54 -93 -73 58 -34 -128 -32 9 39
9297 39 -21 -60 -33 33 -12 -7 0 16 -25 23 52 -54 -19 -23 -54 -1 19 -23 -12 87 19 -101 37 -10 -22 14 92 5 -3 7 31 0 -15
9284.3 -15 4 -62 54 68 -30 70 -11 19 -55 -79 19 -37 -51 26 76 -10 -48 -6 -43 -75 23 34 37 43 -62 53 -80 -51 -40 18
9272.8 18 -12 -42 -67 24 -6 -86 147 69 2 -2 30 23 47 39 -23 19 -53 -9 -49 43 -110 -65 83 -19 78 -86 -41 30 -44 -40 -94
9260.9 -94 -30 43 -9 -120 -37 -5 25 -39 -58 35 -1 -16 -28 -44 -49 -8 -52 -55 -4 -20 39 -47 -92 4 22 -48 25 -32 -103 51 -63
9249 -63 -16 -80 22 -84 61 -11 -112 -8 -60 44 12 42 -63 -26 5 -54 -16 -15 28 18 35 -81 -108 1 -35 18 121 -86
9238.3 -86 15 27 -18 55 -72 19 -31 27 54 13 24 -4 -54 42 -38 55 145 -114 81 -96 -1 -82 -27 80 19 6 -23 -55
9227.5 -55 68 -7 11 70 -56 17 -27 53 -35 -48 -27 20 0 -22 55 -15 -43 -81 -113 -15 -23 -67 2 -32 119 -69 -8 -104 33
$$ packed form
9308.9a1k7J3k4nP7%L8Kp8q6R3J1j5N0q0K6j4R4j33O0n0Q4K9j47K0J31r2r4R6M1L0
9297C9o0l9K7O6m5NPJ6m1M8K9j06L5ml1N3K0m2J1R9o8j20J38m7j2L6P8q7qJ0K4l1j5
9284.3a5J9o6J16J4r8J00q1L0p4k4R8n6j4P7N0q6l8M2l7l2R8J1LOj05J15j33K9J1N8
9272.8A8l0Tk5R1l0q0K33p8o7mL2pK4qo2M2p2M4m0R2j53M5J48j02R7j64M5P1p4Mn4
9260.9i4O4P3n2j11Q3L2L0o4j9R3l6j5j2j6nM1m4lN1j6N9q6m5R6J8p0P3n7p1J54j14
9249f3M7o4J02j06J45p2j01J04n2J04l2L0j05L7L1n9L8JM3j0J7j16k7J09l6N3J03k07
9238.3h6J01J2m5P3j27R1n0N8K7m1J1k8n0R6q0R3R0k59J95j77R5q1N5J07o1j3k9l2
9227.5e5J23p5J8N9j26P3m4Q0q8j3K1M7k0k2P7p0k8l8l2R8qm4O9l4J51j88O1r6J37
$$ plain form
9216.4 33 43 -17 -32 5 34 5 -35 -29 -22 -93 71 53 28 133 -42 -31 -11 -70 -58 10 9 -19 22 33 62 -76 26 25 -1 -29 -26
9204.5 -26 9 72 62 1 26 27 13 74 -4 -36 -86 -55 -4 9 -71 13 -50 83 2 -7 -46 29 -5 -32 16 -58 -7 -55 56 -66 -64
9192.6 -64 39 -1 -103 56 48 -39 11 22 -73 43 -109 -27 -18 10 -2 -51 30 99 -31 105 -21 2 -104 -93 35 66 -5
9182.2 -5 82 9 25 -104 38 37 22 65 -44 75 85 3 68 72 -81 115 82 76 92 -85 21 -32 -6 -27 63 -32 -63 24 46
9171.1 46 20 115 90 -75 -91 -91 29 -95 194 142 -40 52 45 52 76 -9 -10 0 -15 -23 20 68 -2 -10 -5 14 -47 -19 59 16 -7 -80
9158.8 -80 2 32 -31 -17 23 -1 6 63 -37 5 -13 -26 -33 25 63 -51 -28 -29 -25 -31 -2 2 68 -23 -33 6 -49 37 -59 43 3 62 -22
9146.1 -22 -20 -22 -102 -19 -59 16 47 -59 20 82 37 8 53 5 -37 -117 -81 3 -31 -5 12 -30 -64 48 -51 88 -19 57 -112 20
9134.6 20 87 -90 -41 -7 -62 -73 12 1 0 83 -106 15 21 -46 -47 -67 -93 -60 37 92 -135 -84 -51 41 -44 65 -12 -36 -2 25
$$ packed form
9216.4C3J0o0j5L7K9k9m0OPp1J64j8k5J05j75J1K0n9J2O8jk8M1J1K9j38J02jk6k8L
9204.5b6L5O3j0o1K5Jj4O1p8l2n0L1N1J3q0Q4o3J33q1rl9P5l4k7M8p4N1m8J11j22K
9192.6f4J03m0j02J59qq7N0J1r5J16j52Q2RK8j2m9Q1O9j30J36j26K3j06J1J28L1p1
9182.2eQ7p3J6j29J42jj5M3j09J19J0q2O5Mj53J96l3oJ6j77J06n3K6k1R0r5l1Q7K2
9171.1D6k6R5k5j65j6%J20j24K89n2j82R2pPK4q5jJ0j5qM3M8p0qNJ9o1K8P8m3k3p3
9158.8h0Q2L0o3J4M0k4PN7j00M2j8j3pN8L8j14K3jMoK9MO6r1j0L9n5Q6r6J02m0N9q4
9146.1b2Kkq0Q3m0P5L1j06P9O2m5k9M5m8m2q0L6Q4l4K6J7m2l4J12r9J39j07P6j69J32
9134.6B0O7j77M9L4n5j1Q5j1jQ3j89J21Oo7jk0k6L3R7N5k27N1L3R2q5J09p7k4L4K7
$$ plain form
9123.1 25 102 -118 19 -9 59 42 5 -81 -34 -42 46 6 -8 -13 -56 -69 -44 -45 32 -36 -27 -33 -8 12 36 93 -11 -112 -36 46 65 22
9110.8 22 -19 -54 25 -121 -36 -14 14 -103 -54 -55 -51 -33 2 -10 -21 -68 -5 -59 -23 66 32 -109 -54 -38 -58 35 -3 -48 -20 14 -32
9098.9 -32 33 42 -51 -44 -75 -75 -54 -2 15 -45 57 -34 -1 -15 -66 63 -46 -63 44 -72 -150 -19 71 12 -67 -108 25 90 83 -138
9087.4 -138 -9 -61 -4 85 9 -16 47 188 52 -2 -35 20 -51 -39 -58 -49 -35 -42 154 29 50 -9 7 28 -135 -66 6 45 -3
9076.3 -3 1 85 -28 13 -61 -83 1 0 -84 -55 55 49 -77 -6 64 9 61 4 -38 -76 7 5 -11 -38 25 31 -62 -48 -123 -26 -19 40 -74
9063.6 -74 37 12 18 10 61 -22 -10 -113 80 22 14 2 -28 -35 8 -47 12 -6 -8 -45 38 -19 75 -64 68 -42 -4 75 -3 59 61
9051.7 61 -1 -30 -5 -92 35 -7 8 29 -45 -15 -35 18 -69 -64 -50 -22 8 63 -31 -50 23 -50 27 56 12 -47 -77 -41 -31 19 -50
9039.8 -50 9 34 -27 19 3 31 16 78 -49 -56 -82 -81 32 -90 -5 61 45 -31 32 -39 -25 -72 -48 -119 13 -69 4 37 70 78 -27
$$ packed form
9123.1B5P7k20J37k8O8j7l7q6M7qQ8m0j4nm3j3K5jP7o8RoK5K0K4N7j04j01P6Q2J9m3
9110.8B2m1l5P9j46Q5K2K8j17M9jMJ8L5j2j1m7O3n4L6Q9l4j41N5J6k0R3l8m5K8L4m6
9098.9c2O5Rr3Pl1%K1N2J7o0J02r1L3j4n1J29j09j7J07j16p8J31R0n9p9m1J33O5pk21
9087.4a38J29n2N7Q9p6k5O3J41j36n4l3N5p1J2j9RJ4pJ96j25K1n9J6K1j63O9P2L9m8
9076.3cMQ4j13M1p4k2Q4jq4K9J10oj26P1P0n5N2n7m2l8Q3kj6k7O3Or3J4p5R7PN9j14
9063.6g4J11k5OqN1q3J2j03J93n8qj2l0pM3n5N9j8kl7Q3n7R4j39J32j10L8P9p8O2K
9051.7F1o2k9K5q7J27m2J5K1p4L0k0N3q7NJ4K8L0N5r4j9P3p3P7K9m4n9l0L6J0N0o9
9039.8e0N9K5o1M6j6K8j5O2j27pk6JJ13j22Q5O6j6p6O3p1J4m7K4p1J32q2P3L3TQj05
$$ plain form
9027.9 -27 -1 -37 -15 -19 54 -47 -39 -46 -21 63 21 32 -34 -69 15 3 -4 4 -2 3 25 -36 -17 -62 92 -22 -18 -4 32 32 4 -33 5 27
9014.9 27 5 -124 -22 -10 -5 -43 -24 -23 14 -83 33 -10 -29 51 -1 71 13 -74 74 -19 -177 -66 40 32 -127 17 -35 -96
9004.1 -96 99 14 22 9 104 -56 103 -65 -11 22 100 -4 -31 -48 -58 -63 113 32 -25 -17 -38 -11 47 -123 50 12 131 -5
8993.4 -5 -80 -71 13 49 -29 -41 50 10 46 -14 -74 -81 -19 49 42 -82 5 -82 -88 -54 -32 -130 14 -150 -9 38 -79 3 6 -5 38 -7
8981.1 -7 -15 -52 82 23 71 -20 -69 69 -35 -7 -64 6 3 76 23 20 31 -52 5 27 63 -37 -21 25 -13 28 -38 33 18 -19 -136
8969.2 -136 23 22 -53 -41 73 37 -73 36 19 -58 -94 -52 -14 66 86 -34 -22 -7 -61 46 -68 -20 -22 -39 -53 53 -57
8958.9 -57 34 -35 52 53 67 -15 -57 10 53 -23 -79 -22 -34 -32 56 -16 87 15 1 -66 65 -5 4 -50 -32 4 -11 -60 -44 -44 23 -11
8946.6 -11 -74 32 42 -27 53 -10 38 15 -74 -74 -62 -10 -4 -33 -50 -62 -134 -24 -23 12 -46 -14 56 -64 -9 -113 -27 -34 -41 -48 8 56 -167
$$ packed form
9027.9b7K6l6K2mP3j01QpK5Q4m2J1o6l5Q4j2pQoNK2o1J9m5J54j14MJ4L6%k8l7L8K2
9014.9B7k2j29J02J2Nl8J9JL7r7J16m3j9Q0n2P2n8q7J48r3j58J11J06qj59J44n2o1
9004.1i6J95q5Qj3R5j60J59j68N4L3P8j04k7j7j0nJ76q1n7Qk1K7N8j70J73l8J19j36
8993.4ep5RQ4L6p8j2R1m0L6o0TpO2O8pj24Q7q7oL4K2r8J44j64J41M7j17Q2Lj1M3m5
8981.1gql7J34n9M8r1m9J38j04K8n7P0lP3n3lJ1q3N7K2L6j00J6M6l8M1o6P1j5l7j17
8969.2a36J59jp5J2J14l6j10J09j7p7l6M2L8Q0K0j20J2J5n4J07j14M8kj7j4J06j10
8958.9e7R1o9Q7JJ4q2m2O7M3p6n6N7j2KQ8p2J03p2j4o7J31p0Rn4J8L6j5m9J6%O7l4
8946.6a1o3J06J0o9Q0o3M8k3q9%J2N2Ok9j7j2p2J10JL5n8L2P0j20N5j04Q6pUN6M8k23
$$ plain form
8933.9 -167 -51 -72 -136 -4 -82 13 38 23 -29 -37 -36 -27 -10 34 4 33 -75 -18 14 38 -56 36 4 26 126 -36 105 68 -18
8922.8 -18 -29 -25 -17 16 75 -95 -10 85 6 -56 -52 51 -17 34 -76 45 -50 43 3 -68 -95 30 -49 16 -12 -1 -3 -143 -20 17
8911.3 17 45 65 -38 44 3 -18 -111 54 32 10 100 -32 -19 -8 33 68 9 33 53 -103 39 -73 48 -35 -147 -32 -64
8900.9 -64 30 -22 -52 -14 82 -51 -17 -55 -59 -13 33 -83 -34 97 101 -20 -1 -24 0 -12 11 -10 -50 37 36 16 -52 24 -66 26 -27
8889 -27 47 -16 -33 -41 29 -30 -20 23 -22 12 -34 -113 -10 -66 16 36 -9 79 -2 107 -95 -110 -44 9 -63 13 8 54 21 -39 -82 -87
8876.7 -87 -90 28 -85 -43 0 -116 -34 -87 -26 72 6 -74 -54 38 -84 43 -16 -5 51 -78 -34 -7 -11 -89 24 -38 61 104 6
8865.6 6 57 -34 -6 39 -113 21 -13 40 29 14 -78 -58 59 18 64 108 89 -6 -16 43 -1 -26 -41 -1 66 -91 -29 11 -24 -23
8854.1 -23 4 67 29 -12 -27 -58 72 -35 37 -15 -27 21 16 -70 -45 59 -77 15 56 -83 -71 -5 21 -26 1 70 49 -60 -82
$$ packed form
8933.9a67J16k1o4J32p8R5K5j5n2qJRJ7M4l0K9j08N7L2K4r4R2l2K2J00j62J41l7q6
8922.8a8j1MQL3N9j70Q5R5p9o2MJ03o8N1j10J21r5R3m0p1k7J25p9O5k8J1kj40J23L7
8911.3A7K8K0j03Q2m1k1r3J65k2TR0j32J3J1M1L5n9K4K0j56J42j12J21q3j12J15l2
8900.9f4R4n2l0L8R6j33L4l8mM6Tj16M9J31Mj21J9k3K4j2K3k1m0Q7jk0o8P6r0R2n3
8889b7P4o3j7qP0n9J0M3m5L4m6p9J03n6Q2K0m5Q8q1J09k02j5O6N3p2P6nM6l3o0m3n
8876.7h7lJ18j13M2M3j16Q2n3O1R8o6q0K0R2j22J27n9J1N6j29M4K7mp8J13o2R9M3r8
8865.6FN1r1K8M5j52J34l4N3j1j5r2K0J17m1M6M4j9r5j0N9m4k5j5M0O7j57O2M0l5J
8854.1b3K7O3l8m1j5l1J30j07P2n2j2M8nq6K5J04j36R2M1j39J2O6K6m7K7O9k1j09k2
$$ plain form
8842.9 -82 -59 46 73 -68 34 -64 -26 65 28 6 -55 16 -3 -44 -54 100 -86 68 45 -12 -20 8 37 -46 65 -42 47 24
8832.2 24 -21 -27 30 -74 -37 13 1 18 -16 43 -130 14 -199 61 -102 25 39 -65 -42 -40 85 82 39 -54 64 -28 -58 9
8821.5 9 -32 37 4 -37 -70 75 15 65 41 -30 45 -40 -11 -5 106 22 40 -10 -68 -3 -11 52 -61 29 16 -105 -10 -67 -73 25 -147
8809.6 -147 -57 23 -6 -163 -33 40 -96 52 -159 1 -33 -56 6 -7 3 63 -96 -19 24 -16 -33 -54 52 -32 -3 20 74
8799.2 74 -7 11 117 -41 27 -41 -51 59 44 -59 -125 -26 2 -32 15 -10 -28 -5 -97 4 51 -47 18 21 -43 17 105 -23 -89
8788.1 -89 7 -10 2 -12 72 34 -66 64 -190 -67 -61 -35 -50 45 -6 86 114 33 -29 62 30 16 -58 50 46 -1 20 -7 30 -68
8776.6 -68 -39 -17 -43 -75 41 50 63 -53 42 39 101 -21 -86 39 69 33 -47 -30 -37 -43 52 7 3 30 -63 -95 10 10 99 21 -70 -72
8764.3 -72 -32 -64 -73 -27 61 -47 129 12 -58 -13 -53 39 -53 -123 -19 -8 56 -9 23 -55 55 -36 -18 68 -69 -74 -41 5 24
$$ packed form
8842.9h2K3J05K7j41J02r8L8R1l7k2o1P1j9m1j0J54j86J54k3n7qK8K9q3J11j07Q9k3
8832.2B4m5oN7j04L7N0j2J7l4N9j73J44k13K60j63J27J4j04K3KJ25lm3r3J18r2l0O7
8821.5Im1O9l3m1l3J45o0N0k4p1P5q5K9OJ11q4J8n0n8O5qO3j13R0j3j21R5n7oR8j72
8809.6a47R0Q0k9j57J30P3j36J48k11J60l4k3O2j3J0O0j59P7M3m0j7k1J06q4K9K3N4
8799.2G4q1J8J06j58O8o8j0J10j5j03o6R9K8l4M7k5j8K3r2J01M7r8O5Lo4O0Q8j28o6
8788.1h9R6j7J2j4Q4l8j00J30k54J23OK6j5R5n1R2K8q1o2R1l2j4p4J08mm7K1k7L7r8
8776.6f8K9K2k6l2J16RJ3j16R5lO2j22o5J25L0l6q0J7poR5m5mK7r3l2J05%Q9p8r1k
8764.3g2M0l2rM6Q8j08J76j17p0M5m0R2r2p0J04J1O4o5L2p8J10r1J8Q6j37nL3M6J9
$$ plain form
8753.1 24 11 -7 10 -96 17 -14 59 30 70 31 130 -101 -58 -88 -60 -36 -13 24 157 -38 -34 -62 23 132 -21 -45 -46 -23 70
8742 70 -39 -67 -14 -55 -161 -31 -13 -9 -38 13 -18 3 1 46 -85 -49 -31 -89 121 -21 36 -42 76 -62 24 20 -28 -24 -58 35
8730.5 35 105 13 23 -35 101 18 26 14 85 -80 -17 -14 0 -26 32 11 -119 -17 22 -73 -4 -19 -38 -85 41 -4 38 28 -15 -47
8719 -47 -59 91 46 -18 14 -49 2 -98 38 -25 32 40 -39 15 75 -29 -12 -82 -74 1 60 51 -27 68 -80 37 -51 -19 10 5 -14
8707.1 -14 18 -22 57 -87 7 -10 -49 -35 -5 43 8 10 -91 76 -154 5 1 -96 -84 -57 71 -19 -57 -139 11 -29 8 -53 -86
8696 -86 8 -88 70 19 10 -29 -148 -19 -32 -45 -17 58 74 23 78 11 64 -50 121 -103 -57 9 -14 47 -61 17 -86 9 54
8684.8 54 -54 -51 -45 -23 31 -100 -4 28 -53 52 26 14 -82 -24 -19 -7 25 -40 23 -102 12 -30 -62 -34 -16 -45 -86 30 25 21 -125
8672.9 -125 12 28 -33 -51 -24 62 -56 -126 16 -48 -6 -77 17 54 -115 46 77 -34 -86 75 19 73 8 24 -66 21 -163
$$ packed form
8753.1B4j3j8J7j06J13l1P3k9M0l9R9k31M3l0K8K4K3L7J33j95Mk8Q5J09j53k4jK3R3
8742G0j09k8N3m1j06J30J8Mk9N1l1K1kM5j31L6J8n8K10j42N7p8J18j38Q6mm8Ml4R3
8730.5C5P0r2J0n8J36q3Qj2P1j65O3LJ4k6N8k1j30J02L9r5O9j5j9m7J26m5M2j0m3l2
8719d7j2J50m5o4L2o3N1j00J36o3N7Qp9N4O0j04J7p0QP5N9rp8R5j48J17q8L2K9nj9
8707.1a4L2m0P9j44R4j7l9J4L0M8l5Kj01J67k30J59mr7J2K7J28r0l8q2J50m0L7o1l3
8696h6R4r6J58n1rl9j19J29j3TK8P5J6n1N5o7N3j14J71k24M6O6k3O1j08P8j03R5M5
8684.8E4j08LOK2N4j31R6L2q1J05k6j2r6N8NJ2L2o5O3j25J14m2l2K8J8k9m1J16nmj46
8672.9a25J37J6o1j8K7Q6j18p0J42o4M2p1R4L7j69J61L1j11n2J61n6N4o5J6r0Q7j84
$$ plain form
8662.6 -163 68 10 36 4 -60 57 -33 17 -116 18 -50 46 -25 3 -61 65 -28 -34 -92 -40 -23 3 -59 29 1 -64 69 -9
8651.8 -9 -7 6 26 42 -55 3 26 -96 22 34 -43 35 44 92 20 -76 -75 -46 -28 -2 42 5 63 40 -52 70 -5 -9 37 31 -14 113
8639.5 113 -113 -20 50 -35 -55 -30 1 8 16 9 50 -58 -62 -77 -57 -92 -41 -32 -81 -20 -41 -96 16 11 -17 12 -79 59 87 74 40 -79
8627.3 -79 7 27 44 30 -75 -52 24 -43 -29 77 16 -123 -49 5 -108 -8 -15 -15 -13 76 -25 25 -77 -23 20 6 68 -54 22
8616.1 22 -13 11 -7 31 -70 13 -128 -55 -16 53 39 2 22 -26 5 -41 -59 17 -15 -7 -49 48 -88 -44 5 -72 -21 -126 -9
8605 -9 14 94 -47 -25 -73 25 4 12 -13 -20 -18 22 -59 -92 -22 12 176 -32 50 -47 86 -11 88 39 16 59 -60 8 6 16 -47 -37
8592.7 -37 82 -88 25 -71 16 -6 -37 -88 -12 20 13 67 -53 30 -8 40 -33 -51 39 19 -56 -32 -15 -86 31 -12 33 18 -21
8581.6 -21 8 -50 0 -21 -68 -132 2 2 -28 60 -69 9 92 -5 62 -25 -34 -66 -17 -33 131 -74 46 27 33 32 40 -62 -18 -1 -47
$$ packed form
8662.6a63K31n8K6l2o4J17r0N0j33J34o8R6p1K8o4J26r3on8N2J7K6o2Q8k8o5J33p8
8651.8iKJ3K0J6r7N8K3j22J18J2p7P8RM8p2r6JK9J8K6M4l7N8k3r2J22p5mM6om5J27
8639.5A13k26R3P0q5k0K5L1PQpM1j08mj5K0l5N1Rm9O1k1n5J12nk8K9r1J38K8j3l4j19
8627.3g9Q6K0J7j4j05K3P6o7J4J06o1j39P4N4j13J00p%KQ9j01N0j02N4M3j4O2j22P6
8616.1B2l5K4j8L8j01Q3j41P3L9O9j4l7K0m8L1m6j8P6l2Qm2R7j36M4M9p7N1j05J17
8605iK3Q0j41K2m8R8k1Qk5pKM0q1l3P0L4J64k08Q2r7J33r7R9m9k3M3j19O8kJ0o3J0
8592.7c7J19j70J13r6Q7k2l1n1P6L2pN4j20Q3l8M8p3j8R0k0p5K4J7p1J17m3M5j5l9
8581.6b1K9n8N0k1m7o4J34%l0Q8j29P8Q3r7O7q7rl2M9j6J64k05J20j9OjQj02M4J7m6
$$ plain form
8569.7 -47 -16 -7 -11 42 -57 81 -132 31 -50 -35 -54 -44 110 -130 -69 -31 47 -55 11 13 -36 37 -17 -68 -47 -59 3 40 50 -41
8558.2 -41 75 26 -69 42 -59 -63 -22 -91 20 21 4 -37 -13 35 -88 -58 -107 11 -12 -18 -18 -40 87 -145 -32 -69 -38 34 123
8547 123 89 17 8 17 -74 42 0 3 -54 -58 56 31 27 45 35 52 33 -1 -6 95 -109 18 -179 14 95 -36 -44 -86 -40 38 7
8535.2 7 62 -58 -19 11 -53 -25 3 47 -63 -18 50 36 -45 95 30 -49 -88 33 -10 45 61 -112 -32 43 15 -67 -13 62 -29 56
8523.6 56 -80 -93 -58 24 -80 -16 55 31 7 26 -26 19 -64 -28 -3 -30 -68 -46 45 -28 -42 7 -40 -51 -77 -13 32 64 -136 32
8512.1 32 9 -16 44 -91 -14 -26 -50 38 36 -16 -62 65 -68 -39 -64 -17 -60 4 43 95 -77 26 51 -39 124 -70 19 43
8501.4 43 7 59 -39 -99 81 -34 -48 -8 12 -12 -86 50 17 -28 97 -11 43 39 37 -23 58 -58 -72 -28 72 8 -53 49
8490.6 49 -29 -51 -11 5 -59 -116 -17 53 13 -94 -25 -68 21 -20 32 -43 13 96 -126 78 20 -62 -2 16 23 19 -39 102 39 -50
$$ packed form
8569.7d7L1RmN3r9J38k13J63q1J5j9J0J54k40O1L8P8j02O6Km9P3n4n1K1j2O2L7J0r1
8558.2d1J16m9r5J11j01mM1o9J11Jj7m1K4M8j23L0m9J18k3o%k2J27k32J13l7L1P2Q9
8547A23l4p2rRr1J16m2Ln7mJ14k5mJ8j0J7j9l4nJ01k04J27j97J93Q1j31qm2M6P8l1
8535.2GN5j20L9L0o4K8TM4j10M5O8j4q1J40o5p9l9J21m3N5J6j73Q0P5k8q2N4P5r1Q5
8523.6E6j36j3L5Q2j04O4P1k4TJ9n2M5q3L6K5k7l8K2R1p3j4M9m7j1k6O4M5L2k00J68
8512.1C2k3k5O0j35P7j2k4Q8kn2m6J27j33K9k5M7m3O4L9N2j72J03K5r0J63j94Q9K4
8501.4D3l6N2r8o0J80j15j4M0K0k4p4J36l3m5J25j08N4mko0Q1j16j4M4J00o4o1J02
8490.6D9p8k2M0J6o4n7R9P0m0j07O9m3Q9m1N2p5N6Q3k22K04n8q2O0J8Pmn8J41o3q9
$$ plain form
8479.1 -50 -38 -32 5 68 35 -54 64 -83 30 2 -84 -27 18 -83 30 -51 3 -70 0 49 140 -11 25 -39 -113 -10 9 60
8468.4 60 -57 -27 -22 14 -53 -24 13 -33 -94 -44 -13 -44 24 -74 -31 -43 -20 101 18 -78 -24 39 10 -105 65 83 -1 -62 -13 -43
8456.9 -43 -159 -70 32 -1 -6 -76 10 53 76 26 -8 -99 -87 74 7 34 -17 -38 17 -6 -103 77 33 -6 36 -82 -7 -70 24
8445.7 24 -29 9 -34 5 -23 -10 -96 69 -18 22 13 31 1 77 -26 106 -89 28 70 -14 -26 -38 -40 -38 -85 36 -4 -33 -83 -55
8434.2 -55 -43 41 106 -27 -58 -37 101 -8 -2 -31 -66 -63 -86 -23 14 -4 -47 -34 57 23 -47 -51 -139 -24 36 -4 -84 -4 -89 6 29
8422.3 29 -1 44 27 -67 -9 4 -58 64 -115 48 -54 -37 -11 -62 17 -92 -28 15 -6 58 -42 -96 91 16 -31 -30 -82 22
8411.6 22 -6 -109 9 -9 26 -48 49 -22 53 -6 -53 65 78 -61 -3 -67 5 -1 45 3 -48 77 1 -52 -36 78 17 -28 6
8400.4 6 5 -38 95 -62 34 26 -60 -6 10 -37 23 -33 -63 11 -1 -57 -112 -67 20 -33 63 35 -102 23 -106 -32 52 33 44 8
$$ packed form
8479.1e0J2OL7O3l3q9J18j47J13k8q6N7M5j01J13q1N4p3P0M9R1j51L6o4p4J03J9N1
8468.4F0j17L0NL6o7K9L7m6o1N0L1l1O8r8M3j2K3J21q3r6N4O3k9j15J70J8q4o1M9l0
8456.9d3j16Q9J02l3np0Q6M3K3n0l4r1J2J61o7K7n1k1N5k3r7J80m4l9M2j18P5o3R4
8445.7B4n3L8m3L9k8J3q6J65q7M0rJ8l0P6j03J32j95J17M2q4j2TkKm7J21m0k9n0K8
8434.2e5J2Q4O5j33l1K1J38j09Ok9l5Lk3O3L7j8m3J3R1l4p0mq8J15O0m0q0Q0q5R5K3
8422.3B9l0M5j7r4N8J3o2J22j79J63j02J7K6n1P9j09O4M3k1O4j00n4J87p5m7Jn2J04
8411.6B2k8j03J18j8L5p4R7p1P5n9m7J18J3j39N8o4P2oM6m2n1J25p6n3J6J14o1m5L4
8400.4Fjm3J33j57R6qq6N4J6m7O0n6l0P4j2n6n5M5Q7n3R6k8j37J25j29P4Q4j9J1l6
$$ plain form
8388.9 8 26 143 -6 23 -14 -35 -35 24 34 -17 35 -30 -43 -6 35 -11 43 8 -22 -15 -65 1 7 59 -79 -53 -55 -11 -71 -10 -140 8
8376.6 8 -24 32 6 -113 44 -87 -52 42 78 6 -17 15 -74 48 -54 21 -70 46 -26 -100 -20 9 -48 -7 27 -6 -20 14 -4
8365.5 -4 73 15 16 -140 9 27 -116 12 -95 1 122 -45 13 49 -10 43 26 -71 -39 -28 40 46 -63 -40 -95 -35 -105 12
8354.8 12 1 -32 39 -79 -48 -90 24 2 50 -42 -39 111 41 -94 -105 22 -4 10 39 -19 58 8 -31 -24 7 -90 80 101 32
8343.6 32 -47 31 4 -116 -23 -108 -39 -31 42 -122 -19 -17 -20 114 -5 40 29 -114 34 35 109 -18 -15 -30 45 -13 -75 22 39 -1
8332.1 -1 37 -14 -45 1 20 75 -81 10 -15 -67 11 18 19 -15 -31 18 25 -42 9 51 -26 18 48 -51 -32 -61 -16 -69 -22 -126 -50 79
8319.8 79 -23 -81 -40 -42 14 18 -77 -52 -61 43 -1 74 -26 48 -35 22 -20 -78 -106 -13 -19 -149 22 12 -2 55 5 -38 -78 -16 6
8307.9 6 -56 -76 -16 0 -5 -16 -40 1 -3 -25 -24 -36 -28 -68 -18 26 53 -39 -16 -48 -99 7 -4 62 -61 -117 42 -39 -97 -23 46 2
$$ packed form
8388.9HJ8J17j49K9l7k1%N9J0n1N2o5j3L7M1m6N4l5l0Pn0O6ON2j38K6kM4o0O1j30J48
8376.6Hl2N6k6j19J57j31L5R4L6p2k3L2q9J22j02P5r1J16p2p4Q0K9n7M1L4l3j4L4j8
8365.5dP7n8Jj56J49J8j43J28j07R6J21j67N8L6n9N3j7r7L2J1O8Oj09K3n5O0p0J17
8354.8A2j1l3P1j18L1m2J14k2M8r2LJ50p0j35j1J27k6J4K9n8P7n0l9PL1r7J70K1o9
8343.6C2p9P8k7j20R3q5O9QP3j64J03KlJ34j19M5j1j43J48JP4j27Lj5P5n8o2R7J7m0
8332.1aL8n1l1M6J9N5j56R1k5n2P8PJl4j6M9Po7N1M2p7M4L0r9J9k9M5n3M7j04P6J29
8319.8G9j02n8M1kN6Mr5K5rJ04m4P5j00P4q3N7m2n8k8R3oj30J71j0j4N7n0m3m0O2K2
8307.9Fo2k0O0J6nj1k4M1mk2Jj2Qm0N0M4K7r2K3l2n1J06j1O6j23n6J59q1n8P4O9m4
$$ plain form
8295.7 2 26 87 130 36 -3 -97 -16 80 23 -10 15 -14 60 -16 60 38 -35 -76 -92 75 -127 -84 26 -21 76 37 61 82 -24 -5
8284.2 -5 24 -28 14 -82 30 -16 -62 -49 17 74 -60 20 -65 18 8 75 -9 9 4 5 -13 -28 -69 17 43 -3 4 9 -13 45 -68 5 -87
8271.5 -87 -33 52 -39 44 13 -42 -77 -52 79 -84 7 72 83 -38 -9 6 -38 4 -77 36 -29 5 -5 84 -14 -75 -82 -73 -51 -24
8260 -24 23 56 -70 32 -24 6 -78 -49 14 48 -66 -70 -35 26 14 43 -60 35 -36 22 -40 -58 -71 60 47 -84 -29 -9 -70 -45
8248.5 -45 11 -54 52 89 32 100 15 22 -61 -16 23 -43 45 7 -72 -84 -147 52 -61 59 -5 -17 118 -55 38 -50 -51 -11 -15 10
8236.9 10 -46 -60 53 42 -61 41 -4 8 9 -28 -14 -19 -18 39 -9 -59 -33 1 73 6 -5 -6 4 -51 26 -16 -50 -66 -11 -90 -94 -7
8224.7 -7 69 -77 -51 51 -14 -1 42 73 61 -10 28 53 87 62 -3 -45 -100 -114 -2 30 -14 14 1 4 -13 14 -73 -30 27 -69 -43
8212.8 -43 -83 -78 -145 -11 -97 -1 -44 -66 43 92 73 -99 31 -99 -73 -63 -3 19 -113 -57 -13 9 -65 -101 -34 29 36 94 -12
$$ packed form
8295.7BK4O1M3r4l9r4Q1R6n7l3K5k9P4p6P6k2p3m1j6J67k02M3J10m7R7l9K4K1j06J9
8284.2eK9n2M2r6J12m6TJ3O6N7j34Q0q5Q3j0O7q4J8nJj8j5m1Q6K6m6PNk2N8j13P3r2
8271.5h7N4Q5r1Q3l1n5l5K5J31j63R1O5J1j21K9J5m4M2q1J13o5L4j0Q9r8o1pRK2K7
8260b4M7L3j26J02n6L0q4K9O3L4j14mL5O1j2K9j03R5p1N8o2j8j3J31j3j31N5K0o1K5
8248.5d5N6o5J06L7n7O8q5Pq3M5L9o6Q8l8p9j2o3J99j13J20o4j2J35j73R3q8jM0mK5
8236.9A0n6j4J13j1j03J02m5J2Jl7J4nJN7m8n0K6L4P2o7j1jJ0n5P7m2l4j6N5p9mQ7
8224.7gP6j46K6J02o5J3M3L1j2p1L8K5L4k5o5m2n5j4J12L2m4K8j3Lj7K7q7M3N7r6K6
8212.8d3m0No7J34q6R6m3k2J09M9j9j72J30j30K6J0O0K2j32N6M4K2p4l6O7O3PN8j06
$$ plain form
8201.6 -12 3 -22 18 40 59 98 63 -38 12 -61 24 15 -25 -13 61 -30 54 -43 -92 -50 -63 -7 133 9 47 7 -45 -2 62 23
8190.1 23 -91 -53 131 -49 -104 -91 -5 -16 25 -43 17 -52 -156 64 -7 -30 -59 -63 20 7 -95 51 60 -40 10 -102 -72 15
8179.4 15 106 -47 33 -77 -11 23 -35 10 23 -17 11 43 -57 -7 8 -120 50 -40 45 -3 -79 49 -8 -97 14 14 -88 21
8168.7 21 -39 -50 -20 -61 22 -49 34 23 -145 -87 27 53 -14 -12 -24 61 -18 63 35 -84 -22 -6 -41 87 24 38 23 -27 -28 -40
8157.2 -40 -18 0 -105 -82 -12 -8 26 4 114 -3 -85 -16 5 -11 8 -7 -71 55 -20 -39 -52 -35 -17 19 -98 -4 34 43 -109
8146 -109 -52 -106 -18 10 114 72 -119 -14 -24 80 73 -61 -57 41 -18 46 -10 59 -107 32 -61 -17 -33 -40 -45 43 -76 24 -61
8134.9 -61 -29 37 7 28 -26 -7 -13 -29 -30 95 21 122 -14 -103 -122 85 -29 -106 25 74 14 31 -16 -47 28 -3 -48 -8 50
8123.8 50 42 37 45 64 -29 -1 -71 36 -137 -58 12 4 -48 28 27 -78 54 17 19 35 63 -20 51 42 -56 -21 125 -37 -107 17 53
$$ packed form
8201.6a2J5k5M0K2J9L9l5j01N0p3Q5rm0J2P4r1Q4r7m9M2j3N6J40j24L8m0n2M3O4l9
8190.1B3j14L8J84j80n5J3Q6j1M1o8O0o9j04K20p1k3k9mQ3j3j02J46Rj00N0j12L0Q7
8179.4A5R1j53Q0j10O6L4n8M5J3m0K8L2j00N0J5j28J70r0Q5m8p6J28n7q9J11%j02J09
8168.7B1o0j1L0m1Q3p1Q3j1j68N8J14K6o7Kj2Q5p9Q1k8j19O2J6l5J28o3J4j5n0jj2
8157.2d0K2J8j05K3P0ML4k2J10j17q2O9K1j6J9j5o4J26p5j9j3J7J8L6j17R4L8Rj52
8146a09N7n4Q8K8J04m2j91J05j0J04pj34MR8n9O4n6O9j66J39r3M4j6pnQ8j19J00q5
8134.9f1L2O6l0K1n4J9oj6jJ25p4J01j36q9j9K07j14p7J31M9o0J7m7l1P5l1m5M0N8
8123.8E0qnQJ9r3K8p0J07j73P9P0qn2P6jj05J32l7KJ6K8q3P1rr8L5J46j62p0J24L6
$$ plain form
8111.9 53 54 -4 23 11 36 -26 -2 52 -24 103 46 131 -26 74 -14 47 56 -45 -29 -91 -46 -21 34 -69 -12 2 67 -53 15
8100.8 15 -23 63 -66 -89 7 -58 -44 -85 -28 -47 35 -56 152 -58 13 7 -9 -84 54 42 27 -17 -60 9 117 32 -46 -109 6
8089.7 6 -86 14 10 -128 -5 -27 -81 -37 -42 -59 5 -72 64 95 -6 -86 -11 47 -53 -47 -7 -60 82 -22 -60 0 -97 89 -80
8078.6 -80 -60 -97 31 52 100 6 -10 10 -58 11 86 68 53 37 22 -32 55 -87 16 -48 -18 -2 -100 -10 34 -45 12 77 30 -26
8067.1 -26 -10 -43 -30 37 -109 -13 5 -73 -36 2 -80 25 -37 -25 5 1 31 -52 -167 -26 -27 -4 -12 11 -44 -36 20 -93 44 -79
8055.6 -79 -71 -35 60 60 25 71 32 -30 -76 -26 4 -64 -38 58 -80 72 14 -42 4 -41 80 40 22 -86 -17 16 -94 -25 -32 67
8044.1 67 -111 47 5 -5 -52 -2 -32 -115 -36 38 -77 -26 -83 -41 -43 37 53 41 26 -59 58 -18 -15 -43 -42 -40 -44 3 18 -5 20 105
8031.8 105 72 39 14 33 -91 -30 -62 -31 -11 -66 -110 -41 -12 49 61 -104 99 -71 -49 -46 1 34 -72 37 -55 78 -52 -37
$$ packed form
8111.9E3Jn8K7j2K5o2K4N4p6J27n7Q5j57J00q8O1Rj01J6o2M5K5N5j03N7J4O5j20O8
8100.8A5l8Q6j29k3R6o5J4m1N7j9Q2r1K08k10P1oj6p5J38j2j5m4m3O9J08q5p8o3J15
8089.7Fr2J00mj38J23k2n4M4nj7O4p7J36L1j01q0P5N8j00OM0n3J42j04l8O0r7J86j69
8078.6h0K0l7J28K1M8r4j6K0o8O9P5j8j5j6j5n4Q7j42J03o4L0J6r8R0M4p9N7O5m7n6
8067.1b6J6l3J3O7j46R6J8p8L7L8q2J05o2J2L0mL0q3j15J41jK3qK3n5QN6j13J37j23
8055.6g9QL6R5%l5M6l9o2m6N0L0o8K6R6j38J52n8n6M6m5J21m0j8j08O9L3j10O9pR9
8044.1F7j78J58m2j0m7N0l0q3P9P4j15N1n7M2kQ0J6j2j5q5J17p6Lk8JKmM7J5k3K5Q5
8031.8A05l3Tk5J9j24O1l2L1K0n5m4O9K9O1J2j65K03j70K2LM7L3j06J09r2J33j30J5
$$ plain form
8021.1 -37 -4 175 -48 -60 -1 11 -6 -30 -53 -114 44 53 -12 17 -29 -33 -137 -74 -58 -61 -64 1 -17 -41 -119 19 -84 -8 8 51
8009.6 51 -6 6 85 -2 -67 -5 -32 10 -41 -18 -70 34 -45 85 30 -69 -25 46 59 -7 24 -77 -55 -23 -24 -14 26 36 60 -60
7998.1 -60 -28 3 49 2 -50 -61 34 18 12 -34 -117 -18 -99 -2 -52 -34 23 -58 73 77 78 23 76 -53 -94 -16 85 -25 -130 -21
7986.6 -21 19 -53 21 23 10 8 -11 -11 83 -31 4 -67 -53 15 -48 52 24 49 -31 56 60 -20 -1 -33 -25 77 27 8 -89 -37 64 7
7974.3 7 -132 1 -38 27 -77 -14 98 -22 -7 13 13 11 17 84 -35 24 68 31 -42 31 16 -56 84 -99 -51 -14 99 -178
7963.6 -178 36 -24 -63 49 62 -28 -9 -13 -29 -86 -9 -50 -64 -8 91 28 42 0 -65 -15 -36 -46 -48 -47 83 28 -132 -63 -22 -101
7952.1 -101 -17 -9 70 -14 54 -86 10 -79 -32 -30 -101 1 50 -16 34 43 -23 -95 -30 1 -30 -8 -35 44 52 15 -111 -28 78 125 49
7940.2 49 32 17 -26 33 -46 -51 -113 -39 -27 61 58 22 -35 -19 57 16 -11 -2 -26 87 -33 -61 -102 6 -22 -15 -33 -75 -71 -6 22 29 97
$$ packed form
8021.1c7L3J79k23j2N9J2j7k4k3o1J58Ro5K9m6mj04O3J6lTO5j8k4p8J38j03P6J6M3
8009.6E1n7J2P9q7o5O2k7M2n1K3n2J04p9J30n5r9M4P1J3o6L1j01K2L2jJ0M0J0K4j20
7998.1f0L2L1M6m7n2j1R5j6om6q3R9q1R7n0J8N7q1J31MJn5N3j29m1P8J01j10j05J09
7986.6b1M0p2P4Kj3kj9%R4j14L5p1J4O8o3J00k8K5q0Q7Mq0J9l2QJ02n0j9r7N2J01n7
7974.3Gj39J33l9O5j04O3J12j20J5K0%kOO7j19N9M4l7p3P3j5p2J40j83M8L7J13k77
7963.6a78K14o0l9J12J3r0J9mj6n7P7m1j4N6R9o3J4m2o5N0k1j0kJJ30n5j60O9M1p9
7952.1a01Q4QP9q4O8j40R6q9M7Kp1J02M9o6N0Ro6p2O5L1l1K2k7P9Ql7j26Q3J06M7p6
7940.2D9j7j5m3N9p9no2P4J2Q8ll6n7J6P6m1k7Rk4J13j20k8m1J08k8Pj8m2MO5K8PO8
$$ plain form
7927.6 97 91 5 -42 41 -109 93 1 -8 -34 49 68 -48 17 -49 18 30 -31 -64 -140 -89 -35 48 -93 -51 61 -60 52 63 -64
7916.4 -64 34 16 49 0 23 8 31 61 27 -3 5 -66 -61 -58 79 -64 31 -68 73 -46 21 -99 58 -61 7 -56 -15 -17 72 -35
7905 -35 -55 -37 3 -29 -67 68 -36 -102 34 9 -62 -65 -120 118 -23 -35 92 -38 -68 58 -21 -93 52 -61 70 -27 -79
7894.6 -79 11 -56 -65 10 -84 -64 -19 45 -52 -45 58 86 20 -19 -71 -66 -2 40 -8 -105 -30 5 -66 9 66 -28 -10 -2 -35 22 -51 -51 62
7882 62 69 -28 38 19 30 74 49 -28 -93 53 -19 4 46 -24 -124 58 -26 -67 4 -24 -154 -173 -46 -34 -3 79 7 -36 -5 90
7870.5 90 -20 -127 -59 39 -73 58 61 -68 -56 65 -79 -15 -71 -57 -10 60 -56 -20 -26 27 -42 0 8 -17 83 33 -60 36
7859.7 36 -79 -96 40 -8 -53 -61 94 50 -38 94 -79 -45 -9 16 4 41 -22 -12 28 21 89 -43 37 -21 -38 -39 26 -35 -16 -22
7848.2 -22 3 34 34 -134 -38 0 87 8 0 -39 14 -33 -62 -98 95 14 -73 -64 -56 40 41 -74 -36 -131 74 -22 -49 -18 -65 22 40 -94
$$ packed form
7927.6I7oq6m7Q3j50K02r2rk6Q3J9j16O5o6O7J2o1l3p6N1N4Q3j41M2J12j21J12J1j27
7916.4f4R8j8L3m9K3j5K3L0l4l0Qp1NLJ37j43R5r9J41j19O7j20J57j19O8o3M1kQ9j07
7905c5k0J8M0l2l8J35j04o6J36k5p1ln5K38j41j2J27j30l0J26p9p2J45j13J31r7n2
7894.6g9R0o7rP5r4K0M5O4r7PJ03K8o6l9n2NO4M2m8r7P5L5p1P5N7r4J8Ql3N7p3%J13
7882F2Pr7O6j9J1M4k5p7o5J46p2K3M2p0j00J82q4m1P1k8j30j9J27J2L1Q2p2m3L1R5
7870.5I0j10j07O8R8j12J31Lj29J2J21j44O4n6J4M7P0j16L6oN3o9M2Qk5J00n0r3R6
7859.7C6j15j7J36m8m5qJ55m4q8J32j73L4L6K5j2L7o3J0M0pO8j32Q0n8j7jO5o1J9o
7848.2b2K5L1%j68R6L8Q7p9ql9N3m7k9l6J93q1q7RQR6Jj15L8r5K05r6k7L1m7Q7J8j34
$$ plain form
7836 -94 -12 -9 -29 64 33 16 -19 -71 127 -21 -31 11 -7 -1 17 -3 -18 -32 -59 9 100 44 -75 -34 -45 -16 -92 -14 10 77 35 15
7823.7 15 4 -14 13 55 -91 41 18 -40 19 29 -40 -14 -76 -29 31 -29 -21 -190 -46 -15 -60 -28 89 43 30 3 74 -98 22
7812.6 22 -65 -15 2 -29 -55 9 -23 -19 -53 -1 -9 -32 -22 27 -46 -16 -92 -56 38 -92 75 -94 42 79 -32 -29 -52 -4 0 70 -78
7800.7 -78 39 -40 -20 -6 -145 9 66 -62 11 23 -98 -85 6 -28 -35 -75 -55 -63 -64 -58 1 11 1 64 65 -24 -5 -148 -38 -60
7789.2 -60 63 -29 -37 -12 -44 19 96 -64 -72 30 -65 -25 -129 11 22 13 -26 63 -16 -33 -125 -57 -83 35 -40 83 -43 23 -30
7778.1 -30 26 28 7 80 -55 -24 59 -84 4 -28 20 -22 2 23 14 -125 -15 21 -6 -65 12 51 -36 56 85 68 -31 -64 1 -41
7766.6 -41 -41 88 56 26 -26 -85 -44 -14 -3 -39 -34 -64 39 -17 12 114 10 5 28 -62 -25 -3 -60 4 63 -68 -62 9 -47 -88 140
7754.7 140 12 -16 -35 -12 -11 33 -11 -27 -5 -139 -55 -8 -25 -29 -25 -4 -4 -28 6 -11 -89 9 16 -67 17 -11 12 82 15 -97 -22 -11
$$ packed form
7836i4Q2Lk0R3l1j7l5n2J98j48j0M2j8OJ8k0j5j4k7O8R1n6j19M1j1K9p6P8K4O7m2k0
7823.7A5j1j8K7M2j46J32k3n8N9J0o9K6o2M7O0o0Qj69J44L1m5L2J17m6j3k7P1j72J20
7812.6B2q7N0J7l1k6O4l2Ml4N2qk3J0M9p3L0p6L6R4j30J67j69J36L7j11Lk3M8MP0j48
7800.7g8J17p9K0J4j39J54N7j28P3J2j21J3R1l4pm0K0qjON9J0j0O3Jq9J9j43J10k2
7789.2f0J23r2qK5l2O3P7j60qJ02r5M0j04J40J1rl9Q9p9j7r2O8k6J18p5J23j26O6n3
7778.1c0N6Kk1P3j35L1Q3j43Q8l2M8m2K4K1rj39J10L6k7n9P7L9q7R2K9j7r9l3O5m2
7766.6d1%J29l2l0n2n9M1L0J1l6Nl0J03n6K9J02j04nK3r0L7K2n7O4N9j31OP1n6m1K28
7754.7A40j28k8j9K3JM4m4j6K2j34Q4M7j7mMK1%k4L4j7p8R8Pq3Q4k8K3P0o7j12P5J1
$$ plain form
7742.4 -11 -48 -95 -112 -40 -1 39 66 -72 -114 10 4 -30 -60 -1 -6 42 -7 32 -3 51 -57 35 -14 16 -69 -12 42 -43 -82 -4 -5
7730.5 -5 26 -74 14 86 68 -10 -34 -59 -33 64 -59 -7 65 24 153 -83 -11 75 0 62 -49 -158 -27 -70 27 11 -27 -18 -2
7719.4 -2 -11 -18 -74 59 -72 39 -85 -48 -2 -20 -12 1 -66 -49 -2 -39 -17 -9 55 12 53 -8 30 38 -51 -63 -12 -36 81 7 13 -34
7707.2 -34 30 2 48 40 11 -1 19 66 -10 -34 -63 36 -83 25 -70 83 73 16 1 42 7 -19 7 70 37 -34 -86 43 -51 8
7695.7 8 -31 -105 46 33 2 -56 -127 -7 -101 -3 -52 4 60 41 23 -56 -51 3 -48 15 -84 91 -73 -29 85 -119 8 -66 9
7684.6 9 -3 -68 -38 31 -13 -54 52 4 26 32 -34 -29 -3 -3 -9 37 -44 -70 -53 -54 -64 -52 -14 -97 7 13 -165 -131 7 32 -41 36 -64
7671.9 -64 -20 -27 -37 -56 13 -68 56 79 9 32 -15 -75 -86 92 -70 -38 2 44 -26 -22 -88 -18 3 17 -48 130 31 25 117 -9
7660.4 -9 -97 4 -63 -25 14 46 20 -45 -135 60 47 107 -24 -15 40 -57 96 51 -12 3 -25 -52 -78 -16 -42 -49 51 -29 12 -74
$$ packed form
7742.4a1l7m7j7P2L9M0K7j38m2J24ol4l0N9nM8m9L9l5N4j08R2m9L0q5N7N4q5l9P8j
7730.5eL1j00Q8P2j8p8k4k5K6R7j23N2P2m1J29k36P2Q6p5O2j11j09J31m3R7j6l8RJ6
7719.4brpn6J33j31J11j24L7M6j8QJ3o7J7M7l7K2QO4m3M1o1L8Qq9j2N1k4J17p4Om7
7707.2c4O4k8M6qk9j2K0M7p6k4k9R9j19J08r5J53j0n7j5M1l5k6K6O3l3p1n2J29r4N9
7695.7Hl9p4J51j3l1n8p1J20r4R8m9N6Tj9j8p9NN4n1O3r9J75j64M4J14k04J27p4P5
7684.6Ij2o5L0O9m4m1J06m8K2Oo6NK6%oM6q1k6J7jj0J2L8q3J04Oj78L4J38K5p3P7j00
7671.9f4M4pj0j9O9q1J24K3p0K3m7o0j1J78j62L2M0M2p0Mo6P0K1J4o5J78r9oR2j26
7660.4iq8J01o7L8L9L2k6o5r0J95j3O0j31RN5r7J53m5o3J5k8k7k6O2k6pJ00q0M1q6
$$ plain form
7648.9 -74 -111 5 -4 -22 20 -26 -39 -7 24 -11 -37 -8 -60 -90 -108 -72 62 59 50 -62 -20 24 59 -19 -5 -106 -42 92 85 -8 14
7637 14 -50 -47 -18 76 -33 -26 -83 0 12 62 3 -31 -27 -87 -62 -57 29 16 0 -92 -50 -63 44 -26 21 -98 -26 69 87 -16 29 6
7624.8 6 -40 53 121 -15 -16 -75 -49 1 5 -63 -115 -74 124 15 -37 12 21 -51 -31 -20 -11 -65 -59 -34 -47 -9 -63 -10 -12 -127 25 -47
7612.5 -47 65 33 -14 -51 31 31 -73 -10 -106 -12 -122 30 10 -14 -45 93 -4 -100 0 -68 -37 63 -17 42 -104 -12 -22 12
7601.8 12 8 -90 -70 -29 -17 -16 86 -52 45 22 -81 29 74 7 22 121 94 78 -21 -29 -9 -22 -65 -83 10 56 30 12 -92 -34
7590.3 -34 6 41 8 -59 -107 -19 22 -81 -10 -39 103 47 42 -42 -5 21 -162 -20 -84 -80 -64 35 -152 -62 -34 39 -84 -115 15
7579.1 15 -44 1 2 12 69 -132 33 -40 7 -60 35 -58 40 -16 28 -21 -62 57 -17 14 66 12 -64 30 50 13 2 0 47 -54
7567.6 -54 39 -72 52 64 -7 -17 -47 134 58 14 66 -45 25 18 -22 -72 -2 -20 -69 -86 -80 -43 76 -57 -50 -42 -102 42 37 -52
$$ packed form
7648.9g4l7J16rj8M2m6j3L2L1l5k6K9n2l0j8L6J34lrj12M2M4L5p8J4j01O4J34pr3K2
7637A4o4LK9R4j09Pn7Q3J2N0n9l4Mo0K5NQ6j3j6r2M2j3J07p0M7j19P2R5J8j03M5k3
7624.8Fm6R3O8j36jn9K6N0Mo8n2M1J98j09n2M9Rp2K0J1Rn4OK5j3L8n4N3kj15J52p2
7612.5d7J12l2m7l7Q2%j04O3r6R4j10J52k0k4l1J38r7r6J00o8L1J00q0N9j46R2j0L4
7601.8A2mr8K0M1J2JJ02j38R7k3j03J10M5o7J5R9k7j6r9qK0j3m3j8R3M6k6j8j04N8
7590.3c4M0L5l3o7m8Q8M1j03P1k9J42n6nq4L7K6j83J42o4MJ6R9j87R0K8P3j23l1J30
7579.1A5n9M5JJ0N7k01J65p3M7o7R5r3R8n6M4m9m1J19p4L1N2n4p6R4K0l7j1kM7j01
7567.6e4R3j11J24J2p1j0l0J81p6m4N2j11P0pm0n0P0j8m9j7OL7J19j33PQo0J44nq9
$$ plain form
7556.1 -52 17 -41 57 29 56 52 -84 31 77 12 -36 -32 36 2 9 95 7 -14 9 49 -85 -7 -44 -38 -45 65 -14 -49 -81 -32 58 69
7543.9 69 -76 -28 8 70 -36 53 94 -2 -21 -68 -47 -8 -2 -81 148 3 -82 -95 49 -5 -61 -14 9 -51 6 -48 98 -73
7533.1 -73 -95 -105 77 -63 -36 -27 -1 32 -19 -44 -20 20 -42 -69 -4 25 -62 -68 -110 -35 -7 -47 -67 84 -61 7 48 -65 41
7522 41 36 -21 -53 -30 -40 -31 -93 5 -56 -17 -6 -10 -16 14 -58 -56 36 -1 -6 51 33 -5 -41 -89 35 -24 -9 -39 67 15 10 -50 46 -138
7509 -138 6 -8 45 -76 -24 -142 63 -84 -120 -23 -61 54 -86 -157 59 2 -125 25 -20 -114 16 -54 -11 20 69 13
7499 13 29 -6 -43 -3 13 -52 -19 46 29 -60 -36 -46 -77 -110 -123 -57 58 -86 -89 -1 -59 -63 -71 -33 -108 50 -4 128 93 30 -28 -93
7486.8 -93 28 -44 6 -4 68 -35 64 15 -1 -22 33 -128 14 -96 35 -106 -146 -126 0 -16 -44 123 73 68 -43 -43 -69
7476.4 -69 -3 -34 -50 -4 46 10 30 -68 -16 -33 -34 46 83 -56 -30 -34 -67 4 -50 15 -18 -15 -43 51 -15 5 81 3 -22 -63 -17 35
$$ packed form
7556.1e2O9n8R8k8K7mj36J15M6o5m8MO8l4PQ6q8k1K3M0j34P8l7OpJ10p9l5l2M9R0J1
7543.9F9j45M8L6O2j06Q9M1r6j9m7K1L9Op9K29j45q5j3J44n4n6M7K3o0N7n4J46j71
7533.1g3k2j0J82j40K7RK6L3n1k5K4M0o2k7O5K9q7om2P5K8m0k0J51j45O8M1j13J06
7522D1nn7l2K3j0Ro2R8o1L9J1moL0p2KR2l7nN7j8l8l6m8J24n9J5l0J06n2no0R6j84
7509a38J44j4N3j21N2j18K05j47l6R7l8J15j40p1K16n7j27J50m5r4J30p0M3L1M9n6
7499A3J6l5l7M0J6o5L3O5j7q9K4j0l1l3j3O6J15j44lQ8n8mqL8p5J58n4J32l5o3n8o5
7486.8i3J21p2N0j0P2j03R9m9j6k1N5j61J42j10J31j41m0K0J26j6k8J67n0nj11%k6
7476.4f9O6l1j6M6N0l6K0r8N2j7jQ0L7j39K6ml3P1n4O5l3Lk8R4o6K0P6p8k5m1M6N2
$$ plain form
7464.2 35 -39 -41 -17 -9 -32 56 -36 78 94 25 -68 14 -10 3 37 -103 -118 -6 -97 7 6 16 -8 0 15 -71 -26 9 -22 -52 -32
7452.3 -32 -56 15 -80 -35 -41 6 -13 2 -33 -1 65 131 -9 -13 26 -25 -66 19 -43 -64 -9 -50 -3 -120 -39 -26 51 -60 118 -37
7440.8 -37 30 62 50 90 -135 127 28 25 -37 -1 -151 -67 31 7 63 3 -67 48 -120 -8 3 -100 39 29 9 12 -21 -11
7430 -11 -41 -78 71 22 58 -6 -8 3 3 -52 5 -86 -57 -48 -27 2 43 -140 -48 -26 -80 43 9 131 -22 -83 -87 -18 -76 41 -111
7418.2 -111 -78 28 44 -29 -1 43 -63 -24 -91 -116 78 -22 -57 -54 9 20 26 28 -91 -55 -49 -59 -118 63 -37 -107 -26 74 84
7407 84 -43 109 -52 61 -17 -81 58 69 -20 -2 -17 39 -43 37 144 -55 -20 -41 28 -4 -72 -39 -50 -42 44 -91 32 12
7396.3 12 -80 3 -4 5 10 -59 49 -16 -108 38 -31 -47 -82 -5 49 41 44 23 22 -131 -42 29 -39 41 2 -2 18 -27 19 76 84 -5 -112
7383.7 -112 -5 40 61 -76 -37 10 56 33 -30 4 -66 33 -35 151 -67 -122 -30 8 8 53 9 -14 23 -44 -41 9 14 -73 -2 -81
$$ packed form
7464.2C5p4kK4Qk3Q8r2J14J6o9r3Q2k4J3L4j40j5J12r1J04jJ0k4QJ5q6M5L5l1l0K0
7452.3c2k4P1r5M5oM7j9J5l5L2O6Tj40mL9n1m1Q5o2k1N5m1M7j17Q1J3P7j11J78j55
7440.8c7O7L2j2M0k25K62r9lo2L6j50Q4R8k4N6o0p0J15j68J12J1j03J39j0k0Ll3J0
7430a1l0l7J49m9L6o4kJ1%n5N7r1K9RK1K9M1j83R2K2n4J23l4J22j53o1mO9n8J17j52
7418.2a11L3J06J6p3K8M4j06L9o7k5J94j00l5LO3J1OKj19L6Oj0n9J81j00p0Q1J00J0
7407H4j27J52j61J13p8o4J39J1q9J8j5N6q2Q0J07j99L5k1O9l2o8L3j1QQ6j35J23k0
7396.3A2r2Q3pRNo9J08o5r2J46o9j6l5P7N4qLk1jj53Q9P1o8Q0l9mK0m5M6N7Qq9j07
7383.7a12J07M5K1j37L9M7M6k3o3L4p0R9o8J86k18n5R2L8%M5m4k3L7o7LN0Nq7P1p9
$$ plain form
7372.2 -81 -68 40 60 37 -7 57 -44 94 -61 14 -114 -89 -26 -21 -38 -10 -81 -77 -25 -49 45 -73 3 -20 -154 -12 24 -34
7361.4 -34 35 51 -103 4 45 -71 -44 -53 31 -26 -47 159 18 52 -19 15 36 -5 -25 -92 -17 8 21 -10 -29 -20 -41 -45 -56 76
7349.9 76 18 35 -4 -93 19 -114 -35 3 -28 21 -62 -41 -53 -34 -55 28 5 20 -56 -1 -67 -19 -23 116 27 17 56 13 51 15
7338.4 15 51 -24 58 34 -17 -155 88 8 41 -6 -46 -16 -30 15 45 18 90 17 -124 -86 41 -14 -18 -51 37 3 101 27 17 -117
7326.9 -117 40 49 39 -12 -13 49 -80 -6 -44 -15 -48 43 -3 14 -25 -89 -39 20 -25 -79 -109 -28 -36 -72 -55 54 -91 -39 -51 43
7315.4 43 -3 -15 -34 -59 -36 80 -61 -1 49 -11 -37 -55 -56 39 47 -1 -3 17 -24 44 -8 43 49 -81 10 -33 -26 -120 10 -23 -18 4
7303.2 4 -41 -14 -51 -16 12 -63 10 -10 2 -108 62 16 -76 -47 56 -57 -166 -54 -50 5 -26 25 -10 48 -60 48 -27 6
7292.4 6 -58 -57 -58 16 -51 -72 159 -17 -150 -61 -91 -74 -74 38 -5 35 -98 -9 10 4 -10 -55 11 53 -76 74 45 -78 -102 25
$$ packed form
7372.2h1J3J08K0k3m4O4j01J38j55P5j28K5O3Nj7K8p1MN2k4R4j18P6k3j34J42L6n8
7361.4c4O9J6j54J07M1j16K7rQ4n7k1K06j41L4p1L4K1m1k0o7P5K5J3l1j9Rk1mj1J32
7349.9G6n8J7l9q9J12j33P9L8l1M9q3K1j2J9k1Q3k3J5p6N5o6M8mJ39q9j0L9m3L8l6
7338.4A5L6p5Q2k4n1j38K43q0L3m7m0L0j4M5L0k7P2p3j41L8J27n5ml3Q8l4R8p4j0j34
7326.9a17J57Rj0n1jO2j29P4l8K9l3R1m6J7l9o4N0N9m5n4l0Q1ql6J7J09j45N2j2R4
7315.4D3m6j2j9k5K3J16j41O0N0o0k6j8jR5Qm8kK0m1O8n2N1Oj30R1m3Pr4J30l3NK2
7303.2Dm5K7l7L5K8p5P3k0J2j10J70m6r2K9J03j13j09J12MN5l1N1l5N8j08J08p5L3
7292.4Fo4JjP4o7k1K31j76j33Q9l0J7%J12m3M0j33Q9J9oj4m5O6M2j29J50k9j23k4J27
$$ plain form
7280.9 25 -25 -25 37 8 -90 20 2 50 -59 -65 -34 -68 -26 15 -12 8 32 167 -37 -68 3 74 -9 -51 52 25 55 9 37 98
7269.4 98 86 -44 -65 53 11 -36 -111 -39 30 -93 22 38 -57 -6 -51 46 -88 127 -50 -39 106 -36 47 -94 92 -9
7259.5 -9 -36 -7 11 -26 7 -35 -52 5 1 -45 -42 5 35 -31 12 -34 -7 -78 -46 -47 -1 -30 -40 -87 50 6 34 -30 -63 33 -92 -22
7247.2 -22 -9 -10 36 -62 -28 38 -18 -11 -32 -24 -41 -37 -4 -29 -120 -69 40 -25 41 4 56 37 -42 -27 -32 8 -39 49 35 -60 14 -7 46
7234.6 46 -8 -23 21 -24 -106 3 -33 -108 26 -1 -27 36 -88 83 5 2 63 -114 54 16 60 -38 -8 -50 -5 -23 -56 19 47
7223.4 47 6 40 -94 42 23 -65 -18 11 -125 -3 101 11 9 29 -94 -106 -11 -55 17 94 -77 38 23 80 -52 -60 15 -33
7212.7 -33 -22 -29 -3 -26 -86 -87 -97 -7 -18 53 36 -49 -10 -81 -16 -59 -34 46 -40 -31 2 -77 -45 -4 -72 -12 49 -22 6 3 -22 -40 -6
7200.1 -6 79 55 -52 -3 41 -23 -83 5 -74 -42 -12 11 -46 43 59 -65 -53 -66 8 -25 19 -62 13 -76 83 98 -1 16 -112 22
$$ packed form
7280.9B5n0%O2k9r8J10j8M8j09oL1l4M2M1k7K0K4J35k04l1P1Tq3m2J03k7L0m6K8O1
7269.4I8j2j30k1J18m2m7p5P2O9j23J15J6r5N1m5R7j34K15j77J1J45j42Q3j41J86j01
7259.5ik7K9J8l7L3m2j7N7mm6LM7L0o6M3m6K7p1L2jM6k9j0m7J37m4K8o4l3R6j25P0
7247.2b2J3jM6r8L4O6n6Pk1Qj7ML3k5r1N1J09o5O6l7N2j9p9J5nM0m7Q8j4r5P4k1N3
7234.6D6n4j5M4m5q2J09l6p5J34k7k6O3j24J71p8lO1j77J68l8M4r8L0m2M5j8l3P5K8
7223.4D7m1L4j34J36j9q8M7K9j36J22J04r0kK0j23j2R5m4P2P7j71J15j5N7j32qP5m8
7212.7c3J1pK6k3o0jj0R0j1P1j7q5L9p1O5m3K5Q0q6RL3p9L2M1o8O0O1p1K8lk5j8L4
7200.1fQ5k4j07M9M4o4o0Q8p9L2L0K3n7Q9J6j24J2j3P4l3M4q1P5q9J59J5r9J7j28J34
$$ plain form
7188.6 22 8 40 37 -7 -5 -35 -82 21 -27 62 -88 61 28 31 4 -15 -4 -2 -33 48 -20 -28 -38 105 -21 69 -87 -57 53 84
7177.1 84 83 -121 22 58 -27 13 -38 2 62 -26 -3 14 -2 -22 -6 -47 -43 2 2 2 48 -14 -48 -47 -78 14 -69 55 32 -69 8 -2
7164.8 -2 -29 61 -59 -57 31 63 -65 114 -70 18 -25 36 -34 77 -74 -55 90 45 3 -110 -93 1 38 -9 -32 -35 47 -56
7154.1 -56 94 -44 -60 -48 -2 9 26 -14 53 -42 17 5 -35 -5 -150 21 -83 -28 -28 0 24 -50 -8 -52 -43 26 -62 -21 -11 21
7142.6 21 -28 -10 32 -50 16 -23 -12 39 -80 28 -50 21 26 10 -1 7 11 36 -32 72 -40 -16 -50 10 -111 8 -3 -39 -72 -18
7131.1 -18 -69 -86 22 5 24 3 -61 -13 1 38 -60 -43 37 27 15 -14 67 17 -165 90 -25 87 -22 -54 31 12 52 22
7120.3 22 -46 -43 -60 -18 -2 -33 -54 -49 -67 -69 -15 38 24 -35 35 -30 8 66 -6 -85 13 -31 -49 27 36 -41 -57 -32 21 -57 -46 18 -22
7107.7 -22 12 10 -63 -50 -23 -47 -97 -55 -44 -3 -35 -94 -75 -7 5 21 -97 -1 -43 59 41 -77 -41 -91 -32 -4 -70 -34 -47 4
$$ packed form
7188.6B2j4L2lm4Kl0m7J03m8Q9j50J49l3Lk7j9J1Kl1Q1o8qj0J43j26R0j56L0J10L1
7177.1H4jk04J43L6q5M0n1M0O0q8K3J7j6k0J6m1MM5%TM6o2l4Jl1R2q3J24k3j01P7j0
7164.8bk7R0j20KQ8L2j28J79j84Q8m3O1p0J11j51J9J45m5m2j13J7R4L7m7k3lQ2j03
7154.1e6J50j38j6J2M6J1J7m0O7r5N9j2m0L0j45J71j04N5%K8K4p4M2m4RO9q8M1J0L2
7142.6B1m9J8M2q2O6l9J1N1j19J08p8P1Nj6j1QMK5o8J04j12K4l4O0j21J19j1l6l3N4
7131.1a8n1j7J08j7J9k1o4M8J4L7r8J7Q0j0j2k9Q1n0j82K55j15J12j09l2Q5j9M0l0
7120.3B2o8Lj7M2J6l1k1Nj8kN4N3j4n9P0o5L8N8p2p9R8m4j8P6Rp7j6K5N3p8J1O4m0
7107.7b2L4kp3J3K7k4n0M2J1M1l2n9J9O8J2J6j18R6m2J02j8j18L6n0N9K8o6L6j3N1
$$ plain form
7096.2 4 24 -101 35 52 -68 23 -97 -82 13 -36 -13 12 5 -69 43 -69 64 -20 37 -38 -49 -38 -22 -37 33 136 -112 23
7085.5 23 20 -117 12 0 -2 13 -21 1 -99 14 -5 -43 -35 86 43 69 -11 37 1 8 34 -56 -44 -3 69 -39 9 12 -31 32 14
7073.6 14 -45 -46 -59 -14 -4 71 62 -98 -23 -101 -127 86 -1 -22 -84 -65 -78 -3 -17 7 -58 -40 -33 29 43 -15 -96 -18 -4 -157 6
7061.7 6 -16 -44 -103 -62 4 45 -17 -53 18 -19 -31 -41 71 53 -80 27 27 91 -68 -91 -66 -59 -56 1 -72 -31 -27 103 26 -36 5
7049.8 5 -88 -75 40 26 -85 -58 54 -82 63 101 -24 -25 177 -96 55 -64 -62 -4 33 -1 -37 -19 -16 -31 -4 -37 47 -103
7039.1 -103 -135 29 20 17 -43 31 -31 0 51 -98 11 -14 1 -131 62 -41 41 -45 13 92 -17 29 12 0 -8 55 -92 -31
7028.3 -31 -138 -2 -64 -79 -77 -35 16 -103 22 -10 61 11 44 21 -77 -48 -65 -14 15 -39 72 11 9 72 -13 -84 20 -59 -137
7017.2 -137 -7 1 -45 -8 -47 17 56 -9 -1 11 95 37 -26 31 32 12 39 83 43 -17 -43 -62 -68 -19 61 18 -47 14 -86 35 71
$$ packed form
7096.2DK0j25J36J7j20R1j20J5R5m9K3K5pp4J12j12J33q4N7p5j1J1J6j5P0J03k48J35
7085.5B3lj37J29j2kJ5l4K2j00J13j9l8QJ21m3K6q0M8l6PK6r0J2M1P2j08M8Lm3O3j8
7073.6A4n9jj3M5J0P5rj60P5p8k6K13q7k1o2J9j3P5j4K4o5J8PO2J4n8q1P8J4j53J63
7061.7Fk2k8n9M1O6M1o2l6P1l7j2j0J12j8j33J07%O4j59k3K5PLN7p3M1MJ30p7o2M1
7049.8Er3J3J15j4j11K7J12j36J45L8j25jK02k73J51j19KN8L7l4l6J8Lj5K7l3Q4j50
7039.1a03l2J64rlo0P4o2L1N1j49J09k5J5j32J93j03Q2q6N8P9j09M6j7j2qO3j47O1
7028.3c1j07J36o2j5KM2N1j19J25l2P1n0L3k3r8K9j7N1K9n4J11o1kO3q5p1J04p9p8
7017.2a37J30Qm6L7l9O4L9o5QJ2Q4n8o3N7Jk0K7M4m0o0k6j9oM9Q0m3o5O1j00J21L6
$$ plain form
7005.3 71 30 -75 -151 10 -30 37 -28 -10 -41 -22 -44 -97 13 -77 -55 -91 -28 -17 30 -115 11 27 -93 7 -3 -8 -41 -65
6994.6 -65 -21 -81 -11 -27 -39 42 9 33 -106 20 9 26 -19 -68 66 -124 -45 14 -26 -21 76 -40 70 24 -9 -59 -119 -60 -48
6983.5 -48 -72 24 -26 23 -64 -19 -2 -8 67 -7 27 0 -87 -52 -71 -23 -68 -34 -48 -100 -57 39 -13 -35 -45 18 59 -14 94 -60 -68
6971.6 -68 -28 16 -112 -39 27 -13 63 -39 44 -63 -68 -35 -114 48 -30 44 -19 11 -162 27 82 -11 53 -31 -29 -51 5 8 45 12
6960.1 12 -20 -112 59 -17 -78 67 -10 26 37 120 -4 -30 -50 -8 31 -71 -14 -27 -52 -79 -8 -50 -99 46 40 -17 -18 51 -39 -48
6948.6 -48 4 7 8 -38 42 3 49 -40 -87 -12 13 -15 59 1 -103 17 -42 39 38 -16 -36 -83 -47 -103 -11 -20 31 -74 -14 65 9 -111
6936.3 -111 48 -108 50 -12 -114 -38 -76 68 47 70 -38 38 -56 -83 31 37 -17 1 -119 -30 22 76 33 -2 12 34 0
6926 0 -47 -8 -100 -16 -17 20 -76 89 -37 -23 42 -12 -134 61 -81 15 -3 -1 -26 -10 18 36 53 -29 -73 -86 -23 -204 -5 -2 55
$$ packed form
7005.3G1m1j05p6J61m0O7o5J8l1J9k2n3J10r0K2l6O3J1M7j45J26J6j20J00j0nl3k4
6994.6f5M4o0P0j6j2Q1l3K4j39J26j1J7m5m9J34j90P9N9m0NR7j16J10m6l3n0o0N9J2
6983.5d8k4R6n0M9q7M5J7oP5p4L4k7q7L5j9M8m5L4j4n2M3R6n2k2j0O3M1p3J08j54q
6971.6f8M0M4j28P3O6m0P6j02Q3j07nL3p9J62p8P4o3L0j73J89N5r3O4q4Kk2N6LL7l3
6960.1A2l2r2J71p6o1J45p7L6J1Q3j24k6k0M2L9j02N7j3k5k7P1m2m9J45on7jO9r0r
6948.6d8N2LJm6Q0l9M6q9m7P5K5k8P4n8j04J20n9Q1jn4k0m7L6n6R2rN1j05O0P9n6j20
6936.3a11J59j56J58o2j02P6l8J44k1K3j08P6r4k7J14On4J8j20Q9N2N4m3l5J4K2l4
6926@m7L9r2Q4jL7r6J65j26J4O5n4j22J95j42R6j8Kk5J6K8J8J7q2m4j3O3j81J99LN7
$$ plain form
6914.1 55 32 0 10 24 -52 -93 -2 24 -107 -60 -52 -15 54 64 -35 -115 -59 11 -116 -74 52 27 23 -24 -65 68 -185 41 -56
6903 -56 7 -12 -5 -60 -20 29 -47 -26 -60 -23 -138 -38 -75 -61 46 36 -61 -77 -101 7 18 -45 -82 -112 -57 -11 52 -47 -141 -178 -125
6891.1 -125 -140 -148 -234 -217 -448 5197 4805 6144 2180 666 268 104 171 144 87 65 106 5 95 140 76 91 116 62 13
6881.5 13 142 79 32 75 43 59 63 50 -48 -47 -36 12 -3 68 40 50 89 23 -28 16 -4 88 67 53 -52 45 12 53 46 -18 39 -128
6869.3 -128 19 -27 -26 5 -41 -17 77 -47 -41 44 28 16 56 -43 61 -13 -52 -6 11 130 -144 -14 60 86 42 10 53 68 -95
6858.2 -95 18 48 -76 42 -64 -20 -7 36 -89 78 -59 -32 52 -141 -18 34 -74 46 -3 -22 -23 42 -48 -51 39 -78
6848.2 -78 64 -43 43 65 0 -18 -25 -21 -105 24 -13 -83 34 -44 -59 -24 -58 44 41 112 -69 28 18 25 -50 -55 21 -53 44 20 -110
6836.3 -110 -33 32 -61 32 -18 -180 42 -64 -75 -94 -38 -103 22 11 33 6 -10 40 -34 -15 -51 -19 -68 -61 50 -24 52 54 -22
$$ packed form
6914.1E5k3l2J0J4p6m1R1K6j31M7QL7O9J0r9q0N6P0j27M2J26k5mm7m1J33k53K26r7
6903e6O3j9Pn5M0M9p6K1l4L7j15J00l7J4J07j0r7j6k4J08J1o3l7l0N5M6O3r9r4l7N3
6891.1a25j5qq6J7k31N645l92J339l964j514l98j64O7k7n7k2M1j01R0M5o4J5K5n4m9
6881.5A3J29o3m7M3l2J6Mj3r8JJ1M8j5P1k8J0L9o6n1M4k0R2k1j4j05R7l3M1po4N7j67
6869.3a28J47m6JL1m6K4R4j24OQ5j6j2M0r9J04p4l9M6J7J19k74J30P4K6m4l2M3J5j63
6858.2i5J13L0j24J18j06M4J3M3j25J67j37K7Q4j93J23N2j08J20m9j9jO5r0lR0j17
6848.2g8J42j07Q6K2o5j8pMq4J29l7p0J17p8j5L5l4J02lP1j81R7j0Pp5nP6p4R7k4j30
6836.3a10P7O5r3R3n0j62K22j06j1j9N6o5J25j1K2k7j6N0p4J9l6L2m9PJ11p4P6Kp6
$$ plain form
6825.2 -22 -11 -24 22 -105 52 77 -21 -28 -23 -52 42 -61 -19 -27 -38 2 8 -31 -63 -59 -81 -41 7 -153 17 -113 -4 44 59 10
6813.7 10 -16 -125 15 22 -34 42 -64 9 -67 50 68 -67 -6 29 -111 -18 -21 -52 -58 -22 -49 -1 -19 39 -35 1 -88 71 -36
6802.6 -36 -86 80 -32 29 -8 -16 -39 39 -27 -4 -28 -50 -80 -75 -89 112 9 74 -5 -28 -48 19 -62 -30 -87 -31 -62 -49 -36 32 -52
6790.7 -52 98 -108 -26 -41 -4 49 -3 70 63 -19 40 -39 -43 -115 -4 -56 39 27 -32 -6 34 -64 -40 30 -71 -30 -113 -84 -20 48
6779.2 48 24 -2 -62 53 -21 -35 43 -35 29 -39 47 -12 6 36 42 -26 -25 -72 15 -30 -90 36 -24 -52 -29 -10 28 43 25 29 82 -11
6766.9 -11 32 -69 24 -1 2 -67 3 -62 3 -35 -14 -11 -51 60 -3 -32 34 -79 1 -46 18 -47 -52 19 2 1 -54 34 -68 -110 82
6755 82 69 40 -10 121 10 -14 -77 -46 17 66 -33 -80 59 14 3 32 152 -39 -33 69 -18 -87 32 26 -76 31 -47 -35 -42
6743.9 -42 -116 15 -18 -165 -91 -51 16 63 -53 -25 11 -108 2 -65 -12 -13 26 -5 -118 -82 -107 -3 -4 -26 10 -32 -10 -56 63
$$ packed form
6825.2b2J1j3M6j27J57K5r8pNk9R4j03M2qj1M0Ol9l2Mk2M0M8j60J70j30J09M8J5m9
6813.7A0k6j09J40Pn6P6j06P3p6J17J8j35O1L5j40R3ll1oL6k7M8j8N8p4L6q9J59j07
6802.6c6n0J66j12O1l7qk3P8o6K3k4k2l0Nj4K01j03O5p9k3k0O7q1L2n7N6l1J3TO8q4
6790.7e2J50k06Q2j5L7N3n2P3pq2N9p9mp2J11n2R5j2n9K6M0r8K4P0j01M1q3K9O4O8
6779.2D8k4k6o0J15p4j4P8p8O4o8Q6n9J8L0Oo8Jm7Q7m5o0J26o0k8K3J9L8J5j8MN3r3
6766.9a1M3j01R3k5Lo9P0o5O5l8K1Lm0J11o3k9O6j13Q0m7O4o5nP1j7jn5Q8j02m2J92
6755H2j3k9n0J31j11k4o3L1O3M9r9m7J39m5j1K9J20j91OJ02q7o9J19oj02J07p8J2p
6743.9d2p4J31l3j47P4M0O7M7j16K8L6j19J10o7N3jL9l1j13L6k5J04jk2L6m2K2m6J19
$$ plain form
6732.8 63 -2 -17 -26 -48 7 -72 -15 -13 -59 -11 -23 -11 10 -38 17 -38 -74 11 61 -53 45 -60 -68 -27 -52 -34 10 -62 -114 -28 -22 -35
6720.6 -35 -114 -117 -91 9 -77 -4 33 -12 -3 -28 -57 -1 -131 112 154 13 102 77 34 -76 -36 -32 -33 -99 -60 -126 1 -50 -84 -63
6709.1 -63 -103 22 -149 -84 -29 -43 -118 29 -127 64 20 -37 -110 -33 -55 -152 -118 -40 -65 -86 -33 -126 -159 -96 -129 -124 -25 -71 -23
6697.9 -23 -133 -141 14 -94 -74 -61 -39 -30 -158 -125 -112 -72 -184 -51 -38 -70 -81 -25 -160 -143 -113 -53 -138 -119 -144 -36 -239 -201
6687.2 -201 -284 -202 -249 128 12808 11919 10118 10566 11825 3437 1299 836 453 348 337 300 384 322 180 260 233 182
6678.8 182 120 157 87 199 32 136 159 117 107 164 178 34 117 90 87 50 98 104 -57 125 63 126 91 -24 24 -76 87
6668.4 87 -7 8 83 -47 80 50 1 48 122 22 -22 69 -68 53 -28 40 30 -5 35 41 103 328 104 194 126 151 28 45
6657.7 45 -25 111 85 7 11 1 97 35 -9 39 -98 -60 -22 41 64 -32 27 24 -13 42 -86 3 -15 -9 1 41 -72 -38 40 -49 27
$$ packed form
6732.8F3o5j5rk2N5p9N7Km6M8j2J2K1m8N5n5l6Q5N0j14R8j05qM1k5J8M4p2n2Q6Oj3
6720.6c5p9lK6J00q6P3L7m5Rk5k9N6j30K43M2j41Q9k5m3j10M0Mjo6L9o6J27n1l4K1
6709.1f3m0J25j71O5N5j4p5J47j56J91m4n7p3P7k2r7L4P8k5k1N3r3l3O3l3NR9m6M8
6697.9b3j10qJ55j08K0J3K2Rj28L3J3M0j12J33J3l2j1N6j35J7L0O0q5J9k5J08k03L8
6687.2b01q3Q2m7L77J2680q89j801M48J259q388k138m63l83j05j1l7Q4o2j42Q0k7n1
6678.8A82o2L7p0J12j67J04K3m2j0N7J4j44Q3k7ll7M8Oj61J82o2O3l5j15M8j00J63
6668.4H7r4J5P5j30J27l0m9M7P4j00m4R1j37J21q1O8j0l5M0OO2K25k24R0o8K5j23J7
6657.7D5p0J36k6p8Mj0R6o2m4M8j37L8TO3K3r6N9ll7N5j28Q9j8OJ0M0j13L4P8q9P6
$$ plain form
6645.8 27 -10 -8 1 74 41 20 -72 36 -22 124 -75 -56 -13 76 0 3 92 16 -39 -13 -66 31 -27 7 36 3 2 -6 -69 34 11 -62
6633.5 -62 -149 28 16 -12 -46 53 76 27 36 -76 -14 21 4 -28 -44 1 20 5 -94 7 -9 10 -82 -95 99 -46 -80 25 42
6622.4 42 39 -62 -65 -85 -91 31 18 30 -37 87 -129 -74 -20 31 -18 -94 121 -71 -157 -147 78 -2 95 30 -32 64 -75 73
6611.7 73 19 -63 11 26 -38 -5 -66 -186 -21 -143 -49 34 -41 -31 1 58 -27 95 -69 -27 -17 -55 6 -21 11 35 -74 -75 4
6600.6 4 25 -41 -30 50 -65 -19 67 -90 24 10 -3 -28 -4 -7 -17 -35 -35 -81 -35 31 -30 -2 1 1 -1 61 -7 -11 6 -16 -5 72 -24
6587.9 -24 -8 -47 -58 -18 35 91 -148 37 -5 4 -99 4 53 74 26 -84 -62 -19 90 65 -29 11 -12 -14 -25 86 -23 -49
6577.2 -49 33 37 -92 -44 0 -30 -30 8 -15 42 -14 32 12 22 -42 -53 10 46 -36 -56 -29 -91 -79 -41 -54 -96 2 -153 -1 -11 -53
6565.3 -53 15 -67 1 -25 25 28 -23 -75 -71 -88 -55 4 40 -10 -58 -67 -43 -69 11 5 -18 13 -7 -61 -19 -50 -17 6 94 7 -29 -68 48
$$ packed form
6645.8B7l7KRP3l3k1r2J08n8J46j99J9M3Q9p6LQ9p6n5K6n3R7n8L4K9l3jqo3J03k3p3
6633.5f2q7J77j2k8l4R9K3m9Rj12O2L5j7l2j6M5J9j5r9J01j6J9r2j3J94j45l4J05J7
6622.4D2lj01lk0oJ22j3J2o7J24k16N5N4N1m9p6K15j92q6J0K25q0R7o5o2R6j39J48
6611.7G3n4q2P4J5o4L3o1j20J65j22R4Q3p5J0L2N7q5J22j64M2J0l8O1k7L2K4j09jP9
6600.6DK1o6J1Q0j15M6Q6j57J14j4j3k5K4lj0j8%m6M6O6o1K8L%kO2o8mJ7k2J1P7r6
6587.9b4J6l9j1M0N3N6k39J85m2Rj03J03M9K1m8j10K2M3J09k5r4M0k3kj1J11j09k6
6577.2d9Q2Mj29M8M4l0%L8k3N7n6M6k0J0o4j1O3L6q2k0K7o2J2L8j3m2R8j55J52j0m2
6565.3e3O8q2O8k6N0Ln1n2Mj7L3N9L6n0m8rK4k6Q0ok3L1k0n4M2l1L3K3Q8q7l6l9J16
$$ plain form
6552.7 48 -51 31 -25 -48 -10 -56 70 108 -2 -89 66 54 62 -111 -33 57 -82 -15 -10 -51 -20 46 -41 -61 8 43 90 4 10 -45
6541.2 -45 113 78 39 -18 -66 25 42 90 -64 4 11 47 32 3 171 6 3 22 -63 -85 -46 78 -20 60 0 41 25 51 63 26
6529.7 26 32 70 -18 -146 -72 72 -30 22 -11 40 3 -21 -85 27 -25 -50 108 9 -56 -133 -5 -45 -36 -10 -11 -74 -19 37 -85
6518.6 -85 -24 -30 0 -44 31 -13 -3 -52 -42 56 1 -1 -104 -54 47 -83 -79 -21 -33 -67 -20 -29 20 28 8 46 -42 -64 13 -44 -34 8
6506.3 8 86 43 -16 -25 -56 -78 -101 -5 60 -100 69 55 39 33 -15 -9 12 13 26 -20 -17 -73 37 -25 -7 -30 67 69 -119 56 -37 -53
6494 -53 53 -13 2 10 -5 -86 -2 34 14 -67 42 -23 -101 -13 -20 -57 74 -65 -71 -149 -71 -163 -89 -47 -15 80 -94 -31 58 89 149
6482.1 149 189 -9 -76 -21 -67 -1 -49 7 -8 -144 -95 -66 -24 -123 31 14 -103 -128 -72 -96 -48 -27 -167 -29 -43 -62 -164
6471.8 -164 -142 91 77 -5 39 -236 18 -93 -234 -163 -150 -158 -48 -166 -265 -168 -143 -132 -187 -169 -187 -204 -169 -199 -311 -277 -227
$$ packed form
6552.7D8r9Q2n6k3L8m6J26L8j10q7J55j2Qj73P8R0j39O7Nm1L1O6q7k0O9L5M7q6On5
6541.2d5J58l5l9n7m8R1J7M8j54O8PL6j5k9J68j65lJ9q5k2L9J24r8Q0o0M1j6K6J2l7
6529.7B6OL8q8j28P4J44j02N2l3N1l7k4o4J12n2k5J58r9o5p7J28m0RK6jo3N5N6j22
6518.6h5O1oL0m4P5m4J0m9J0R8n5kj03N0J01j30MN8j2l4M7rM9Qk0L8q8k2P7n7J0M2
6506.3HP8m3n9rl1k2k3R6O5j60J69j4j6om8OK1JJ3m6Ln6J10o2J8k3R7Kj88J75r3j6
6494e3J06o6J5Qj5q1Q4L6k0q1J09o5p8Q8pl7J31j39op8P8r2P4M2L2R5j74O3Q9L1O0
6482.1A49M0j98o7N5m6O6m8N6j5j36M9K9M2r9J54j7j17k5N6k4M8K1j40J38j4j9j02
6471.8a64K2K33j4q2M4k75K54j11j41P1J3qJ10j18r9R7K5J1n5J8j8j7L5l0j12L4N0
$$ plain form
6461.4 -227 -321 -324 -356 -327 7530 30324 26681 32000 12085 3446 1972 1372 888 1028 788 792 580 352 313 334 366
6453.4 366 206 236 268 517 482 435 355 519 425 527 201 168 173 228 193 215 140 0 129 128 309 19811 26634 24574
6444.2 24574 31967 10517 3252 1853 1166 682 631 439 437 417 223 396 376 373 288 332 348 129 249 202 295 214 183
6435.4 183 125 321 207 191 185 249 141 60 150 110 238 90 189 66 211 220 110 96 167 188 297 324 236 234 97 79 69
6425 69 143 101 71 139 137 122 128 147 153 142 101 127 95 172 153 141 160 227 61 68 106 37 167 96 138 127 60 102 89 39 276 209 188
6412.4 188 202 93 85 -9 -39 111 55 75 176 134 160 24 39 149 45 109 134 54 86 52 170 57 85 83 88 91 55 99 50
6401.3 50 136 6 53 9 147 12 43 141 20 24 80 136 42 -3 -37 175 30 62 48 67 103 18 23 80 110 84 81 -32 24 120
6389.8 120 60 56 83 1 59 117 100 37 24 144 125 49 21 10 106 116 155 90 82 86 56 40 2 40 8 8 45 117 139 117 24 92 91
$$ packed form
6461.4b27r4ll2K9P857K2794l643N319j9915q639j474o00m84J40k40Mk12k28l9K1L2
6453.4C66j60L0L2K49l5m7q0J64r4J02l26l3NN5l5K2p5j40J29jJ81J9502O823k060
6444.2B4574P393k1450p265j399o87m84n1j92kk0j94J73k0lq5M4J6k19J20m7R3q1l1
6435.4A83n8J96j14j6oO4j08q1R0m0J28j48R9j23J45Rj10j4P1K1J09K7q8kj37j8j0
6425F9P4m2l0O8kj5OJ9Oj1m1K6l2P7j9j2J9O7j66PL8o9J30p1M2j1o7M2j3n0K37o7k1
6412.4A88J4j09qr4l0J50n6K0J01m2K6j36J5J10j04O4K5q0L2l4J18j13K8kNLl6M4m9
6401.3E0Q6j30M7m4J38j35L1R8j21MN6Tr4m5l4K12j45L2j4J9L6q5NN7L0k6lj13N6R6
6389.8A20o0mK7q2N8Tj7o3j3J20j9p6k8j1R6J0L9o5qMl0j6l8L8l2%L7P2K2k2r3O8j
$$ plain form
6377.1 91 160 60 79 64 208 206 184 115 151 84 74 13 40 159 118 151 93 64 122 111 112 159 53 133 13 51 55 85 118 58
6365.6 58 45 32 25 124 52 68 10 98 134 53 90 24 150 -25 -6 40 57 151 103 115 49 30 64 126 24 61 114 69 66 78 -31
6353.7 -31 41 52 -51 64 5 -44 11 83 42 39 139 110 -19 35 144 47 71 19 111 69 206 78 113 -49 96 63 21
6343.4 21 28 13 34 -35 -10 51 -39 10 38 110 30 -117 -14 4 81 26 17 -56 -15 20 45 63 -16 -6 45 27 -9 16 116 38 67
6331.5 67 21 41 -25 12 3 19 75 76 -37 3 11 71 -17 90 -4 52 3 46 103 4 57 109 57 -98 11 11 19 -42 7 133 8
6319.6 8 -13 115 7 58 -93 78 -30 -56 16 89 -85 -56 -40 -52 92 24 55 -8 -1 30 -28 41 70 21 31 27 33 92 113 -23
6308.1 -23 57 80 65 23 69 16 74 57 56 97 -15 4 109 6 51 70 -130 15 44 -22 -6 12 19 63 -12 -84 99 -13 -6
6297 -6 75 42 -18 8 -11 11 -44 0 -35 32 -75 3 58 80 37 97 -9 37 36 -14 37 64 40 -78 -31 96 -20 74 -28 -34 20
$$ packed form
6377.1I1O9j00J9j5J44kk2o9L6o7j0o1K7J19m1L3n8k9N8j1JM7j06Q0j20L8ML0L3o0
6365.6E8j3TpR9p2J6n8Q8L6q1L7o6J26j75J9M6J7R4m8J2o6j9L4O2j02L7N3m5lJ2j09
6353.7c1P2J1j03J15n9m9N5P2m1lJ00k9j29N4J09r7K4n2R2m2J37j28L5j62J45l3m2
6343.4B1Pj5K1o9K5O1r0M9K8P2q0j47J03J8P7n5rp3M1L5K5J8p9J0N1j8l6K5J00p8K9
6331.5F7m6K0o6L7rJ6N6Jj13M0QO0q8J07r4N6m9M3N7r9N3N2n2j55J09%Qo1M9J26j25
6319.6Hk1J28j08N1j51J71j08k6P2P3j74K9J6j2J44o8L1o3PL1n8O9K9m9J0mON9K1j36
6308.1b3Q0K3j5m2M6n3N8j7jM1j12J9J05j03M5J9k00J45K9o6J6J8PM4p5p2J83j12P
6297fQ1l3o0K6j9K2n5M4l5O7j07P8N5K2m3O0j06M6jn0N1K7k4j18M7J27j16R4j02oN4
$$ plain form
6285.1 20 -28 123 41 42 2 30 -20 1 -2 74 52 33 22 -25 -2 78 71 56 37 41 17 -109 0 62 14 103 36 -5 -31 37 -27 -66
6272.9 -66 -25 91 31 101 51 74 -34 -96 62 9 52 -78 -48 44 64 62 59 98 -54 5 3 96 43 -2 29 15 29 64 8 -46
6261.4 -46 -39 -80 170 81 43 15 -108 87 -14 53 -7 0 28 42 11 -27 57 20 27 -24 -20 38 -18 -7 -51 -48 -47 -36 69 30 -12 98
6249.1 98 -80 -41 -59 15 80 -1 46 66 30 27 -41 -56 -45 59 62 36 -71 58 90 19 -4 110 39 -30 46 41 26 -72 -34 -70
6237.6 -70 89 24 -3 -41 -54 -4 61 72 58 18 96 23 -29 65 7 -80 -3 -47 17 -38 61 18 0 113 43 8 -3 22 47 73 26
6225.7 26 44 -5 -23 128 9 60 -90 -45 45 8 158 72 -21 -103 13 18 35 -34 106 -3 -26 54 -73 -47 -49 -46 -41 -96 -44
6214.6 -44 44 -83 20 24 -11 -2 151 -29 56 37 122 3 11 -27 -12 63 47 -20 34 124 47 1 -19 43 -19 -4 -24 108 -13
6203.5 -13 -149 42 25 63 13 113 6 -65 -30 5 61 -7 22 43 -73 -10 49 -67 60 1 -16 -15 31 -47 63 85 -85 -17
$$ packed form
6285.1B0m8J51q2Jm0K8n0K1lP6k2j9j1m7K3Q0pj5j9Mk4j26J09O2m8Q9o7m1k6O8o4l9
6272.9f6M1J16o0P0n0K3j08o2J58n3M3j30L0R2K0klL9j52N9kR3n3m5L1j4J4L5n6n4
6261.4d6Pm1K50q9l8k8j23J95j01O7o0PK8J4l1l8Q4l7Pn1MN8n6J1m4LJJ1J05l9m2J10
6249.1I8j78L9j8P4O5q1M7K0l6lo8j5J1J04Lk6j07J29L2p1k3J14p1o9P6nj5r8L8l6
6237.6g0J59o5k7l8j3N0O5J1j4m0P8p3n2R4n8q7P7m4O4n5R9m3j8J13p0l5j1K5TK6m7
6225.7B6J8m9j8J51j19N1j50M5R0l7J50q6r3q2J16NJ7o9J40j09k3Q0j27K6kLNn5N2
6214.6d4Q8j27J03Ml5RJ53j80Q5j9Q5j19Ql8J5P5j6o7N4R0p7m6k0O2o2J5k0J32j21
6203.5a3j36J91j7L8n0J00j07p1L5TN6o8K9K1j16O3N9j16J27n9j7JM6p8J10K2j70O8
$$ plain form
6192.7 -17 21 64 65 27 -48 12 73 68 6 41 12 46 -57 65 81 -50 -34 27 44 -28 -45 -26 -1 -86 -40 -4 15 25 -20 6 -26
6180.9 -26 56 -62 4 -54 16 123 19 12 80 7 29 -68 -6 -5 11 20 -32 11 79 16 -7 12 -63 -40 -19 35 -54 -37 93 -10
6169.4 -10 -80 -18 -48 0 102 4 -57 -41 -25 -84 -46 74 -2 -30 -30 -41 40 -31 32 37 55 53 16 -8 55 2 44 -30 41 53 -12 -42
6157.1 -42 -6 -38 -38 -49 -52 56 -2 47 64 28 -21 -64 -45 18 -31 -54 -42 88 -11 21 36 45 28 -25 -30 -12 27 -55 56 -74 12
6145.2 12 -37 56 11 2 26 -14 109 2 -96 57 57 96 11 -45 18 -66 16 -5 -30 -15 -20 12 -36 22 -61 28 24 33 51 41 25 -88
6133 -88 108 -70 58 93 96 -36 -21 57 26 -18 -114 35 12 75 22 -40 60 -54 41 -27 61 17 -25 -31 26 -50 49 36 -95
6121.8 -95 -49 -69 83 86 20 -24 20 -2 -46 -76 36 -43 60 -30 -21 -57 17 20 -35 -17 75 -60 27 32 -48 -79 65 3 -32 39 53
6110 53 3 29 -25 10 -3 -76 -25 -10 26 105 45 -57 -18 20 32 68 107 -46 45 1 -85 -56 15 104 -16 -69 -50 2 53 39 41
$$ packed form
6192.7a7L8M3Jl8p5O0O1no2L5k9L4j03J22J6j31J6O1J7p2j7J9K5q5M6L6J9J0m5K6l2
6180.9b6Q2j18O6n8P0J07j04pO8p3K2r7O2JJ6Rn2M3O8o3k3J9p5K3K1N4q9J7J30j03
6169.4a0p0O2l0M8J02r8o1J6Tn9L8J20p6k8%j1Q1p1O3NJ8kl7k4O3n3M2p4P1J2o5l0
6157.1d2L6l2%j1lJ08n8M9J7l6m9m3J9O3m9k3J2J30r9L2J5Rj7n3nJ8L9q2J11j30Q6
6145.2A2m9R3m5rK4m0J23j07r8J53%L9q5n6O3q4Q2k1k5J5nL2m8N8q3Q9mRJ8j0j6j13
6133h8J96j78J28L5Lj32J5P8l1m4r6J49k3O3n3o2J00j14R5o8Q8m4m2oN7p6R9j3j31
6121.8i5M6k0J52Lo6m4M4k2m4l0J12p9J03r0Rl6P4Ln5J8R2j35Q7Nq0l1J44o2l5P1J4
6110E3n0K6n4L5j3p3N1J5L6P9o0j02L9L8J2L6L9j53R1m4q6K9P1Q9j20n3J9N2N1j4K
$$ plain form
6098.1 41 83 14 -13 75 44 9 99 51 25 58 -35 87 68 -32 70 -64 -55 9 -92 -49 -73 -14 12 36 61 55 -72 1 1 131
6086.6 131 82 -25 4 -75 -4 48 -72 -55 -20 38 -4 -38 39 -138 115 36 61 2 15 32 47 23 -59 -3 5 74 22 67 39
6075.5 39 29 36 -12 14 52 -85 -15 35 38 27 -26 -18 40 -7 96 138 -12 -17 42 -39 -55 -57 -24 -77 -98 31 14 21 -11 -8 17 53 -24
6062.8 -24 -51 8 2 -23 84 -37 -6 -121 -28 32 -65 -93 -5 -30 20 -32 8 2 5 46 69 10 34 91 -62 52 62 -85 2 14
6051.3 14 -35 -51 61 40 96 40 -41 75 -80 -31 0 17 75 69 -68 -128 -80 47 -1 -4 42 -42 63 -24 -15 44 -17 -29 -47 12
6039.8 12 -52 18 -17 32 100 54 -63 51 -38 -49 54 80 -90 5 45 -44 -106 36 -26 59 46 -92 21 69 36 21 152
6029.5 152 91 43 6 -41 42 33 24 -49 58 -10 -4 4 -38 -41 46 -40 47 3 30 8 72 6 0 -24 18 44 75 64 95 27 24 95 -28
6016.8 -28 43 -41 -77 41 -12 -4 -47 73 114 52 103 19 -24 27 97 9 48 44 -63 -3 67 -60 27 -47 12 7 -6 -18 -48 43 -56
$$ packed form
6098.1D1M2o9k7Q8l1l5R0m8k6L3r3J22j9j00J02j34RO4j01M3k4N9K6K4K5oj27P3%J30
6086.6A31m9j07K9p9P1N2j20J7L5N8m2l4P7j77K53p9K5n9J3J7J5k4q2N6QO9n2M5k8
6075.5C9j0Pm8K6L8j37P0N0Lj1n3QN8m7J03M2j50nN9q1j6kL3n3k1J29j7Pl2LK5L6p7
6062.8b4k7N9ok5J07j21L1j15R3O0r7k8Q8k5N0n2M0oLM1K3n9K4N7j53J14J0j47Q7J2
6051.3A4m9j6J12k1N6n6q1J16j55M9L1J7N8oj37o0M8J27m8lM6q4J05q7RN9o1j2j8N9
6039.8A2o4P0l5M9O8m6j17J14q9j1J03K6j70R5M0q9o2J42o2Q5j3j38J13M8l3j5J31
6029.5A52o1m8l7m7Q3rTp3J07o8OQm2lQ7q6Q7m4K7k2O4o6ok4M2K6L1j1L1o8lP1j23
6016.8b8P1q4l6J18n3Qm3J20M1o2N1q4m3N1P0q8L9mj07O0P0j27Q7p4N9nj3j2l0R1r9
$$ plain form
6004.9 -56 -37 -43 -57 -54 42 -32 -25 40 -94 6 28 25 18 -35 70 -76 -23 35 -10 -13 100 6 111 -117 -36 9 -89 22 -10 31
5993.4 31 29 -5 14 2 -55 34 6 6 -6 54 5 9 -76 -10 27 127 -121 -40 26 19 -82 -38 -67 -18 30 -17 44 -24 -36 38 71 -19
5981.2 -19 82 6 -43 110 -6 -1 -16 -36 25 -39 30 28 30 4 60 -49 -77 -59 -144 -73 19 69 -39 -17 60 15 -25 -39 -59 30
5969.7 30 38 -128 40 -16 75 -19 27 -33 -3 5 -81 3 -68 -6 4 23 -105 11 88 86 -75 -11 16 -34 15 -39 23 -2 -35 22
5958.2 22 -60 51 61 14 -18 28 -64 -46 16 73 -83 -64 -94 56 23 69 -50 14 -48 -31 -14 3 -35 47 -27 21 -9 68 7 13 45
5946.3 45 -34 49 13 26 140 82 -5 -9 -48 -24 -77 77 -43 35 -8 -60 6 42 45 42 -19 77 75 -12 0 20 82 -53 -4 36 -9
5934.4 -9 -31 13 -16 -49 -17 66 34 10 -57 16 5 16 -44 7 51 30 -48 -20 61 -120 1 -10 -70 -96 11 53 -18 85 6 -128
5922.9 -128 -25 -21 -13 6 30 -81 -74 -12 -53 -97 29 28 70 -7 0 58 -39 -14 -70 -45 -70 -8 8 -7 -43 42 -52 124 -44 -64 9
$$ packed form
6004.9e6J9oj4LR6p4PO5j34J00K2lpn3J05j46N3N8m5lJ13r4J05k28Q1M5r8J11l2M1
5993.4C1kl4J9j2n7Q9k8%j2O0m9Mq5O6L7J00k48Q1O6pj01M4k9M9M8m7O1o8j2P4L3r0
5981.2a9J01p6m9J53j16Nj5k0O1o4O9kKk6N6j09k8J8q5P1R2N0j08K2P7m5m0j4k0Q9
5969.7C0Qj66J68n6R1r4M6o0L0Qq6Q4p1O2J0J9j28J16P7kj61O4K7n0M9n4O2k5l3N7
5958.2B2q2J11J0m7l2M6r2J8O2N7j56J9l0J50l3M6j19O4o2J7Ul8Q2p4M8l0P7o1OL2
5946.3D5p9Q3l6J3J14n8q7ml9K4n3J54j20P8m3n2O6L6Llo1R6kq7J2K0O2j35M9M0m5
5934.4ik2M4k9l3L2Q3l2k4o7P3j1J1o0N1M4k1p8K8Q1j81J21j1o0k6J07M2p1J03p9j34
5922.9a28J03MQJ9K4j11PO2m1m4J26jM2p7PN8r7K5n6K5k5O2J6j5l6Q5r4J76j68k0P3
$$ plain form
5911 9 -9 3 -7 13 -7 -1 34 -84 39 -19 3 107 58 -11 -6 23 -122 56 -6 68 35 -89 73 -24 -69 -9 23 24 69 32 -36
5899.1 -36 -17 -13 45 136 5 50 27 -7 70 88 -51 30 36 43 70 -23 21 88 -25 -53 44 -97 -51 27 103 -16 109 -78 -8
5888 -8 56 -62 -48 -39 -27 -15 -82 54 11 -58 108 28 11 -87 -45 -21 -43 -98 -2 -24 -86 2 96 14 -21 23 113 -29 -77 17 18 -29
5875.8 -29 13 -51 12 109 -78 20 23 -1 -46 -20 -98 -89 46 -28 50 -20 65 -58 -6 42 23 21 39 6 8 9 0 -67 15 -59 -42 -26 -26
5863.1 -26 54 -75 -49 60 -34 26 -50 15 26 50 -9 -16 0 71 -48 -16 56 15 -53 -19 35 -51 -10 57 -13 -44 40 -113 -45 61
5851.6 61 -28 1 25 14 -24 79 -135 37 20 -25 6 -27 74 72 0 77 -90 73 6 -25 -20 11 -39 40 -34 -57 79 -13 -63
5840.5 -63 -29 -106 -6 16 -56 62 -31 -72 23 -9 -92 79 -37 -64 -27 65 -46 13 -64 64 -4 57 -38 -52 -7 83 0 36
5829.8 36 88 -35 -32 -19 110 19 27 17 -3 -29 -13 -10 -31 -56 -12 -56 -33 7 107 -51 31 -86 -33 73 8 18 -110 -96 -102 17
$$ packed form
5911Ij8J2j0K0k0OL5j18J23n8K2J04m9o9NK9j45J78o2P4l3j24J62r7m5O0L2JM5l7o8
5899.1c6J9MN8R1j31M5k3l4P7J8j39Q1OPK7r3M4O7j13k8R7j41M6P8P6j19J25j87P0
5888hO4j18J4RJ2To7J36m3o9J66q0j7r8M2K4k2n5R6k2o2Q8R4q2l5M4R0j42m8R4Jm7
5875.8b9M2o4O3R7j87R8Lk4m5K6p8RJ35p4P8p0Q5j23N2M8j9kJ8l3KJro7Q2p4J7J6%
5863.1b6Q0j29K6J09r4O0p6O5J1K4n9pJ6P1j19L2P2m1o8L4N4q6M1O7p0l1Q4j53O8J06
5851.6F1q9K9K4j1l8J03k14J72j7m5L1l3J01kp2P7j67J63o7l1NL1n0P9p4k3J36r2n0
5840.5f3L4p7J00K2p2J18r3m1R5l2q3J71j16k7L7R2j11N9p7J28o8O1r5j4M5R0q3L6
5829.8C6N2j23LJ3J29r1Qj0k0k6J6Lk1k5M4m4K3M0J00j58Q2j17N3J06o5J0j28J4oJ19
$$ plain form
5818.3 17 29 34 -23 -46 8 0 82 -31 113 -19 -58 -11 -7 23 -41 22 -12 -4 -15 112 47 -35 -38 -38 29 103 -61 -77 26 -46 53
5806.4 53 -23 -60 -126 6 77 24 8 66 43 36 26 15 -11 28 19 9 -36 -3 65 -25 73 54 -49 57 15 121 -20 143 -18
5795.3 -18 -68 18 50 37 10 18 -36 126 29 55 60 64 -22 -16 6 -36 24 81 -33 29 61 85 56 -5 -62 23 -36 54 -85 -16 71 10
5783 10 38 55 15 7 -71 29 -55 10 -27 -115 44 109 65 -35 34 73 -48 -34 -24 54 57 -101 -8 -43 45 15 -85 -12 -65 -35
5771.5 -35 -21 24 -68 -5 51 58 57 -19 -15 -92 -47 26 15 -1 -22 -95 -76 -26 50 73 23 -113 -29 0 -7 25 -67 25 50 -2 26 2 173
5758.8 173 22 -46 127 -44 -27 89 63 67 -48 -46 87 -42 12 -56 -55 -71 81 -48 -18 49 12 47 -70 25 -63 -118 -46
5748.5 -46 -40 78 7 14 50 46 -16 -36 24 19 109 10 26 84 77 7 58 21 7 -30 -1 -54 -18 -28 -52 -76 -25 7 48 -96 -54 34 -40
5735.9 -40 -31 61 -58 14 -22 -52 32 31 20 -103 -25 -42 -101 37 76 32 -4 -47 10 -11 -28 99 -59 -12 47 -51 31 35 -33 18
$$ packed form
5818.3A7J2Nn7k3N4qQ2j13J44j32l9M7ML0o4O3l4Qj1J27o5q2l%O7P4j64j6J03p2R9
5806.4E3p6l7o6J32P1n3j6N8k3pj0j1k6L9rj0m5L3O8r0R8j9j03J06m2J06j41J63j61
5795.3a8n0Q6L2j3k7Qn4J62r7K6NMq6OK2m2O0N7j14O2L2K4k9o1n7Q5n9R0j39O9Q7o1
5783A0K8J7m0qp8J00q4O5l7q8J59O5m4j00O9L9j21J4J0P8Lj58R3l5Q8l0j00P3n3L0
5771.5c5J4M5r2O3N6Pjp6Mp7M5P3j1j6k1p3J9N0P6K3n0j36Q4K9pL2r2R2K5n2K8k4J71
5758.8A73j51o8J73j71J7J16k6Mj15KJ33j29N4o8Jj6J52j29L0O7l7L5j17R5q8n5P2
5748.5d6OJ18p1PL6mo2k0O0nR0r9J6N8pp0N1l7j4l7K9n3L6j0k4TN1L2M1j44M2Q8p4
5735.9d0RR2j19P2l6l0Q4jj1j23P8j7n9J38L9m4l6m3N7k1j7J27j58M7N9r8Q2Mo8N1
$$ plain form
5724.4 18 -48 -59 59 -71 90 46 -14 88 61 -89 54 -73 -14 -11 19 8 81 -37 -49 67 52 -65 28 -11 -45 40 51
5714 51 3 -47 16 8 95 14 -90 -12 -27 25 -71 -44 22 -57 -25 34 27 51 58 70 61 -12 -28 38 -18 61 96 -29 -24 -28 34 64 -12 51
5701 51 39 -22 0 41 -2 -38 -55 -12 11 81 2 -2 -38 -78 -42 97 26 116 58 16 166 -2 -85 -34 81 57 -24 9 -63 7 -11
5689.1 -11 80 -89 -22 -57 53 -4 -53 -2 54 120 -18 -49 22 -71 -21 -25 -7 -52 40 -36 -139 -35 -33 -5 3 -15 30 71 -12 85
5677.6 85 -15 120 -27 -29 88 50 -54 29 -28 47 -35 74 -73 -61 -50 36 -17 -89 7 22 28 129 51 -58 -18 -60 -58 -73
5666.9 -73 -71 -65 -81 -16 2 57 21 18 52 15 116 40 -50 -5 -52 -110 68 65 -4 32 29 -1 62 87 70 18 -40 15 65 -53 -39 25
5654.6 25 -29 110 71 57 -7 -11 83 -50 -34 51 -1 -16 -53 2 42 2 7 -14 0 -4 -2 13 -64 -78 41 53 1 35 -11 89 41
5642.7 41 61 28 51 0 9 32 50 47 -13 13 -2 -69 -38 -71 29 -79 45 12 37 73 -16 -18 28 -76 -16 -116 -88 11 1 24
$$ packed form
5724.4A8o6j1J18j30J61m4o0J02k7j50J43j27N9LL0j1P3j18j2J16j5j17R3l9l4Q5J1
5714E1m8n0O3qQ7q1j04P8j5N2r6K7O6p9L2N9pK4PJ2rp3j6O6n6P9L5j25NmO2L0p6O3
5701E1j2o1K2M1m3l6j7M3K3P0p9ml6m0L6J39p1R0n8m2J50j68q3N1J15k4q1L3p2P0j8
5689.1a1R1j69O7l5J10n7m9N1N6O6j38l1P1r3N0mJ8m5R2p6j03J04KK8Qj8M5M1q3R7
5677.6H5j00J35j47kJ17l8j04Q3n7P5q2J09j47J2J1Q6n3p2R6J5OJ01p8j09M0m2Kj5
5666.9g3KOj6O5J8N5l6lL4l7J01p6r0M5m7n8J78lo9L6ll0O3K5j7n2n8N5N0j18J4O4
5654.6B5n4J39l9j4o4mR4j33J6Q5n2j5l7N5M0m0Nk1J4mKJ5p7j4J19J2n2L4m6J00m8
5642.7D1K0l3K3n1RK3J8lo0K6j5o7L1l3J00j08J24l3K5L6q9kM6j04O0j00K8R9j0K3
$$ plain form
5631.2 24 -5 -26 -6 42 25 -58 -67 -70 -56 24 37 -41 -47 2 -22 -17 51 16 -26 -49 109 -30 44 10 -46 -14 -6 -27 15 66 42 91 64
5618.6 64 48 80 -78 28 -69 9 128 28 -122 8 -26 4 -70 24 42 54 -21 -3 40 10 36 96 -74 34 -49 -1 -24
5608.2 -24 -18 -34 -97 46 17 -38 -100 -39 47 2 -16 39 6 -6 23 34 -48 -8 62 15 -62 -72 23 26 17 -32 94 -3 -5 49 -48 17
5595.9 17 37 -61 -42 -34 -44 -22 -27 -57 19 -41 -163 -14 -16 67 61 -115 78 77 35 -80 75 6 32 -36 42 -107 -117 37 -13 -35
5584.4 -35 20 -65 19 -47 31 1 3 22 66 10 43 -12 -22 -114 30 125 101 -22 -32 31 9 20 127 -59 76 149 -47 57
5573.7 57 64 -28 -12 -9 12 64 51 -37 -76 62 -6 1 25 99 -35 -73 -10 2 -3 -48 -43 -40 -27 -51 -23 -49 55 58 -22 21 -53 -106 -9
5561.1 -9 -52 -52 -54 33 63 46 -21 57 -73 70 64 33 47 -13 10 -41 -13 -114 -50 -50 -84 -46 -153 -35 4 -50 14 -10 -71 16 -44
5549.2 -44 31 51 96 27 26 15 91 -5 -49 44 29 -24 -66 -21 -30 -4 -53 -48 5 81 19 26 25 -60 -5 37 30 -14 -43 -54 58 -63 -46
$$ packed form
5631.2B4k9k1K0M8j7q3rlJ4Q0J3p8oM9k4NO8l5m2k3J58j39P4l4n6L2Qk1M2N1k4M9k7
5618.6F4j6L2j58J06r7P8J19j00j50J30l4L0p4R4J8J2p5J8M3l0K6O0j70J08q3M8k3
5608.2b4Oj6o3J43k9n5o2O1Q6m5j8N5l3j2K9J1q2M0P0m7p7j0R5Lrm9J26r7kN4r7O5
5595.9A7K0r8J9Qj0K2nl0P6o0j22J49kQ3oj76J93jm2j15J55o9K6o8P8j49j0J54n0k2
5584.4c5N5q5Q4o6P8l0KJ9M4n6L3n5j0r2J44R5k4j23j0O3k2J1J07j86J35P3j96J04
5573.7E7Pr2J6LK1N2j3q8l9J38o8PK4P4j34l8O3J2nm5NLJ3k4K8k6J04Lq0M3p4n3R7
5561.1im3%kQ7L0j7o7P8j30J43ol1J4o0K3n1K8j01O4%l4L8j07J18L9n4O4k4o1Q7o0
5549.2d4P5K0M5o9jj1P6r6m4R3j5n3m2M5rK6m9NN3P6o2Pjq5N5M2pm4k9j1J12j21J7
$$ plain form
5536.5 -46 126 38 -21 -69 34 -70 -42 -25 53 -33 8 -55 -80 27 -27 119 14 -22 46 -17 65 -23 -20 -20 8 62 -49 -24 86
5525.4 86 -32 -38 -26 61 51 1 -15 -1 13 -23 30 -86 -89 105 -12 -49 -57 15 65 94 -77 51 -49 34 -39 -30 16 -103 99
5514.3 99 -43 18 11 -46 38 -76 45 3 40 42 -44 34 75 -37 -17 29 66 -1 37 85 -10 14 2 26 -72 -39 -13 36 28 -82
5502.8 -82 -100 58 35 -37 -31 16 1 -21 35 -10 -23 -39 -30 58 30 -140 59 0 -14 -60 -35 -38 -56 97 -84 36 -29 31 40 -47
5491.3 -47 2 58 62 -7 -16 39 -29 63 32 -58 19 49 31 70 0 -15 -54 4 -27 -29 -39 -62 -29 3 -3 12 -68 -18 85 82 -54 42 -10
5478.7 -10 61 40 -14 -15 -30 -9 36 51 19 -3 -31 45 30 5 -58 13 -25 11 34 16 -21 27 -4 16 -81 -33 -17 -55 -60 60 -19 25
5466.4 25 8 11 -49 61 -56 58 -67 -91 -90 -52 -9 -25 -3 -18 -10 43 12 -3 -20 -26 -14 -73 -36 -2 100 -34 53 -5 75 -48
5454.9 -48 58 79 39 -62 86 79 -75 -123 2 90 80 -45 6 -107 -27 -30 23 -70 18 -39 -9 -20 -35 -21 -5 -74 -1 -35 -74
$$ packed form
5536.5d6J72q8n9m8J03j04K8J7P8q6M1o3k5J07n4J46j05l6O8o3Q2q8L%K8N4j11K5J10
5525.4H6j18oJ2Q7j0n0j6J4Tl6N3j16lJ94j17l7qP2N0K9j71J28j00Q3p3RM6j19K02
5514.3I9j42O1pn7Q4j14J21m2L7Kq6P8M1j12K0M6L7o7L8M8r5K4j2K4r8L3K6M9qj10
5502.8h2j8J58k3p2OM7j5k2N6m5j3j6RQ8k8j70J99n9j4m6K5lj8J53j81J20o5O0Rq7
5491.3d7M9N6Mo9rN5o8R2l1r0P7L0j8L9p0j5l9N8l1kj0k3L3L2oJ5q0N0J03lj36R6n2
5478.7a0P1k1n4jj5K1M5J5l2k2k8P6j5k5o3P1l8L6K3j8l7M8l1K0r7M8J6l8nJ20p9M4
5466.4B5j7Lo0J10j17J14j25k4JL8M3j6K2j5QN3l1j5j7oJ2n9L7L4J02j34Q7n8Q0j23
5454.9d8J06K1m0j01J48pj54m8J25Q8j0j25N1j13Q0lN3r3Q8n7L0j1j5J4J6o9P3l4l9
$$ plain form
5443.8 -74 -2 54 44 13 15 -11 -62 -41 -33 39 -27 -1 1 9 -65 -50 -43 -52 -27 95 46 73 61 -60 8 -78 27 65 77 -2 -49 -49 36
5431.1 36 -67 -25 -26 14 -116 6 9 -35 111 -1 -35 -26 43 -76 -22 39 -29 1 68 -6 -5 9 37 27 21 -37 -131 54 -39 27
5419.6 27 -96 -16 2 -17 62 -34 3 -96 -9 35 -86 -74 45 -71 -24 -29 82 12 47 -5 2 -4 13 -5 28 70 -63 14 56 25
5408.1 25 -15 -71 -19 128 -17 3 -1 93 43 15 -19 69 -4 8 56 -27 16 -30 3 -106 -100 -38 12 3 -127 103 4 9 -7 -20 -44
5396.2 -44 56 50 31 -3 42 26 12 -49 106 -73 30 -47 17 -98 21 67 100 82 -24 -71 -19 3 -71 -23 -3 -34 45 -24
5385.5 -24 5 5 30 -59 47 43 16 15 -85 -28 11 107 -60 0 -37 -48 -85 -11 -27 4 38 23 25 47 15 9 14 -15 -56 0 -56 -34 -47
5372.9 -47 8 -9 -4 14 -57 -84 -74 5 7 50 29 -22 -18 38 66 67 11 71 89 10 -29 -19 -6 23 -53 49 -39 -36 -35 -31 34 -121 80
5360.2 80 60 40 5 -94 40 -41 90 0 63 31 -10 15 25 -22 17 -72 59 -50 -10 12 -59 14 154 18 -98 68 -84
$$ packed form
5443.8g4P2N6j0l1Kk6n1K1QP2o6K6KQp4J5PrK5J22m9K7j2j21O8q6J05L8J2p9m7%Q5
5431.1C6j03M2jM0j30J22Lm4J46j12l4RO9j19N4O1o8L0O7p4JJ4K8j0on8r4J85r3O6
5419.6B7j23Q0J8j9P9r6L7r9Q7M4j21J2J19j16M7nJ11p0L5n2PoJ7j8L3M2j33P7M2l1
5408.1B5m0n6N2J47j45K0mR4n0k8l4Q8p3J2M8q3M3m6L3j09OO2N0rj30K30r9Nj6j3k4
5396.2d4J00oj9l4M5j6j4o1J55j79J03p7O4j15J19M6L3j8j06m7N2K2p4M8K0l1P9o9
5385.5b4K9%K5q9J06mk7jj00N7L9R6j67O0l7j1l7P4j6L1L4j5KK2l2oNk9m1N6n6K2j3
5372.9d7N5j7NJ8p1k7J0P9KM3k1n1MN6K8Jn6O0J8p9l9J0J3K9p6J02q8LJMO5j55K01
5360.2H0k0Tl5r9J34q1J31r0O3l2m1K5J0m7L9q9J31j09M0K2p1P3J40j36j16J66j52
$$ plain form
5349.9 -84 -31 19 -29 -63 -13 107 48 -15 -25 -11 -44 29 -36 -30 -49 -70 -25 -21 -2 -4 -1 19 -81 36 -31 -30 -26 -18 -25 5 -15 -54 31 -13
5336.8 -13 67 8 -26 -113 22 40 13 39 -129 -44 -11 -49 35 -78 17 25 109 -32 -22 -62 23 31 43 -18 -24 63 -68 21 -35 -19
5325.3 -19 -9 -35 39 -8 -6 -57 -29 -8 12 108 28 -15 -14 -12 15 1 68 71 -35 74 109 63 -15 -63 -14 26 -19 5 28 -55 -46 -2 -16
5312.7 -16 7 -23 11 -88 23 78 -76 -63 12 67 69 -112 -2 -53 29 -4 -11 73 4 -80 110 -26 43 40 -66 -29 -91 -29 -2
5301.6 -2 -25 -77 -37 -84 7 -13 40 -74 -18 -98 -37 -38 -28 28 -4 -86 37 -4 -27 -42 -44 22 0 54 -45 77 11 47 45 19 -64 -63
5289.3 -63 -35 20 -39 2 0 53 -51 -16 9 -66 -25 -13 -79 -89 71 -2 69 2 44 22 58 19 -4 13 93 -23 -90 1 -9 -32
5277.8 -32 -24 -114 -13 7 75 -38 -84 -45 81 -40 -76 -17 70 94 -29 63 -24 -42 -1 88 37 -5 -27 -17 31 -38 -26 61 41
5266.7 41 -2 -60 39 -35 -22 2 55 -24 53 59 -26 61 2 55 -5 22 -14 20 16 -48 36 -27 4 -30 -77 3 39 56 108 -46 3 -27
$$ packed form
5349.9h4N3N0m8l4N0J20n9o3j0J4l3P3o5Oj9k1M5MJ9kLK0j00J17o7JMQpL0k0l9Q5m4
5336.8a3Q0n9l4q7J35J8k7K6j68Q5L3l8Q4j13R5QQ4j41J0m0Q5QJ2o1oQ7j31Q9n6J6
5325.3a9J0k6P4m7Kn1K8K1K0R6q0m3JKK7j4O7Lj06J09L5m6p8m8M9M0m5K4K3q3RM4j4
5312.7a6K3l0L4r9J11N5j54J3P5N5Kj81J10n1Q2l3pQ4o9q4J90j36O9lj06L7o2O2K7
5301.6bk3n2M0m7R1k0N3j14N6q0O1jJ0N6l2q2J23m1k3j5kO6k2N4r9J22o6L6kk6q3J
5289.3f3K8N5n9M1kN3j04L5K5p5M1J2o6j0J60p3P1o7M2k2L6l9k3J7Q0j16o7R1j0k3
5277.8c2Qr0J01K0O8j13m6L9J26j21l6N9Q7K4j23R2q7j8M1Q9n1m2k2J0M8o9J2Q7k0
5266.7D1m3n8R9p4J3K4N3p9P7Oq5Q7n9N3o0K7l6L4mo4Q4o3L1l4m7Q0L6J7N2j54M9l0
$$ plain form
5254.4 -27 -50 19 101 -33 -38 -59 -63 -109 -21 38 41 -61 -28 -16 -99 15 39 102 -38 -30 -8 39 -51 24 52 -89 100 6 -6 -2 157
5242.5 157 86 12 77 -4 31 -27 -12 -117 28 -39 -33 -53 98 54 -54 52 14 -112 -89 27 -52 74 -59 24 74 89 15
5232.2 15 -14 -94 -14 66 -18 -63 86 63 60 -6 4 -25 38 108 -18 -61 -47 -12 65 104 -27 3 0 17 -41 123 -71 -31 -14 -51
5220.7 -51 9 -79 -4 -11 50 -55 5 -17 -10 2 -81 -7 35 1 64 -19 -27 -107 -23 32 8 -14 6 -3 20 -14 -59 52 12 38 -150 12
5208.4 12 -37 16 140 -1 -71 25 -46 -19 1 63 -2 46 -44 66 17 39 97 54 17 -29 -89 -56 -69 16 -74 53 -37 -38 53 -53
5196.9 -53 49 -20 2 -88 46 1 1 30 -36 -54 33 -56 76 -6 -67 -10 -34 42 59 -81 -25 41 26 -112 54 -35 -7 -37 -61
5185.8 -61 -66 -38 -124 51 -107 43 34 -32 71 -12 -110 43 76 28 37 -16 -135 72 -93 3 -35 91 -4 102 50 40 46 35
5175.1 35 -24 74 31 61 -43 16 -33 15 47 36 -31 -10 -60 -31 -23 -24 14 14 48 1 -5 13 49 -89 31 -45 -89 -116 -120 -66 17 -98
$$ packed form
5254.4b7k3O9Q2j34nk1mm6Q8N9Lj02L3J2q3J14K4O3j40QK2M7r0P5K8j41J89r4j2MJ59
5242.5A57p1p4O5q1L5n8J5j05J45o7Ok0J51m4j08J06l8j26K3J16p9J26j33Q3N0J5p4
5232.2A5k9q0Q0Tq4m5J49k3lo6J0k9O3P0j26m3J4L5P7L9j31L0lJ7n8J64j94M0J7l7
5220.7e1O0q8P5pO1j05O0k2PJ2q3P4M2l4O3q3qq0Q4N5k4k2K0rK3l4m5J11m0K6j88J62
5208.4A2m9N3J24j41p0R6p1K7K0O2o5M8r0J10m9K2N8m3l7m6o0L3j3Q5r0J27r0jR1j06
5196.9e3J02o9K2r0J34m5%K9o6j8Q7q9J32q2o1N7k4P6J7j40N6O6j5j38J66q9K8l0k4
5185.8f1nK8q6J75j58J50ro6J03q3r8J53L3m8Rn3j19K07j65R6l8J26r5J06n2j0Oj1
5175.1C5n9R8m3L0j04N9m9M8L2j1o7K1n0K9QjL8%L4m7oJ8L6j38J20p6m4k7mN4Q3j15
$$ plain form
5162.8 -98 32 -11 -16 38 -29 -25 74 -133 -2 -31 -61 101 -49 55 51 -29 -34 -22 -9 -3 -22 56 71 31 111 -20 73 1 17 -47
5151.3 -47 6 29 100 -79 -12 -23 -19 16 -48 95 -21 53 31 74 -129 21 80 4 -9 16 40 29 14 55 60 -96 41 -18 -52
5140.2 -52 35 43 -98 9 42 61 36 5 28 -11 23 -33 -14 -15 -74 33 -66 -5 13 -35 29 -1 9 15 5 6 -62 -67 -53 -6 -19 29
5127.9 29 -60 35 26 16 -27 -3 -123 99 -18 80 87 -12 122 -103 -55 67 57 36 -69 39 -147 -36 5 40 25 6 13 7
5117.2 7 -83 -75 59 41 34 2 68 -121 39 -11 -1 -55 -18 14 5 -45 6 -11 6 -47 -54 4 -25 -31 25 -18 34 19 68 -7 48 35 -35
5104.6 -35 -43 -8 -54 -84 64 -44 -3 -130 -51 -3 -7 8 -40 -23 9 -37 -32 -18 -68 -72 -105 -104 -58 -7 36 1 16 -45 -51 37 18 34 -4
5091.9 -4 -27 15 -7 36 120 -2 -13 -61 45 -21 -26 -7 35 -53 30 -45 -6 -59 -17 -1 88 -38 -84 -111 19 -96 -64 -43 -42 -42 77
5080 77 -85 -6 17 -30 -100 -3 21 40 -45 5 -5 -38 -80 -49 6 20 -18 -71 7 -107 -45 -13 20 48 28 -72 89 1 -40 -15
$$ packed form
5162.8i8J30m3nN4o7MR9k07J31k9l0J62j50J04mq0nJ2J3Oj9P8J5m0Q0j31R3p2J6o4
5151.3d7N3K3P1j79O7j1ML5o4J43j16P4k2M3k03J50N9p6j3K5K4j1j5M1Nj56J37n9l4
5140.2e2Q7Qj41J07L3J9k5l1K3l9L4n6J9jn9J07r9O1J8m8O4l0J0Oj0Jo8nJ4M7j3M8
5127.9B9q9R5rj0m3K4j20K22j17R8Pr9J34k25M8J22j0k1j05J08j86J11M1L5j5j9Po
5117.2Gr0QJ34j8pl2O6j89J60n0J0n4L7L2rn0N1j7J7n3pN8k9oN6m3N2j5M9p5N5j3p0
5104.6c5qL5m6l0J48j08M1j27P9M8mJ5m8J7L2m6NJ4n0ml3JM6N1M3l5J5o1oQ8j9J6l8
5091.9dk3M2k2M3Q4j22j1m8J06o6nJ9M2q8Q3p5L9n3M2J6Q9j26m6k7J30j15L2K1J%J19
5080G7j62P9K3m7p0R7K4J9q5N0j0l3m2L1N5J4l8n3P8j14O2L2L3K8k0j00J61q8m1K5
$$ plain form
5068.5 -15 18 65 -43 18 0 30 -32 111 -11 12 9 -79 89 -59 -23 -35 205 38 -17 -4 -75 -3 53 95 21 -15 -24 -13 40
5057.4 40 -43 -2 35 26 40 0 7 -6 -25 -50 33 5 20 27 56 5 14 -13 7 -178 -16 -12 5 -52 69 -88 68 -37 72 -8
5045.9 -8 -17 0 17 -20 -1 93 -81 -16 121 15 9 -4 47 -4 -7 33 133 37 81 29 26 23 4 38 10 -38 57 -44 -3 -45 -39 -52 -3
5033.3 -3 -80 -40 -11 -55 3 -66 -34 37 -13 22 -17 -10 54 81 -12 -36 53 100 42 -16 -129 17 -11 -95 -17 -53 -8 49 -25 84 53
5021.4 53 97 38 70 -2 -87 14 10 18 72 -51 -42 36 50 3 -77 42 -14 -5 -97 -76 38 67 -38 -40 22 -17 -36 -58 42 -4 -29
5009.5 -29 33 1 18 -17 -24 -17 116 12 -37 -17 -36 4 -2 36 -60 -26 13 -19 18 -46 110 124 -101 -26 -75 -23 54 5 65 -95
4998 -95 -54 32 32 8 -59 -3 -83 -138 -107 -67 64 -24 43 -29 -81 -84 25 -17 -66 -38 -41 -39 4 9 57 -19 -5 -24 47 -69 5 2 -32 8
4985 8 -88 2 -24 -13 190 -39 -80 3 -103 -60 -33 -57 -15 -7 0 11 3 13 -111 -5 43 -23 -53 -28 -4 -84 30 15 -28 41 -35
$$ packed form
5068.5a5L3M7j08O1j8L0o2J43j22K3lq8J68j48L6j2K40j67n5J3p1P2N6M2p4l6rJ1N3
5057.4D0q3M1L7rJ4m0Pj3j9k5Q3k8J5PK9n1Rk7K0j85J62MJ7n7J21j57J56j05J09q0
5045.9hrJ7Tl7J9R4j74O5J37j06oj3N1n1lM0J00r6M4n2lTj9L4k8m8R5j01M1m2Oj3M9
5033.3cp7M0K9m4N8o9L2P1n0L5l9PO4K7r3k4Q9M7n8Tj13J46k8q4P8l6M5N7p4J09l1
5021.4E3M4n9L2p2q5J01mQN4j23RP8J4m7q0J19n6Rr2K1J14K9j05kO2l9j9k2J00m6k5
5009.5b9O2l2J7l5pPJ33j04m9K0j9M0oL8r6L4L9l2L7o4J56J4k25P5m9N2P7m9O0j60
4998i5M1Q6%k4o7N6q0n5L1M0J31q8O7p2n2lJ09m2m9K8lKM3NM8p6J4j9P1j16P4ll4M0
4985Hr6R0k6J1K03k29m1Q3j06M3K7k4M2QPJ1qJ0j24J06M8o6l0K5K4q0J14j5m3O9p6
$$ plain form
4973.1 -35 59 14 -167 31 35 -46 7 -123 52 9 -9 9 -2 -9 28 -54 89 89 19 -93 94 18 82 15 50 -10 -16 41 -26 -44
4961.6 -44 36 13 -37 -62 0 26 18 -60 41 56 -78 62 25 5 45 -43 3 -101 -21 -46 -49 52 -15 -62 -25 71 -7 -104 -8 78
4950.1 78 54 2 122 0 13 22 34 -45 -51 73 -10 -56 53 -25 3 44 -60 -46 30 -86 -19 -14 -70 34 -31 -44 34 31 -3 -20
4938.6 -20 -27 63 39 117 12 -79 -30 -58 32 -19 69 41 -11 27 -17 8 86 -28 -21 109 -5 -25 -62 -92 13 -7 -34 59 -154
4927.5 -154 -18 98 51 54 56 -73 22 22 19 -61 -2 -152 8 55 -69 -10 -59 -1 -11 -67 14 31 -39 -55 -17 37 -31 -39 28 -70
4916 -70 -55 121 61 -9 -19 29 24 26 -25 -93 -122 -57 -1 90 -14 11 -29 -32 30 -45 12 80 -21 -82 25 -29 -22 -4 -102 -15 -56 -125
4903.7 -125 -130 -18 25 -38 -104 12 -74 63 45 -5 13 37 -70 -59 28 91 -50 -66 21 -87 -34 111 -71 12 51 21 56
4893.4 56 18 -19 -9 49 190 19 2 28 -2 -62 -37 21 4 120 129 33 0 -67 -22 41 -3 13 -87 -97 12 -5 -95 -62 44
$$ packed form
4973.1c5R4m5j81J98Mq1N3j30J75m3j8J8j1pL7q2J43%p0j12J87p6O4o7L5o0oN7o7j8
4961.6d4Q0k3n0k5O2K6qp8J01J5j34J40l7k0M0q8M6j04Q0k5lJ01o7m7L7R6p8r7R6Q6
4950.1G8k4n2J20j22J3RJ2p9oJ24q3m6J09p8K8M1j04J4P6j16O7Nn6J04o5j3P8ll4j7
4938.6b0pR0k4P8j05r1M9k8R0n1Q8k8n2L8m4K5P8j14PJ30j14k0l7l0J05k0k7R3k13
4927.5a54J36J16m7LKj29R5%lq0N9j50J60M7j24N9m9N8j0n6Q1J7p0j6L8N4o8qO7r8
4916g0J5J76o0p0j0M8nKn1o8k9O5N6R1j04K5m0lO2p5N7O8j01o1J07n4PJ8r8Q7m1o9
4903.7a25nJ12M3o3o6J16q6J37j8n0J8K4j07J1Q7O3j41j6Q7j08N3J45j82Q3L9l0L5
4893.4E6l8l7J0N8J41j71j7K6l0o0K5N8j7J16Rr6l3o7M5O3m4J6j00j0J09j7r0L3J06
$$ plain form
4882.2 44 15 71 72 -21 -52 -74 12 -6 41 -13 154 56 -74 72 -63 -56 -50 -17 4 -19 20 -93 15 -38 15 -25 0 -2 -77 -90
4870.7 -90 -2 -24 -15 12 -49 -10 26 2 2 -23 89 68 -72 -73 -12 -25 33 -32 8 -18 19 35 -97 36 57 -18 -49 11 -83 -55 72
4858.9 72 26 -88 -1 59 1 57 -24 -85 -98 82 49 108 63 -9 46 32 -80 -41 -17 -31 -27 -29 -25 24 24 25 -42 -89 -16 -15 -46 28 55
4846.2 55 31 25 100 43 42 -4 -56 -22 17 32 72 -101 -24 7 198 65 66 23 38 24 60 -55 28 -109 -6 -10 12 -40 -1 -74
4834.7 -74 -7 -22 -29 42 31 13 -91 -6 41 -23 43 -72 -10 -30 67 -26 22 -9 -20 -23 4 -10 -7 -64 16 15 63 56 84 -91 27 -40
4822.4 -40 100 26 6 -80 68 -24 87 69 31 82 -27 33 -97 85 59 -19 -38 -6 0 18 -40 -110 64 -20 -28 -4 0 -84 -71
4811.3 -71 -89 -25 42 -91 15 21 -14 22 -20 -54 7 40 -16 -45 -60 -2 25 -25 10 -31 43 -11 61 27 -26 -26 18 -5 -14 72 5 -34
4799.1 -34 -35 1 -15 -60 -35 -82 85 -28 19 -33 51 -1 -62 66 -57 89 27 -48 15 48 -50 -39 -4 2 -80 68 1 0 -19 -5
$$ packed form
4882.2D4k9N6Jr3l1k2Q6j8M7n4J67r8j30J46j35POL3K1k3L9j13J08n3N3m0K5kp5j3
4870.7i0Q8k2RK7o1L9L6k4%k5J12k1j40jO1j3N8o5M0k6L7J6j32J33K1p5l1O0r4K8J27
4858.9G2m6j14Q7O0n8N6q1o1j3J80l3N9m5p2N5j4j12L9K4j4MkMM9%Jo7m7P3Jl1P4K7
4846.2E5k4oP5n7jm6n2L4L9J5M0j73P7L1J91j33Jm3J5j4L6j15Q3j37J03mK2n2L9p3
4834.7g4O7j5pP1j1j8j04Q5M7o4O6j15O2k0R7r3M8l1j1lK7j4Ln7Q0jM8pK8j75J18o7
4822.4d0J40p4k0q6J48r2J11j8l8N1j09O0j30J82k6p8j9L2OJ8n8p0J74q4qK4Mq4J3
4811.3g1j8O4O7j33J06Ol5L6m2l4O1L3n6k9j5N8K7n0L5m1P4n4P2l4n3%M4k3rQ6o7l9
4799.1c4jL6j6m5K5m7J67j13M7n2Q4n2o1J28j23J46o2p5O3L3r8J1L5Oq2J48o7jj9J4
$$ plain form
4787.6 -5 12 4 28 40 -50 41 14 50 1 -75 -9 98 -20 32 -36 -44 70 -61 -23 47 -40 89 -119 36 -46 -58 11 -150 8
4776.4 8 27 -43 44 -19 71 -70 47 33 -72 -32 124 30 -126 31 33 -12 -23 -42 10 -69 69 -23 -38 -50 -78 -74 23 -4 -52
4765.3 -52 76 29 35 -96 19 -64 94 45 48 -33 1 66 48 -72 32 98 6 40 -63 49 38 -75 35 25 -22 79 -7
4755 -7 -36 76 29 51 -67 16 -27 1 5 120 59 -31 -17 -59 44 -51 -45 -50 -10 -37 -19 -8 27 36 -14 13 9 2 35 62 31 84 23 -33
4742 -33 -4 11 58 -3 -53 -87 -44 16 77 36 16 37 10 -6 7 -89 131 60 8 36 -9 63 35 49 -79 13 -71 -37 -2 -13 -47
4730.1 -47 13 27 35 56 32 2 -50 76 62 20 2 28 24 -106 57 -34 -51 -33 -73 -139 -39 28 58 -64 2 18 37 -48 52
4719 52 57 71 -32 41 8 30 45 -12 -3 8 -2 62 -5 -84 63 -54 36 104 -13 58 -30 35 -4 -64 12 -12 -35 76 -22 -42 -19
4707.1 -19 -22 -31 -17 16 -20 -156 8 21 98 24 -4 57 48 -17 -10 -41 49 -43 -18 -94 4 -18 15 -63 -95 -106 1 48 -7 -11 89 -23
$$ packed form
4787.6eJ7qK4J2r0R1k7L6m9p6O6J07j18N2o8qJ14j31L8P0q7J29k08J55q2j2O9j61J58
4776.4HJ9p0Q7o3R0j41J17j4j05M0J56r4j56J57Km5j1j9N2p9J38r2j5j2k8MR7k7m8
4765.3e2J28m7Oj31J15q3J58m9Lq1L4O5j8j20J04O6r2L4j03J12j1j13J10j0m7J01q6
4755gk9J12m7K2j18Q3m3K8MJ15o1r0J4m2J03r5OnM0k7J8J1L5Rn0K7mpL3K7l1N3o1n6
4742c3K9J5M7o1n0l4M3O0O1m1k0K1k7j6J3r6K20p1n2K8m5P2k8J4j28R2q4L4L5j1l4
4730.1d7O0J4QK1k4l0n2J26j4m2j8K6mj30J63r1j7J8m0o6J00O7L0j22O6J6J9q5J00
4719E2NJ4j03P3l3K2J5n7RJ1j0O4o7p9J47j17R0O8j17P1q8O5l9o0P6k4k3J11r8k0K3
4707.1a9lrJ4L3l6j36J64J3P7p4k8O1ro5Pl1R0r2K5p6R8k2L3p8l2j1J07M7n5mJ00j12
$$ plain form
4694.8 -23 7 -25 -76 -16 20 72 -76 -53 40 3 42 58 -19 56 -110 -41 14 88 -23 53 22 29 -36 -26 80 -17 28 -28 -77 21
4683.3 21 -49 84 -27 33 -21 86 -59 -23 39 27 44 34 -39 50 -30 -58 -3 -104 39 69 -48 -16 -42 -70 47 80 52
4673 52 55 -7 -5 87 -70 12 -23 -4 -21 65 -37 -147 -58 -46 -6 -91 1 37 -60 13 19 -106 -54 81 -43 110 -90 9 -8 -28
4661.5 -28 26 -28 -43 -74 -61 -113 5 -37 35 -31 16 42 41 8 -51 -16 61 -11 79 -53 14 48 -11 -45 -67 12 -111 -20 -5 -16
4650 -16 -30 101 25 -86 -28 -4 -42 -10 20 -21 -42 -41 58 -53 -63 -69 -128 30 30 24 -28 -20 70 -62 -49 -62 24 -23 -23 -33 -77 -68 -34
4637.3 -34 -77 -64 -96 -1 -14 -48 6 26 95 -26 -26 -13 -63 -80 -21 129 -79 -171 7 -105 61 32 92 -28 38 67 4 -90
4626.6 -90 -1 -63 -9 54 41 6 -77 -50 -28 -5 -41 -41 -7 25 -65 28 -13 -32 -88 -74 15 -54 -64 18 -13 -28 -86 21 56 -76 6
4614.7 6 -8 -21 8 -194 -136 26 -5 -71 9 125 -26 -26 -36 31 -9 -6 -7 59 38 18 -73 -32 -30 -39 -39 -52 -19 49 -43 35 -114 24
$$ packed form
4694.8b3L0l2n1O0L6N2j48K3R3l7L9J6p7P5j66O9N5P4j11P6l1Po5J0J06r7M5n6m9R8
4683.3B1p0J33j11O0n4J07j45L6O2j2J7j0p3Q9q0k8N5j01J43L0j17L2k6k8J17L3k8
4673E2Lo2KR2j57Q2l5J9j7Q6j02j10Q9J2M0q5R2L6r7P3Oj25N2J35j24J53k00R9j7k0
4661.5b8N4n4j5l1J3n2J18m2P2o6M7K6jl3n9L5P7p2R0j32O7L4n9l4k2P9j23R1J5j1
4650a6j4J31p6j11N8K4l8L2L0m1k1JR9j11j0on9J58%on2QR0j32J3j3Q6m7%j0m4RL4
4637.3c4m3J3l2R5j3l4N4K0O9j21%J3n0j7N9J50k08r2J78j12J66k9O0j20O6K9o3r4
4626.6i0Q9o2N4O3j3l5q3K7K2K3l6%L4L2r0R3m1j9n6J4Q9o9j0Q2l1j5n8J07L5j32Q2
4614.7Fj4j3K9k02N8J62l1o6Q0J16j51%j0O7m0LjO6k1k0r1M1Kr%j3L3O8r2P8j49J38
$$ plain form
4602.4 24 -4 35 -2 26 39 32 -6 81 -20 80 -53 21 9 8 69 -23 9 15 -35 -21 -65 -6 41 -23 -33 -75 -15 -9 -41 -5 -44 117
4590.2 117 -41 -4 -70 -3 31 44 34 44 -72 38 47 -49 27 19 -49 -11 -62 61 86 -38 46 -8 -8 8 -73 37 7 15 -112
4579 -112 -68 -63 -9 18 -77 44 -54 -35 -15 -33 -44 56 71 -13 9 25 -12 -9 -20 12 63 14 -70 47 28 76 14 -59 -63 0 -15 -36
4566.8 -36 -25 59 59 -38 -86 -3 -19 -71 8 -2 45 88 -3 -52 -6 -28 -75 84 -3 -27 -13 -13 8 89 1 -41 36 36 52 1 23 -30
4554.5 -30 -30 -54 30 91 -72 31 -54 -50 -30 40 -21 -3 -35 -69 -28 31 38 -42 -15 -44 3 76 -8 17 -101 1 10 -9 119 72 -8
4542.6 -8 -48 5 -13 -2 -24 -47 59 -40 10 -49 -20 42 -74 45 -47 82 34 -62 -19 -26 94 56 -14 11 -19 12 -11 -14 42 -1
4531.1 -1 2 -1 -36 12 11 5 4 -20 -19 7 -93 -62 3 -1 -97 110 19 -40 -67 19 -81 28 63 -86 -97 -41 40 53 14 -33 -45 -12 -22
4518.5 -22 -41 23 21 10 -3 49 2 32 -77 28 25 0 38 79 -7 -80 13 108 -44 -16 27 20 -90 -54 34 -32 29 95 25 -6 -80
$$ packed form
4602.4B4k8L9l7K8J3pl8Q7j01J00j33P4j2jO1r2L2On0J4m4N9M7o4j0m2O0Ol2L6l9J61
4590.2A17j58L7o6O7L4J3j0J0j16J10Rr6P6qo8L8n1J23K5j24Q4n4%J6q1J10l0Qj27
4579a12M4NN4K7r5J21r8J9K0j8j1J00J5q4K2J6l7Lj1L2N1m9q4J17j9M8o2p3mO3j5k1
4566.8c6J1Q4%r7m8Q3j6n2P9j0M7M3r1m9M6k2m7J59q7k4J4%K1Q1q8m2P7%J6n1K2n3
4554.5c0%k4Q4O1j63J03q5MK0P0o1J8l2l4M1N9Pq0K7k9M7P3q4K5j18J02Rj9J28m7q0
4542.6hm0N3j8J1k2k3J06r9N0n9K9O2j16J19r2J29m8r6M3pJ20l8p0K5l0L1k3lN6m3
4531.1aLll5M8jojk4JK6j00L1O5mr6K07r1n9k7Q6j00J09L5j49j1N6Q1J3l9m7j2L3j0
4518.5b2j9O4kj1j3N2m7L0j09J05lk5L8M1q6p3R3R5j52K8M3pj10L6Q8o6O1O6p0l1p4
$$ plain form
4506.6 -80 15 15 -52 -22 -124 -13 -10 -25 56 57 47 -30 -30 51 -49 -45 -17 20 14 -20 -110 -81 -38 -47 -38 87 -31 14 -23 -49 -34 -9 -30
4494 -30 55 28 -18 -68 51 84 4 44 7 33 -27 -45 20 56 -65 55 -97 -4 10 43 19 -25 -32 13 1 101 52 -18 82 -12
4482.5 -12 27 0 -14 -30 1 6 21 -79 21 -31 33 -8 10 -15 -1 59 -8 34 -46 110 73 86 -17 -65 28 17 -92 -35 -42 65
4471 65 -41 20 4 -117 -59 68 6 -53 -31 47 25 20 64 -84 114 26 -19 11 95 49 -96 -13 22 -21 35 101 -23 -100 14
4459.8 14 -52 -34 23 -42 -97 -101 -53 -16 -84 -102 -19 -12 -29 -45 -33 -4 71 52 37 -20 16 -57 -18 -27 -56 30 -7 -70 82 -66 7 -35
4447.6 -35 18 59 -19 20 -37 -76 -100 -18 29 90 -23 113 -30 -8 -59 54 -4 35 -7 -5 -83 40 -55 65 -49 -63 -19 -83
4436.8 -83 21 36 -4 4 -160 27 -31 -13 -14 -44 -23 39 2 -46 -15 40 -31 -44 18 -39 -77 -12 95 28 -3 37 7 -99 -26 -31
4425.3 -31 -11 -7 -26 -38 -34 39 57 -54 -32 -40 -5 61 107 -21 52 -17 -65 30 -45 -139 -85 19 -33 22 25 15 -74 53 17 -37 -21
$$ packed form
4506.6h0R5%o7L0j02J11Lj5Q1Jj0p7%Q1j00MK8L7ol4r0K9M3rRJ25j18M5l7k6J5K5k1
4494c0Q5k7m6n0J19L3q0M0l7K6o0j8O5L6j21J20j52R3J4L3k4m4pM5j2J00m9p0J00r4
4482.5a2L9k7j4j6L1NJ5j00J00n2O4m1J8k5J4O0o7M2q0J56l7J3j03m8R3j1j09N7pJ07
4471F5j06O1j6j21N8J27o2n9K2P8k2nM4j48J98q8m5L0Q4m6j45Q3L5m3N6O6j24p7J14
4459.8A4o6J8N7o5n5mM8L7o8j8Q3Pj7j6J2K9P5j9j5n7L6p3L9rk9Q6l7o3J52j48P3m2
4447.6c5N3M1p8L9n7l9k4Q2M7O1j13J36j43K2n1J13n8L9m2Kp8J23r5J20j14j4M4o4
4436.8h3J04J5m0Qj64J87n8J8jl0K1O2l7m8L1N5p1j3O2n7l8O5J07o7l1M0l0j06P3n
4425.3c1K0Mj9j2MP3J8j11K2qL5O6M6j28P3o9m8R5p5r4N4J04n2N5Lj0q9J27l6n4J6
$$ plain form
4413.5 -21 70 101 48 14 -121 72 -71 38 -66 -57 -87 50 -70 51 -68 -20 16 -21 30 50 7 -2 -7 -69 -74 -59 -87 31
4402.7 31 78 -93 -78 127 26 -42 -27 -12 -56 -139 -25 -5 -46 7 -79 -11 -49 34 -7 -45 69 -116 -50 -44 -45 -3 68 2 47 46
4391.2 46 -19 -33 -62 13 -55 13 3 -81 -46 -147 -45 -92 26 -27 -12 59 -3 -96 21 17 22 -26 126 -41 -78 7 25 19 -30 -13
4379.7 -13 31 -92 -53 112 -14 -37 67 -88 93 62 69 56 -87 -19 16 19 -30 -12 39 -53 -2 1 42 -27 -54 -51 9 23 9 32
4368.2 32 -32 15 52 -55 4 -45 1 25 24 21 -6 -37 -44 55 44 11 118 42 0 37 -63 -39 -104 -9 62 14 -20 -20 119 2 69
4356.4 69 -24 -87 54 -20 11 -102 6 -17 3 -18 -22 9 55 -19 -91 -5 5 43 73 10 54 -73 -8 -35 -73 -83 -87 5 8 122
4344.9 122 116 -59 -25 22 88 -50 52 -11 -36 58 45 25 -33 55 9 15 74 -44 -29 -3 70 -2 27 23 46 22 -22 -34 -35 -104 -17
4333 -17 67 -90 22 -11 38 -63 39 -49 -39 111 19 44 6 -144 56 -32 15 90 56 -66 19 1 -29 -26 22 -118 -77 27
$$ packed form
4413.5b1R1L1n3l4j35J93j43J09j04Rl0J37j20J21j19M8L6l7N1K0m3rno2nJ5k8J18
4402.7C1M7j71J5K05j01o8J5Tm4q3J14K0m1N3q6O8l8Q3m1l8J14j85O6OjM2P1o6M5j
4391.2D6o5j4k9P5o8O8j0q4L5j01J02m7J18n3J5P1o2r3J17mNm8J52j67l7Q5J8om9J7
4379.7a3M4j23L9J65j26k3J04j55J81l1Pj3j43O8L5Lm9J8N1r2N1LM1o9k7LO0J4j4K3
4368.2C2o4M7L7j07N9m9M6K4jlk7l1pR9j1l3J07p6m2L7j00K4o5R5P1m8l4%J39j17O7
4356.4F9r3o3J41p4L1j13J08k3K0k1mL1M6p4p2Q6J0L8L0o3M4j27O5k7l8j0mR2LJ14
4344.9A22oj75L4M7O6j38J02o3k5R4j3k0n8Q8m6ON9j18J5K6P3p2K9mK3k4m4j2jo9Q7
4333a7Q4j57J12l3M9j01J02q8J0J50r2K5l8j50K00q8M7P5l4j22Q5j8l0LM8j40M1J04
$$ plain form
4322.2 27 23 20 -35 -153 -30 19 -44 -15 113 36 51 -45 -9 -35 -23 9 -32 51 24 -29 23 -64 46 -6 -4 -32 9 -41 -63 -38 -12
4310.4 -12 83 -97 53 21 -66 51 -124 -8 -72 -57 -64 -18 0 0 -91 -29 33 -14 -69 -65 21 -1 41 -44 -54 -57 -71 -66 36 0 44
4298.5 44 6 -5 -31 15 25 -105 4 -72 95 -18 -20 -11 -65 37 9 22 34 39 81 -31 -72 -33 -4 -13 30 -3 3 13 35 -70
4287 -70 -36 -47 -57 -16 -16 -70 -53 -68 -37 -162 -60 -35 -2 11 7 7 22 -31 -6 -42 -27 79 106 37 -19 34 51 -47 27 -94 -42 -60
4274.7 -60 -54 -54 -72 33 161 44 68 -9 22 -14 -58 51 59 -112 54 -18 48 6 -31 -120 -17 -7 49 -25 36 -16 -35 50 8
4263.6 8 -22 -32 73 -36 78 -20 -154 -15 45 25 -13 -10 13 24 -69 29 -18 48 19 -100 -21 29 25 9 -22 -8 37 -35 30 20
4252.1 20 0 -66 -93 92 4 -11 -11 83 -2 87 -11 -30 80 -38 35 13 60 49 -34 89 -34 -62 -54 -47 -39 4 -18 76 -131 -35
4240.6 -35 -14 -2 31 -39 18 -24 82 20 -48 6 -17 -68 -49 24 123 81 138 13 -59 35 -54 31 58 66 20 -23 22 -75 -38 -1 -20
$$ packed form
4322.2B7mln5j18J23M9o3K9J28p7J5r6L6k6J2L2m1Q3k7n3N2q7J10n2Kk8M1n0k2K5K6
4310.4a2R5j80J50l2q7J17j75J16o4J5pM6J8%r1O2Tm7n5MQ6k2M2q5j0lj4NJ02l6M4
4298.5D4l8j1k6M6J0j30J09p6J67j13kRn4J02k8J3J2NM2j12m1L9K9rM3l3OJ0K2j05
4287g0L4j1j0M1%n4J7j5L1j25J02K5L3J3m%J5n3K5l6J5J06K7o9n6N3J7r8P4j21N2j8
4274.7f0O%j8J05J28j17K4p7L1l6m4J09Qj71J66p2O6m2l7q9J03J0N6p4O1n2j9Q5m2
4263.6Hl0j0J05j09J14r8j34J39O0k0l8LK3J1r3R8m7O6k9j19P9N0mj6l1J4M5p2O5j0
4252.1B0k0o6k7J85q8j5%R4q5Q9r8j9J10j18P3k2M7j1q3J23j23k8QPQM3k2R4k07R6
4240.6c5K1J2L3p0N7m2J06o2o8N4k3n1J9P3R9m2N7j25p2R4q9Q5K7Qm6m3M5r7L7Tj9
$$ plain form
4228.7 -20 -118 -96 -57 -154 61 -112 -90 15 -74 -54 -128 -19 41 27 -98 -43 93 51 -63 -24 9 25 -9 -76 -25 20 -40 -21
4218 -21 18 -27 -35 62 -32 -112 6 -50 -61 49 -28 68 6 4 -8 10 43 -50 92 -56 -10 -15 60 -58 12 -47 -53 23 -51 -17 -24 -54
4205.7 -54 38 -55 23 13 70 90 22 10 -149 -45 53 11 14 -33 -41 -10 -12 -35 23 -151 -29 -49 -38 -7 -67 -86 23 -9 -22 -6
4194.2 -6 -94 -60 24 -19 -91 36 53 2 -55 63 -49 -33 60 10 -62 32 29 74 -67 66 3 131 39 57 153 61 -95 65
4183.5 65 -37 45 -46 -57 -37 -51 -51 -21 19 -82 -34 7 24 -1 26 40 89 62 -34 -44 49 -10 -118 -53 -30 -61 -22 -40 -164 100
4172 100 33 68 9 4 7 6 -17 3 -26 -53 -67 -33 3 32 98 -52 -17 -1 -39 53 85 42 -14 7 48 3 -7 43 45 -61 15 -85
4159.7 -85 -12 15 7 78 -58 -89 47 -24 94 -48 -37 -123 -8 64 -24 42 -30 -97 -2 -35 -3 36 69 99 -109 -22 -64 -105 4
4148.6 4 67 74 15 40 -55 -85 28 58 -37 -66 1 -18 37 -41 -103 73 -29 -75 -47 -85 -36 -54 -51 -42 2 -81 47 2 -10 -2 -48 -74
$$ packed form
4228.7b0r8K2L9r7K15j73K2J05q9K0p4J09O0j4j25N5J36m2j14L9L3J6l4o7N1M5o0J9
4218b1L9m5qR7r4q0J18n6j1J10p7R6o2kj2J8L3r3J42j48M6nP5j18P0n9oP6p4L4pl0
4205.7e4R2r3P8j0N7K0o8j2j59J04R8m2Lm7qL1kk3N8j74J22k0J1L1o0j9J09l2j3J6
4194.2fq8L4Q4m3p2J27J7n1n7J18j12J6R3n0p2R4lM5j41J33o3J28r2J8R6r2j56J60
4183.5F5j02Q2r1j1K0j4%L0M0j01M8M1J7k5K7J4M9k7r6j0R3n9j08O5K3l1L9j8j24K64
4172A00o7L5n9nLjk3K0k9k7j4L4L6K9O6j50L5J6l8R2L2m3n6K1M1m5j0N0Kj06P6j00
4159.7h5P3K7qP1j36l1J36p1J18j42J1q6J15P2q8O6p2o7R5l3L2L9L3L0k08Q7m2m1J09
4148.6DO3Pn9K5r5l0J13L0r5k9O7j9N5p8o2J76j02m6K8l8M9j8LRM4q3J28m5j2Qm6k6
$$ plain form
4136.3 -74 33 -3 -35 -25 84 62 -20 -72 28 -52 -23 94 -34 -13 -64 -86 -79 71 -6 65 56 27 -19 37 -76 -54 -2 -1 10
4125.2 10 -37 -83 -17 43 -5 -28 -16 -79 -4 -1 -50 21 -26 20 79 -10 6 -12 22 102 7 -3 -28 -83 -45 16 -82 -7 46 -85 -20
4113.3 -20 -57 -19 -36 22 79 60 6 -28 23 -7 -72 25 -83 44 3 93 10 60 32 -75 41 5 22 -10 14 16 -18 -51 75
4102.2 75 -26 -38 88 -28 -6 82 -92 7 122 54 -11 -41 -30 -11 9 -26 -2 6 77 -27 34 8 -78 -18 115 -11 82 -21
4091.5 -21 -92 30 -131 -76 -4 60 -77 -68 -16 -55 12 -19 34 -2 -12 13 28 50 -23 15 -45 -43 32 86 8 44 27 -51 -36 -47 121
4079.6 121 -49 -15 22 -56 47 12 -109 -60 -47 5 103 -95 7 -32 48 12 -18 -48 78 -31 73 -44 -72 -51 -59 -42 -114
4069.3 -114 -32 -90 -49 -21 103 -7 -34 -34 -79 12 10 3 14 -70 -8 20 66 -80 -74 1 31 77 -16 25 -56 -77 33 -30 8 -4 43
4057.4 43 52 63 -31 -27 -32 -51 51 -3 11 45 38 12 31 -63 -75 111 95 -76 72 -14 15 19 4 -13 8 58 42 61 138 -50 -22
$$ packed form
4136.3g4J07l6l2J0J09k2q2n2J00q0K9J17j28K1n1k2PJ50p7P1rk9m6N6j13K2N2JJ1
4125.2A0m7m6O6O0m8k3J2o3P5Lm9P1m7M6N9q9J6j8L4Q0r5j0k5n5L8O1r8P5N3j31O5
4113.3b0l7L8j7N8N7j9n4l4N1l0o5R7j08J27m1R0q3N0k8j07J16l6J7l2K4Kl4l3J26
4102.2G5j01j2J26j16K2Q8j74R9J15o8o5l0J1J9K0l5K4QP1j04O1k6q6O0J33j26R3j03
4091.5b1p1J22j61N5P2O4j37RN2l9O7l1N3l6j0K5J5K2p3L8o0KP5N4p8L6j7p8J5j1J68
4079.6A21j70L4L7p8J03l5j21M9J3N2R8j98J02l9Q0l6l0TJ26j09J04j17k8K1qJ7p2
4069.3a14Q2n8M1K8J24j10k7%m5R1kpJ1q4O2K8M6j46OP5L0M6r3M1q1k1J10o3L8j2M7
4057.4D3RJ1r4Mnj9J02n4J4L4pk6J9r4j2J86j6j71J48q6K9Mj5j7K1N0j6J9P7j88K8
$$ plain form
4045.5 -22 -62 -123 29 84 -130 6 -11 -18 -38 25 22 5 -58 35 -69 -12 -85 -112 -29 30 -6 71 75 26 -9 -56 -14 -52 14 11 -21
4033.6 -21 17 112 -51 -10 -25 -32 47 -79 -102 -85 -3 -27 -30 9 -62 -11 3 -2 -121 0 15 5 25 -5 -63 -45 -14 -3 -8 -2 8 9
4021.3 9 10 -27 14 -58 -42 76 -16 -3 -45 -36 -40 -47 72 -11 -6 -126 -39 37 -85 -91 0 4 22 -41 -77 23 32 134 -25 4 57 95
4009.1 95 144 19 -52 23 -39 -84 -76 3 -71 -31 -90 3 71 -113 -29 27 33 142 86 -22 64 -138 -90 -46 -31 46 34 2 11 21
3997.6 21 21 73 -64 -56 -40 -100 31 58 -45 60 19 89 -72 16 28 -9 -78 72 20 -18 51 83 -42 -38 -60 -8 18 21 -6 23
3986.1 23 -95 -17 -76 -47 -75 -42 -8 9 -40 44 90 136 34 105 19 35 -16 58 8 9 5 -52 36 17 -117 67 -73 66 -56
3975 -56 94 61 -34 26 43 12 44 21 16 -38 -81 14 7 -21 -40 84 35 -33 -16 40 28 -53 59 -53 -27 -59 38 59 -54 39 -96
3963.1 -96 -41 12 -21 -15 5 -41 29 -17 13 56 37 -3 30 -38 -19 -63 -51 -39 -3 32 0 -52 48 -46 6 32 -26 -28 59 7 56 -6
$$ packed form
4045.5b2m0o1J52N5k14J36j7pk0O3lj7o3R3j04N7p3k7Q3N9l6P7Mm9l5m7M2l8O6ll2
4033.6b1L8R5j63M1j5pP9j26k3J7Q2k4lL9p1N1J4nj19J21J5j0K0l0n8J8L1J1nOJ0J
4021.3IJl7M1p2J6J18r2J3m2RmpJ19q3Nj20Q7P6j22oR1MJ8o3l6J00RJ02j59K9N3L8
4009.1I5M9j25p1P5o2m5QP9p4M0n9R3O8j84Q4N6OJ09n6j08Q6k02M8M4J5P7j2l2RJ0
3997.6B1%N2j37QJ6o0J31K7j03J05m1P0j61Q8J2l7o9J50n2l8O9L2j25Mk2N2K6Lk7K9
3986.1B3j18P8n9K9k8L3L4J7m9Q4M6Tj02P1q6J6n1P4n0Jmn7Q8j9j34J84j40J39j22
3975e6J50l3r5O0J7l1L2k3nn4m3R5pk8j9J24m9o8J7N6j2q1J12j12K6l2R7K1j13R3j35
3963.1i6N5N3l3OK0m6P0m6L0M3j9m0L3o8J9m4J2TL6L5l2n2J00r4N2K6n8kQ7n2M9o2
$$ plain form
3950.8 -6 10 -31 34 40 -87 -67 64 -14 -3 -87 74 15 -121 -84 -43 76 38 60 -26 46 46 -51 66 -32 -36 65 -84 54 29
3939.7 29 20 116 18 74 -26 2 -24 21 -124 63 29 2 -25 44 45 61 73 -23 60 -89 84 16 85 -57 229 304 465 622
3929 622 777 800 810 773 683 438 302 309 221 171 118 67 93 -53 -15 -4 34 -66 54 56 36 88 26 -57 17 2 -18 38 52 70
3917.5 70 -61 22 -21 70 -12 100 38 3 -31 55 3 47 -21 16 50 39 -74 98 38 -9 79 63 11 93 -4 -48 75 14 -46
3906.4 -46 6 49 56 96 10 37 48 99 -25 80 -53 2 32 -1 63 35 -34 28 11 50 129 120 345 499 523 774 908 860 834
3895.2 834 660 496 380 221 181 203 53 139 79 110 89 27 78 73 34 112 50 4 -5 53 20 82 84 -79 52 -75 1 79
3884.5 79 76 78 -9 4 -20 22 24 -26 59 50 9 73 55 23 -14 26 17 -18 65 70 6 -88 30 -51 4 -28 10 46 -15 -38 10 -12 -54 -3
3871.5 -3 -59 -36 -13 44 98 78 -65 122 -104 -70 -11 125 51 94 113 234 351 595 737 804 879 804 697 578 365 328 241
$$ packed form
3950.8fJ6m1O5Oj27K0J31p8J1q4J61n9j36L7M1J19l8K2q6P2%r7J17r8mJ01j49J38k5
3939.7B9rR6r8N6j00K8k6M5j45J87l4k7TO9JJ6J2r6Q3j49J73o8O9j42K86P5J61J57
3929F22J55K3J0l7r0k45j36Pq8n0n3n1K6j46L8J1L8j00J20Kk0N2o2q3P4j5k0N6J4J8
3917.5G0j31Q3m3R1q2J12o2l5l4Q6n2M4o8L7L4j1j13J72o0m7Q8j6n2Q2r7m4J23o1o0
3906.4d6N2M3PM0q6K7J1N1j24J05j33N5L0l3O4k8o9O2j7L9P9rK25J54K4K51J34m8k6
3895.2H34j74j64j16j59m0K2j50Q6o0L1k1o2N1nl9P8o2m6rN8l3O2Kj63J31j27P6P8
3884.5G9lKq7J3k4M2Kn0Q5rm1O4j8l2l7M0rl5Q3No4r4J18q1N5l2L8L6o1k3M8k2m2N1
3871.5cn6K3TN7N4k0j43J87k26L4N9J36p4M3J9J21J17K44J42O7P5p5j07j19k13l7q7
$$ plain form
3861.1 241 207 209 158 67 97 86 29 120 69 114 12 -40 63 56 38 49 51 9 59 11 110 73 -42 2 19 -82 56 -43 25 35
3849.6 35 -3 -3 3 4 14 39 62 -30 148 34 -95 -23 -93 -79 128 -57 -19 96 -50 65 -89 -13 -28 -45 86 -1 18 62
3838.9 62 -71 -10 -11 -9 -10 34 -93 11 3 -21 -58 -6 14 -24 -95 24 -23 41 54 -64 -6 -72 61 31 -167 53 42 -84 29
3827.8 29 -12 -27 -18 -46 61 68 134 33 27 2 3 68 49 60 30 -24 83 24 -4 -28 -14 -60 -30 73 63 61 2 48 -43 -3 -38 55
3815.5 55 36 -21 -20 -25 -10 -28 16 40 -33 -39 -7 58 -15 27 19 1 4 -2 -57 23 78 -5 10 22 104 -84 15 19 -32 43 -55 -53 4 -32 -1
3802.1 -1 4 1 72 78 87 -27 -23 66 -63 60 8 98 33 -18 -88 -49 -91 53 -43 -103 48 -27 -3 -38 -26 6 -16 83 -69 7 33
3790.2 33 -86 -126 22 23 -56 -18 23 -80 1 -13 98 -50 -68 69 -1 21 -7 53 30 -20 -6 45 -3 32 17 6 -30 -13 -2
3779.1 -2 -19 7 -2 -29 2 -24 48 -50 -36 -27 16 46 19 13 19 -21 -63 2 22 21 33 -17 -32 -19 19 26 -23 2 20 72 -35 28 111 -16
$$ packed form
3861.1B41l4Kn1r1L0j1n7R1n1M5j02n2J03pj8J1Km2N0m8R9l7j15M4J7j01J38r9O8J0
3849.6C5l8%OJJ0K5K3r2J78j14j29P2p0J4K07j85L8J15j46J15j54P6j5j7J31q7J9M4
3838.9F2j33O1jKjM4j27J04qk4l7N2K0l8p1J19m7O4J3j18N8o6J33l0j98K20j1j26J13
3827.8B9m1j5Rk8J07PO6j01ok5JO5j9J1l0n4J07n9k8k4J4m6L0J03j0kn9M6r1M0l5R3
3815.5E5j9n7JnJ5j8M4K4p3oL2O5p3M2qj8Lon5Q0N5q3J5J2Q2j88R9Mn1P5r8KN7l6L1
3802.1aNlP1ORj14MQ9j29J23n2R0o5n1p0L9m2J44r6o0J51p5K4l5J2L2k2R9j52P6K6
3790.2C3j19m0J48Jp9L8M1j03Q1j4J11j48j8J37p0K2k8O0k3n0J4N1m8L5j5j1l6J7J1
3779.1bj7K6rk7L1k6P2r8J4RM3L0k7oOm0m2O5K0jJ2n0j5J3L8Pm9K5J8N2j07O3Q3j27
$$ plain form
3766.1 -16 9 19 -77 -29 95 -8 0 -11 -67 6 -37 -14 27 101 6 25 37 -128 -34 -12 -68 2 -43 19 23 102 -75 38 -23 15
3754.6 15 97 4 -22 -71 -26 20 -55 -23 -84 -16 79 26 -60 30 49 40 -20 -3 -42 -2 -93 14 45 27 -71 129 -10 63 11 38
3743.1 38 47 -66 8 8 -62 6 89 -55 -33 -64 24 14 -60 -32 4 23 -34 -23 -60 -48 -48 66 -8 -32 91 -46 121 -8 15
3732 15 -37 39 -19 -22 -54 24 61 10 11 9 21 -20 70 -8 -10 -103 66 52 33 16 43 34 46 -73 72 122 -8 90 -33 36 -7 -5 -2
3719.3 -2 28 -34 -32 5 -12 11 4 -23 50 72 17 -26 -28 49 38 -50 -80 65 -7 -19 5 49 26 34 -1 54 -92 -44 20 22 97 -29 53
3706.7 53 -49 -3 -139 30 -27 69 -30 -50 -85 8 62 -22 -56 -74 0 5 5 -23 -14 18 81 68 -15 25 -24 -95 -33 -42 -88 -77 46
3694.8 46 -12 14 -142 -95 34 57 -20 -29 -8 -5 24 78 -37 -99 3 38 -44 59 -8 -78 -24 -74 8 46 41 130 -44 -20 52 87
3683.3 87 18 -1 -110 48 5 -56 9 -64 -2 61 -28 -33 -124 157 -141 12 18 -85 39 91 -39 -26 -3 -64 -40 -56 -26 -30 16
$$ packed form
3766.1a6K5J0r6M8J24j03Qj1n6P3m3K3M1P4r5J9J2j65R4K2n6P0m5O2MP9j77J13o1L8
3754.6A5Q2r3k6m9M5M6p5L2o1O8R5n3q6R0J9ro0J7l9M0r1J07L1j8r8K00j39P3n2K7
3743.1C8Rj13P4%p0O8Q3j44K2l1Q8j0p4K8L6J9n7J1l7J2%J14p4k4J23j37J67j29K3
3732A5n2P6n8ll2P8L7n1JkJ2m1R0p8kr3J69j4j9j7K7rJ2j19J45N0j30R8j23O9m3KL
3719.3bL0o2KL7j7K3pk7P3K2n5m3kP7j1q8l0J45p2j2K4M4k3Ql5N5j46M8O4KP5j26Q2
3706.7E3j02M6j36J69n7R6r9k0l5R3N4q4l4j8P4N%k8RL2O3j3q3M0m9p1O2rm6J1J23
3694.8D6n8K6j56M7J29K3p7rK1LK9N4j15o2J02L5q2J03o7p0N4n0Q2L8nQ9j74K4P2L5
3683.3H7o9j9j09J58m3o1O5p3O2O3q9nr1K81k98J53Oj03J24N2j30J3K3o1K4j6L0mM6
$$ plain form
3672.2 16 -1 -59 -6 -51 16 -63 128 16 -22 68 -31 0 22 -10 -26 -7 50 31 -61 50 13 -24 -31 22 -28 91 58 97 -66 48
3660.7 48 46 -14 19 -26 117 -54 -40 58 89 37 -68 -10 59 0 -39 17 -51 35 18 -20 53 13 17 156 -27 37 -117 108 11
3649.5 11 -20 28 -61 -5 -55 -42 -135 50 -94 11 25 -32 -15 -15 97 88 -114 -49 -10 27 19 127 29 11 12 3 -55 -51 60 -3 -90
3637.7 -90 -25 -2 72 -9 81 16 -81 27 -1 -3 45 28 13 27 0 -22 -33 -48 108 14 20 -38 -53 0 1 -17 -72 -4 -52 7 -22 -22
3625.4 -22 21 -40 6 -17 -77 14 36 70 -1 -77 7 4 71 23 -29 -33 16 -30 23 50 55 108 -1 -67 3 -50 -49 17 -34 25 85 -36
3613.1 -36 15 95 -46 -43 -12 -40 -91 7 -145 19 6 166 -2 47 46 158 -39 79 -53 23 -94 -35 -77 13 26 -4 -27
3602.8 -27 7 -3 -5 -34 -30 13 123 -35 -26 31 84 -97 66 10 -41 45 -30 -37 45 -38 2 8 41 -29 -76 -45 47 -30 23 12 -84 34
3590.5 34 57 14 37 78 -12 -78 -27 81 -17 16 -59 75 112 -33 -108 70 -13 -38 -33 -30 31 16 -64 76 38 157 51 13 38
$$ packed form
3672.2A6j7n8N3m5O7p9J91j12l8R0r9L1K2l2j6J9N7j9r2J11l7TpN3n0J19l3L9j63J14
3660.7D8ko0L3m5J43j71J4R8L1n2j05N8O9n9l9N6o8Q6j7l8P3m0MJ39j83O4j54K25r7
3649.5A1l1M8q9N6n0J3r3J85j44J05J4n7J7%J12rk02O5L9L7qJ08r8j8Jrn8MJ11o3q7
3637.7i0O5K3P4q1R0o5r7J08k8kM8j7j5J4k7k2j1j5J56r4On8j5N3Jj8n5O8m8N9k9%
3625.4b2M3o1M6k3o0R1K2L4p1p6Q4lO7m8n2mM9m6N3K7NN3j09o6P0n3JO6n1N9O0j21
3613.1c6N1Q0j41LL1k8n1R8j52J64j3J60j68M9jJ12j97J18j32P6j17N9m2R0J3l0k3
3602.8b7L4j0kk9MM3J10j58RN7N3j81J63n6n1Q6p5pQ2q3M0OL3p0m7L1R2p7N3j1r6J18
3590.5C4K3m3K3M1r0o6N1J08r8L3p5J34L7j45p5J78q3k5NLO1j5q0J40l8J19j06l8K5
$$ plain form
3579.4 38 -50 34 40 33 -49 -78 -7 -9 -117 54 -33 -81 -81 8 -15 -48 -45 -29 -15 -63 -32 -65 -9 -115 69 42 57 3 -105 -18 28
3567.5 28 -18 21 -46 -83 -44 -71 -57 2 -46 15 -2 34 -56 -5 81 -24 8 -66 -2 -47 49 -43 38 67 106 -153 -32 -97 5
3556.4 5 51 28 -6 -24 -29 -20 -63 31 -31 -10 8 -72 -4 -57 20 -51 6 58 -14 -47 -61 66 22 -34 -31 50 46 -43 -13 86 -1 12 -29
3543.8 -29 82 -36 -11 -17 -46 88 101 38 62 115 108 9 5 -1 -20 -103 70 15 -21 -84 -57 53 92 80 -67 -4 -32 -13 60 102
3532.3 102 -81 -59 -32 27 -14 -8 -74 28 91 -31 -73 73 63 -35 -88 -19 55 44 -14 -46 103 -50 -113 67 -97 8 32
3521.9 32 31 63 -34 -16 -50 -45 97 88 -13 3 -9 -27 68 21 42 27 86 96 -39 8 5 4 21 32 -13 56 66 41 -69 -33 -10 18
3509.6 18 0 2 107 12 36 6 24 30 12 -92 26 69 21 -38 55 10 -42 -47 -34 -40 150 28 30 48 -43 21 23 33 33 67 38 58
3497.4 58 -25 -24 -11 21 66 39 12 36 8 -15 -11 2 26 30 10 -7 27 -26 -94 -81 -49 57 -17 43 34 28 -50 33 -9 -38 -13 -26 20 -100
$$ packed form
3579.4C8q8Q4Opq2k9P1kj08J71q7m8%Q9k3l3LJ6J4m8L1l3N6j06J84k7J5n4j08Q7M6
3567.5B8m6L9o7l7L9k7J4N9m8O1j7L6r0N1Q6j05L2p4O4m5R6r2Q1K9L9k59J21o5J02
3556.4EM6k3l4j8nRm3R4o2K1J8q0O8n3P7p1N7N2p2l3j4J27m4n6LQ1mq9L0R9q7J3m1
3543.8b9J11j18K5ok9J34J3o3K4N3pr9moj9q3J73n5l6o3K7J10L9j2j47O3k8J9P3M2
3532.3A02j83K2K7N9m1Oo6J02O3j22m2J46j0r8n3O9P4j1n8l2J49j53o3J80j64J05K4
3521.9C2jL2r7J8l4NJ42rj01J6j2j8R5m7K1j5N9J0j35M7ljJ7J1m5O9J0k5j10L6K3K8
3509.6A8j8KJ05r5K4l0J8Oj8j04J18M3m8n9R3m5n2nJ3oJ90j22KJ8r1O4KJ0%L4k9K0
3497.4E8q3JJ3L2M5k7TK4k8k3MJ3K4Mk0j7L4n3o8J3L2J06p4O0rop8Q3m2k9K5j3M6j20
$$ plain form
3484.3 -100 20 33 112 6 -16 108 -13 -63 -18 60 9 18 75 27 12 16 26 45 -129 -68 39 8 -134 8 -58 -95 -15 -106
3473.6 -106 78 15 54 5 -34 -19 37 -120 -36 90 -31 -16 -9 38 69 -55 -54 -81 2 -51 74 -138 -57 30 4 -78 -18 18
3462.9 18 -33 -77 -25 -53 19 16 -44 -8 17 -35 53 13 61 -7 -11 52 -8 -3 38 -20 41 58 -3 -116 28 -74 -77 -10 54 9 -34 -3
3450.6 -3 -46 14 -6 0 -116 15 -31 -6 -56 -6 -48 82 1 72 -63 -5 6 -65 -51 60 69 -69 -92 24 -43 12 -38 84 -18
3439.5 -18 98 24 13 -59 7 -34 74 -67 20 -9 -32 -31 -12 -69 -78 -52 -2 -52 54 83 -3 -45 13 -77 -21 -6 66 -21 11 14 -64
3427.6 -64 54 -75 -32 36 -33 -172 -55 42 -61 19 16 61 94 -67 22 -20 8 -72 -51 9 -4 43 79 54 -62 7 41 -22
3416.9 -22 108 85 24 -101 36 -104 17 70 -48 12 32 20 58 -63 31 -74 16 19 41 -18 -37 -33 -95 34 15 46 95 -27
3406.1 -27 -18 20 15 13 -15 109 -60 -38 -2 -51 -53 18 -28 -33 65 -78 19 -93 41 2 -18 -52 -23 -58 25 -54 -3 -23 -47 24 38
$$ packed form
3484.3a00J20J3P9j06k2J24j21n0M5P8n1RN7m8j5MJ0J9j74O1J07l1j42J42o6l7Q0r1
3473.6a06J84o3L9m9l9J5N6j57Q4J26j21J5PM7L1j24Jk7Q3n3J25k12Q1Q7k6q2O0L6
3462.9A8n1m4N2k8P2lo0L6K5n2Q8m0M8o8mO3o0NM1n8O1J7o1j13J44j02lO7O4m5m3L1
3450.6cm3O0k0Oj16J31m6K5n0N0m2J30q1P1j35N8J1p1J4J11Rj38k3J16o7N5n0J22j02
3439.5a8J16p4j1p2O6m1J08j41Q7k9k3JJ9n7rK6N0n0J06K9q6m2N8r0N6J5P2q7L2Lp8
3427.6f4J18j29M3O8o9j39J17R7j03Q0lM5L3j61Q9m2K8q0K1O0j3M7L6k5j16O9L4o3
3416.9b2J30k3o1j25J37j40J21N3j18O0K0j2L8j21R4j05R0LK2n9j9Mo2J29j9L1M9j22
3406.1b7RL8nkk8J24j69K2L6m9kP1m6nR8j43R7j12J34l9k0l4K9l5Q3p9N1k0k4P1J4
$$ plain form
3394.3 38 -39 -65 -6 -66 -24 22 -18 -18 48 25 -30 5 -44 -77 27 -13 60 -22 36 -67 46 79 -27 126 -74 -37 61 16 23
3383.2 23 -9 10 82 69 -58 -61 72 -3 -23 41 -18 196 28 -10 7 2 -32 29 -52 20 33 21 35 31 -30 14 59 -110 5 15
3371.7 15 80 -77 50 -41 -64 -8 62 32 -100 123 30 -100 -40 -56 24 -3 30 49 -23 99 26 -34 11 -67 47 -90 44
3361.3 44 2 93 -30 -46 -24 -16 -71 51 -68 -131 -33 -45 65 12 30 41 -8 -42 -7 -15 46 9 -25 94 -33 34 -4 -50 -8
3350.2 -8 -39 -37 59 42 -43 -38 -87 -53 -5 42 -53 4 -23 9 -92 103 -26 61 5 -31 -51 -48 10 82 -16 -90 34 -35 39 -31 -90
3338.3 -90 -11 -5 19 24 -57 -44 22 24 98 -29 19 -19 -11 21 -55 61 112 -31 -46 50 178 -16 -24 10 40 -21 -27 -11 -43 -48 -40 60
3326 60 11 2 1 -94 41 33 -93 -99 103 -1 -30 -58 28 -17 -3 10 -7 -39 61 -62 -24 -26 20 -98 -30 47 -65 43 -69 57
3314.5 57 -29 56 13 57 50 90 -3 -25 25 31 -10 24 -13 -4 15 -12 -95 80 -62 -43 15 19 52 -15 -88 -98 -22 -45 -55 -2 -12 41
$$ packed form
3394.3C8p7k6N9o0M2M6m0%O6k3n5L5m9l3J04m0P3q2N8j03J13L3j06J53k00L7R8m5P
3383.2B3l2J9P2j3j27lJ33p5k0O4n9K14j68l8J7nl4O1q1P2J3j2J4mo1M4M5j69J15J0
3371.7A5O5j57J27r1k3N6P0l0j32K23r3j30O0j6Q0k7L3J9p2J22p3o0M5p8J14j37J34
3361.3D4m2R1j23j6K2Qn5J22j19o3R8j2J10n3J8J1m9l4L5qO1l7l4J19j27O7l8m6M2
3350.2hl1KR6j7q5Nm9L4M8M7r5N7k7L2j01J95j29Q7n6l6k0LN8P2r8p4J24o9P4p0n9
3338.3i0P9OK4Nq1J3O6KP4j27M8l8QL2p6J16N1j43j5R6J28j94qL4L0o1oJ6l2nQJ00
3326F0m9rjr5J35qj26oK02j04k9k8Q6m5J4J3j7l2J00j23L8kM6j18O8P7j12J08j12J26
3314.5E7q6Q5m3M4pM0r3k2N0Om1L4l7RJ9k7q3J75j42J9N8ML3o7p3j0P6k3j0N3j0N3
$$ plain form
3302.3 41 -35 -126 -18 -20 83 26 14 25 -96 -8 92 -35 35 74 62 12 -51 47 -51 -89 -121 18 35 22 21 -60 -21 -81 26
3291.2 26 -45 -19 65 -58 40 -44 12 32 -110 -34 34 77 11 -128 31 -8 1 4 -7 74 -34 -5 3 -23 11 -76 -62 89 8 -43
3279.7 -43 -88 13 -38 10 -96 -101 -74 -168 -67 -39 -3 -30 107 45 -37 -29 4 -89 -16 -107 69 -11 -59 -15 20 24 47 29 -64 -16
3268.2 -16 9 -13 23 -64 4 -8 68 48 -3 -49 25 18 -17 50 38 -27 -87 46 -24 -37 47 -63 107 -73 6 45 -29 91 -42
3257 -42 19 -23 27 98 20 22 1 -78 -17 -35 -39 -25 -18 -72 71 -78 10 20 35 14 2 -41 55 0 0 -109 45 -22 94 27 75 -68
3244.8 -68 79 -49 18 -79 -35 -12 5 50 -34 44 1 15 37 -103 79 24 -104 -34 42 -46 95 -43 33 100 -142 28 73
3234.4 73 -63 -35 -67 -18 -15 35 34 -27 -95 26 69 -85 -15 -10 1 -59 -8 -78 -105 31 37 85 6 10 -180 10 8 -42 39 -60 57
3222.5 57 -26 -44 -22 -44 -8 -72 -63 -22 16 28 -27 21 -20 7 35 32 -90 -42 28 36 30 -2 2 -84 -56 -101 -19 -64 -39 51 17 -21 -61
$$ packed form
3302.3D1p6r1J08kJ03n7j2J1j21Q8J00j27P0L9j2n0o3R8r8l8l2J39J7j3jq1L9o0J07
3291.2B6p1K6Q4j23R8q4N6K0j42P6O8M3o6j39J59l9RLj1Q1j08K9Qk6L4q7J4J51q1n1
3279.7d3m5J01n1M8j06nK7r4J01K8L6k7J37o2q2QL3r3P3r1J76q0m8M4L5MK3j8r3M8
3268.2a6K5k2L6q7O8j2P6k0n1m6P4pl5O7j2o5o0J33p0j3Q4j10J70j80P9L9p4J20j33
3257d2O1m2N0P1p8Kk1p9O1j8mJ4Pn4J43j49Q8J0J5k1j2m3R6n5%j09J54o7J16o7M8j43
3244.8f8J47j28O7r7M4K3J7M5q4P8m3J4K2j40J82n5j28P0P6q8J41j38P6O7k42J70M5
3234.4G3j36K8l2M9LN0jo1o8J21M3j54P0NJ1o0N1p0k7J36OM8p9Mj90J90kn0Q1r9J17
3222.5E7q3j8K2k2L6o4RM1L8J2n5M8m1K7K8lj22M8P0Qol2Mq6K8m5Q2m5K5R0l4l8m0
$$ plain form
3209.9 -61 -66 -71 34 78 -30 -43 11 26 66 -23 10 13 85 -7 -15 -57 -39 2 5 -6 55 48 -90 16 -43 84 171 18 40 11 -11
3198 -11 22 40 -30 -122 -2 45 45 80 14 36 -70 7 -63 36 23 -49 -64 -43 -76 -50 -15 -26 -8 -40 -82 40 -77 18 7 40 75
3186.1 75 33 39 -45 -13 2 -84 -74 -103 -38 -61 -20 -27 22 107 0 -12 93 68 31 63 -5 -50 -16 -41 -1 -96 -8 19 83 47 -22
3174.3 -22 70 27 -65 -18 -70 -110 76 28 -24 -23 15 -41 -30 -92 10 33 42 45 -55 38 -25 -104 -78 13 1 -32 58 -67 -55 5 -14
3162.4 -14 -19 37 -61 34 -22 30 76 42 -72 11 31 32 -46 87 -82 4 -116 -12 26 86 97 6 19 29 -96 17 -75 79
3151.6 79 37 -34 -28 -62 19 78 8 -11 -25 4 101 -70 24 -5 -47 21 -29 -27 -31 -99 6 -2 -3 -44 -13 99 80 58 15 -81 -64 36
3139.4 36 156 -147 -40 7 6 -65 19 -58 -102 117 85 -18 -18 76 9 -21 -110 24 64 27 -14 45 19 67 22 -119 -50 13 17
3128.3 17 -46 34 -65 -35 -79 19 24 -2 -41 91 -56 -13 -5 41 20 61 -79 -72 -55 -93 33 -5 56 38 -86 -18 -80 73 31 -29
$$ packed form
3209.9f1nTJ05M4j08j3N4J5M0q9L3LP2r2qm2J8M1Lj1O1pj38J06n9J27Q7j53K2k9k2
3198a1L3J8p0r2J20M7%L5o6K2j06P7p0R9j3p2j5K1l3K6L5j1J8l2m2J22j17R5j1L3L5
3186.1G5m2Oq4L2J5q6J0k9O5k3M1pM9Q5j07j2J05k5l7L2o8m5L4k5M0r5Q8K7O4l6o9
3174.3b2R2m3r2M7n2m0J86m8n2JL8n6J1o2J02K3RLj00R3o3p9K6R1j2l3R0j25J2O0j9
3162.4a4nN6r8R5n6N2M6l4j14Q3K0Jp8J33j69Q6j20J04L8O0J1r1J3J0j25J13r2J54
3151.6G9m2p1Ol4Q1N9p0j9j4K9R7j71R4k9m2O8n0Kmo8J05qjm1L1J12j9k2m3r6J7J00
3139.4C6J20l03J07M7jp1Q4p7m4K19l2j03%R4o7l0q9J34M0l7m1N9k6M8m5j41O9O3M
3128.3A7o3Q0r9L0m4R8Nk6l9J32j47M3QM6k1M1j40PJ7l8J26l8O1j8j24O8o2J53m2o0
$$ plain form
3116.8 -29 100 -20 15 108 -32 123 69 44 6 -7 6 45 -43 -87 -14 -109 111 -47 -24 36 17 -8 81 -3 -1 -1 -40 -17 -42
3105.6 -42 98 -15 61 -52 -80 41 -22 37 -57 51 0 -11 86 -7 77 -54 -19 -123 -7 13 2 107 100 94 49 -21 58 -58
3094.9 -58 4 -33 46 56 -61 18 9 -42 -56 -20 -30 -103 -26 45 -17 69 22 -14 -42 -71 -86 89 -53 -52 -38 -33 -37 -73 -1 -28 -28 -66
3082.6 -66 9 -89 105 50 78 3 -30 -106 -63 -19 -33 52 54 -57 -22 47 -25 -71 -17 -39 11 -79 15 20 15 23 12 -20 27 6 53 0
3070.4 0 68 62 -63 -84 20 22 21 8 -13 -53 -113 -4 -30 75 26 71 43 -51 -112 -52 -4 -8 -14 -79 15 -27 -19 26 56 -37 -80 -43 33
3057.7 33 44 43 -37 -19 -4 38 -21 62 68 -75 -50 20 68 34 -101 -13 -47 118 85 -39 -27 -44 25 98 -54 -7 -7 69 14 -11
3046.2 -11 -33 -38 11 -52 34 12 -65 38 -34 -41 -32 -76 -24 -113 -18 23 -8 11 23 80 -96 76 88 -12 -80 -54 13 -54 104 60
3034.7 60 6 -12 119 -18 -79 -47 -43 -59 -14 -68 -97 -52 -87 19 89 16 -14 -19 79 136 -58 61 -26 72 -72 -51 -33 28 60
$$ packed form
3116.8b9J29j20L5R3j40J55n4k5l8j3J3L9q8m4P3r5K20j58K3O0j9k5Q9q4K%l9K3k5
3105.6d2J40j13P6j13k8J21o3N9r4J08n1j1R7r3Q4j31L5j04J16K0j1J05pom5p0P9j16
3094.9e8O2l7P9J0j17P9rn1j4L6j0p3P7P1o2Q6m7l6k8k9j5J75j42JJ4Nml6P2k7%l8
3082.6f6P5r8J94n5K8p5l3p6M3M4j4Q5Kj11L5O9p2m6N4k2N0r0R4NnQj1l2M7k1M7n3
3070.4@O8oj25k1J04Kjj3k1m0o0J09k6J05m9M5k8r4o1O0M8moo5R4m2QM5L0r3m3L7P6
3057.7C3J1jq0J8J5M2n9Q3Oj43K5P0M8l4j35Q8l4J65l3j24J2j7O9P3j52M7%P6n5k5
3046.2a1k2nM9o3Q6k2p7J03p2pRm4N2q9R5M1l1J9J2N7j76J72J2j00o8K6O7o7J58m4
3034.7F0n4j8J31j37o1L2Mj6M5n4k9M5l5J06P0p3l0nR8N7j94J19q7R8j44K1J8O1L2
$$ plain form
3023.6 60 41 17 94 -4 16 6 -14 -26 -24 -75 7 -18 -55 -29 -5 49 -47 -8 63 -11 -82 4 11 -10 13 -15 -35 12 100 8 -115 -35
3011.3 -35 48 -31 -42 -42 71 -11 -81 -2 -3 0 108 36 56 47 20 -39 109 1 75 20 14 63 -5 -19 -49 -5 59 -54 -17 17 13 38
2999.1 38 132 4 -59 -75 -94 39 -66 52 38 -15 30 -3 61 -24 -7 -14 -48 -19 54 -143 -109 -88 6 2 102 1 -56 -9 37
2988 37 -14 11 31 -29 -66 21 0 -44 36 13 8 74 -47 -5 46 -67 32 -14 9 6 38 -15 15 -87 33 29 -36 21 -19 78 7 -119
2975.7 -119 -3 46 29 -45 59 29 -95 9 43 -24 -60 -4 0 -37 -56 6 -17 10 -10 85 29 18 -81 -23 -53 19 43 -18 0
2964.6 0 -73 -55 80 -21 -28 -66 92 -115 -15 -36 -90 -15 -38 41 127 -52 -40 -34 -45 17 4 7 -14 -9 -22 16 -45 -13 120 26
2953.1 26 -4 -32 0 3 -3 27 -28 1 -2 -7 69 85 24 -160 -6 53 24 4 -16 65 -10 7 -69 17 23 96 -15 74 -55 -103 -74 29
2940.8 29 -60 25 -43 1 -50 33 76 -26 -34 -52 119 -57 -59 72 77 97 -13 -16 16 102 -38 -1 10 47 35 -5 14 -16 -29 26
$$ packed form
3023.6F0j9k4P7r8K0j0k0j2Kn1Q2k5l7K6K4N4r6L9P1p4p1Q6Pk1K3k8k0M7Q8r2j23Q0
3011.3c5Q3p9j1%J13q2p0P9jLJ08p2K0rk7n9J48j08P4n5oM9o8j4l0M4O4j13L7L4mK5
2999.1C8R4j28o3j6j9J33j05J18j4n3M5l3O4q5J7pl4K9P3j97L4K1R4mJ00j01n7M7M6
2988C7n1K5K0o0l7Q7k1m4Q0k3nO6j21M2N1j13R9m6K3lL2n3L0j02J20mo5N7m0R7p1j26
2975.7a19J16M9j7p4J04l0j24J04L4o7l6N6Ml7j9O2k3K7k0R5n6j1r9N8l0P2K4o1J8
2964.6@p3J8J35j01pl8J58k07J00k1n4P5k3P9Q6j79J2Oj1O2j3Lk1Nj3L8o1L2J33r4
2953.1B6l0k8L2LoL0n5K9lnP6J6o1j84J54N9k9k0TQ1p5J7p6Q6OP3j11Q9j29m8K9J03
2940.8B9q9Q5o8M4n1Q3M3j02qj8J71j76kJ31NK0j10lL2Q6j40L7J1L7j2m0J9l0j3N5
$$ plain form
2929.3 26 -77 -30 -21 -13 -107 14 -23 -51 57 -117 -54 39 31 16 -7 38 92 23 -30 125 -44 -25 -16 114 67 33 -68 43 -164
2918.2 -164 -31 -24 63 -27 97 -2 -80 19 57 24 -117 -4 -2 47 64 31 -33 -71 40 117 -20 3 -11 -13 -24 -44 10 29 0
2907.1 0 15 8 -107 -65 94 -8 -78 -37 -88 44 11 -61 113 -16 -103 37 -4 -6 3 60 53 -49 47 14 -65 12 111 -11 0
2896 0 -24 -70 -27 22 -46 -3 -49 77 -63 -7 -46 -94 51 -64 99 107 72 -27 77 -67 23 34 -50 -73 137 4 35 -65
2885.2 -65 -41 -53 10 56 -11 99 -12 -26 44 32 113 -3 -54 -5 -35 14 21 23 -15 16 26 -9 -50 -60 90 3 -34 21 -59 16
2873.7 16 -19 -7 -1 -21 8 -27 -9 -22 -78 -19 93 -21 -53 -25 52 -42 57 -82 -49 82 -53 -2 0 13 94 -21 101 -95
2863 -95 -38 110 12 -13 -9 99 -54 18 -54 -32 6 -52 83 -95 120 -42 10 -33 14 -14 -9 1 -35 82 21 -70 -26 -42 62
2851.9 62 8 -56 -5 54 75 95 -27 -57 52 -61 -25 6 -37 -2 70 -11 59 -29 -4 -72 111 32 -59 14 -29 -86 -52 8 -129
$$ packed form
2929.3B6j03M7RQr4J21l7k8J08j74O3R3qj5k3M5N4o9n3J55j69J9RJ30m7l4j01J11k07
2918.2a64J33PQ7r0J24r9p8R9L8l3j41J13KM9J7l3o4l8J11P7j37K3j4kj1k0N4J9k9
2907.1@J5pj15M2J59j02p0M1n1J32l3p2J74j29q7J40m1kRN7pj02R6l3p9P7R9j22J1
2896@k4m6M3M9o8M3m6J26j40N6l9m8J45j15J63Ql5r9J04j44R0J1q4k3K10j33L1j00
2885.2f5K4j2O3M6o7J10j11j4P0j2Q1j16n1M9l0M9PKl8L1J0l5m1j0J50q7l7N5q0P5
2873.7A6l5J2Ok0K9l5J8j3n6N9J12j14l2K8P7r4R9j39L3J31j35N1KJ3Q1j15J22j96
2863i5N7J48r8k5MJ08j53P2p2K2L8n8J35j78K15j62N2m3M7k8NJ0l6J17o1r1M4j6J04
2851.9F2n4o4N1N9K1K0j22l0J09j13L6L1m3L5P2q1P0q8K5o8J83p9r1P3m3n7L4O0j37
$$ plain form
2840.8 -129 3 58 -95 -15 -4 -48 74 -18 42 8 29 47 -12 50 -37 -36 -18 53 -60 -44 13 21 -10 -54 -12 9 -3 -12 -133 -62
2829.3 -62 142 -30 -70 1 102 45 30 26 -112 0 -101 44 -53 26 91 -52 30 -92 35 -64 -26 6 106 -52 -25 -112
2819.3 -112 -22 6 43 68 6 -55 73 -72 -72 -76 14 49 11 -16 13 -48 56 8 -22 -19 44 16 -28 39 -8 8 -58 34 -55 -41 -95
2807.4 -95 -21 76 -23 -10 -27 78 50 108 -139 -33 9 -10 -33 11 26 -19 -21 -21 10 -10 86 -23 51 -11 -109 -76 -32 -18 -15 65 -25
2795.6 -25 44 -42 49 -1 17 82 30 7 -12 92 -17 -31 -29 -4 64 -63 13 60 -58 2 58 -56 -19 5 9 -15 -73 38 36 34 32 -3
2783.3 -3 32 18 3 7 -51 -3 65 30 -63 -17 12 34 -60 105 28 69 -29 4 43 -120 -74 -40 80 115 41 -7 -59 -35 -14 -108 -4
2771.4 -4 21 28 12 -39 18 -43 46 -20 10 7 -114 49 -12 -53 90 56 1 0 33 5 65 59 -4 36 6 -1 37 30 17 4 70 -55 16
2758.8 16 -25 -3 23 37 5 -36 87 66 23 -21 0 -9 47 -53 44 12 -68 -36 -123 24 -57 -76 23 15 -20 45 -55 -126 56 -42
$$ packed form
2840.8a29J32N5j53Q0J1m4J22r2O0l4K1J8n9O2q7JJ8P1j13J6N7Ql1m4M2K1j2rj21P1
2829.3f2K04j72m0P1J01n7j5mj38J12j01J45r7P9O5j43Q2j22J27r9L8L2J00j58K7q7
2819.3a12R0K8L7K5o2o1J28j45%mR0L5l8k7K9o1J04m8l0LO3k8m4O7m7J6o6R2q9J4n4
2807.4i5P4R7r9J3j7J05k8N8k47J06M2j9k3M4J5m5k%L1k0R6j09P4o2r8L3M4J4LQ0r0
2795.6b5O9q6R1n0J8O5n2k3j9J04j09j4KK5O8j27P6M7j18O0N6j14L7K4Mk4n8J11kUl5
2783.3cL5j4j5Mn8M8O8l5r3M6K9K2r4J65p7M1r8L3L9j63M6L4J20L5p4m8n2K4K1r4J04
2771.4dK5Pj6n1N7o1Q9o6L0lj21J63o1m1J43l4n5jL3k8O0oo3M0l0pL8pj3TO6j25P1
2758.8A6m1K2K6J4l2m1J23k1m3m4K1rN6j00R7l2q0L2q7J47q1j9R9ql5O5j00p1J82r8
$$ plain form
2747.3 -42 35 -23 125 24 -4 -37 -6 57 0 -21 27 65 -59 -21 -35 -50 -158 11 21 46 60 14 41 -50 1 17 19 -24 5
2736.1 5 -33 104 -50 24 -82 59 77 -28 -24 14 -11 -4 -89 -14 -20 31 6 -83 -88 -26 -75 50 -21 -8 -94 14 22 66 -26 36 58
2724.3 58 15 -79 28 -45 153 54 -52 19 28 -12 -6 53 -52 20 -49 -154 -27 16 -70 -102 -21 -81 -20 -34 0 -37 40 -10 -56
2713.1 -56 -49 -110 -36 43 -1 -43 -63 62 -17 23 -11 29 145 -54 -19 46 22 52 77 -27 -3 -51 -12 -39 -14 -2 56 35 44 10
2701.6 10 -33 7 -28 -108 -35 -11 68 -35 15 0 -44 -38 61 -5 11 11 -108 -25 81 44 -27 19 -16 -43 104 32 -7 -58 84 54
2690.1 54 -105 74 89 37 18 60 -28 -93 -32 52 7 -87 -38 76 -160 -33 -76 16 51 86 26 39 -9 3 51 -1 -7 -32 -63 32
2678.6 32 -54 21 -14 10 25 93 1 7 2 48 -48 -94 -18 -47 -138 -6 -19 118 -83 -5 9 -87 -59 64 2 -53 -6 -46 -25 21
2667.1 21 25 67 4 -57 -26 -31 -22 -21 57 -14 -38 7 -37 2 42 21 -22 25 -53 82 23 26 10 -40 -21 -11 38 -7 -49 32 -25 -59 -57 -84
$$ packed form
2747.3d2P7n8J48j01k8l3L1O3n7k1M8L8j24L8j4j5j08J69J0K5J4m6K7r1N1J6Km3K9
2736.1El8J37j54P4j06J41J8j05ML8k5Pq5P5oN1k5q9nO2m9J25p1J3q6J08QM4r2O2K2
2724.3E8m3r4J07p3J98r9j06P1Rm0ON9j05P2o9j05J27M3q6l2Q1o0O1j4L4l7P7n0m6
2713.1e6Po1P4P9m4m2k0J25p9M0l4M0J16j99L5O5k4L0K5j04K4m8L9k7K5J2N8k1Rl4
2701.6A0m3M0l5q0P3K4P9j03N0j5m4OR9o6J6%j19Q3J06l7p1M6l5k7J47p2l9n1J42l0
2690.1E4j59J79J5n2j9M2q8o5O1Q4m5r4M9J14k36J27m3R2L5To0J3m8J2M8n2ok5l1R5
2678.6C2q6P5l5K4J5O8r2OnM6r6m6P6k9r1J32j3J37k01P8J4r6K8J23o2n5M7m0K1M6
2667.1B1MM2o3o1L1nRJP8p1k4M5m4L9M0k1m3M7p8J35n9Lj6n0J9J0M9m5m2Q1n7l4Kk7
$$ plain form
2654.1 -84 18 27 -12 -18 -5 -15 -23 72 -17 13 -4 19 -34 61 -74 -35 63 19 50 36 58 26 14 20 -52 -18 86 17 -46 79 -98
2642.2 -98 -98 -52 81 -33 63 -60 -93 -22 -7 37 -4 -96 97 19 -58 -23 -11 -1 -10 5 -6 -58 34 39 67 -4 -46 2 -14 -60 -33
2630.3 -33 -31 -41 19 -4 11 -31 -87 21 44 34 10 78 7 67 45 -113 -19 -89 55 53 38 -23 -33 56 -34 1 59 26 -29 -21 -15 -5
2618.1 -5 -38 12 -54 78 -144 103 -18 42 -24 27 -24 19 -17 96 -88 36 24 86 -22 82 -56 -10 -9 64 -29 27 76
2607.7 76 -49 52 -2 -24 -74 81 -60 13 -3 1 -46 75 28 -43 17 -10 -131 -97 -21 3 89 -15 -30 15 3 11 3 30 -63
2596.6 -63 -15 -43 -110 19 62 16 -65 -96 111 -4 24 28 48 -45 -28 20 -15 32 71 99 12 -16 -32 -11 47 -12 19 84 -4 -27
2585.1 -27 -63 -41 63 32 41 -73 53 21 -53 43 -37 -56 12 21 5 90 -52 -102 27 79 57 12 18 11 -1 -101 18 58 -89
2574 -89 -124 39 31 -58 -116 56 31 45 43 13 5 -22 7 -15 5 -44 -61 14 9 -62 82 -103 46 49 -32 15 -104 4 25 51 53 -46
$$ packed form
2654.1h4J02Rl9oJ3j0qR5q9L0j7K3n3R5j35L9R8m4L1j4K2l2j2Op2L4J04o9o3J25j77
2642.2i8%M6J33j14R6j23l3P1J5M4m1r2J93p8p7L5J2J0rJ5j1n2R2NK8p1m2M8j6m6K7
2630.3c3Kj0O0k3J5m2n6J08K3j0k4O8p1O0k2j58R4p0J44kj5o1j0Q9r0L5N8l3n5QOJ0
2618.1el3N0o6J32k22K47j21O0o6N1n1M3l6J13j84J24j2O2j08J04j38M6JP3r3N6M9
2607.7G6j25J01n4k2n0J55j41P3j6Mm7J21m7p1O0k7j21L4P6K4Q6j04j5M5j2QqK7r3
2596.6f3M8k8o7J29M3m6q1l1K07j15K8MK0r3J7M8l5M7L9K8q7k8j6K1N8n9L1O5q8k3
2585.1b7l6K2J04l1Rj14J26l2p4R6q0j9O8Rj6Q5j42n0J29N2k2m5Opj2j00J19M0j47
2574h9l5J63qq9n8J72k5J4kl0qk7K9k2K0m9j7P5np1J44j85J49Lq1M7j19J08K1K6Kr9
$$ plain form
2561.7 -46 13 22 13 -29 -12 -83 9 -160 -28 19 42 -55 51 5 136 -59 22 -14 46 -97 45 -62 -25 -77 -33 56 -144 -33
2551 -33 12 45 19 6 -8 -65 66 -29 -20 -81 -85 22 64 47 12 -5 -29 -38 62 -45 -52 -10 -35 93 17 -55 8 44 161 10 -12
2539.1 -12 31 5 -105 18 -6 -17 -63 -75 -43 43 -45 -27 -36 -168 15 81 -28 -123 -35 -113 31 80 -8 12 -32 -25 -1 3 3 -91
2527.6 -91 28 -8 -22 24 -32 -56 19 59 -36 -53 -104 -14 2 -65 5 -127 61 31 85 3 17 -14 -31 35 63 -72 -12 -50 26
2516.5 26 4 21 2 -22 -22 -80 45 -37 54 -22 22 29 -69 4 31 -81 -26 -6 -90 -33 -40 -12 -14 59 -7 -85 4 45 87 2 98 46
2504.2 46 62 55 -56 45 78 114 -2 -47 -46 -61 4 28 -64 48 -10 -29 48 -124 1 -27 22 -87 28 -42 -27 17 2 -22
2493.5 -22 -43 3 -112 -51 91 -31 51 13 -105 7 0 -129 10 -51 31 77 60 -17 34 -47 101 -48 -64 36 -9 86 60
2483.2 60 58 -1 -33 -32 -16 -43 56 21 -20 95 -25 -123 19 23 26 39 5 32 17 -9 -138 -50 94 66 -9 -52 -30 31 12 -14 34
$$ packed form
2561.7d6N9Rrm2J7p1R2j69J32M7K3r7J06m6J31j95Q1l6O0j43J42j07L7n2M4Q9k00J11
2551c3M5L3k6j3j4n7J31r5Ro1mJ07M2j7l5j7k4rJ00j07pM2k5J28p6p2O3L6J17j51k2
2539.1a2M3k6j10J23k4j1m6j2L2Q6q8J8rj32J83O6j09r5Q8p8J44M9q8K0m4PK4M%r4
2527.6i1J19l6j4M6n6k4P5M0r5j7n1R0J6o7P0j32J88l0N4q2J4l1j7O6K8j35O0l8P6
2516.5B6k2J7j9k4%n8J25q2R1p6M4Pr8P3K7j12N5K0q4N7pK8kP3o6p8Q9M1M2q5R6n2
2504.2D6J6pj11J01L3L6j16m5Jj5O5K4r2J12n8j9P7j72J25k8M9j09J15p0J5M4j5k4
2493.5b2k1M6j15O1J42j22Q2l8j18J12pj29J39o1Q2M6j7p7N1q1J48j49j6J00m5R5k6
2483.2F0kn9l2JJ6k7R9l5m1J15j20r8J42MLJ3l4K7j5k6j29Q8J44k8p5m3K2O1j9k6M8
$$ plain form
2471.3 34 0 -93 -45 19 16 8 -103 -69 7 -35 27 119 -16 -29 -41 -50 -73 -90 -58 -9 -39 7 37 -46 28 29 -33 38 -38 124 24
2459.4 24 -34 33 -8 -54 -15 -74 109 -25 -24 -12 -13 -42 55 -9 6 -70 -78 -84 -30 69 -26 -20 -8 14 28 15 -25 2 75 104 -75 -55
2447.1 -55 87 -22 -66 -44 18 -17 -52 42 -28 -25 41 -2 40 -34 77 -81 -51 43 94 78 -50 138 40 6 57 -141 20 -36
2436.4 -36 -20 -16 116 51 1 93 -43 29 -74 1 -69 43 19 54 71 6 -32 -20 -69 137 45 43 7 4 -22 -31 -4 46 -164 18
2424.9 18 -24 92 30 15 21 30 44 -69 28 -31 -58 23 -28 33 -30 -38 -47 60 14 82 21 -65 19 31 33 -99 -66 53 -10 75 18
2413 18 -1 -160 -80 41 28 21 -28 87 4 35 -2 -19 127 -104 44 -16 -14 -18 5 -4 58 -76 4 -28 69 35 -21 -55 -53 10 -47
2401.1 -47 -11 106 -1 57 68 20 -42 -31 -41 -37 -17 8 -12 17 -12 20 -80 0 -18 9 -151 -5 5 87 -25 -16 -48 -65 -33
2390 -33 -12 15 26 27 -79 18 31 142 -23 49 -86 10 -102 -48 -63 -63 -7 14 18 -143 -69 -23 -104 -27 48 -20 25 55 41 -5 -1
$$ packed form
2471.3C4l4r3M8O4lqj11L4P6m2O2R2j35j3j2rk3j7L2M9l0M6L0q3P4Jo2P1p6J62j00
2459.4B4n8O7m1m6L9n9J83j34JJ2jk9R7o4J5p6qoN4R9r5OJ2K2J4j3m0K7P3K9j79K0
2447.1e5J42j09m4K2O2l5TR4p0LO6m3M2p4J11j58L0R4N1j6j28J88r8l4N1j98J61n6
2436.4c6J6MJ32o5n0R2j36P2j03P5p0J12k4L5J7o5l8J2m9K06r2kl6lk6rK7N0k10J82
2424.9A8m2J16o2j5ORJ4j13R7n9k7Q1n1O1o3qrJ07m6O8o1q6Q4J2Kj32L3J19o3Q5n7
2413A8j9j59Q0J21j3pm9J15q3L1l7j7J46k31J48o0KmK3rO2j34Q0l2R7l4n6l4KO3n7
2401.1d7L6J17j07N8J1m8o2J1j0MK0K5k0K9k9L2j00Q0j8K7j60J46J0Q2j12Rl2j7L2
2390c3K1K7J1Jj06R7J3J11j65P2j35R6j12N4j5%N6K1Mj61P4M6q1P7P5o8M5L0j4m6M
$$ plain form
2378.1 -1 -109 3 20 9 10 33 20 141 -49 2 -59 27 -22 29 22 -17 2 -19 30 -54 44 -41 -48 -99 -85 78 12 -66 20 -6 -48
2366.3 -48 63 -99 -84 11 -63 50 -73 -23 -20 6 47 102 187 -40 -4 -39 -65 27 61 129 -63 -50 11 6 -83 -19 45 26 -63 15
2354.8 15 -37 46 40 -58 25 -13 -94 -44 -2 -28 12 14 -27 22 -40 -65 4 -75 -1 34 108 8 27 -41 -13 43 34 -26 -19 17 15 119 -118
2342.1 -118 -14 4 35 41 -83 59 9 25 39 -42 -59 42 32 29 -22 -58 -33 -134 27 -36 -50 -105 13 1 11 -27 -31 -63 -12
2331 -12 51 -52 -42 -5 -94 23 36 31 -43 -11 60 -6 36 -13 2 48 -92 -1 5 -14 27 -33 -47 10 -63 -56 -9 48 -29 8 0 34 23
2318.3 23 21 93 -1 -13 39 36 79 18 4 20 35 17 45 87 -54 -49 20 37 61 -20 -84 -49 70 43 20 78 61 -50 0 -51 63
2306.5 63 115 -54 -55 -90 18 -41 -74 -53 -23 -7 10 101 8 8 15 -46 -16 68 35 -94 -5 18 14 32 -37 -38 -2 39 -85 84 15
2294.6 15 52 -117 -1 -117 75 22 -39 -1 73 -82 -60 24 -52 68 -12 -34 -1 -70 -2 -46 17 2 -40 -43 -66 -27 -29 -53 -75
$$ packed form
2378.1aj08J12J7j1JK3j3J21j90N1o1Q6m9N1pl9J9k1M9q4R8q5pn1J4J63o6p8Q6k6m2
2366.3d8J11j62J5R5p4J13j23N0LK6M1N5Q5k27L6l5k6R2L4O8j92J3O1nq9O4Tj9q9P8
2354.8A5n2Q3or8Q3l8q1N0M2k6M0Km1M9o2k5O9p9P4L5P4j00J9o8K8N6ro0PL6kJ04k37
2342.1a18J04J8L1Oj24J42n0J6J4q1j7J01j0ln1l6K5j01J61o3j4n5J18j2J0l8ml2N1
2331a2O3j03J0L7q9J17J3np4L2P1o6M2m9J5M6j40R1Oj9M1o0j4N7p3PM7N7p7L7qL4j1
2318.3B3kP2r4j2N2lM3o1j4J6J5j8K8M2j41NO9J7K4q1o4L5J19k7k3N8j7j11N0n1J14
2306.5F3N2j69jl5J08n9l3K1L0J6J7R1r3%Po1L0Q4l3j29Q9K3mJ8o9jL6M1j24J69o9
2294.6A5L7j69J16j16J92n3o1L8P4j55K2Q4p6J20q0k2L3o9O8m4O3j5m2lk3L9kk4k2
$$ plain form
2283.5 -75 -2 -70 7 137 -18 37 -68 -62 27 46 9 -72 51 14 -30 50 -62 33 44 -36 15 18 19 75 -44 76 -29 42 -11
2272.3 -11 38 -18 49 -86 25 40 101 -68 -9 -26 -11 33 -80 16 -113 27 -31 -16 34 96 2 4 -23 76 42 -61 -13 -36
2261.6 -36 -159 -33 33 -31 -123 136 42 47 46 73 0 0 44 47 12 7 45 -3 -58 -58 0 57 62 -84 61 27 -51 -78 -51 -23 2 -22
2249.3 -22 -39 -4 10 -15 -26 16 -39 84 53 25 -21 59 -30 -4 99 2 19 2 44 -12 -48 -9 -64 12 -70 -2 -45 6 16 88
2237.8 88 40 82 2 9 59 68 -36 -50 -36 5 13 -120 46 -98 24 -68 -41 -83 -31 -46 -37 15 -30 -16 -115 -66 49 -22 118 -28
2226.3 -28 26 21 -60 -17 9 -4 127 -95 69 15 10 -60 -25 16 -62 -25 18 49 -57 -112 62 55 -116 40 62 -21 -59 38 -82
2215.2 -82 -28 -17 8 -18 -22 90 -10 -29 9 34 -33 -93 -151 49 12 0 -9 -77 37 -41 30 -43 126 22 -8 -13 6 -29 29 20
2203.7 20 -43 -98 75 -5 8 -24 61 24 5 -65 7 -39 -65 -71 -118 -73 60 -37 164 43 -30 33 -19 -55 108 5 -41 -9 -51
$$ packed form
2283.5g5P3o8P7J30j55N5j05OQ9J9l7q1J23l7m4Q0j12R5J1q0N1LJN6j19J20j05P1n3
2272.3a1M9n6O7j35J11J5O1j69N9j7J5M4j13R6j29J40n8J5N0O2r4Kk7R9l4j03M8k3
2261.6c6j23J26O6o4r2K59r4NjK7p3%M4Ll5nL8m8n5%N8N7Nj46J45l4p8k7K7K8K5k4
2249.3b2j7L5J4k5j1M2n5J23l1k8m6Q0q9K6J03r7J7j7M2n6l6L9n5P6q2O8m3N1J0P2
2237.8H8m8M2q0PN0Rj04j4J4M1Qj33J66j44J22r2K7m2N2j5RN2m5J4r9M9J15p1J40j46
2226.3b8N4nq1M3K6j3J31k22J64n4np0L5M1p8L7M3L1j06n5J74pj71J56K2q3l8R7j20
2215.2h2N4J1K5k6mJ12j00j9L8K5o7o0n8K00l7j2ro8J14p8P1p3J69j04l0nJ9l5N8r
2203.7B0o3n5J73q0J3l2Q5l7j9p0P2m6k6om7M5J33r7K01j21p3O3n2l6J63j03m6L2m2
$$ plain form
2192.6 -51 26 -53 13 -26 -33 -95 -65 107 2 -2 -100 45 21 -18 48 117 24 -49 -82 54 -2 -11 -68 11 53 4 42 82 -89 -4
2181.1 -4 8 -52 24 28 -55 -16 62 67 -28 3 -62 39 1 -100 8 -32 -67 37 -3 50 -82 -69 11 18 39 -17 40 -81 6 50
2169.6 50 -82 -37 -15 39 74 45 3 11 -7 -26 51 -36 -11 65 108 47 -21 -126 -53 62 33 22 -27 106 -7 -18 -39 -31 -1 -13
2158.1 -13 24 -12 61 -108 -67 -21 -84 -76 -40 -57 55 -44 10 47 -24 89 25 -6 -54 -51 19 -45 13 -190 47 -85 45 -42 -29
2147 -29 5 20 69 -63 -61 -67 -50 -58 72 108 -150 -68 12 27 -33 57 -89 88 72 -103 3 6 -2 -72 42 28 54 -59 13 13 -70
2135.1 -70 27 -62 42 77 -60 -12 -18 37 -10 35 17 42 -11 -46 5 -93 15 57 58 38 35 9 41 41 22 39 -90 52 2 20 26
2123.2 26 16 -43 -67 32 -24 0 -93 25 2 63 -66 74 2 -30 -31 13 59 -8 20 -70 -6 -1 15 52 103 50 73 0 -30 44 -6
2111.4 -6 -12 12 107 -20 56 81 6 -44 -33 17 21 40 30 -46 -47 -13 -66 -59 -31 8 -105 50 -13 120 -25 -60 -86 -59 -25 24 -72
$$ packed form
2192.6e1P7p9O6l9po2L0J72j05mr8J45k4l9O6O9r3p3l3J36n6rn7P9M2m9L8M0j71Q5
2181.1dJ2o0P6Mq3L9P8Nr5L1o5J01l8j01J08m0l5J04m0N3j32J3Q0PK1n6N7j21Q7M4
2169.6E0j32M5K2N4L5k9m2Qj8j9P7q7K5P6M3o1o8j05P3J15k9j1m9J33j13j1k1QL0j2
2158.1a3L7l6P3j69M1M6o3QL6j7J12r9N4L7p1J13o4l1m8LP0o4N8k03K37j32J30q7J3
2147b9L4J5M9j32KoJ7qJ30L6k58Q2Q0J5o0R0j46J77j6j75J06Lqp0J14j4K6j13P2%q3
2135.1g0R7q9J04L5j37M8oN5m7M5j8K5n3l5N1r8J08M2Jk0lk6L2%j9J7j29J42n0J8O
2123.2B6j0n9k4R9n6K4r3J18k3O1j29J40p2l2jM4M6o7K8r0O4NJ6L7N1n3K3p3l0P4n0
2111.4foK4R5j27P6K5p5n0J1N0MJ9j0p6jL4n3PK8L9j13J55o3J33j45l5k6K7L4M9r6
$$ plain form
2099.5 -72 58 -2 -46 -22 0 -20 -30 10 -4 21 6 -13 8 55 -29 -12 42 -28 14 27 -20 -13 87 -73 96 -67 -73 35 49
2088.4 49 -95 7 22 -68 -129 -49 30 60 -51 -26 -15 -1 -100 55 -43 -68 -69 -89 -131 -73 -34 6 51 4 43 -26 -124 28 -46
2077.2 -46 3 91 67 -46 -159 -34 -61 -77 6 -65 44 -15 -38 -37 5 -173 8 10 -74 6 6 151 75 -22 43 -102 3 -72 -13
2066.1 -13 37 -6 66 -103 20 74 -30 -60 93 103 59 10 -37 -64 -88 -14 2 61 -13 -14 63 -30 29 53 6 -4 -37 -23 51 0
2054.6 0 38 6 -59 60 -69 -27 33 107 -6 43 -27 -45 -52 27 44 10 116 94 6 6 18 -38 -92 28 50 18 -59 10 -156 16
2043.1 16 -66 -21 8 -57 97 35 12 -46 29 -73 7 -20 126 -70 -38 -116 -6 -111 -28 20 -94 -129 -5 8 -86 -70 54
2032.8 54 -73 -28 -27 21 50 -34 -71 4 15 -33 31 -40 -107 57 -17 30 -16 0 -6 -24 10 69 -6 23 -89 41 -31 11 -32 -49
2021.3 -49 -15 -5 -1 27 -19 3 71 -108 -35 -4 52 15 84 32 33 -50 -45 -28 75 -64 -11 -21 48 -18 -20 76 -72 71 35 75 -43
$$ packed form
2099.5g2J30o0m4K4K2k0j0M0j4K5j5j9K1M7q4J7N4p0M2J3m7PJ00j60J69j63oJ08J4
2088.4D9j44J02J5r0o1Q0P9L0j11K5J1J4r9J55r8k5jk0m2N8L9M0M5m7L9o9r8J52p4
2077.2d6M9Q8k4j13TJ25k7j6Q3p1J09n9k3JM2j78J81Kq4Q0%J45p6r7O5j45J05p5N9
2066.1a3N0m3P2j69J23N4j04l0J53J0m4m9m7k7k4P4J6N9p4jP7r3N9K4m7j0l3J4P4n1
2054.6@L8l2o5J19j29M2O0P4j13M9p0j8pP9J7l4J06k2q8%J2n6n4J20K2l2p7O9j66J72
2043.1A6q2M5K9o5J54o2k3n8P5j02Q0k7J46j96L2p8J10j05Q3M8j14l5J24J3r4J6J24
2032.8E4j27M5JM8K9q4l7P5J1m8O4p1o7J64p4M7m6J6oj8L4N9p5K9j12J30p2M2m3j7
2021.3d9L4J0MK8m6K2O8j79P3L1N6l7O9n2Jq3NJ7J03j39N3j0O9o6kR6j48J43l6M0j18
$$ plain form
2009.4 -43 17 -41 10 -12 54 101 -48 40 33 51 7 -22 9 -23 -13 -16 64 64 85 -54 -98 -13 21 52 -37 -25 69 3 -7 -54 9 40
1997.1 40 126 28 36 -29 -60 21 25 6 55 -140 -34 -80 -10 72 60 76 -70 -3 11 73 -31 18 26 8 16 33 19 5 -120 -63 84
1985.2 84 -3 -59 29 -11 -3 -57 25 3 -47 -60 62 -45 -74 -98 -6 -89 10 -41 -19 -20 -68 49 -34 -67 -41 -78 -17 14 -51 2 -68
1973.3 -68 59 -24 20 49 -143 -3 -20 73 -24 -11 -13 -26 14 -11 -34 -15 -17 119 -43 -96 98 -58 19 -96 132 -11 65
1963 65 -60 66 -28 -54 -22 -10 3 95 19 -31 -38 -21 -18 -3 -66 -15 14 -64 85 15 -83 13 35 61 68 0 6 54 40 -31 -38 -18 -66
1950.3 -66 -68 -5 5 -24 -34 14 -44 -12 -5 -58 -2 66 -77 54 62 -98 36 12 14 20 16 -28 -23 53 -65 -46 44 36 -154 11 -69 -25
1938.1 -25 15 23 20 41 -61 -30 28 -90 -4 37 26 -26 -58 5 137 17 -29 18 -26 10 60 -5 -47 -37 44 0 30 128 -8 94
1926.6 94 48 160 -70 3 -32 10 44 2 27 25 -21 -48 -30 -93 74 13 80 -44 4 -28 -140 78 -50 -54 -88 -99 68 61 39
$$ packed form
2009.4d3O0n8N1k2O6M7j49Q8pJ8m4k9L1l2J0lQ0%K1j39m4Q5L4L1q9J2R4o6j0m7O3L1
1997.1D0Q6r8Qo5l1Q1Mj9M9j95J06m6P0Q2j2J6j46O7J4O2j04M9Qj8QJ7j4Tj25N7J47
1985.2H4q7n6Q8m0Qn4Q2k2n0j3J22j07k9k4R2q3R9n1K2jm8J17q3l3K6l7O1L1o5N3p0
1973.3f8J27q3M4K9j92J40j7R3r7J3kj3M0k5k3J9kJ36j62n3J94j56P7j15K28j43P6
1963F5j25J26r4k6L2J2J3R2p6n0pJ7LJ5o3N1K9p8J49p0r8R6K2K6Po8OM8j4p1pK0m8
1950.3f6kO3J0k9j0M8n8L2Pn3N6O8j43J31Qj60J34k4KOmm4NP6j18J9R0qj90J65q0M4
1938.1b5M0QlK1j02L1N8j18Q6M1j1n2l2O3J32j20m6M7m4L6N0o5m2J0Q1m4L0R8j36J02
1926.6I4m6J12k30P3l5M2L4m2K5km6k7J8o3J67o1O7j24M8l2j12K18j28ml4j1J67pk2
$$ plain form
1915.5 39 -4 41 -87 -63 -48 -17 3 3 -20 -96 39 -15 -36 -59 -37 -76 -104 58 3 -23 -42 -11 2 16 -16 41 22 63 87 -45
1903.9 -45 -28 31 -43 -46 -49 64 79 5 -63 5 -113 28 97 -24 25 14 -1 -4 -7 -64 -29 13 11 136 33 -71 -44 -57 -44 -20
1892.4 -20 80 1 -58 36 -22 0 2 11 -56 -63 139 17 74 -135 -47 15 -98 50 64 10 33 -11 -47 -66 -18 54 20 41 -74
1881.3 -74 44 -68 -6 -103 -16 26 20 58 54 11 64 54 5 29 92 14 39 -38 -23 -114 -90 -38 -25 53 -21 108 1 19 -26 -30 -76
1869.4 -76 52 88 -40 69 -36 -36 -77 55 -36 54 -37 -96 36 -8 -63 -5 3 -49 -63 -51 55 -40 92 -70 9 -35 -17 -5
1858.7 -5 -81 -81 21 14 -34 -104 -69 -38 52 21 -75 16 -40 11 -49 -10 -101 -29 79 32 45 -70 46 42 -52 116 17 -16 10 35 58
1846.8 58 39 12 -11 -41 4 -42 -15 33 82 41 -29 32 -4 44 -3 -37 -85 79 19 -40 34 -54 58 10 -82 -18 72 84 -37 5
1835.3 5 10 77 92 -42 -32 -40 -32 -105 36 15 -7 -132 -76 39 21 -8 13 4 17 -50 61 -187 -115 30 93 -30 -68 136 24
$$ packed form
1915.5C9m3M5j28K4J5L1K0%k3p6J35n4k1k3K2l9k8J62n5k6j9L1J3J4l2N7j9M1K4j32
1903.9d5J7N9p4lTJ13J5p4o8O8j18J41O9j21M9j1j5lTn7L5M2kJ25j03j04K7j3J3K4
1892.4b0J00p9n9R4n8K2KRo7pK02j22N7k09Q8O2j13J48J4n4K3m4l6j9M8P2l4K1j15
1881.3g4J18j12O2r7Q7M2oL8mm3N3j0m9K4O3p8K5p7J5r1K4N2J3P8p4J29j07J8m5mm6
1869.4g6J28L6j28J09j05%m1J32r1R0r1n9J32m4n5N8Qn2j4J2J06r5J32j62P9m4J8J2
1858.7ep6%J02pm8p0L5L1R0l1r6R1n6N1o0L9r1P2J08m7J3j15J16mr4J68r9l3K6K5K3
1846.8E8j9k7k3l0M5m6K7M8M9m1p0O1l6M8m7l4m8J64o0n9P4q8J12m8r2O4R0J2j21M2
1835.3ENO7J5j34J0qQp3J41k1k2j25N6J15j8k9K1rJ3o7J11k48P2J45O3j23l8K04j12
$$ plain form
1824.2 24 71 -50 -13 64 -26 -26 -64 62 -8 61 -5 10 15 28 -21 -31 44 -88 74 33 -91 3 -62 -39 33 46 -36 119 24
1813.1 24 -138 -16 -115 -78 -58 -26 16 23 23 -1 -53 -75 55 -20 -81 53 -9 54 -17 -39 152 60 -15 -6 31 -73 73 72 32 -15
1801.6 -15 -39 -17 -25 -29 19 24 8 -24 13 -9 -21 -11 34 -23 24 77 -5 -6 40 -45 -75 -12 27 0 22 16 0 -29 -19 -25 -63 -78 -64 -129
1788.5 -129 145 -5 16 32 63 -56 -9 -53 67 -35 -41 -9 41 -52 -60 -11 -48 -65 -71 23 33 67 -93 0 -48 9 -144 56
1777.8 56 -1 -6 -35 59 -25 -73 -12 -88 68 75 51 -98 -12 29 19 177 83 -59 40 1 11 -18 -67 -10 88 -24 -7 -36 62 46
1766.3 46 12 -14 -12 -6 -10 -82 2 21 74 10 -5 -54 43 -3 -84 9 43 13 6 21 -30 -117 -63 17 14 1 -135 -86 -37 24 -38 -29 37 -17
1753.3 -17 -58 -35 -44 9 -39 -65 -66 -20 19 -50 36 114 -47 -12 79 -28 7 -15 -48 -45 -3 -137 15 -29 -71 58 1 22 -32 71
1741.8 71 -38 -56 -45 24 -140 112 -32 -38 35 18 -36 96 -14 -51 75 -1 -62 61 9 -51 -41 -86 -32 20 -61 58 -65
$$ packed form
1824.2B4M7j21L7P7r0%l8J26p0O9o6J5NJ3m9j0P5j32J62m1j24R4o5K3P2J3q2J55r5
1813.1B4j62J22r9L7K0L2M2P%k4n2k2J30p5o1J34o2O3p1k2J91r2p5RL7j04J46jm0m7
1801.6a5k4K2qmM8Nj6l2L7k2j2J0M5n7M7N3q2jM6q5l0O3L9k7K2oj6k9J0ol8j5J4o5
1788.5a29K74j50K1J6L1j19M7m4J20j02oL2N0r3qM9l7j7oR4J0L4j60R3m8N7j53K00
1777.8E6n7nk9R4q4m8O1p6J56Pk4j49Q6M1j0J58r4j42R9l9J0k9m9N7R8j12J7k9R8j6
1766.3D6l4k6KOmp2Q4J9N3o4j5m9R7m6q1R3L4l0pJ5n1q7N4Q0lj3j36M9TO1o2RO6n4
1753.3a7m1K3rN3m8k6jM6L9o9Q6P8j61L5R1j07L5k2l3LM2j34J52m4m2J29n7K1n4J03
1741.8G1j09j8J1O9j64K52j44oP3j7n4J32j10l7J26p6o1J23n2o0J0m5N4N2q1J19j23
$$ plain form
1731.4 -65 -18 -33 -46 -30 -39 -18 -27 11 -2 -28 48 -27 41 -23 -88 -72 75 73 30 -34 18 -46 26 -6 -23 -25 19 10 64 -16 -27 7 -9
1718.8 -9 73 7 -1 63 10 16 -13 -65 -75 -33 25 -30 77 1 32 47 113 -74 -90 -8 7 -1 91 -37 74 37 -28 -16 -83 43 -32
1706.9 -32 54 47 129 0 49 77 82 64 -75 58 80 -47 -4 -38 -13 -30 -42 -44 44 -13 89 -80 65 -32 -75 78 -106 1
1696.1 1 106 -118 53 24 -5 -9 5 49 -3 33 44 -38 -6 -7 -66 92 -86 72 49 -41 70 112 40 -151 -95 -3 -74 -34 -32 71
1684.6 71 62 4 14 -73 -21 67 -7 -4 -49 79 -89 -44 14 0 66 -23 90 -79 99 6 -15 -13 -60 -74 -24 66 -53 0 -13 67
1673.1 67 43 -72 5 26 2 -105 -21 86 -38 -45 3 47 -100 -67 96 40 -98 14 38 -17 -42 -51 -68 108 -32 9 -24
1662.8 -24 -74 -26 36 84 32 -57 -88 -67 -16 13 -115 30 -45 12 -10 -1 47 15 -7 -70 49 42 -27 7 61 95 17 -38 -58 -17 17
1650.9 17 96 53 77 -46 -40 -84 64 42 9 15 -3 -62 -61 -8 8 -28 -59 -47 -52 -27 29 -42 -76 33 51 -68 11 -75 -8 23 111
$$ packed form
1731.4f5M7j5j3J6rK1rL8j3k6P6p5O8o4o5J6J47km3o4N2o4P2l2j7kM4rN4q0j1L4j6
1718.8iQ2o6qO4n3Ok9n2j0M2N8n5J07p6L1J5O6j87j6Q2J5qR2j28J11l7o5J2o7J26p5
1706.9c2Q6pQ2j29M9K8Nj8j39J33K2j27M3l4K5j7j2kQ8n7J02j69J45r7m3J53j84J07
1696.1AJ05k24J71k9TmJ4M4n2L6J1q2L2jn9J58j78J58k3r0J11M2p2j91N6R2p1M0KJ03
1684.6G1rn8J0q7N2Q8p4Lm5J28j68M5N8j4O6q9J13j69J78r3k1Km7j4N0R0j19N3j3Q0
1673.1F7k4j15P7K1k4j07Q4J07j24pM8M4j47L3J63n6j38J12K4n5k5rj7J76j40M1l3
1662.8b4n0M8O2M8n2q9l1K1N1K9j28J45p5N7k2RM8l2k2o3J19po9L4N4L4p8n5k0M1L4
1650.9A7P9m3K4j23Om4J48k2l3Oj8n9JN3J6l6l1J2nK5N6p1l4J09J8j19P9q6O7L1Q8
$$ plain form
1639 111 83 -95 -33 42 -38 17 47 -62 2 -75 31 -54 -11 45 55 -1 -55 39 102 -71 -40 82 -25 -46 -31 55 -40 -4 7
1627.9 7 0 -57 110 -59 1 21 -72 -65 -8 36 32 -59 100 -101 -48 57 -18 -44 57 -44 44 -26 36 99 13 -21 88 -54 141
1616.8 141 37 -85 -25 25 -19 19 -9 -78 -30 128 -61 0 -97 -30 -50 -96 -8 41 -78 61 -39 -98 -37 -45 2 -17 160
1606.4 160 26 -60 -22 54 -42 0 19 -49 1 -52 38 -74 17 -17 5 32 -36 129 70 6 -41 -29 -11 10 -108 29 -56 -34
1595.7 -34 27 8 25 -28 -47 36 -40 -34 -45 2 -22 -56 -27 25 19 59 47 -7 -46 24 99 -25 54 140 -9 16 16 45 27 -17 -35 -20
1583.4 -20 -33 -47 -86 -10 -59 50 61 -24 -4 36 12 -28 -5 9 102 -57 75 -8 40 22 26 -27 29 -2 38 -22 -38 70 20 -100
$$ packed form
1639A11k8j78O2P5q0N5L0j09O4p7J06q5M3N6J0n6n4R4O3j73L1J22j07k1J5Q6r5L6J1
1627.9Gpn7J67j69O0K0r3PN7M4mr1J59k01N3J05p5k6J01j01Q8p0O2O3q6l4J09j42J95
1616.8A41j04j22O0N0m4L8k8o9M8J58j89O1r7O7k0m6Q8M9j19J39j00n9O1qM7j9J77
1606.4A60j34q6L8P6r6M2J9o8N0n3R0j12R1l4K2K7o8J65n9o4m7J2J8K1j18J37q5K2
1595.7c4O1j9J7n3j9Q3p6Oj1M7k4l4K9N2oM0j2n4l9P0P5j24P9Q6j49K5%K9j8m4j8J5
1583.4b0j3j4l9P6m9J09J1q5K0M0k4m0K3J4R3j59J32q3M8j8Mn3N6l1M0o0j6J08n0j20
$$ [...]
-244.3G7
##END NTUPLES=NMR SPECTRUM
##END=$$ End of the data block
