##TITLE= Compound file, contains several data records
##JCAMP-DX= 5.0
##DATA TYPE= LINK
##BLOCKS=2
##ORIGIN= Department of Chemistry, UWI, JAMAICA
##OWNER= public domain
##TITLE= aspirin,  2-(acetyloxy) benzoic acid
##JCAMP-DX= 5.01  $$ exported from JSpecView
##DATA TYPE= NMR SPECTRUM
##DATA CLASS= XYDATA
##BLOCK_ID=1
##ORIGIN= Dept of Chemistry, UWI, Mona, JAMAICA
##OWNER= public domain
##LONGDATE= 2002/05/22 17:33:00 -0500 
##SPECTROMETER/DATA SYSTEM= Bruker AVANCE 500 MHz
##$MODELS=
<Models>
 <ModelData id="aspirin" type="MOL">
aspirin (2-(acetoxyl)benzoic acid)
RLACD/Labs0520021140  
http://wwwchem.uwimona.edu.jm/spectra
 21 21  0  0  0  0  0  0  0  0  0 V2000
   -0.8665    0.8024    0.0000 C   0  0  0  0  0  0  0  0  0  0  0  0
    0.4499    0.2908    0.0000 C   0  0  0  0  0  0  0  0  0  0  0  0
    1.5489    1.1509    0.0000 C   0  0  0  0  0  0  0  0  0  0  0  0
    1.3462    2.5308    0.0000 C   0  0  0  0  0  0  0  0  0  0  0  0
    0.0581    3.0583    0.0000 C   0  0  0  0  0  0  0  0  0  0  0  0
   -1.0298    2.1931    0.0000 C   0  0  0  0  0  0  0  0  0  0  0  0
   -2.1591    0.0020    0.0000 C   0  0  0  0  0  0  0  0  0  0  0  0
    1.5412   -2.0441    0.0000 C   0  0  0  0  0  0  0  0  0  0  0  0
    2.9836   -1.6136    0.0000 C   0  0  0  0  0  0  0  0  0  0  0  0
    0.5219   -1.1013    0.0000 O   0  0  0  0  0  0  0  0  0  0  0  0
   -3.2313    0.5672    0.0000 O   0  0  0  0  0  0  0  0  0  0  0  0
   -2.0988   -1.3365    0.0000 O   0  0  0  0  0  0  0  0  0  0  0  0
    1.1799   -3.1900    0.0000 O   0  0  0  0  0  0  0  0  0  0  0  0
    2.5593    0.7752    0.0000 H   0  0  0  0  0  0  0  0  0  0  0  0
    2.2106    3.1880    0.0000 H   0  0  0  0  0  0  0  0  0  0  0  0
   -0.0976    4.1321    0.0000 H   0  0  0  0  0  0  0  0  0  0  0  0
   -2.0482    2.5645    0.0000 H   0  0  0  0  0  0  0  0  0  0  0  0
   -1.1721   -1.6380    0.0000 H   0  0  0  0  0  0  0  0  0  0  0  0
    3.5898   -2.5187    0.0000 H   0  0  0  0  0  0  0  0  0  0  0  0
    3.2178   -1.0204   -0.8881 H   0  0  0  0  0  0  0  0  0  0  0  0
    3.2178   -1.0204    0.8881 H   0  0  0  0  0  0  0  0  0  0  0  0
  1  2  4  0  0  0  0
  1  6  4  0  0  0  0
  1  7  1  0  0  0  0
  2 10  1  0  0  0  0
  2  3  4  0  0  0  0
  3 14  1  0  0  0  0
  3  4  4  0  0  0  0
  4 15  1  0  0  0  0
  4  5  4  0  0  0  0
  5  6  4  0  0  0  0
  5 16  1  0  0  0  0
  6 17  1  0  0  0  0
  7 12  4  0  0  0  0
  7 11  4  0  0  0  0
  8  9  1  0  0  0  0
  8 10  1  0  0  0  0
  8 13  2  0  0  0  0
  9 21  1  0  0  0  0
  9 20  1  0  0  0  0
  9 19  1  0  0  0  0
 12 18  1  0  0  0  0
M  END
</ModelData>
</Models>
##$PEAKS=
<Peaks type="HNMR" xUnits="ppm" yUnits="arbitrary units" >
<PeakData id="1" title="methyl group ~2.3" peakShape="singlet" model="aspirin" atoms="19,20,21"  xMax="2.83" xMin="1.83"  yMax="10000" yMin="0" />
<PeakData id="2" title="H ~5.03" peakShape="multiplet" model="aspirin" atoms="18"  xMax="5.23" xMin="4.83"  yMax="10000" yMin="0" />
<PeakData id="3" title="H ~7.18" peakShape="multiplet" model="aspirin" atoms="14"  xMax="7.33" xMin="7.03"  yMax="10000" yMin="0" />
<PeakData id="4" title="H ~7.38" peakShape="multiplet" model="aspirin" atoms="16"  xMax="7.53" xMin="7.23"  yMax="10000" yMin="0" />
<PeakData id="5" title="H ~7.61" peakShape="multiplet" model="aspirin" atoms="15"  xMax="7.76" xMin="7.36"  yMax="10000" yMin="0" />
<PeakData id="6" title="H ~8.04" peakShape="multiplet" model="aspirin" atoms="17"  xMax="8.24" xMin="7.84"  yMax="10000" yMin="0" />
</Peaks>
##.SOLVENTNAME= CHLOROFORM-d
##.OBSERVENUCLEUS= ^1H
##.OBSERVE FREQUENCY= 500.13309
##.ACQUISITIONTIME= 3.17194
##.ACQUISITIONMODE= SIMULTANEOUS
##.ZEROFILL= 32768
##XUNITS= HZ
##YUNITS= ARBITRARY UNITS
##XFACTOR= 5.34893E-3
##YFACTOR= 2.14109634E-2
##FIRSTX= -229.85934842
##FIRSTY= -2.9696
##LASTX= 5119.07064794
##NPOINTS= 33925
##XYDATA= (X++(Y..Y))
-42973 -139 -143 -110 -115 -100 -90 -120 -118 -88 -134 -113 -123 -122 -125 -86 -125 -121 -130 -129 -133 -129 -124 -132 -137 -158 -139 -124 -88 -125 -103 -164 -155 -111 -132 -128 -89 -127 -137
-41853 -99 -113 -116 -122 -129 -118 -102 -143 -68 -150 -146 -117 -107 -122 -123 -118 -120 -121 -112 -115 -137 -130 -110 -114 -128 -103 -110 -111 -83 -164 -148 -106 -131 -126 -155 -135 -133 -115 -102
-40704 -145 -140 -115 -128 -170 -138 -130 -134 -125 -98 -129 -114 -117 -128 -109 -126 -135 -126 -96 -96 -143 -108 -123 -141 -145 -124 -74 -117 -124 -131 -127 -110 -136 -100 -139 -158 -109
-39613 -132 -113 -159 -113 -103 -138 -110 -117 -119 -107 -140 -121 -111 -118 -148 -126 -106 -140 -148 -112 -109 -126 -150 -102 -100 -130 -121 -117 -98 -146 -151 -128 -138 -134 -132 -137
-38552 -169 -112 -137 -119 -146 -125 -144 -113 -92 -113 -147 -105 -136 -125 -96 -102 -126 -135 -126 -115 -110 -125 -123 -147 -147 -113 -128 -122 -142 -88 -132 -96 -116 -110
-37550 -111 -133 -141 -94 -110 -141 -115 -126 -113 -136 -121 -140 -141 -96 -120 -133 -154 -109 -119 -125 -123 -137 -145 -154 -141 -126 -136 -173 -155 -136 -100 -114 -127 -119
-36548 -101 -89 -107 -100 -102 -117 -165 -152 -105 -129 -140 -148 -107 -105 -70 -87 -91 -110 -117 -130 -110 -108 -160 -91 -109 -136 -141 -102 -134 -157 -99 -136 -106 -102 -94
-35517 -144 -158 -126 -148 -152 -133 -133 -143 -167 -135 -128 -142 -115 -114 -139 -124 -121 -96 -145 -149 -119 -142 -124 -100 -153 -114 -123 -113 -133 -94 -159 -107 -132 -125
-34515 -131 -137 -153 -104 -120 -130 -87 -107 -151 -112 -137 -87 -127 -129 -88 -110 -110 -146 -114 -139 -129 -153 -117 -88 -115 -133 -134 -118 -118 -128 -113 -140 -134
-33542 -114 -123 -130 -152 -111 -163 -127 -140 -154 -91 -125 -128 -124 -139 -141 -133 -125 -79 -140 -151 -127 -145 -122 -132 -122 -108 -137 -106 -150 -142 -141 -103 -155 -104 -136
-32511 -110 -132 -135 -116 -146 -140 -137 -122 -123 -122 -116 -130 -104 -110 -109 -133 -135 -140 -126 -97 -146 -133 -125 -148 -86 -138 -130 -137 -136 -158 -129 -120 -143 -144 -144 -143 -75 -130 -126 -131
-31332 -147 -107 -123 -125 -84 -140 -114 -101 -126 -136 -129 -104 -124 -133 -140 -131 -145 -135 -148 -119 -153 -147 -118 -112 -116 -137 -120 -113 -161 -134 -126 -131 -145 -144 -80 -173 -115
-30241 -121 -157 -128 -146 -123 -130 -101 -130 -141 -147 -135 -137 -132 -117 -115 -143 -97 -107 -106 -120 -144 -141 -119 -124 -93 -160 -137 -138 -143 -106 -98 -120 -135 -150 -121 -112
-29181 -107 -103 -138 -116 -115 -120 -109 -147 -109 -135 -95 -117 -137 -128 -165 -119 -121 -127 -124 -107 -141 -135 -116 -123 -128 -122 -131 -139 -125 -133 -122 -129 -128 -124 -97 -120 -114 -120 -126 -86 -128
-27972 -144 -118 -107 -141 -132 -153 -81 -132 -119 -116 -137 -81 -143 -121 -114 -134 -144 -105 -117 -104 -113 -152 -133 -162 -134 -131 -111 -113 -106 -103 -99 -130 -100 -113 -163
-26941 -156 -135 -114 -124 -108 -125 -147 -108 -125 -128 -116 -127 -83 -116 -137 -160 -115 -145 -120 -115 -118 -92 -120 -158 -119 -131 -150 -141 -151 -114 -102 -125 -107
-25968 -142 -111 -149 -111 -136 -111 -138 -120 -137 -130 -137 -121 -132 -113 -111 -114 -151 -147 -138 -124 -141 -125 -104 -144 -149 -151 -119 -108 -131 -116 -124 -144 -122 -133 -131
-24937 -98 -132 -145 -147 -130 -116 -140 -144 -120 -148 -147 -137 -155 -140 -120 -134 -163 -137 -117 -149 -150 -129 -145 -135 -124 -152 -135 -124 -138 -154 -113 -135 -150
-23964 -118 -118 -130 -113 -140 -124 -81 -124 -108 -118 -120 -119 -124 -121 -88 -119 -114 -142 -80 -119 -126 -110 -121 -147 -104 -144 -115 -98 -144 -115 -118 -139 -163 -113 -147
-22933 -149 -101 -138 -130 -97 -114 -112 -121 -132 -89 -126 -130 -126 -125 -130 -110 -135 -166 -119 -130 -132 -138 -104 -125 -137 -144 -108 -127 -108 -105 -141 -91 -111 -156 -164 -142 -126
-21842 -156 -138 -105 -129 -125 -125 -122 -170 -145 -150 -114 -141 -149 -131 -122 -117 -162 -131 -154 -151 -146 -138 -172 -134 -113 -132 -129 -105 -128 -114 -156 -132 -131 -160 -136 -131 -128
-20752 -147 -148 -127 -184 -123 -143 -128 -102 -121 -141 -133 -112 -122 -130 -149 -120 -118 -141 -123 -95 -84 -120 -118 -132 -137 -130 -124 -128 -135 -120 -128 -161 -155 -148 -161 -119 -146
-19662 -92 -112 -157 -123 -114 -147 -99 -113 -145 -110 -123 -122 -136 -165 -128 -141 -121 -153 -154 -136 -108 -129 -122 -161 -150 -144 -132 -85 -134 -119 -129 -136 -125 -116
-18660 -137 -148 -159 -118 -110 -121 -126 -132 -138 -134 -143 -139 -109 -127 -117 -135 -131 -147 -122 -149 -113 -161 -104 -185 -129 -116 -110 -149 -143 -122 -137 -125 -158 -149 -130 -122
-17599 -151 -149 -139 -114 -127 -118 -120 -112 -134 -116 -148 -111 -90 -141 -127 -112 -159 -138 -129 -148 -144 -143 -142 -114 -147 -133 -104 -156 -94 -103 -118 -111 -135 -116 -157 -100
-16538 -127 -133 -143 -109 -115 -115 -120 -117 -152 -134 -126 -132 -94 -115 -102 -133 -138 -117 -112 -129 -144 -125 -122 -124 -119 -141 -123 -107 -123 -143 -136 -131 -109 -126 -126 -133 -125 -156 -82
-15388 -130 -120 -79 -108 -141 -152 -107 -131 -125 -88 -163 -110 -126 -120 -141 -103 -134 -111 -122 -111 -142 -86 -111 -98 -144 -126 -134 -123 -117 -113 -138 -125 -131
-14416 -133 -131 -139 -148 -139 -142 -163 -127 -144 -126 -140 -117 -149 -124 -157 -113 -117 -141 -120 -106 -152 -98 -138 -118 -100 -117 -118 -156 -138 -103 -166 -129 -165 -144
-13414 -108 -164 -142 -141 -128 -126 -115 -131 -109 -106 -143 -132 -103 -170 -149 -132 -110 -117 -127 -131 -110 -108 -110 -159 -122 -84 -111 -72 -129 -148 -122 -119 -126 -85 -140
-12383 -147 -120 -139 -127 -126 -125 -139 -169 -102 -119 -153 -107 -134 -87 -120 -101 -137 -132 -132 -110 -139 -123 -131 -147 -120 -130 -130 -147 -96 -158 -126 -141 -129 -137
-11381 -138 -130 -125 -115 -119 -160 -123 -146 -100 -123 -107 -157 -128 -125 -132 -108 -142 -150 -141 -102 -128 -126 -135 -142 -94 -120 -112 -98 -144 -102 -126 -95 -147 -105 -112 -70 -163
-10290 -144 -97 -107 -141 -141 -109 -95 -150 -128 -135 -123 -127 -138 -150 -133 -132 -119 -146 -143 -121 -123 -157 -144 -128 -130 -126 -145 -117 -82 -127 -132 -113 -120 -93 -136 -92
-9229 -129 -140 -105 -116 -129 -127 -122 -104 -125 -131 -85 -112 -111 -106 -118 -123 -140 -150 -111 -107 -165 -127 -108 -119 -152 -100 -119 -140 -122 -133 -160 -117 -138 -144
-8227 -143 -168 -143 -121 -124 -152 -97 -148 -127 -164 -118 -190 -122 -120 -131 -143 -122 -119 -101 -128 -153 -149 -159 -141 -138 -129 -145 -133 -104 -122 -159 -135 -101 -121
-7225 -142 -126 -142 -121 -126 -139 -127 -115 -196 -121 -150 -106 -144 -121 -126 -132 -151 -165 -109 -158 -127 -111 -108 -100 -172 -120 -135 -118 -163 -103 -123 -129 -146 -142
-6223 -155 -139 -149 -136 -144 -133 -150 -127 -135 -154 -127 -122 -130 -115 -111 -120 -123 -128 -134 -140 -121 -147 -161 -134 -142 -119 -125 -128 -146 -139 -136 -127 -121 -126 -135 -131 -121 -151 -115 -126 -93
-5015 -128 -125 -112 -118 -84 -91 -102 -129 -132 -130 -130 -133 -125 -142 -157 -110 -96 -126 -117 -112 -108 -144 -115 -101 -145 -141 -121 -95 -85 -128 -104 -122 -141 -143 -130 -132 -123 -143
-3895 -146 -104 -117 -140 -123 -140 -157 -141 -112 -134 -105 -144 -130 -124 -105 -179 -130 -120 -121 -133 -141 -121 -127 -144 -144 -107 -159 -133 -87 -132 -127 -140 -146 -129
-2893 -113 -100 -131 -91 -114 -138 -117 -71 -162 -125 -143 -126 -146 -134 -126 -143 -134 -161 -98 -129 -129 -154 -143 -115 -122 -132 -139 -141 -130 -131 -107 -110 -154 -139 -139
-1862 -140 -101 -143 -125 -137 -158 -142 -123 -130 -109 -169 -118 -125 -153 -144 -152 -96 -128 -106 -110 -148 -128 -150 -118 -122 -173 -109 -145 -111 -125 -133 -134 -146 -150 -140
-830 -154 -133 -90 -121 -127 -137 -112 -172 -166 -147 -93 -123 -144 -74 -121 -118 -113 -133 -152 -120 -125 -130 -83 -137 -126 -134 -127 -116 -139 -138 -101 -125 -112 -155 -122
201 -128 -89 -148 -138 -124 -137 -107 -123 -138 -136 -114 -109 -149 -136 -129 -132 -186 -92 -132 -116 -128 -98 -154 -140 -116 -146 -147 -138 -138 -116 -147 -113 -145 -142
1203 -104 -157 -102 -115 -122 -116 -120 -109 -129 -164 -151 -148 -118 -97 -160 -176 -121 -114 -144 -148 -104 -178 -107 -123 -125 -97 -97 -134 -137 -163 -146 -136 -140 -105 -107 -163
2264 -164 -130 -154 -117 -149 -99 -140 -138 -144 -166 -121 -159 -150 -119 -125 -150 -129 -109 -153 -108 -115 -100 -86 -124 -89 -120 -158 -164 -139 -121 -160 -143 -113 -151
3266 -119 -177 -117 -104 -115 -117 -109 -144 -152 -141 -148 -154 -140 -147 -125 -110 -147 -166 -97 -129 -161 -142 -148 -130 -106 -99 -120 -123 -110 -126 -124 -158 -130 -136 -135 -131 -110
4356 -127 -129 -150 -115 -158 -143 -152 -131 -143 -129 -116 -134 -112 -129 -114 -151 -133 -119 -132 -155 -166 -100 -134 -150 -143 -139 -128 -150 -149 -133 -149 -136 -138
5329 -132 -152 -133 -117 -153 -103 -125 -149 -113 -157 -114 -124 -149 -135 -117 -175 -121 -134 -138 -107 -133 -132 -135 -160 -115 -123 -118 -134 -101 -159 -117 -156 -124
6301 -133 -122 -124 -130 -152 -118 -141 -138 -143 -145 -115 -149 -112 -121 -113 -124 -104 -97 -122 -158 -133 -124 -116 -121 -113 -128 -144 -124 -152 -149 -109 -109 -157 -145 -118 -118 -103 -99
7421 -126 -135 -131 -117 -156 -97 -130 -124 -137 -114 -109 -118 -147 -158 -125 -118 -104 -95 -127 -95 -120 -88 -126 -136 -150 -134 -156 -159 -74 -79 -159 -111 -131 -109 -98
8453 -128 -125 -134 -132 -128 -137 -137 -156 -111 -124 -129 -114 -148 -113 -94 -128 -114 -132 -88 -152 -152 -92 -109 -103 -155 -127 -123 -125 -107 -103 -123 -102 -129 -122 -115 -155 -126 -153
9572 -169 -105 -168 -119 -120 -126 -121 -171 -163 -108 -141 -102 -131 -119 -103 -125 -126 -143 -138 -71 -140 -130 -158 -102 -131 -144 -132 -133 -113 -101 -150 -115 -137 -130
10574 -112 -120 -123 -138 -94 -127 -155 -141 -122 -114 -93 -97 -126 -101 -139 -141 -103 -136 -126 -134 -144 -152 -116 -96 -93 -95 -153 -123 -127 -113 -108 -141 -121 -112 -157 -164 -112
11665 -102 -154 -109 -149 -130 -124 -120 -143 -127 -125 -137 -92 -133 -117 -121 -84 -97 -120 -113 -102 -123 -109 -119 -124 -129 -140 -135 -136 -123 -130 -136 -150 -115 -136 -131 -115 -100
12755 -138 -88 -109 -134 -116 -131 -114 -110 -142 -141 -122 -136 -112 -93 -141 -126 -112 -103 -140 -116 -113 -133 -105 -147 -138 -131 -161 -181 -140 -161 -113 -119 -99 -131
13757 -176 -142 -102 -116 -143 -142 -103 -135 -127 -150 -138 -110 -180 -131 -137 -153 -116 -159 -137 -161 -157 -167 -166 -104 -113 -134 -140 -125 -149 -120 -177 -136 -139 -135 -154
14789 -112 -127 -120 -141 -90 -150 -134 -157 -131 -112 -125 -141 -119 -141 -101 -117 -107 -70 -113 -130 -155 -135 -123 -144 -126 -118 -142 -121 -106 -134 -124 -143
15732 -170 -116 -114 -113 -117 -126 -140 -112 -135 -126 -159 -135 -164 -143 -119 -149 -125 -167 -121 -105 -142 -148 -131 -100 -146 -159 -145 -150 -150 -126 -177 -131 -142 -126 -107
16763 -110 -120 -165 -122 -120 -157 -97 -136 -162 -167 -154 -158 -137 -102 -165 -136 -106 -83 -110 -110 -140 -153 -132 -111 -102 -100 -133 -136 -131 -129 -106 -118 -157 -113 -154
17794 -99 -95 -115 -123 -150 -139 -138 -149 -114 -117 -142 -128 -149 -125 -132 -134 -142 -140 -111 -129 -143 -132 -189 -105 -114 -182 -75 -137 -148 -127 -147 -143 -165 -166 -143 -105
18855 -113 -131 -123 -185 -163 -135 -131 -110 -165 -129 -153 -122 -120 -154 -120 -146 -125 -129 -142 -132 -121 -87 -119 -120 -126 -144 -113 -110 -164 -123 -135 -122 -146 -107
19857 -132 -128 -124 -140 -98 -120 -137 -98 -137 -114 -143 -115 -138 -111 -147 -143 -116 -140 -120 -138 -106 -122 -138 -121 -105 -129 -152 -93 -144 -122 -123 -112 -144
20830 -130 -118 -142 -112 -129 -106 -139 -144 -134 -114 -129 -178 -116 -135 -80 -123 -120 -129 -140 -102 -109 -135 -123 -120 -147 -118 -190 -135 -118 -107 -112 -113 -124 -132
21832 -115 -147 -114 -111 -144 -133 -159 -134 -124 -112 -94 -100 -163 -124 -131 -161 -106 -116 -135 -134 -152 -126 -170 -151 -125 -124 -131 -138 -155 -174 -124 -100 -143 -149
22834 -127 -153 -156 -111 -142 -85 -157 -154 -99 -168 -110 -144 -116 -117 -144 -150 -122 -115 -130 -145 -137 -109 -147 -124 -126 -132 -118 -146 -132 -133 -131 -121 -124 -119 -128 -122 -128 -159
23954 -132 -140 -114 -129 -112 -130 -153 -139 -129 -96 -158 -155 -133 -134 -145 -131 -122 -144 -120 -126 -127 -110 -117 -155 -148 -124 -131 -164 -135 -116 -116 -139 -126 -142 -111 -134
25015 -123 -153 -112 -137 -120 -127 -168 -141 -138 -104 -167 -135 -132 -113 -121 -132 -130 -125 -119 -115 -145 -137 -92 -132 -131 -117 -131 -109 -133 -134 -116 -137 -156 -132 -103 -102
26075 -151 -128 -99 -141 -118 -130 -159 -107 -130 -153 -161 -114 -159 -124 -146 -134 -130 -114 -170 -125 -117 -117 -117 -130 -166 -146 -130 -116 -112 -142 -148 -132 -89 -131
27077 -101 -146 -142 -136 -164 -177 -101 -137 -154 -71 -120 -117 -132 -118 -128 -161 -173 -161 -106 -121 -119 -132 -155 -103 -148 -132 -122 -118 -124 -134 -118 -131 -127 -124
28080 -118 -105 -103 -117 -117 -126 -145 -96 -135 -165 -159 -111 -125 -108 -136 -144 -103 -149 -113 -101 -105 -160 -115 -109 -147 -98 -113 -146 -133 -123 -134 -107 -110 -123 -144
29111 -124 -134 -156 -134 -114 -146 -161 -130 -100 -104 -141 -146 -128 -154 -141 -120 -134 -144 -78 -109 -92 -142 -115 -121 -154 -123 -115 -99 -131 -149 -132 -156 -147
30084 -138 -141 -143 -151 -98 -121 -161 -165 -117 -154 -139 -130 -116 -137 -122 -139 -129 -151 -121 -129 -153 -156 -128 -119 -89 -144 -105 -118 -137 -130 -144 -129 -144 -130 -131
31115 -135 -140 -136 -131 -138 -121 -151 -141 -140 -143 -127 -142 -123 -159 -114 -132 -141 -127 -129 -115 -135 -144 -117 -146 -128 -150 -129 -142 -88 -115 -115 -133 -148 -157 -116 -128
32176 -137 -123 -117 -138 -125 -120 -151 -110 -155 -137 -86 -130 -114 -136 -117 -165 -93 -136 -137 -129 -147 -99 -159 -143 -154 -121 -137 -159 -136 -129 -149 -130 -114
33149 -135 -129 -149 -133 -127 -136 -119 -115 -122 -146 -105 -172 -160 -100 -139 -144 -107 -120 -138 -130 -131 -157 -89 -125 -113 -120 -141 -148 -112 -101 -85 -116 -83 -75 -116 -142
34209 -115 -155 -144 -129 -101 -152 -164 -144 -162 -121 -170 -109 -142 -148 -128 -118 -146 -164 -143 -112 -100 -140 -178 -134 -127 -155 -156 -137 -160 -159 -153 -148 -96 -130
35212 -146 -132 -137 -117 -128 -132 -140 -116 -140 -117 -137 -136 -130 -133 -117 -112 -146 -141 -127 -127 -111 -126 -145 -91 -137 -112 -139 -160 -135 -154 -123 -106 -122 -143 -130
36243 -135 -120 -120 -119 -117 -119 -105 -129 -146 -144 -113 -105 -126 -145 -150 -142 -114 -102 -145 -113 -161 -114 -133 -199 -107 -116 -141 -150 -161 -133 -104 -122 -137 -130 -123 -112 -149
37333 -123 -150 -109 -120 -145 -158 -127 -121 -155 -101 -122 -124 -139 -170 -114 -134 -147 -131 -106 -117 -119 -116 -140 -139 -131 -127 -115 -120 -143 -111 -133 -121 -155 -151 -148
38365 -125 -89 -164 -91 -119 -108 -143 -114 -135 -167 -103 -126 -140 -134 -142 -108 -131 -108 -125 -133 -126 -115 -126 -117 -134 -144 -104 -158 -152 -144 -118 -133 -124 -137 -143
39396 -130 -107 -137 -141 -147 -131 -121 -142 -139 -147 -179 -146 -125 -99 -130 -146 -131 -147 -122 -155 -126 -148 -135 -147 -116 -132 -122 -149 -144 -142 -130 -111 -113 -127
40398 -126 -117 -148 -161 -108 -172 -148 -141 -144 -132 -116 -170 -135 -105 -100 -120 -123 -135 -144 -148 -107 -139 -159 -132 -122 -146 -125 -133 -124 -93 -116 -124 -167 -165 -109 -116
41459 -123 -145 -150 -112 -127 -106 -105 -138 -108 -98 -128 -116 -169 -135 -93 -151 -128 -127 -156 -154 -153 -99 -126 -117 -129 -106 -133 -146 -150 -122 -126 -124 -116 -112 -129 -105
42520 -120 -141 -132 -137 -124 -136 -143 -125 -119 -130 -140 -123 -134 -147 -139 -147 -121 -122 -107 -147 -157 -147 -115 -155 -124 -133 -102 -127 -123 -86 -165 -142 -121 -114 -130 -149
43581 -162 -149 -144 -146 -143 -153 -107 -130 -113 -140 -145 -117 -121 -116 -90 -136 -95 -107 -165 -113 -161 -127 -122 -170 -146 -120 -131 -113 -111 -153 -122 -132 -130 -132 -118 -98
44642 -106 -150 -93 -125 -156 -107 -117 -124 -136 -156 -131 -131 -117 -127 -133 -143 -121 -109 -132 -99 -144 -121 -104 -142 -154 -141 -127 -128 -151 -121 -159 -133 -133
45615 -147 -91 -113 -107 -140 -119 -139 -121 -146 -157 -119 -95 -121 -121 -127 -124 -106 -154 -140 -118 -114 -134 -109 -143 -131 -126 -171 -165 -151 -99 -145 -127 -139 -139
46617 -154 -171 -120 -88 -118 -126 -142 -108 -130 -147 -172 -151 -142 -156 -123 -125 -70 -164 -158 -183 -130 -141 -100 -107 -120 -103 -159 -153 -142 -122 -123 -124 -120 -113 -117 -125
47678 -160 -119 -150 -134 -145 -114 -146 -145 -150 -135 -99 -121 -120 -107 -131 -165 -135 -128 -147 -134 -119 -142 -93 -107 -121 -132 -131 -111 -141 -139 -123 -123 -148 -136
48680 -141 -148 -135 -140 -135 -109 -167 -144 -141 -167 -138 -123 -118 -140 -147 -118 -125 -153 -161 -115 -132 -81 -99 -151 -120 -164 -127 -152 -127 -161 -118 -144 -113 -143 -109
49711 -111 -131 -122 -97 -146 -131 -137 -163 -108 -113 -118 -120 -103 -133 -115 -140 -123 -111 -151 -135 -146 -119 -145 -136 -144 -130 -127 -142 -131 -137 -128 -119 -140 -134 -162 -110 -121
50801 -155 -119 -131 -138 -162 -124 -135 -137 -129 -147 -123 -129 -139 -151 -154 -144 -124 -104 -140 -137 -117 -121 -127 -109 -108 -152 -172 -148 -115 -156 -170 -126 -132 -129 -139 -149
51862 -111 -117 -153 -137 -126 -134 -141 -142 -121 -155 -133 -113 -136 -165 -131 -108 -127 -149 -114 -107 -141 -129 -142 -115 -134 -150 -139 -133 -116 -154 -116 -153 -97 -135
52864 -143 -114 -128 -136 -132 -128 -116 -101 -148 -133 -98 -112 -149 -133 -133 -124 -129 -105 -110 -134 -112 -117 -162 -117 -104 -152 -99 -129 -151 -109 -127 -150 -159 -154 -95 -150
53925 -105 -141 -104 -138 -146 -145 -109 -139 -110 -120 -112 -108 -130 -142 -111 -144 -134 -158 -106 -119 -133 -129 -137 -129 -133 -135 -131 -111 -160 -134 -158 -121 -102 -144 -142 -124
54986 -166 -97 -154 -102 -123 -138 -147 -180 -109 -120 -165 -139 -117 -133 -124 -128 -141 -134 -114 -139 -166 -152 -123 -144 -162 -135 -141 -137 -124 -144 -136 -137 -123 -142 -143
56017 -125 -134 -138 -119 -127 -131 -119 -130 -109 -122 -128 -139 -150 -98 -131 -143 -121 -122 -116 -145 -138 -100 -165 -151 -135 -101 -117 -121 -137 -136 -122 -139 -139 -138 -105 -106 -152
57108 -174 -131 -125 -146 -142 -148 -109 -138 -126 -127 -120 -127 -121 -131 -118 -120 -119 -107 -148 -113 -122 -127 -120 -179 -134 -137 -120 -112 -93 -126 -115 -130 -118 -109 -147 -177 -108 -127
58227 -122 -131 -136 -128 -138 -114 -168 -154 -129 -161 -109 -113 -143 -141 -100 -134 -134 -130 -137 -147 -112 -145 -133 -129 -140 -131 -164 -163 -133 -171 -113 -113 -162 -122 -167 -131 -154
59318 -134 -169 -135 -144 -135 -127 -138 -145 -154 -130 -145 -127 -142 -131 -136 -120 -123 -114 -112 -111 -167 -150 -163 -105 -137 -103 -150 -152 -129 -139 -127 -140 -154 -159 -127 -135 -102
60408 -113 -111 -125 -138 -164 -139 -98 -121 -126 -162 -136 -131 -130 -127 -141 -126 -141 -140 -184 -109 -146 -134 -117 -123 -132 -116 -126 -126 -132 -113 -136 -135 -130 -128 -112 -130 -142
61498 -140 -126 -148 -142 -133 -127 -125 -142 -119 -134 -146 -152 -105 -113 -135 -119 -143 -161 -143 -114 -136 -108 -138 -136 -141 -119 -123 -140 -116 -141 -159 -142 -102 -140 -122
62530 -131 -123 -128 -134 -138 -119 -146 -116 -136 -128 -169 -129 -158 -132 -153 -130 -168 -145 -151 -127 -128 -135 -130 -124 -95 -108 -145 -154 -113 -142 -132 -135 -148 -158 -125 -123 -136
63620 -90 -136 -131 -100 -108 -142 -147 -175 -117 -146 -152 -177 -138 -142 -112 -140 -137 -139 -148 -133 -109 -123 -139 -126 -105 -136 -125 -163 -129 -167 -153 -157 -122 -129 -113 -147
64681 -161 -146 -157 -96 -103 -150 -148 -164 -126 -148 -121 -135 -149 -95 -146 -186 -115 -141 -137 -166 -129 -144 -157 -117 -115 -155 -121 -161 -134 -134 -147 -105 -142
65653 -162 -118 -139 -170 -141 -149 -129 -111 -152 -141 -123 -115 -136 -172 -133 -127 -140 -114 -128 -180 -115 -148 -129 -115 -127 -111 -146 -154 -139 -127 -111 -137 -131
66626 -151 -137 -118 -143 -130 -175 -123 -161 -133 -138 -125 -119 -131 -147 -151 -96 -120 -122 -122 -143 -79 -108 -121 -118 -125 -128 -155 -129 -139 -156 -107 -106 -122 -114 -115 -156
67687 -111 -101 -146 -165 -115 -108 -139 -118 -153 -109 -150 -106 -158 -122 -145 -125 -138 -127 -141 -124 -122 -138 -124 -135 -129 -141 -105 -145 -153 -160 -122 -103 -132
68659 -119 -130 -140 -159 -139 -131 -120 -166 -128 -113 -152 -179 -131 -143 -103 -132 -171 -151 -158 -138 -169 -136 -117 -116 -159 -137 -127 -121 -145 -136 -133 -113 -140 -115
69661 -158 -117 -110 -127 -154 -136 -147 -123 -128 -166 -128 -126 -133 -102 -122 -147 -128 -148 -143 -134 -97 -147 -129 -85 -147 -144 -136 -128 -169 -145 -129 -127 -92 -143 -137 -142
70722 -181 -132 -114 -129 -120 -99 -121 -137 -152 -136 -132 -152 -102 -75 -105 -151 -105 -113 -140 -133 -125 -151 -136 -99 -78 -142 -129 -126 -117 -135 -148 -154 -125 -142 -155
71753 -157 -111 -143 -131 -149 -154 -144 -118 -130 -134 -164 -109 -123 -121 -144 -171 -127 -146 -116 -132 -125 -94 -153 -145 -111 -131 -157 -158 -116 -176 -119 -121 -168 -141
72755 -98 -139 -152 -117 -103 -154 -111 -110 -138 -152 -115 -101 -135 -140 -137 -106 -144 -100 -124 -147 -128 -128 -116 -149 -145 -148 -120 -139 -121 -137 -111 -120 -102 -110 -152
73787 -133 -140 -118 -132 -150 -126 -122 -108 -123 -131 -140 -159 -104 -125 -135 -117 -178 -126 -112 -111 -142 -124 -146 -126 -84 -156 -158 -151 -116 -122 -130 -92 -103 -144 -153
74818 -125 -137 -100 -121 -126 -107 -124 -119 -146 -127 -125 -124 -164 -119 -102 -131 -139 -134 -131 -117 -142 -111 -111 -128 -138 -116 -155 -119 -160 -133 -142 -144 -123 -152 -159 -128
75879 -126 -141 -112 -150 -121 -133 -131 -110 -132 -130 -107 -111 -105 -109 -151 -160 -95 -132 -127 -147 -119 -114 -118 -91 -126 -114 -153 -119 -138 -121 -104 -74 -112 -135 -171
76910 -163 -154 -160 -130 -152 -132 -143 -120 -138 -131 -147 -133 -123 -146 -110 -129 -137 -152 -118 -122 -136 -165 -89 -148 -129 -129 -100 -138 -137 -127 -111 -136 -149 -135
77912 -129 -137 -140 -91 -140 -116 -109 -120 -140 -163 -119 -128 -137 -142 -153 -110 -109 -110 -129 -147 -89 -143 -91 -166 -140 -137 -111 -138 -119 -122 -129 -138 -95 -113 -137 -155 -130
79003 -112 -92 -125 -129 -125 -126 -143 -147 -125 -110 -108 -168 -152 -107 -125 -138 -114 -132 -127 -151 -109 -151 -123 -110 -126 -117 -145 -149 -126 -128 -129 -100 -99 -137 -125 -128
80063 -78 -145 -135 -118 -134 -131 -101 -159 -123 -92 -154 -123 -156 -108 -114 -110 -123 -121 -143 -120 -100 -104 -119 -104 -113 -111 -121 -116 -119 -105 -107 -139 -124 -130 -103 -123 -106
81154 -87 -131 -95 -103 -143 -67 -98 -125 -105 -123 -109 -135 -111 -97 -129 -101 -142 -103 -145 -100 -96 -143 -127 -85 -136 -131 -115 -102 -109 -126 -155 -131 -91
82126 -88 -80 -117 -121 -122 -101 -116 -88 -134 -127 -132 -115 -98 -114 -110 -124 -89 -115 -133 -98 -105 -116 -137 -131 -121 -153 -115 -112 -109 -140 -108 -113 -102 -105 -122 -129 -89 -77
83246 -118 -79 -110 -93 -122 -129 -120 -128 -143 -88 -124 -106 -124 -96 -88 -123 -120 -146 -136 -119 -94 -99 -92 -67 -99 -83 -109 -83 -125 -71 -104 -85 -96 -82
84248 -90 -48 -33 -105 -124 -56 -82 -102 -128 -70 -71 -84 -79 -49 -49 -93 -70 -84 -73 -29 -79 -65 -75 -100 -95 -64 -105 -80 -80 -62 -85 -100 -64 -58
85250 -79 -86 -94 -59 -80 -66 -73 -64 -33 -55 -63 -61 -39 -35 -47 -61 -52 -69 -28 -63 -75 -37 -60 -44 -3 -18 -18 -43 -75 -63 -51 -65 -54 -65 -77 -84
86311 -90 -89 -47 -51 -85 -105 -68 -92 -67 -100 -48 -70 -77 -97 -98 -88 -43 -84 -65 -91 -72 -63 -74 -57 -84 -92 -86 -55 -72 -84 -103 -60 -109 -73 -88
87342 -68 -87 -82 -94 -110 -93 -86 -115 -91 -51 -111 -110 -136 -119 -97 -109 -119 -139 -106 -82 -77 -120 -125 -137 -131 -95 -138 -126 -130 -124 -95 -124 -144 -99 -107
88373 -138 -125 -130 -146 -120 -130 -130 -125 -120 -105 -119 -137 -115 -148 -125 -142 -111 -131 -136 -132 -126 -152 -139 -96 -141 -128 -120 -124 -114 -126 -151 -97 -127 -128 -128 -148
89434 -125 -121 -108 -134 -137 -152 -139 -126 -125 -149 -109 -139 -128 -134 -117 -97 -106 -135 -137 -103 -118 -134 -133 -150 -104 -120 -124 -117 -119 -99 -131 -127 -107 -96 -131 -98
90495 -126 -111 -115 -97 -122 -153 -94 -123 -138 -110 -108 -156 -96 -90 -127 -126 -143 -131 -92 -133 -108 -140 -132 -136 -135 -107 -115 -87 -128 -126 -110 -160 -150 -129 -123
91526 -158 -156 -105 -133 -134 -129 -129 -106 -131 -105 -121 -116 -118 -108 -117 -145 -155 -143 -142 -94 -93 -109 -113 -84 -158 -108 -142 -104 -138 -121 -142 -103 -124 -121 -136 -135
92587 -117 -119 -137 -153 -126 -100 -117 -157 -135 -128 -122 -114 -131 -117 -153 -102 -145 -120 -114 -119 -99 -121 -146 -124 -115 -101 -115 -128 -133 -124 -128 -88 -120 -98 -104 -116
93648 -107 -149 -120 -103 -133 -119 -133 -130 -123 -113 -148 -108 -127 -134 -121 -124 -145 -118 -90 -162 -102 -158 -106 -120 -129 -79 -111 -75 -107 -93 -124 -106 -100
94621 -113 -141 -120 -135 -98 -133 -142 -118 -139 -102 -124 -130 -133 -117 -117 -121 -145 -138 -134 -133 -139 -151 -93 -139 -116 -101 -122 -140 -129 -155 -169 -132 -154 -118 -92
95652 -136 -152 -95 -117 -97 -110 -154 -140 -116 -116 -137 -129 -142 -156 -156 -111 -140 -121 -114 -142 -148 -151 -107 -95 -126 -122 -141 -129 -98 -149 -124 -148 -128 -120
96654 -164 -131 -125 -116 -147 -167 -123 -125 -116 -119 -95 -145 -174 -181 -119 -108 -144 -87 -148 -110 -132 -125 -153 -137 -160 -144 -111 -141 -135 -128 -138 -124 -147 -105 -160
97686 -140 -132 -134 -130 -101 -135 -126 -145 -115 -110 -132 -141 -135 -111 -142 -137 -142 -144 -116 -134 -104 -110 -123 -128 -101 -108 -124 -103 -143 -161 -121 -134 -109 -142 -147 -94 -112 -135
98806 -128 -117 -101 -136 -149 -129 -125 -121 -123 -127 -131 -143 -132 -133 -91 -91 -124 -131 -118 -149 -117 -110 -147 -101 -100 -131 -106 -135 -128 -146 -141 -122 -108 -144 -154 -119 -152
99896 -95 -135 -134 -110 -119 -103 -112 -136 -80 -166 -134 -148 -155 -143 -111 -125 -127 -127 -98 -163 -114 -113 -119 -149 -119 -58 -123 -130 -122 -127 -130 -137 -122 -141 -145 -152 -130 -158 -136
101046 -135 -117 -114 -122 -159 -112 -127 -133 -143 -130 -156 -102 -127 -119 -105 -118 -127 -139 -155 -118 -127 -122 -103 -127 -134 -114 -126 -106 -123 -98 -127 -133 -117 -138 -119
102077 -151 -151 -166 -119 -112 -130 -119 -88 -123 -147 -125 -119 -123 -119 -116 -128 -126 -144 -123 -146 -105 -158 -119 -94 -123 -107 -96 -155 -128 -124 -77 -99 -96 -122 -111
103109 -128 -108 -76 -111 -96 -84 -101 -89 -126 -121 -85 -107 -118 -98 -115 -112 -115 -111 -80 -95 -145 -77 -124 -95 -132 -48 -79 -109 -121 -111 -97 -122 -131
104081 -97 -87 -99 -96 -116 -139 -106 -88 -90 -90 -95 -120 -88 -127 -109 -98 -94 -82 -111 -95 -108 -81 -83 -114 -83 -114 -67 -120 -80 -141 -80 -79 -68 -90 -71
105113 -105 -104 -82 -80 -103 -77 -104 -67 -71 -65 -69 -95 -105 -81 -112 -120 -57 -103 -79 -104 -122 -103 -65 -107 -73 -89 -99 -75 -95 -86 -49 -78 -101 -67
106115 -90 -67 -75 -101 -91 -64 -71 -74 -69 -81 -78 -52 -48 -62 -45 -81 -38 -82 -71 -60 -73 -74 -69 -57 -96 -83 -86 -34 -76 -63 -59 -51 -41 -57 -38 -88 -41
107206 -80 -40 -19 -41 -36 -28 -40 -34 -51 -57 -40 -43 -52 -60 -28 0 -58 -39 -17 -58 -5 -29 -14 -3 -45 -40 -35 -6 -2 -27 -33 -45 -24 2 -6 -27 -59
108296 -8 -40 -46 -26 -54 11 -38 -16 -54 -13 11 -54 -43 -16 -17 -44 -36 -17 -16 -37 -49 -47 -14 -39 -23 -5 -15 -89 -41 -37 -36 -30 -32 -51 -19 -48
109357 -47 -26 -31 -35 -56 -27 -20 -25 -20 -37 -52 -73 -38 -13 -72 -44 -34 -27 -40 -67 -39 -26 -33 -59 -32 -16 -47 -64 -69 -50 -35 -37 -53 -78 -59 -80
110418 -103 -68 -65 -56 -48 -77 -83 -66 -55 -61 -83 -98 -93 -67 -44 -65 -96 -92 -122 -49 -122 -103 -80 -102 -96 -106 -75 -99 -82 -110 -93 -91 -113 -112 -70 -122
111479 -127 -82 -106 -102 -110 -103 -129 -98 -110 -132 -102 -106 -100 -140 -61 -146 -88 -123 -99 -102 -120 -117 -123 -92 -123 -126 -102 -101 -105 -145 -107 -81 -91 -142 -113 -105
112540 -143 -122 -117 -96 -121 -101 -90 -163 -101 -123 -131 -135 -87 -155 -79 -113 -110 -101 -138 -84 -116 -98 -121 -101 -115 -98 -89 -156 -145 -107 -113 -133 -97 -64
113543 -131 -117 -109 -112 -115 -130 -120 -93 -130 -133 -128 -133 -121 -106 -100 -93 -145 -115 -116 -113 -79 -140 -91 -103 -73 -102 -86 -115 -101 -83 -56 -79 -73 -87 -74 -100
114604 -86 -132 -117 -98 -92 -105 -72 -127 -78 -79 -125 -107 -109 -119 -101 -125 -107 -120 -115 -100 -76 -103 -107 -97 -106 -123 -122 -92 -93 -119 -92 -69 -94 -25 -69
115635 -65 -86 -90 -84 -95 -101 -61 -25 -1 -44 -34 -87 -95 -82 -88 -87 -87 -120 -99 -105 -95 -124 -110 -99 -93 -113 -95 -102 -106 -123 -154 -119 -109 -115 -134 -129 -149 -109
116755 -139 -120 -75 -105 -102 -124 -96 -113 -74 -82 -71 -125 -73 -101 -78 -107 -80 -77 -100 -89 -92 -80 -105 -92 -108 -71 -92 -131 -106 -143 -117 -113 -123
117728 -126 -107 -102 -87 -98 -80 -99 -99 -89 -104 -83 -101 -123 -104 -120 -99 -114 -123 -110 -71 -65 -101 -110 -95 -111 -94 -89 -145 -89 -86 -94 -66 -99 -97 -123
118759 -122 -104 -125 -114 -103 -121 -88 -85 -101 -51 -134 -121 -100 -98 -111 -89 -119 -97 -142 -71 -102 -81 -110 -107 -113 -106 -91 -94 -124 -56 -105 -103 -94 -69 -94
119791 -91 -85 -68 -68 -61 -96 -64 -37 -104 -73 -82 -82 -67 -68 -82 -63 -93 -24 -71 -41 -48 -41 -19 -42 -10 -1 -2 -1 18 6 -19 34 31 85 89 89 122 105
120911 126 146 212 194 231 239 260 238 252 288 277 295 274 316 310 271 269 298 319 275 246 229 218 211 214 176 182 169 174 180 153 144 170 156 130
121943 110 122 164 143 129 133 112 159 130 129 114 109 121 117 155 132 147 166 157 167 146 148 164 149 174 152 199 153 203 147 175 175 183 191 180
122974 219 213 228 209 170 176 182 148 157 202 135 138 146 148 150 122 153 129 141 115 113 77 142 125 95 123 156 104 79 114 115 78 89 81 81 71 66
124065 80 77 14 51 54 86 78 60 75 17 53 23 21 25 39 25 43 16 39 21 5 8 1 28 8 -15 8 16 -6 -3 5 0 -4 -7 26 8 -17 5
125185 -10 12 -26 -15 -24 -29 -47 -9 -22 -37 -38 -30 -61 -27 -69 -33 -59 -25 -35 -28 -53 -56 -59 -47 -26 -58 -59 -91 -15 -19 -96 -55 -60 -56 -100 -66 -48
126275 -40 -91 -66 -87 -67 -80 -92 -75 -80 -94 -82 -70 -73 -94 -74 -48 -86 -67 -105 -58 -54 -72 -58 -98 -116 -85 -83 -81 -74 -84 -93 -98 -96 -108 -113 -123
127336 -110 -93 -85 -73 -91 -96 -104 -89 -55 -76 -92 -77 -94 -96 -116 -79 -71 -84 -96 -98 -118 -139 -112 -102 -99 -104 -79 -108 -93 -143 -92 -127 -119 -89 -104
128368 -108 -100 -90 -105 -126 -110 -97 -136 -142 -121 -76 -135 -101 -120 -112 -124 -80 -85 -118 -148 -107 -130 -138 -96 -82 -124 -115 -136 -107 -89 -62 -105 -111 -124
129370 -164 -120 -123 -96 -86 -80 -126 -100 -157 -126 -127 -105 -122 -147 -121 -93 -116 -141 -95 -99 -115 -115 -77 -120 -103 -101 -70 -91 -126 -130 -75 -117 -100 -99
130372 -97 -125 -120 -119 -118 -128 -96 -85 -132 -90 -106 -118 -148 -121 -59 -93 -86 -114 -103 -79 -109 -92 -123 -125 -103 -115 -121 -125 -119 -145 -93 -113 -120 -116 -147 -136
131433 -115 -108 -60 -107 -94 -87 -86 -126 -69 -107 -104 -72 -90 -105 -94 -87 -91 -130 -112 -101 -119 -119 -96 -99 -123 -63 -122 -95 -103 -66 -127 -148 -121 -138 -125
132465 -132 -124 -94 -136 -96 -120 -126 -128 -114 -122 -67 -110 -151 -155 -92 -96 -129 -139 -92 -107 -119 -101 -133 -114 -116 -130 -87 -119 -82 -120 -124 -99 -74 -118 -127
133496 -158 -117 -133 -112 -82 -130 -125 -129 -84 -72 -67 -133 -94 -91 -62 -109 -89 -107 -153 -104 -80 -110 -91 -124 -78 -98 -104 -67 -123 -119 -70 -124 -73 -112
134499 -88 -109 -71 -152 -105 -103 -76 -89 -100 -110 -114 -125 -111 -126 -117 -111 -61 -110 -107 -100 -115 -120 -101 -91 -151 -100 -104 -124 -134 -118 -124 -138 -126 -145 -125 -113
135560 -64 -134 -85 -141 -117 -155 -137 -120 -118 -156 -90 -152 -120 -137 -159 -123 -110 -137 -99 -117 -102 -137 -133 -113 -77 -139 -147 -114 -114 -104 -109 -105 -133 -79
136562 -101 -140 -127 -99 -122 -93 -90 -83 -131 -128 -97 -130 -119 -104 -106 -130 -119 -115 -137 -114 -113 -130 -111 -107 -106 -130 -115 -107 -113 -161 -108 -146 -124 -124 -139 -106
137623 -146 -119 -134 -136 -120 -133 -118 -128 -109 -125 -112 -138 -132 -155 -154 -156 -124 -153 -137 -136 -126 -128 -146 -142 -123 -111 -158 -107 -104 -136 -153 -137 -140 -122 -146
138654 -124 -166 -155 -132 -155 -127 -100 -133 -149 -132 -133 -144 -176 -108 -166 -161 -152 -125 -122 -108 -107 -153 -115 -121 -155 -134 -158 -120 -150 -162 -110 -154 -99 -132
139656 -139 -132 -119 -137 -146 -151 -121 -145 -152 -130 -160 -147 -123 -138 -130 -112 -159 -126 -138 -135 -105 -122 -112 -114 -149 -157 -139 -156 -154 -116 -141 -134 -125 -123 -123 -147 -121
140747 -153 -117 -123 -140 -140 -121 -125 -155 -165 -157 -136 -150 -127 -142 -141 -112 -121 -107 -171 -146 -146 -155 -187 -142 -157 -167 -124 -127 -136 -129 -144 -102 -155 -150 -120 -135 -104
141838 -137 -122 -149 -95 -151 -118 -153 -132 -105 -118 -128 -148 -162 -125 -150 -155 -131 -108 -129 -115 -135 -131 -125 -154 -164 -123 -125 -131 -141 -151 -161 -145 -124
142810 -121 -147 -157 -118 -143 -152 -151 -136 -155 -141 -143 -118 -142 -140 -157 -111 -137 -166 -162 -149 -106 -108 -172 -175 -150 -139 -149 -141 -147 -141 -150 -164 -95 -170 -136 -126
143871 -150 -125 -158 -114 -101 -104 -187 -132 -124 -174 -136 -163 -135 -118 -152 -130 -143 -126 -105 -136 -141 -132 -160 -142 -124 -147 -161 -91 -126 -117 -166 -142 -162
144844 -138 -150 -162 -143 -166 -157 -151 -132 -131 -153 -173 -117 -121 -149 -109 -106 -147 -161 -149 -154 -139 -149 -120 -156 -160 -156 -143 -171 -136 -139 -109 -157 -165 -144 -143 -139
145905 -160 -122 -81 -114 -136 -149 -109 -154 -134 -136 -113 -136 -139 -133 -112 -128 -118 -142 -160 -134 -122 -149 -128 -136 -121 -142 -145 -158 -123 -147 -131 -153 -164
146878 -106 -129 -145 -136 -131 -133 -155 -118 -131 -103 -165 -126 -169 -136 -159 -161 -143 -163 -126 -91 -149 -124 -160 -131 -140 -131 -147 -112 -127 -111 -121 -123 -135 -119
147880 -143 -161 -122 -163 -105 -128 -159 -122 -145 -129 -161 -115 -146 -132 -121 -112 -131 -107 -129 -116 -154 -130 -130 -111 -137 -102 -121 -143 -120 -140 -123 -119
148823 -158 -112 -120 -129 -129 -122 -128 -124 -132 -140 -123 -137 -100 -136 -124 -110 -116 -125 -101 -114 -109 -154 -111 -76 -107 -95 -127 -132 -106 -122 -121 -85 -119 -117 -136 -122 -151 -126
149943 -117 -115 -153 -153 -140 -87 -120 -105 -105 -98 -112 -129 -142 -131 -121 -115 -120 -134 -106 -84 -106 -120 -70 -117 -93 -101 -93 -137 -137 -94 -122 -152 -115 -110 -107 -129
151004 -119 -138 -107 -121 -78 -115 -118 -89 -89 -113 -115 -98 -134 -90 -84 -90 -123 -121 -97 -125 -117 -106 -100 -89 -124 -93 -118 -109 -93 -88 -112 -127 -122 -124 -128 -125 -125 -110
152124 -107 -90 -106 -71 -91 -76 -121 -122 -153 -139 -112 -133 -128 -109 -117 -136 -116 -120 -120 -96 -138 -124 -99 -151 -119 -158 -108 -127 -122 -113 -125 -135 -134 -152 -159
153155 -110 -129 -144 -125 -135 -139 -138 -157 -112 -120 -136 -127 -152 -144 -126 -133 -155 -93 -162 -141 -103 -131 -123 -146 -155 -151 -143 -149 -143 -92 -120 -142 -146 -147 -130 -122 -137 -130
154276 -144 -148 -102 -128 -164 -144 -117 -164 -147 -134 -157 -154 -121 -143 -156 -163 -150 -146 -186 -172 -141 -159 -169 -137 -152 -132 -157 -139 -138 -127 -143 -147 -116 -124
155278 -156 -162 -165 -140 -137 -144 -152 -150 -155 -126 -179 -142 -138 -124 -122 -156 -155 -128 -151 -140 -156 -163 -152 -146 -103 -149 -161 -126 -141 -143 -171 -154 -181 -114 -160 -143 -175
156368 -149 -147 -123 -119 -127 -126 -179 -133 -149 -157 -134 -158 -146 -130 -145 -105 -148 -141 -151 -166 -154 -140 -133 -138 -166 -168 -178 -129 -151 -138 -111 -128 -137 -135 -150 -154
157429 -138 -119 -160 -139 -141 -119 -105 -161 -153 -161 -155 -164 -125 -134 -201 -132 -150 -164 -149 -164 -132 -156 -139 -167 -122 -142 -108 -162 -141 -150 -114 -162 -156 -134 -135
158461 -135 -136 -153 -112 -126 -168 -142 -148 -174 -115 -182 -159 -148 -149 -134 -162 -121 -138 -161 -150 -144 -133 -137 -133 -137 -160 -170 -174 -92 -130 -193 -133 -152 -178 -153
159492 -138 -130 -154 -163 -139 -159 -143 -154 -133 -119 -145 -110 -150 -155 -155 -139 -139 -140 -149 -129 -136 -130 -127 -137 -193 -168 -149 -159 -125 -137 -149 -170 -112 -191 -196 -153
160553 -140 -168 -163 -169 -155 -132 -113 -145 -146 -177 -129 -185 -146 -150 -117 -140 -128 -139 -181 -159 -156 -180 -107 -139 -168 -146 -147 -100 -150 -106 -128 -161 -110 -177
161556 -134 -136 -144 -160 -160 -139 -122 -160 -166 -173 -172 -167 -144 -130 -147 -127 -170 -170 -122 -165 -152 -135 -129 -135 -121 -130 -106 -149 -178 -155 -124 -178 -149 -188 -168 -164
162617 -113 -160 -122 -196 -150 -138 -163 -163 -155 -170 -148 -164 -145 -145 -185 -182 -194 -173 -148 -157 -149 -170 -144 -145 -145 -139 -126 -131 -149 -156 -171 -170 -169 -178 -166 -163 -162 -178 -130
163766 -166 -180 -154 -148 -143 -119 -110 -154 -164 -150 -146 -132 -130 -150 -164 -173 -169 -148 -126 -140 -170 -186 -156 -147 -154 -163 -148 -171 -131 -166 -139 -133 -163 -150 -209 -171
164827 -144 -145 -142 -118 -174 -166 -143 -186 -153 -144 -178 -159 -153 -158 -186 -176 -159 -155 -155 -120 -131 -154 -141 -134 -183 -135 -154 -159 -151 -111 -188 -166 -193 -179 -171 -162 -176
165918 -165 -163 -149 -177 -137 -179 -161 -159 -167 -197 -166 -178 -139 -143 -159 -185 -170 -160 -145 -148 -199 -144 -135 -154 -140 -161 -139 -121 -163 -176 -155 -157 -183 -164
166920 -160 -154 -172 -147 -198 -130 -169 -150 -144 -157 -140 -169 -146 -147 -147 -163 -195 -156 -173 -184 -186 -193 -191 -163 -187 -207 -161 -163 -176 -182 -193 -138 -197 -192 -195 -160
167981 -215 -169 -203 -229 -166 -183 -180 -191 -185 -173 -157 -133 -169 -150 -170 -147 -180 -145 -169 -155 -154 -159 -120 -126 -191 -137 -155 -133 -182 -149 -138 -126 -164
168954 -155 -125 -143 -116 -161 -182 -144 -151 -126 -148 -179 -147 -192 -164 -192 -150 -144 -160 -142 -173 -182 -152 -141 -166 -165 -146 -131 -173 -160 -146 -131 -167 -138
169926 -167 -151 -172 -139 -118 -169 -148 -177 -160 -145 -155 -155 -162 -149 -154 -128 -151 -186 -174 -177 -162 -137 -175 -115 -142 -148 -147 -147 -171 -145 -154 -173 -113 -164 -169
170958 -138 -163 -189 -154 -149 -185 -162 -152 -155 -149 -134 -170 -120 -152 -164 -143 -128 -185 -170 -139 -169 -118 -165 -129 -139 -152 -116 -147 -151 -162 -169 -137 -169
171930 -153 -163 -159 -132 -154 -175 -136 -181 -170 -147 -175 -138 -162 -153 -167 -151 -136 -147 -186 -157 -165 -179 -165 -180 -161 -177 -166 -129 -194 -169 -122 -151
172874 -134 -176 -147 -148 -172 -145 -170 -178 -173 -182 -180 -144 -189 -148 -138 -154 -139 -139 -160 -129 -178 -151 -156 -147 -190 -134 -165 -162 -168 -145 -182 -175 -173 -128 -132 -167 -155
173964 -141 -172 -127 -127 -142 -138 -147 -153 -155 -149 -152 -159 -151 -157 -135 -167 -203 -175 -165 -146 -182 -137 -179 -149 -146 -173 -156 -163 -110 -169 -176 -188 -143 -158 -180 -170 -111
175055 -130 -179 -169 -145 -141 -170 -160 -167 -154 -126 -177 -168 -170 -146 -184 -153 -162 -177 -148 -160 -167 -123 -165 -173 -187 -143 -152 -105 -132 -150 -172 -146 -167 -147 -169
176086 -178 -151 -145 -181 -179 -167 -176 -162 -147 -160 -159 -161 -149 -162 -135 -150 -183 -171 -168 -160 -168 -200 -178 -136 -153 -133 -168 -153 -163 -159 -153 -164 -141 -156 -137 -155
177147 -184 -181 -129 -177 -154 -176 -155 -138 -131 -165 -163 -186 -166 -181 -177 -185 -169 -176 -191 -190 -169 -164 -174 -181 -166 -140 -192 -173 -178 -189 -142 -165 -192 -155 -150 -177
178208 -125 -159 -154 -143 -167 -179 -187 -138 -194 -197 -155 -153 -145 -214 -188 -184 -151 -165 -155 -170 -162 -161 -181 -197 -140 -134 -137 -154 -155 -171 -156 -174 -167 -182 -182 -148 -179
179299 -159 -173 -171 -175 -160 -145 -171 -165 -159 -175 -165 -169 -207 -180 -173 -157 -217 -183 -166 -166 -148 -157 -175 -180 -166 -164 -144 -163 -181 -152 -197 -166 -205 -158 -150 -166
180360 -162 -125 -167 -179 -142 -169 -180 -155 -178 -161 -168 -159 -160 -131 -165 -166 -183 -141 -185 -163 -157 -163 -133 -151 -196 -169 -191 -154 -140 -149 -199 -161 -183 -175
181362 -152 -142 -200 -175 -153 -165 -175 -203 -204 -135 -164 -200 -191 -139 -176 -134 -190 -172 -196 -195 -173 -170 -171 -191 -128 -172 -180 -141 -161 -168 -182 -179 -134 -160 -179
182394 -183 -133 -133 -163 -150 -175 -161 -178 -142 -159 -173 -153 -180 -204 -178 -165 -155 -130 -203 -149 -146 -161 -161 -157 -164 -165 -174 -159 -166 -176 -153 -155 -188 -164 -184
183425 -172 -165 -146 -188 -152 -159 -181 -179 -183 -168 -160 -159 -159 -188 -158 -188 -178 -149 -216 -151 -168 -173 -193 -154 -152 -180 -146 -158 -187 -164 -188 -158 -170 -166 -140 -168
184486 -162 -133 -176 -168 -161 -140 -152 -167 -187 -156 -166 -174 -149 -133 -165 -180 -167 -168 -151 -151 -124 -147 -133 -161 -128 -183 -140 -159 -116 -141 -160 -154 -158 -165
185488 -159 -146 -171 -146 -140 -174 -141 -156 -174 -142 -151 -166 -134 -186 -158 -136 -136 -175 -148 -124 -154 -168 -168 -144 -111 -178 -155 -141 -147 -105 -88 -103 -101
186461 -152 -153 -140 -110 -156 -150 -160 -134 -148 -100 -150 -69 -126 -106 -123 -125 -155 -103 -163 -115 -153 -124 -146 -134 -158 -105 -97 -107 -116 -113 -105 -105 -113 -81 -85
187493 -68 -83 -62 -58 -6 -11 54 87 175 185 248 266 343 395 491 528 603 676 828 992 1368 1674 1715 1278 839 582 426 274
188318 209 169 160 89 86 42 70 37 6 -13 53 -27 24 12 38 -5 -19 -45 -36 -52 -13 -20 -26 -45 -50 -53 -68 -53 -37 -24 -49 -42 -26 -16 13
189349 19 62 36 142 154 273 270 345 373 454 476 589 637 759 815 1022 1238 1705 2049 2154 1638 1088 755 552 334
190086 262 225 187 120 117 65 100 69 59 44 20 12 12 -34 -3 -10 -31 -50 -7 -60 -57 -92 -71 -79 -57 -76 -70 -91 -87 -121 -108 -110 -131 -104 -154
191118 -159 -129 -120 -139 -163 -95 -108 -155 -153 -130 -157 -142 -162 -170 -149 -138 -138 -176 -186 -138 -159 -171 -183 -148 -167 -177 -194 -182 -164 -158 -170 -141 -128
192090 -169 -187 -143 -167 -175 -188 -153 -120 -148 -160 -148 -179 -151 -186 -164 -194 -170 -237 -182 -171 -185 -218 -165 -183 -193 -185 -186 -194 -155 -190 -164 -191 -171
193063 -168 -197 -173 -157 -143 -167 -155 -179 -170 -150 -169 -159 -160 -138 -167 -179 -154 -194 -157 -191 -200 -182 -153 -121 -205 -155 -161 -191 -206 -199 -167 -153 -175
194035 -167 -209 -211 -219 -193 -185 -179 -193 -193 -169 -138 -176 -156 -187 -148 -166 -193 -202 -174 -176 -146 -215 -161 -206 -199 -173 -200 -179 -162 -182 -205 -162 -173 -196 -179
195066 -177 -181 -189 -166 -174 -179 -159 -169 -200 -129 -185 -180 -181 -173 -179 -163 -128 -171 -135 -215 -149 -157 -116 -165 -137 -138 -145 -162 -132 -202 -193 -203 -166 -192 -152 -191 -216
196156 -173 -163 -160 -153 -198 -161 -171 -135 -188 -132 -192 -180 -200 -187 -197 -163 -194 -189 -160 -177 -176 -175 -181 -213 -221 -184 -189 -170 -173 -182 -201 -153 -205 -205 -214 -148 -177
197246 -203 -184 -182 -203 -185 -208 -142 -190 -192 -167 -203 -201 -194 -198 -184 -200 -160 -206 -195 -244 -199 -191 -194 -209 -177 -190 -180 -220 -181 -220 -195 -183 -207 -153
198248 -160 -179 -198 -201 -197 -183 -222 -150 -199 -184 -146 -175 -171 -198 -175 -174 -161 -208 -182 -175 -191 -190 -148 -208 -182 -208 -172 -205 -162 -186 -179 -197 -153 -218
199250 -157 -177 -171 -217 -183 -217 -163 -198 -173 -207 -177 -175 -151 -170 -173 -195 -168 -203 -165 -172 -175 -178 -132 -179 -161 -189 -148 -201 -169 -193 -163 -203 -173 -172
200252 -170 -188 -144 -154 -116 -192 -161 -208 -148 -184 -139 -160 -142 -180 -140 -147 -133 -135 -114 -178 -129 -142 -104 -156 -135 -105 -130 -147 -108 -111 -98 -131
201194 -51 -156 -96 -87 -80 -123 -94 -113 -24 -67 -48 -62 -55 -61 -48 -28 32 -11 39 -5 53 24 112 97 124 118 141 131 235 232 326 430 544
202167 653 832 936 1118 1274 1469 1611 1842 2020 2328 2529 2925 3324 3952 4888 5899 6236 5488 4006 2979 2205
202785 1723 1334 1163 978 837 731 710 599 605 518 501 438 408 358 324 288 320 219 240 192 217 164 171 107 148 89 60 59
203610 70 63 21 33 -2 -30 -17 -42 -49 -57 -44 -64 -45 -64 -36 -72 -48 -62 -67 -100 -88 -137 -105 -119 -151 -152 -95 -135 -75 -173 -117 -150 -107 -130
204612 -114 -130 -106 -139 -106 -152 -117 -135 -135 -168 -128 -122 -94 -135 -64 -115 -90 -116 -145 -153 -121 -136 -126 -131 -70 -149 -122 -157 -137 -169 -115 -130 -87
205584 -151 -99 -125 -65 -107 -123 -109 -104 -148 -124 -104 -78 -115 -102 -133 -52 -125 -81 -151 -86 -124 -56 -96 -90 -102 -64 -69 -91 -77 -41 -58 -27
206527 -66 -29 -88 -63 -70 -55 -54 -75 -78 -106 -61 -55 -82 -17 -63 -39 -92 -37 -73 -19 -38 -65 -60 -39 -52 -26 -54 -33 -30 21 -5 11 6 36 -4
207558 44 6 49 47 24 82 38 59 53 37 39 71 53 64 84 58 94 96 80 98 135 101 145 152 135 159 175 179 183 187 217 217 209 188 170 201
208619 220 220 226 254 262 226 285 269 322 305 305 318 331 397 345 374 384 421 399 432 446 478 473 489 499 537 511 545 603 630 612 573 625
209591 646 666 713 717 733 746 808 784 814 818 868 884 925 964 1002 1066 1073 1055 1152 1181 1269 1342 1394 1457 1584 1646 1777 1798 1820 1814 1858 1857
210534 1956 1965 2025 2045 2128 2113 2176 2215 2271 2312 2378 2399 2497 2538 2675 2730 2806 2805 2913 2897 3023 3062 3147 3170 3304 3289 3389 3426 3598
211388 3666 3869 3948 4111 3976 3965 3873 3993 3875 4029 3967 4056 4084 4265 4279 4501 4494 4697 4673 4916 4950 5112 5091 5217 5170
212125 5357 5391 5642 5629 5750 5627 5660 5563 5657 5625 5867 5916 6241 6269 6585 6658 6961 7051 7350 7374 7745 7737 8110 8156 8598 8694
212891 9081 9189 9583 9695 10166 10291 10752 10849 11392 11584 12210 12461 13146 13390 14127 14400 15163 15524 16318 16603 17433
213510 17872 18929 19626 20758 21309 22489 23202 24458 25210 26665 27677 29404 30524 32476 33880 35984 37546
214011 40038 42023 45104 47631 51412 54756 59486 63113 67557 70521 75817 83042 95867 113469 136180 156969
214482 182954 211152 242722 274461 309829 342192 372407 406471 447716 490527 542201 595506 668105
214865 768395 913137 999582 989775 841991 637449 500099 393876 318009 262986 230953 204630
215218 186820 169600 158193 146740 139223 130942 124848 117181 111292 104558 100582 95399 90922 84580 80429
215660 75501 71745 67581 64618 60903 57882 53943 51434 48241 46228 43269 41030 38307 36483 34147 32544
216132 30323 28945 27087 25866 24229 23216 21752 20908 19474 18581 17339 16645 15449 14741 13683 13113 12173
216633 11716 10880 10485 9691 9393 8708 8435 7770 7619 7083 6881 6316 6158 5710 5622 5205 5213 4796 4781 4435 4427 4113 4114
217310 3775 3809 3511 3530 3305 3322 3032 3000 2661 2544 2196 2119 1894 1912 1774 1896 1739 1808 1659 1714 1574 1679 1537 1641
218017 1554 1601 1464 1611 1459 1534 1385 1430 1246 1293 1194 1262 1127 1156 1061 1145 1022 1095 984 1072 940 1010 858 955 869
218754 951 849 913 824 896 802 883 816 890 781 849 763 828 760 799 773 821 769 793 707 774 714 770 702 772 703 781 731 820 811
219638 880 802 879 814 803 734 787 730 750 703 721 666 731 636 649 646 656 598 629 593 632 569 634 542 628 567 619 538 588 548 625
220551 550 581 523 554 519 536 494 513 486 530 452 528 455 503 457 491 473 482 512 463 474 478 448 453 421 419 447 399 392 404 392 367 380
221523 388 372 395 395 411 404 406 422 404 415 423 366 356 386 383 363 355 341 367 358 371 370 351 358 344 354 370 351 312 331 347 315 353 331 340
222555 331 330 359 311 328 345 374 331 339 349 349 345 298 308 331 321 321 291 307 304 295 315 295 263 271 265 289 278 267 261 273 274 286 248 298 277
223615 238 261 289 257 226 240 253 211 272 215 239 215 246 234 230 228 253 261 249 229 212 211 224 218 237 218 242 240 242 215 229 217 227 203
224617 248 206 234 225 248 218 228 283 246 212 250 229 267 192 239 207 244 219 234 194 203 245 252 215 241 206 231 218 250 245 262 214 270
225589 210 262 224 235 234 283 271 284 293 279 281 330 273 300 313 363 339 371 358 411 393 443 446 449 472 519 559 678 713 844 952 1138
226532 1244 1424 1595 1807 1922 2145 2355 2608 2881 3266 3708 4425 5430 6356 6481 5472 4049 3101 2391 1951
227121 1596 1439 1218 1162 1017 1001 902 896 793 807 762 758 632 702 566 604 522 525 504 488 420 444 377 397 378 354 363 315 296
227976 301 235 286 259 253 211 231 201 227 207 232 191 216 143 197 121 203 119 156 161 138 152 145 83 148 98 132 119 148 134 85 94
228919 128 68 123 91 92 99 115 64 113 61 92 53 111 60 114 52 91 72 68 48 104 22 97 60 107 75 40 69 70 74 52 82 60
229891 34 72 46 79 51 91 17 85 53 97 20 41 44 42 55 16 27 70 59 105 38 85 87 54 38 22 49 43 17 40 30 66 31
230863 56 7 79 34 54 62 63 43 55 20 57 37 35 26 28 21 49 6 88 28 38 -12 36 17 40 8 58 21 25 23 43 26 32 32 10 8
231924 20 57 15 -12 50 14 15 17 52 21 12 18 70 39 48 -18 24 -16 18 6 47 12 53 11 18 27 28 13 10 16 62 5 36 9 -10 29
232984 5 1 49 -20 15 -22 19 40 -8 31 3 42 18 16 23 25 8 -15 32 22 1 -5 24 -9 21 -8 14 16 8 14 10 15 19 13 35 7 19 29
234104 18 17 0 -8 7 30 -23 25 9 2 11 -4 -12 14 -4 22 26 -34 -51 2 0 -42 10 -58 8 -8 -8 -10 -21 -28 1 21 -18 -4 12 -24
235165 -1 -13 -18 -36 4 -16 29 -5 45 18 9 -7 31 -18 20 40 -4 -24 -15 -42 -42 -8 -26 -3 17 5 -9 -20 -37 -6 -40 12 -26 -35
236166 -8 -29 -53 -19 -23 -8 -25 -26 1 1 -6 -8 -34 -20 -35 -4 11 1 1 5 -6 -13 -15 6 27 8 -14 -10 -25 7 -17 3 -29 -5 -50 7 -34
237256 -18 -17 -37 7 -9 -60 -48 -17 18 -22 -22 2 -13 -38 14 -12 6 -26 1 1 -24 -39 -27 -10 -15 -13 -5 -40 -5 -11 -11 -8 -16 -11 -36 -17 -6
238347 -49 -26 -31 -15 -26 -9 -35 -60 -52 -42 -48 -18 -15 -27 -15 -33 -14 -16 -32 -2 -55 4 -7 -37 -9 -19 -31 -65 -43 -60 -12 -35 -33 -26
239348 -56 -17 -3 -22 -13 -29 -54 -24 -55 -38 7 -31 -17 -30 0 1 -38 -36 -54 -16 -41 -17 -40 -5 -44 -11 3 -47 -45 -50 -25 -14 -34 -42
240350 -22 -24 -24 -20 -12 -21 -34 -22 -48 -28 -19 -47 -39 -25 -32 -24 -71 -27 -56 -41 -71 -39 -75 -22 -49 -43 -42 -37 -39 -41 -17 -35 -71 -24 -85 -43 -53 -51
241470 -56 6 -43 -44 -79 -34 -40 -50 -48 -32 -60 -32 -36 -34 -6 -19 -24 -18 -37 -22 -61 -71 -53 -50 -49 -63 -68 -89 -50 -28 -50 -22 -31 -42 -59 -49 -39
242560 -23 -57 -18 -46 -57 -29 -35 -56 -43 -57 -11 -45 -36 -68 -54 -76 -35 -75 -55 -67 -64 -84 -66 -58 -69 -87 -31 -71 -55 -82 -74 -81 -72 -66 -74
243591 -58 -68 -82 -34 -73 -62 -47 -63 -82 -53 -81 -52 -56 -70 -84 -53 -47 -40 -82 -49 -68 -56 -53 -62 -27 -32 -66 -44 -94 -68 -86 -71 -96 -59
244593 -59 -74 -40 -53 -38 -51 -71 -34 -59 -44 -21 -42 -65 -65 -65 -28 -90 -31 -76 -29 -84 -53 -85 -49 -66 -43 -59 -38 -53 -55 -60 -41 -60
245565 -55 -47 -64 -62 -46 -34 -73 -77 -63 -57 -67 -51 -60 -63 -62 -69 -31 -64 -58 -51 -82 -58 -53 -60 -52 -72 -57 -65 -36 -72 -24 -39 1 -43 -36 -17 -50 -60 -48
246714 -25 9 -37 -9 -37 -9 -64 -19 -29 -57 -28 -41 -50 -71 -55 -87 -63 -44 -69 -82 -85 -65 -71 -33 -50 -55 -62 -44 -78 -85 -88 -39 -55 -92 -92
247745 -69 -15 -32 -31 -49 -42 -26 -29 -62 -47 -41 -77 -36 -10 35 -10 -35 -23 -7 3 -58 -41 -51 -70 -56 -78 -69 -86 -39 -65 -88 -30 -24 -76
248747 -75 -84 -40 -44 -48 -64 -80 -46 -54 -60 -66 -61 -78 -48 -55 -84 -55 -23 -23 -88 -25 -82 -64 -37 -54 -60 -51 -48 -39 -58 -60 -38 -66 -51 -60 -50 -59 -58 -51 -77
249925 -86 -88 -80 -50 -50 -72 -74 -43 -66 -59 -41 -55 -97 -65 -74 -53 -53 -62 -82 -68 -50 -68 -52 -87 -48 -65 -114 -62 -107 -78 -42 -25 -68 -67 -55 -79
250986 -83 -102 -54 -47 -94 -75 -58 -81 -59 -94 -79 -62 -130 -64 -43 -72 -73 -99 -92 -99 -72 -69 -91 -48 -45 -88 -49 -48 -54 -65 -102 -43 -60 -70 -57
252017 -76 -58 -87 -29 -75 -86 -46 -75 -96 -44 -73 -61 -29 -68 -104 -84 -59 -90 -64 -60 -41 -76 -45 -70 -96 -93 -103 -52 -82 -78 -96 -54 -34
252989 -71 -86 -87 -69 -75 -90 -59 -72 -107 -52 -73 -35 -99 -64 -81 -81 -55 -60 -70 -42 -66 -87 -107 -82 -81 -60 -82 -51 -85 -76 -64 -83 -80 -76 -76
254021 -68 -64 -82 -78 -77 -103 -104 -85 -103 -97 -92 -74 -103 -61 -47 -96 -84 -71 -102 -65 -78 -92 -53 -134 -64 -97 -100 -92 -56 -60 -95 -60 -61 -92 -54 -80
255081 -93 -90 -44 -70 -115 -102 -101 -87 -82 -79 -55 -111 -78 -75 -67 -86 -94 -100 -63 -91 -85 -97 -53 -65 -44 -106 -83 -57 -53 -89 -45 -111 -58 -71 -67 -90 -32
256171 -97 -71 -118 -68 -88 -88 -49 -69 -66 -64 -107 -78 -64 -115 -85 -87 -71 -85 -97 -76 -79 -59 -77 -60 -65 -70 -74 -65 -80 -107 -67 -100 -100 -94 -58 -99 -113
257261 -89 -66 -75 -74 -84 -78 -74 -102 -74 -117 -64 -110 -49 -105 -55 -86 -50 -88 -71 -111 -83 -120 -86 -99 -74 -82 -80 -91 -69 -87 -91 -103 -58 -84 -58
258293 -52 -76 -55 -102 -91 -93 -100 -88 -82 -80 -92 -63 -77 -86 -61 -80 -96 -95 -93 -91 -97 -81 -48 -63 -36 -85 -110 -115 -44 -30 -58 -101 -111 -99 -97 -118 -67
259383 -45 -82 -62 -83 -103 -84 -82 -107 -77 -48 -88 -81 -69 -86 -120 -95 -58 -118 -91 -43 -108 -107 -96 -96 -54 -102 -100 -86 -120 -91 -83 -65 -101 -82
260385 -83 -109 -74 -85 -94 -96 -75 -89 -84 -93 -91 -91 -37 -100 -80 -91 -93 -56 -84 -100 -108 -91 -85 -83 -80 -63 -75 -93 -63 -91 -91 -101 -81 -86 -59 -91 -61 -82
261504 -107 -70 -69 -64 -54 -49 -41 -69 -38 -23 -48 -22 -58 -67 -45 -35 -53 -82 -59 -97 -78 -74 -69 -82 -60 -94 -96 -76 -95 -90 -45 -92 -68 -96 -76
262535 -65 -44 -68 -98 -78 -83 -105 -88 -59 -84 -79 -71 -99 -63 -56 -77 -78 -51 -66 -93 -73 -45 -95 -99 -100 -71 -100 -96 -59 -80 -88 -73 -100 -56 -71 -85
263596 -58 -89 -82 -67 -112 -80 -111 -78 -83 -64 -58 -83 -115 -79 -105 -79 -94 -89 -80 -119 -105 -77 -130 -132 -87 -75 -106 -78 -106 -81 -98 -88 -126 -75
264598 -85 -77 -87 -97 -107 -99 -99 -125 -102 -130 -122 -116 -82 -70 -71 -63 -108 -82 -87 -105 -75 -87 -91 -99 -91 -82 -47 -52 -74 -104 -111 -101 -82 -127 -69 -74 -78 -126 -82
265747 -100 -92 -135 -70 -78 -66 -72 -69 -143 -75 -95 -106 -90 -106 -54 -94 -53 -83 -112 -97 -53 -64 -99 -97 -79 -79 -81 -69 -88 -96 -100 -79 -115 -61 -72
266778 -77 -120 -108 -75 -104 -91 -84 -92 -99 -96 -95 -99 -88 -87 -104 -115 -66 -78 -118 -91 -98 -102 -86 -95 -90 -113 -95 -74 -92 -93 -87 -97 -120 -113 -87 -60 -65 -100 -59
267927 -49 -113 -83 -85 -124 -90 -100 -53 -99 -83 -84 -97 -83 -127 -88 -112 -62 -65 -88 -90 -94 -69 -83 -78 -76 -85 -105 -64 -127 -68 -86 -103 -105 -90 -90 -55
268988 -86 -101 -100 -83 -81 -60 -117 -87 -98 -91 -97 -93 -126 -59 -87 -102 -80 -75 -89 -66 -114 -93 -112 -126 -80 -77 -90 -90 -118 -100 -70 -92 -86 -96 -79 -78
270048 -80 -117 -72 -81 -96 -106 -78 -117 -97 -83 -79 -81 -90 -122 -83 -56 -108 -47 -107 -58 -92 -82 -84 -72 -74 -62 -131 -107 -83 -88 -90 -87 -79 -79 -71 -108 -110
271138 -54 -70 -68 -90 -63 -122 -91 -91 -66 -70 -97 -106 -76 -88 -104 -77 -54 -111 -72 -93 -74 -75 -44 -41 -64 -89 -82 -102 -95 -79 -37 -91 -101 -84 -112
272169 -21 -101 -80 -61 -68 -33 -68 -44 -84 -69 -27 -54 -59 -44 -34 -73 -67 -64 -41 -47 -58 -34 -67 -49 -67 -33 -29 -17 -20 -13 -49 -46 -57 -41 -28 -40
273230 -62 -37 -35 -42 -37 -45 -51 -46 -16 -31 -24 -7 -46 -7 -34 -23 -8 -38 -74 -10 -50 -14 -43 -68 -40 -69 -24 -3 -2 -10 -48 -15 -44 -22 -38 2
274291 -39 -46 -26 -10 -18 -46 -45 -21 -17 -24 -22 -14 -18 -8 -13 -59 -14 -15 17 -32 -33 19 -32 -18 -34 -7 -19 -1 -34 -24 -45 -9 -3 -31 -26 -3 -31 -47
275410 -35 15 -53 5 -38 -28 -19 -60 -27 -49 -38 -39 -47 -15 -9 -49 -22 -49 -68 -51 -41 2 -28 -32 -52 -26 -46 -51 -44 -46 -31 -39 -25 -41 -65 -46
276471 -26 3 -6 -41 -34 -21 -32 -20 -45 -35 -26 -6 -18 -14 -7 -42 -39 -48 -44 -75 -58 -27 -33 -34 -26 -30 -22 24 -23 2 -31 -11 -16 -28 -13 -17 -43 -29 -27
277620 -38 -29 -14 -51 -11 -4 -36 -11 -15 -37 1 -17 -38 -7 -33 -28 7 -63 -17 -13 -20 -2 -41 -16 -44 -36 -24 -22 -25 -32 -50 -33 -19 -60 -34 -23
278681 -58 -34 -30 -40 -29 -55 -39 -27 -39 -15 -1 -17 -68 -22 16 -20 -35 -10 -22 -11 -41 -38 -33 -32 -99 -29 -42 -30 -47 -39 -25 -31 -57 -47
279682 -7 -46 -39 -37 -42 -30 -58 -31 -53 -43 -49 -30 -55 -48 -66 -32 -77 -51 -88 -76 -43 -53 -38 -82 -83 -53 -44 -91 -71 -35 -76 -85 -57 -66 -58 -84 -92
280773 -84 -66 -59 -87 -59 -71 -43 -33 -44 -80 -68 -55 -88 -96 -57 -86 -75 -68 -57 -97 -85 -75 -77 -58 -78 -60 -87 -92 -76 -96 -60 -87 -70 -85
281774 -129 -72 -105 -87 -91 -72 -71 -104 -66 -87 -86 -114 -92 -72 -80 -89 -104 -85 -78 -70 -97 -86 -61 -87 -66 -125 -50 -88 -100 -92 -87 -83 -85 -99 -79 -60
282835 -84 -58 -48 -87 -69 -86 -59 -72 -74 -79 -89 -110 -74 -96 -81 -99 -120 -118 -98 -98 -89 -103 -64 -89 -110 -150 -89 -120 -111 -84 -61 -76 -106 -93
283837 -112 -79 -70 -99 -98 -123 -90 -104 -94 -101 -108 -128 -92 -100 -91 -81 -82 -110 -72 -72 -117 -99 -98 -58 -81 -75 -138 -65 -66 -79 -107 -116 -110 -106 -70 -43 -85 -89
284956 -68 -75 -72 -84 -76 -90 -126 -74 -99 -117 -122 -69 -87 -103 -98 -112 -64 -128 -83 -103 -87 -106 -97 -89 -100 -64 -73 -104 -96 -83 -93 -106 -76 -100 -65 -101
286017 -71 -105 -107 -123 -98 -120 -83 -116 -91 -139 -59 -71 -111 -110 -76 -57 -69 -73 -76 -104 -78 -120 -117 -94 -105 -82 -93 -126 -90 -81 -101 -101 -98 -69 -88
287048 -61 -97 -91 -86 -130 -75 -108 -103 -106 -125 -85 -45 -127 -85 -92 -96 -126 -68 -86 -84 -70 -113 -77 -101 -107 -104 -116 -102 -72 -63 -113 -76 -80 -39 -87 -81 -119
288138 -86 -101 -87 -92 -122 -70 -77 -87 -76 -94 -82 -60 -83 -130 -96 -79 -127 -91 -81 -91 -69 -115 -97 -93 -99 -92 -115 -119 -83 -88 -73 -121 -87 -90 -92
289169 -77 -67 -96 -88 -82 -103 -68 -99 -90 -91 -115 -112 -83 -90 -92 -97 -68 -130 -91 -93 -80 -101 -74 -106 -86 -93 -110 -85 -113 -88 -130 -120 -113 -82 -129 -156 -111
290259 -77 -110 -102 -108 -108 -56 -94 -123 -136 -105 -94 -93 -111 -102 -103 -98 -123 -103 -79 -85 -78 -106 -81 -86 -112 -86 -83 -77 -81 -68 -58 -98 -97 -110 -107 -100 -98 -67 -99 -70
291438 -67 -80 -70 -108 -104 -84 -98 -90 -107 -88 -87 -89 -106 -117 -86 -108 -123 -94 -64 -106 -78 -95 -115 -96 -126 -110 -74 -77 -113 -103 -128 -106 -105 -111
292440 -117 -125 -91 -89 -93 -103 -73 -92 -72 -117 -71 -87 -105 -93 -126 -94 -126 -98 -70 -110 -84 -81 -95 -119 -101 -98 -65 -81 -80 -99 -132 -102 -107 -114
293441 -98 -87 -90 -69 -101 -110 -141 -98 -114 -97 -102 -108 -93 -102 -84 -75 -73 -97 -91 -51 -122 -59 -96 -76 -129 -80 -112 -100 -81 -87 -98 -77 -86 -54 -95 -102
294502 -105 -122 -83 -61 -85 -64 -106 -121 -116 -96 -95 -60 -105 -114 -56 -103 -74 -79 -72 -72 -102 -77 -89 -104 -93 -96 -84 -93 -70 -85 -79 -97 -95 -122 -93 -80
295563 -97 -85 -103 -112 -80 -64 -105 -62 -116 -117 -104 -102 -110 -111 -114 -109 -121 -79 -98 -87 -80 -90 -92 -86 -78 -74 -94 -86 -75 -90 -103 -103 -113 -92 -115 -104 -87 -79
296682 -79 -78 -99 -95 -118 -67 -107 -57 -87 -69 -82 -105 -92 -82 -75 -101 -102 -97 -79 -105 -97 -84 -44 -107 -119 -57 -73 -75 -65 -89 -78 -71 -74 -70 -83 -40
297743 -78 -60 -66 -57 -77 -20 -5 -27 -59 -78 -104 -56 -55 -45 -107 -94 -92 -27 -38 -72 -53 -66 -61 -57 -29 -60 -107 -65 -81 -37 -62 -91 -60 -87
298745 -36 -45 -46 -91 -55 -67 -83 -64 -74 -49 -104 -88 -89 -87 -85 -119 -73 -73 -76 -70 -91 -75 -84 -106 -76 -94 -121 -94 -74 -107 -116 -106 -71 -75 -138 -113 -80
299835 -77 -91 -88 -75 -94 -70 -104 -63 -121 -57 -99 -80 -100 -92 -123 -75 -110 -94 -103 -117 -77 -131 -85 -92 -99 -88 -69 -103 -84 -101 -93 -72 -81 -90 -67
300866 -90 -83 -90 -77 -114 -113 -64 -81 -76 -105 -131 -83 -99 -70 -130 -107 -117 -104 -41 -85 -108 -117 -107 -116 -112 -81 -77 -97 -79 -98 -103 -88 -93 -84 -118 -64 -89
301956 -70 -97 -69 -51 -86 -67 -65 -91 -98 -64 -61 -76 -92 -43 -57 -66 -92 -95 -32 -71 -39 -85 -75 -94 -56 -85 -71 -52 -90 -76 -42 -56 -73 -77
302958 -61 -95 -54 -86 -34 -35 -95 -74 -38 -89 -25 -30 -91 -39 -82 -70 -38 -100 -70 -70 -65 -67 -54 -52 -69 -58 -35 -57 -55 -51 -65 -43 -54 -70 -71
303989 -61 -84 -71 -63 -67 -53 -55 -74 -34 -51 -73 -30 -60 -42 -71 -19 -37 -81 -58 -43 -21 -12 -43 -97 -56 -87 -63 -42 -12 -36 -59 -35 -61
304961 -72 -15 -39 -54 -56 -30 -26 -14 -59 -51 -30 -42 -24 -22 -11 -54 -8 -41 10 15 2 -48 -10 -33 -42 -61 -26 -25 -27 -34 -35 -26 -34 6 -40 -47 -48 -53
306081 -34 -33 -18 -16 -5 -25 -37 -4 16 21 -22 2 0 -5 -22 -21 -26 -24 -28 -46 -20 -3 -34 -11 -7 -23 -28 -1 -5 -11 -14 -12 9 -13 -11 12 32 -23 -35
307230 29 -15 -5 -8 -6 1 -9 4 -2 -29 -1 23 4 -5 34 -38 31 32 17 -18 34 27 23 5 20 23 69 46 16 18 21 46 26 13 28 40 74
308320 30 35 48 39 50 30 24 26 18 41 72 54 43 26 50 34 53 39 61 56 25 49 44 29 57 73 81 83 86 84 89 103 92 99 117 106 99 157
309440 108 141 125 163 168 131 146 131 132 109 148 137 149 148 154 211 225 183 194 207 229 228 257 260 288 287 276 333 326 372 340 418 451 516 559
310471 616 652 792 823 930 1047 1149 1245 1418 1586 1785 2017 2286 2682 3213 3667 3911 3714 3472 3444 3486 3681 3963
311148 4498 5302 6210 6859 6687 5810 5338 5089 5084 5238 5693 6389 7615 8574 8813 7569 6213 5407 4920 4679 4661
311767 4869 5441 6138 6447 5998 4832 4091 3539 3220 3014 2996 3087 3372 3510 3445 2863 2323 1943 1633 1459 1337 1243
312415 1115 1037 968 932 899 816 771 707 675 609 601 590 558 484 440 385 398 388 372 338 337 291 283 244 273 218 208 167 174 183 166 137 120
313387 149 152 132 98 64 67 104 68 53 52 86 62 38 18 0 53 32 37 29 16 23 55 -1 -18 8 23 -23 0 2 -13 -20 -1 15 -12 -38
314419 -13 9 -11 17 -19 -18 -31 -29 -6 2 -20 15 -15 -13 21 -24 25 -8 -8 11 23 -39 4 -2 4 19 78 48 15 -30 12 -25 -21 42 30
315450 -4 3 5 22 38 21 15 10 46 6 20 18 38 24 29 49 33 87 34 36 48 53 66 63 47 57 69 78 60 68 73 84 73 104 98 102 98 113 112
316599 68 84 115 97 156 159 157 129 124 170 175 162 147 158 180 183 192 175 180 182 192 209 206 223 193 251 222 228 254 270 239 239 235 299 265 250 239
317689 272 287 273 287 313 313 285 308 276 294 296 311 318 264 318 349 333 299 331 340 330 325 339 351 339 346 350 327 309 332 336 324 336 316 336
318720 322 353 352 286 342 333 308 343 271 340 334 336 312 324 291 312 317 296 327 306 307 292 281 270 280 286 256 286 331 327 310 321 296 317 360
319751 340 362 291 320 322 340 355 301 319 350 309 296 343 300 336 323 294 318 262 302 323 284 293 308 299 301 266 300 269 312 267 286 237
320724 262 263 258 242 215 215 234 201 211 223 177 206 186 181 197 155 184 119 135 104 144 98 71 121 68 75 91 96 106 76 76 34 46 59
321725 35 79 63 47 77 60 72 39 -6 77 56 17 15 45 0 20 36 20 15 26 -13 45 -13 68 33 -8 -15 2 -4 13 -1 -7 -5 -8
322727 26 -2 -8 -8 -24 5 2 -4 -23 27 5 -7 9 -1 -2 0 -20 -32 -18 -14 -9 -8 -24 22 -19 27 -21 5 17 -27 18 -1 33 -2 -6 7
323788 36 -3 11 10 48 1 -28 -5 2 14 4 -4 1 7 32 -15 -33 -9 -12 28 28 21 -6 21 34 -9 -6 43 -7 -6 31 13 5 -1 -4 -2 -2 -3 -4
324937 -29 -38 10 6 -51 -2 -23 -19 -16 7 3 -26 -33 -24 -3 -48 -28 -9 10 -34 -21 8 -16 -3 10 -19 2 -27 -17 3 -17 -35 -10 -28 7
325968 -19 -30 -3 2 7 -40 -23 -37 -7 4 -4 -4 -33 -48 -25 -15 24 -15 -1 -11 24 -13 -14 -17 11 17 -4 29 -45 -17 -8 -36 -44 -52 -11 14
327029 -19 -33 1 17 -21 0 10 14 -48 -4 4 -34 -36 -45 -4 7 -26 -8 -7 6 12 26 9 -21 14 16 -9 5 -23 6 -29 11 -26 -13 12
328060 -11 -23 4 -4 12 16 15 23 48 20 -3 9 22 22 66 37 27 7 -3 14 38 28 26 -9 24 17 34 15 48 22 -8 -24 33 -5 14
329091 17 43 17 65 20 40 15 36 10 59 50 5 46 -14 -1 6 43 37 52 50 18 37 38 46 -11 55 34 30 28 42 47 48 71 54 57 90 50
330181 60 47 12 49 55 76 82 36 93 41 75 109 50 39 34 67 97 64 83 114 86 63 93 96 55 85 62 55 93 114 94 82 104 93
331183 96 90 108 126 76 70 92 80 68 85 88 104 141 108 126 136 123 119 116 111 122 139 148 147 123 152 191 190 156 156 157 170 154 211 193 182 175
332273 182 204 181 194 204 230 224 242 268 230 286 261 256 280 288 279 316 332 318 339 360 387 365 398 411 423 408 459 406 432 471 408 456
333245 454 468 457 484 463 480 487 489 495 462 509 501 503 499 498 496 522 516 558 557 537 542 526 523 474 544 480 464 493 499 452 454 457 439 422 428 421 395 419
334394 437 402 447 435 444 403 457 398 423 452 385 439 449 440 423 410 420 416 398 424 360 351 347 386 333 350 381 316 384 367 373 357 397 344
335396 378 377 361 363 393 367 396 405 418 414 386 421 401 404 446 426 421 407 447 448 453 473 467 485 480 489 473 466 481 459 475 495 512 538 507 513 495
336486 507 493 497 475 481 493 492 464 486 509 494 516 517 522 523 533 519 505 507 504 509 540 509 509 553 506 486 507 505 485 497 508 513 521 532 456 456
337576 446 430 485 455 440 451 451 469 439 422 454 426 441 416 442 381 407 383 390 382 394 388 350 414 357 409 386 391 384 375 455 412 427 419
338578 414 461 431 393 422 427 442 405 429 454 493 460 470 428 473 460 485 436 484 494 531 529 539 590 602 611 671 706 724 819 880 949
339521 1082 1149 1260 1406 1462 1647 1788 1906 2036 2238 2417 2614 2890 3143 3403 3664 3667 3532 3236 2870 2500 2171
340169 1876 1683 1529 1398 1337 1254 1212 1159 1149 1156 1175 1129 1129 1131 1120 1095 1076 1020 984 937 855 807 769 781 706 655 663 655 590 607 607
341082 543 521 511 515 493 486 432 406 416 391 375 360 362 314 352 325 297 312 319 288 310 299 284 284 259 239 211 221 206 179 182 188 180 163 180
342113 198 185 103 139 166 125 136 132 152 110 107 115 80 112 125 62 126 100 93 73 87 70 109 82 85 88 114 72 52 103 82 97 112 62
343115 112 71 89 79 128 120 118 115 148 109 93 81 75 89 97 108 103 92 86 75 93 83 96 97 127 86 87 87 118 86 97 143 123 111 126 88
344176 154 150 142 117 130 142 87 112 148 101 95 83 74 112 124 105 63 100 96 92 83 69 91 94 106 128 85 101 92 109 123 99 104 94 110 124
345236 52 97 77 99 67 89 85 68 47 63 71 51 76 62 41 92 75 78 57 96 64 82 102 63 87 70 65 81 46 60 68 65 51 73
346238 18 56 87 62 81 61 58 76 86 73 97 48 49 80 62 47 70 65 84 84 53 73 76 40 110 43 58 50 48 77 98 64 98 64 82
347269 79 67 78 32 79 52 68 59 61 57 86 48 59 62 50 61 54 33 29 74 66 77 67 55 64 44 71 56 40 87 57 54 73 71 102 58
348330 53 53 67 36 75 47 74 81 46 84 74 29 80 75 78 85 48 63 98 66 17 56 66 81 58 74 106 90 95 82 68 43 29 74
349332 78 72 51 44 48 60 85 70 68 57 64 73 23 90 19 53 57 36 29 39 87 44 45 27 34 39 39 15 65 42 42 45 56 -16 42 12 71 47
350451 14 59 35 24 55 45 19 25 31 41 43 -4 32 25 15 39 26 19 -2 12 -6 20 -22 2 27 23 16 19 9 25 7 -5 39 -7 6
351482 27 -32 13 28 40 -19 -4 9 -1 6 1 -2 17 17 -1 15 24 33 27 2 -10 3 9 3 -12 1 -16 32 17 9 -4 5 10 -4 11 23 0
352573 13 -8 -14 4 9 0 32 -13 19 7 -3 16 -2 5 13 33 -24 33 -19 -12 21 14 -9 7 -9 -36 20 -11 -35 -40 -6 -2 -15 -11 -19 -24 -1
353663 -13 1 11 -27 -57 -26 -17 -25 28 -2 10 -10 3 9 4 -26 3 -62 -13 -30 -35 -29 -20 0 -9 24 9 -7 -16 -27 19 31 -46 16 -36 -24
354723 -58 -4 -2 -14 13 -33 -20 -56 10 -41 -6 -25 -35 16 -11 -45 -16 -33 23 9 -31 -22 6 -11 -1 -19 -12 -7 -46 2 -22 -28 -21 -11
355725 -12 -4 -21 -18 -39 -7 -12 14 -42 -48 -24 -26 -8 12 -31 -16 -17 -52 -58 2 -22 -17 -45 -9 -4 -19 -32 22 -17 23 -18 -7 10 -4 6 -15
356786 -21 -34 -25 -12 -21 -65 -9 -10 -9 -33 -26 -61 -44 -22 -50 -43 -47 -3 -40 -24 -40 -27 -39 -19 -25 -43 0 -48 -62 -28 -68 -16 -46 -48 -48 -21
357846 -39 -34 -32 -45 -62 -3 -43 -20 -25 -49 -49 -29 -60 -28 -76 -47 -60 -8 -65 -47 -37 -37 -76 -34 -22 -46 -24 -37 -23 -52 -107 -50 -25 -65
358848 -16 -37 -30 -60 -34 -18 -5 -24 -42 -48 -48 -29 -19 -29 -49 -39 -50 -59 -46 -79 -52 -27 -51 -31 -27 -22 -52 -51 -23 -47 -64 -41 -52 -28 -63
359879 -62 -34 -15 -41 -72 -62 -40 -59 -68 -88 -100 -53 -76 -47 -63 -26 -79 -37 -40 -83 0 -22 -30 -57 -48 -3 -26 -58 -38 -12 -58 -57 -21 -83
360881 -47 -33 -25 -51 -45 -41 -43 -88 -41 -58 -36 -39 4 -71 -41 -61 -54 -59 -61 -62 -78 -49 -68 -40 -82 -97 -59 -59 -32 -67 -39 -34 -27 -49 -59 -54 -65 -67
362001 -40 -44 -21 -80 -67 -38 -83 -9 -35 -50 -75 -62 -53 -67 -49 -54 -43 -54 -55 -54 -92 -75 -68 -58 -51 -68 -70 -65 -39 -38 -64 -24 -78 -15 -72 -56
363061 -61 -113 -74 -82 -94 -60 -78 -74 -73 -44 -116 -88 -60 -59 -34 -78 -64 -90 -44 -34 -66 -74 -63 -75 -70 -69 -83 -76 -24 -66 -89 -69 -48 -84 -56
364092 -46 -55 -82 -71 -41 -41 -69 -80 -45 -62 -67 -85 -63 -77 -78 -87 -64 -80 -28 -68 -56 -41 -72 -72 -32 -55 -28 -45 -77 -20 -54 -66 -50 -45
365094 -51 -71 -57 -41 -57 -57 -14 -64 -60 -56 -32 -86 -50 -30 -70 -78 -32 -73 -66 -55 -83 -66 -87 -74 -10 -87 -48 -51 -57 -89 -38 -61 -54 -42 -75
366125 -38 -51 -75 -58 -60 -82 -74 -42 -63 2 -24 -50 -57 -66 -106 -55 -44 -17 -68 -26 -49 -35 -36 -26 -60 -80 -35 -21 -57 -25 -53 -7 -25 -15
367127 -11 -38 -17 -38 -68 -37 -33 -45 -32 -26 -24 -19 -22 -46 -8 -66 -26 -24 -56 -41 -62 -19 -56 -32 -59 -36 -48 -51 -40 -60 -69 -45 -56 -49 -73 -46
368188 -30 -69 -8 -32 -29 -35 -56 -44 -33 -56 -38 -69 -53 -28 -49 -37 -35 -59 -59 -28 -41 -40 -19 -58 -97 -34 -76 -27 -47 -26 -42 -10 -38 -43
369189 -56 -53 -63 -45 -22 -10 -65 -37 -68 -62 -19 -46 -20 -42 -44 -37 -57 -41 -42 -60 -96 -53 -49 -57 -27 -42 -45 -47 -57 -78 -43 -32 -51 -40 -70 -48
370250 -34 -65 -69 -92 -46 -42 -18 -42 -12 -28 -66 -71 -82 -41 -70 -55 -46 -34 -53 -49 -27 -45 -61 -17 -77 -47 -67 -35 -81 -32 -64 -42 -15 -69
371252 -78 -42 -20 -52 -36 -52 -74 -51 -57 -60 -93 -46 -35 -68 -35 -50 -39 -73 -53 -47 -64 -57 -25 -61 -75 -98 -88 -60 -46 -52 -63 -84 -58 -84
372254 -64 -84 -92 -70 -79 -62 -57 -58 -86 -24 -69 -60 -67 -60 -68 -106 -67 -57 -72 -76 -62 -57 -64 -66 -49 -78 -73 -66 -76 -55 -85 -106 -67 -89 -53 -74 -48 -55
373373 -44 -66 -58 -70 -65 -71 -72 -67 -79 -77 -85 -68 -56 -69 -76 -71 -57 -61 -95 -103 -62 -76 -50 -59 -79 -83 -48 -96 -78 -76 -79 -73 -78 -39 -106 -85 -95 -60 -77 -103
374552 -60 -104 -59 -95 -49 -76 -63 -105 -79 -66 -115 -84 -89 -65 -100 -59 -75 -81 -95 -91 -83 -71 -43 -90 -83 -93 -90 -76 -88 -57 -71 -133 -103 -69
375553 -59 -63 -54 -116 -86 -102 -102 -106 -70 -98 -82 -76 -85 -103 -77 -98 -52 -96 -64 -78 -65 -55 -59 -108 -71 -89 -82 -90 -66 -82 -76 -86 -95 -88 -86 -94 -74 -58
376673 -51 -83 -85 -67 -91 -109 -67 -101 -88 -60 -86 -73 -69 -66 -90 -68 -64 -76 -129 -125 -106 -70 -81 -49 -63 -40 -98 -71 -63 -75 -85 -74 -63 -50
377675 -90 -99 -91 -64 -74 -79 -80 -102 -96 -63 -100 -71 -71 -54 -52 -82 -57 -76 -92 -87 -83 -59 -54 -64 -72 -66 -75 -83 -95 -81 -56 -94 -76 -70 -65 -83 -91 -123 -77 -96
378853 -153 -75 -71 -87 -78 -59 -83 -63 -104 -89 -73 -110 -73 -76 -69 -87 -105 -73 -71 -92 -84 -58 -75 -78 -57 -73 -94 -73 -83 -76 -57 -112 -67 -119 -65
379884 -101 -87 -85 -93 -74 -104 -72 -55 -121 -70 -90 -88 -73 -101 -97 -83 -109 -92 -140 -143 -69 -94 -115 -79 -84 -76 -86 -107 -82 -100 -96 -69 -88 -122 -65
380916 -87 -71 -66 -96 -104 -88 -58 -70 -73 -90 -80 -64 -96 -79 -97 -90 -90 -40 -96 -61 -77 -110 -65 -76 -32 -67 -67 -65 -77 -85 -76 -84 -49 -123 -73 -81
381976 -77 -56 -95 -86 -75 -102 -66 -83 -108 -86 -68 -92 -81 -86 -87 -83 -63 -89 -67 -73 -85 -68 -81 -61 -57 -64 -76 -87 -98 -118 -98 -75 -81 -97 -88
383007 -67 -90 -74 -86 -105 -101 -77 -80 -57 -61 -94 -45 -93 -120 -98 -133 -51 -72 -54 -92 -97 -86 -67 -70 -75 -71 -93 -78 -62 -84 -64 -22 -93 -72 -56
384039 -73 -23 -58 -59 -88 -97 -76 -60 -78 -92 -17 -96 -61 -84 -75 -75 -82 -103 -55 -58 -68 -57 -91 -89 -82 -91 -105 -78 -68 -71 -62 -95 -65 -102 -78 -83 -72
385130 -100 -64 -77 -82 -103 -73 -111 -79 -68 -71 -70 -80 -105 -115 -74 -74 -33 -56 -91 -102 -90 -61 -92 -84 -65 -93 -70 -77 -73 -97 -73 -91 -96 -99 -45
386162 -110 -55 -72 -54 -80 -81 -111 -87 -110 -60 -80 -79 -87 -98 -116 -112 -75 -70 -77 -86 -85 -98 -65 -101 -80 -83 -82 -99 -96 -73 -85 -76 -39 -68 -51 -59 -46
387253 -68 -38 -48 -64 -53 -59 -40 -116 -89 -44 -51 -55 -51 -52 -62 -48 -56 -98 -65 -4 -37 -39 -67 -65 -55 -62 -68 -84 -50 -64 -70 -97 -92 -68 -84 -72 -81
388344 -53 -93 -48 -41 -89 -89 -60 -91 -73 -112 -53 -70 -83 -78 -67 -66 -86 -101 -161 -108 -101 -68 -67 -96 -80 -74 -94 -87 -99 -88 -106 -104 -87 -99 -119 -92
389405 -91 -106 -79 -88 -66 -64 -51 -86 -77 -85 -98 -75 -65 -60 -64 -57 -66 -81 -78 -76 -62 -68 -78 -98 -112 -80 -99 -73 -87 -97 -76 -92 -72 -87 -97 -44 -86
390496 -97 -68 -45 -59 -122 -89 -96 -85 -63 -47 -85 -94 -90 -78 -70 -68 -38 -61 -70 -117 -110 -76 -110 -107 -60 -88 -77 -44 -70 -103 -62 -65 -76 -66 -82 -88
391558 -88 -76 -60 -84 -61 -59 -30 -79 -89 -59 -55 -83 -91 -111 -74 -96 -69 -102 -109 -73 -73 -74 -59 -103 -41 -110 -76 -58 -71 -76 -88 -88 -73 -65 -57 -104
392619 -46 -25 -51 -59 -52 -104 -48 -58 -96 -64 -73 -58 -76 -68 -98 -88 -78 -47 -60 -66 -86 -82 -75 -58 -62 -53 -58 -61 -45 -79 -48 -71 -85 -71 -68 -62 -74 -76
393740 -67 -77 -121 -62 -68 -71 -52 -86 -46 -70 -77 -76 -92 -107 -72 -14 -75 -53 -66 -122 -93 -60 -96 -78 -66 -48 -78 -87 -57 -104 -90 -91 -86 -102 -99
394772 -42 -46 -60 -86 -75 -53 -73 -53 -66 -79 -40 -48 -43 -93 -67 -55 -86 -60 -99 -60 -99 -75 -70 -72 -77 -67 -73 -76 -76 -50 -34 -62 -78 -83 -63 -89
395833 -92 -70 -72 -83 -67 -83 -87 -48 -60 -78 -91 -68 -71 -70 -81 -71 -57 -60 -79 -73 -68 -76 -63 -65 -37 -61 -78 -79 -67 -70 -79 -77 -69 -41 -19 -60 -65 -38 -66
396983 -92 -80 -74 -64 -51 -82 -51 -92 -106 -78 -87 -56 -56 -71 -65 -63 -65 -24 -75 -43 -83 -45 -80 -72 -19 -61 -36 -66 -10 -83 -69 -43 -44 -97 -78
398015 -64 -90 -88 -122 -27 -54 -63 -77 -59 -56 -54 -85 -56 -114 -71 -71 -92 -47 -84 -74 -59 -62 -69 -80 -59 -107 -89 -80 -78 -50 -51 -70 -93 -69 -86 -46
399077 -87 -73 -57 -57 -62 -69 -69 -64 -94 -87 -83 -67 -69 -80 -65 -53 -100 -72 -80 -78 -68 -64 -51 -116 -45 -103 -95 -98 -74 -28 -85 -66 -63 -62 -81 -84 -114 -50 -92
400227 -63 -43 -87 -65 -107 -76 -83 -74 -89 -81 -69 -69 -69 -77 -63 -94 -25 -37 -53 -47 -35 -84 -103 -34 -68 -67 -54 -59 -68 -50 -91 -69 -70 -63 -32 -70 -37
401317 -50 -76 -78 -72 -81 -67 -77 -66 -52 -67 -66 -55 -89 -81 -61 -50 -48 -34 -78 -54 -65 -74 -79 -43 -62 -49 -71 -73 -75 -81 -100 -63 -52 -40 -52 -71 -97
402408 -68 -75 -21 -71 -96 -16 -103 -95 -74 -39 -73 -65 -57 -76 -75 -55 -54 -51 -103 -81 -49 -73 -63 -81 -71 -39 -89 -68 -62 -57 -83 -49 -90 -39 -66 -90
403470 -39 -84 -11 -38 -34 -54 -58 -53 -78 -85 -45 -66 -54 -78 -74 -53 -73 -83 -75 -16 -47 -45 -49 -55 -48 -57 -41 -50 -82 -38 -54 -25 -13 -64 -51 -70 -53
404561 -76 -65 -62 -13 -43 -59 -44 -34 -68 -53 -60 -42 -38 -86 -41 -61 -55 -71 -71 -62 -55 -65 -55 -41 -50 -52 -61 -5 -60 -73 -54 -76 -57 -17 -38 -72
405622 -77 -55 -19 -32 -43 -30 -47 -27 -50 -56 -12 -29 -48 -61 -14 -53 -15 -65 -49 -36 -42 -44 -72 -63 -65 -18 -24 -20 -49 -55 -59 -39 -65 -57 -47 -46
406684 -65 -28 -26 -14 -75 -35 -23 -33 -19 1 -30 -8 -18 -22 -31 -22 -32 -27 -56 -13 -33 -25 -60 -50 -22 -59 -21 -28 -31 -9 -31 -30 -50 -75 -14 -34
407745 8 9 -49 -5 -32 -12 -24 -22 -5 -20 -16 -25 7 -66 -7 -8 -25 -14 -18 -28 -16 -29 31 -12 -33 -45 -20 25 -21 -19 -31 -21 -3 -40 -2
408777 16 -9 -40 -37 -55 -14 -29 -6 17 18 -4 7 -21 -10 17 1 -30 -11 -13 -56 -27 14 18 -15 -27 10 10 -11 -12 -34 -22 26 4 10
409780 -26 12 -8 2 -60 -22 -18 17 23 -2 -13 19 -16 8 20 22 24 12 -20 -3 3 33 11 -16 25 -31 8 2 -9 21 -20 32 13 -17
410782 5 -1 -14 10 -9 47 20 4 31 34 20 -5 -12 16 21 13 -5 0 10 -8 20 33 12 1 3 12 35 7 24 20 7 43 11 27 -5 18
411844 32 -30 9 -21 17 11 32 31 1 27 41 80 28 9 47 37 17 16 17 43 67 9 16 16 22 30 14 19 8 55 34 -3 -17 22 26 4
412905 -3 -17 -2 -3 52 20 17 12 11 19 42 46 -8 -5 -20 44 75 52 7 13 3 26 -6 43 0 45 30 20 15 51 18 35 18 22 27 9 1
413996 21 43 17 42 43 -7 27 6 36 24 34 1 21 -16 58 8 36 -2 16 25 12 17 -30 17 7 25 2 -13 24 -3 22 28 -4
414969 26 10 1 32 18 13 31 44 23 6 8 1 14 19 22 21 -3 20 -8 -14 9 16 23 16 43 -17 -11 45 2 35 11 0 18 11 18 24 17 -3 28
416119 -18 8 3 26 39 17 -1 27 20 12 13 27 13 3 34 2 8 17 22 26 2 4 26 -1 -2 -4 13 25 4 -1 6 14 3 13 -6 -7 -16 18 28
417269 -16 -16 -11 33 -6 10 22 9 -4 -4 33 14 9 -5 -17 24 17 -3 25 8 -19 16 9 11 40 18 -14 2 9 4 1 2 33 -9 4 -7 -3
418360 4 7 40 7 -19 18 22 1 18 31 18 44 1 -23 14 -2 64 23 26 11 -5 29 0 48 -32 32 -26 33 25 0 6 16 27 24
419362 -51 23 4 39 46 2 1 34 16 10 28 6 19 23 6 26 8 13 -33 20 -9 15 29 9 3 -51 19 -8 8 12 -21 -4 0 -7 -5 16
420424 8 31 1 -3 17 19 -6 29 0 31 11 -26 -17 10 -2 11 7 26 19 17 27 3 47 -1 16 13 19 4 3 20 24 72 13 13 12 9 15 36 47
421574 44 29 60 9 25 31 57 48 28 33 77 4 -11 81 17 73 37 25 -6 -4 -1 19 46 25 43 -13 4 40 18 1 13 16 49 23
422576 8 7 22 -8 14 -13 29 34 2 18 34 5 37 23 28 53 34 21 6 -13 -10 49 56 40 35 10 41 6 10 12 46 41 62 52 10 31
423638 8 50 20 18 20 40 -9 2 8 42 12 -15 7 1 28 6 20 43 12 -10 8 4 58 11 46 33 3 31 28 37 28 -1 28 -4 41 9
424699 1 32 39 40 57 18 62 21 62 49 42 6 39 -4 33 37 36 31 54 40 44 77 11 41 57 32 28 20 16 38 60 -2 60 36 35 10 25
425790 25 17 -16 35 42 26 61 69 64 3 43 49 19 45 45 33 -20 13 30 39 62 43 32 -6 40 47 89 -1 24 52 80 56 50 52 43 30 31
426881 2 27 56 72 38 26 28 19 35 31 27 44 60 61 6 37 11 35 17 18 30 65 30 11 38 10 41 35 20 51 39 53 21 43 62
427913 27 56 43 33 48 85 56 35 55 59 60 43 57 75 58 50 30 35 33 43 75 74 24 42 70 32 46 38 33 86 35 69 60 53 68 31
428975 54 42 55 40 45 43 81 70 98 51 75 55 63 87 49 36 54 79 37 96 43 5 67 52 78 34 63 74 42 52 88 56 40
429948 53 32 46 61 36 58 59 49 58 108 81 82 91 57 30 68 59 42 68 59 42 103 76 65 39 53 96 57 82 51 78 63 76 62
430950 102 86 57 61 96 73 60 89 46 89 72 19 71 73 93 60 69 87 91 94 66 85 94 83 66 75 67 96 83 78 51 82 89 84 67 90
432012 81 93 100 65 49 98 90 86 86 101 110 71 127 87 92 95 101 122 76 94 98 115 79 127 88 81 54 108 73 107 98 115 122 77 102 114 115
433103 71 107 114 112 119 67 108 91 95 88 85 91 66 70 143 99 125 74 98 88 92 79 121 102 95 74 139 133 104 117 98 137 117 100 97 93 78 114
434223 138 115 104 124 142 125 112 111 121 109 65 120 106 111 132 124 113 130 138 112 118 136 101 102 87 123 137 116 114 156 120 90 112 103
435226 131 155 134 139 134 133 74 122 142 106 111 132 102 123 114 127 118 137 110 134 100 161 135 155 135 111 140 159 158 148 123 142 158 132
436228 141 134 134 128 136 151 159 116 144 165 163 153 113 121 156 175 114 150 161 157 194 180 165 165 161 174 158 187 169 119 166 171 162 161 135 149 154
437319 151 184 171 196 175 165 153 166 150 164 183 177 158 152 160 207 163 198 180 166 178 160 230 153 172 157 173 181 141 203 166 183 167
438292 149 189 149 178 189 196 187 205 155 222 167 173 214 206 201 204 182 227 215 186 197 197 200 199 208 208 192 197 206 191 197 203 194 195 226 203 208 199 208 196 203
439501 214 206 193 226 205 213 190 249 221 201 222 223 223 224 214 235 237 212 202 249 205 269 234 234 210 236 221 229 224 248 208 261 212 244 224
440533 255 251 243 199 235 244 244 252 253 212 221 232 265 254 240 254 235 264 255 260 243 262 268 242 244 235 256 223 249 289 265 229 238 266 252 274 214
441624 246 301 262 254 259 244 265 313 292 266 270 287 277 269 274 268 271 305 231 270 250 269 303 265 256 327 292 279 286 245 298 284 286 317 294 293
442685 304 280 330 295 295 322 367 274 320 294 309 292 313 328 298 318 321 317 325 302 331 306 333 346 290 303 302 338 314 300 315 300 321
443658 335 322 328 329 316 355 324 306 364 340 359 342 343 357 352 344 369 350 299 331 334 357 366 373 346 367 348 373 359 373 358 364 377 379 368 372
444720 358 372 355 337 379 402 359 366 365 407 374 401 348 374 406 399 427 383 395 396 371 407 408 404 394 422 444 393 389 424 432 412 416 434 407
445752 403 448 398 411 410 413 414 403 431 437 410 423 473 454 465 472 439 441 420 460 444 439 475 445 461 431 413 455 469 488 459 449 476 480
446754 474 476 478 508 461 474 490 475 499 534 511 456 500 519 488 509 472 500 511 503 519 493 513 497 523 525 516 528 499 519 517 506 511 529
447757 525 527 559 552 546 539 526 562 599 570 551 543 571 549 574 566 579 569 526 548 590 609 573 562 539 559 572 591 570 575 603 581 546 564
448759 587 592 611 596 600 633 623 634 632 592 630 598 645 599 647 637 604 664 612 626 638 624 640 653 632 674 661 667 668 646 670 690 690
449732 655 687 682 713 743 679 670 686 709 695 724 677 710 713 722 683 704 701 720 731 727 750 719 751 775 756 757 766 756 734 765 770 765 777 796 774
450794 772 759 756 773 778 817 843 825 785 793 825 817 797 818 757 820 814 844 827 828 835 829 871 848 820 830 859 850 853 869 865 887 862 896 868 896
451855 874 880 883 898 904 916 915 927 892 870 954 934 922 960 952 926 916 937 952 968 969 1025 979 1017 965 996 982 1006 985 982 1008 971 959 1019
452858 987 1018 1024 1025 1068 1067 1051 1050 1046 1056 1029 1067 1072 1054 1058 1055 1140 1101 1113 1120 1119 1150 1106 1111 1136 1118 1141 1131 1143 1172 1121 1152 1188 1165 1199 1239
453919 1183 1179 1141 1199 1235 1192 1181 1234 1251 1253 1258 1239 1244 1270 1231 1263 1264 1266 1271 1271 1281 1261 1272 1303 1323 1278 1341 1319 1329 1359 1368 1364 1380 1340 1346
454951 1374 1367 1416 1387 1384 1437 1422 1397 1402 1461 1463 1468 1438 1454 1466 1502 1446 1476 1464 1520 1542 1527 1521 1550 1531 1533 1573 1562 1548 1579 1565 1561 1575 1616
455954 1630 1645 1658 1645 1686 1637 1661 1647 1700 1671 1684 1688 1718 1720 1691 1724 1782 1759 1766 1808 1805 1790 1808 1768 1794 1831 1838 1833 1850 1823 1848 1844 1878 1898
456956 1889 1915 1944 1919 1923 1921 1958 1970 1998 1967 2016 2025 2052 2024 2035 2048 2065 2092 2065 2110 2107 2131 2127 2149 2178 2210 2153 2196 2176 2239 2268 2233 2284
457929 2256 2292 2272 2319 2320 2318 2307 2351 2326 2373 2381 2427 2390 2444 2422 2458 2482 2508 2529 2492 2479 2563 2526 2553 2586 2588 2593 2617 2649 2628 2681 2706 2728
458902 2681 2760 2730 2753 2749 2765 2808 2853 2802 2844 2870 2898 2952 2933 2941 2964 2973 2982 2983 3040 3045 3097 3086 3138 3103 3147 3161 3157 3211 3218 3213 3284 3284 3281 3296 3300
459964 3318 3360 3455 3429 3392 3426 3447 3471 3499 3536 3527 3592 3609 3622 3669 3661 3698 3734 3744 3784 3819 3842 3838 3867 3869 3925 3942 4006 4018 4021 4048 4103 4100
460937 4108 4169 4170 4197 4262 4247 4319 4341 4359 4390 4407 4434 4462 4501 4536 4564 4602 4625 4661 4675 4718 4734 4790 4800 4822 4898 4901 4969 5009 5047 5083
461851 5085 5139 5151 5212 5260 5242 5316 5388 5417 5430 5476 5515 5560 5596 5631 5680 5711 5811 5798 5837 5877 5965 5963 6038 6093 6125 6137 6200 6268 6283
462735 6357 6432 6456 6510 6523 6626 6649 6704 6772 6798 6858 6914 6957 7054 7070 7116 7206 7234 7314 7376 7408 7422 7541 7589 7655 7722 7766 7865 7899
463590 7972 8040 8089 8201 8293 8286 8388 8443 8539 8591 8668 8735 8803 8869 8959 9034 9120 9215 9264 9364 9425 9489 9574 9643 9730 9818 9896 9985 10101
464446 10165 10250 10366 10441 10506 10623 10725 10801 10916 10992 11090 11230 11327 11411 11528 11634 11721 11807 11936 12067 12106 12246 12310 12452 12556
465183 12709 12823 12934 13021 13154 13267 13388 13520 13614 13771 13902 14077 14150 14300 14429 14556 14693 14830 14964 15112 15259 15403
465831 15514 15676 15815 15951 16157 16264 16404 16607 16735 16850 17025 17206 17346 17524 17707 17843 18037 18232 18363 18571 18706
466451 18894 19075 19254 19437 19596 19765 19941 20166 20336 20521 20753 20938 21109 21300 21496 21714 21897 22111 22300 22522 22717
467070 22930 23121 23311 23572 23730 23960 24141 24390 24584 24802 25049 25237 25462 25688 25876 26126 26330 26563 26773 27007 27197
467689 27436 27671 27906 28093 28312 28565 28741 29019 29232 29424 29612 29860 30056 30290 30516 30710 30899 31158 31357 31553 31762
468308 31974 32168 32337 32536 32725 32938 33117 33302 33445 33644 33804 33989 34149 34308 34463 34623 34752 34936 35041 35198 35384
468927 35453 35599 35660 35832 35924 36044 36131 36176 36306 36326 36434 36535 36606 36626 36663 36724 36811 36811 36800 36856 36828 36859 36855 36873 36844 36801 36766 36779
469753 36729 36676 36649 36573 36483 36442 36398 36326 36223 36143 36032 35941 35838 35721 35592 35453 35355 35224 35068 34940 34788 34670 34518 34322
470460 34171 34021 33842 33672 33511 33341 33125 32926 32732 32530 32370 32172 31964 31811 31569 31351 31159 30950 30740 30530 30296
471080 30075 29894 29639 29437 29221 28967 28763 28560 28332 28091 27897 27693 27466 27255 27027 26800 26553 26344 26140 25896 25649
471699 25463 25241 25037 24773 24598 24383 24173 23909 23715 23519 23310 23092 22908 22694 22495 22277 22099 21891 21665 21420 21246
472318 21097 20900 20694 20528 20325 20099 19946 19752 19591 19400 19193 18976 18849 18659 18456 18299 18158 17962 17819 17672 17457
472937 17318 17144 16985 16837 16661 16552 16388 16207 16073 15944 15799 15622 15498 15362 15178 15074 14954 14780 14642 14487 14365
473556 14255 14111 14007 13856 13737 13642 13505 13407 13258 13102 13007 12887 12774 12653 12533 12447 12355 12250 12118 11993 11915 11802 11692
474235 11625 11483 11367 11288 11155 11110 11015 10896 10805 10715 10641 10544 10464 10373 10238 10200 10148 10024 9909 9855 9767 9683 9622 9558 9456 9378
475001 9332 9221 9119 9080 8946 8911 8874 8815 8732 8652 8594 8515 8413 8373 8322 8237 8203 8096 8048 7996 7909 7846 7806 7769 7691 7630 7591 7527
475827 7435 7425 7342 7294 7233 7209 7097 7056 7041 6975 6950 6889 6842 6761 6718 6631 6638 6576 6520 6490 6413 6403 6379 6277 6293 6241 6211 6127 6087 6053
476711 5996 5960 5906 5859 5866 5814 5764 5710 5694 5650 5614 5589 5515 5503 5479 5431 5391 5358 5296 5262 5266 5192 5189 5114 5109 5063 5019 5005 4960 4931 4885 4875
477655 4780 4833 4780 4757 4715 4710 4648 4644 4614 4580 4558 4539 4512 4435 4435 4390 4407 4356 4345 4305 4309 4223 4229 4166 4116 4150 4136 4072 4107 4049 4059 4000 3996
478628 3951 3959 3948 3891 3896 3859 3809 3789 3787 3742 3738 3732 3694 3712 3658 3664 3599 3593 3590 3530 3561 3499 3463 3503 3487 3419 3412 3399 3359 3339 3339 3314 3284 3289 3266 3247
479689 3216 3210 3218 3197 3171 3166 3149 3124 3113 3100 3071 3034 3049 3008 3022 2978 2939 2955 2945 2936 2919 2907 2904 2893 2864 2822 2842 2828 2796 2795 2787 2734 2740 2747
480692 2696 2686 2669 2678 2633 2635 2640 2608 2569 2613 2559 2580 2560 2547 2543 2496 2495 2478 2488 2463 2441 2464 2453 2443 2413 2410 2400 2401 2378 2362 2329 2357 2320 2311
481694 2276 2315 2290 2311 2305 2261 2241 2195 2150 2206 2194 2167 2191 2170 2152 2122 2148 2125 2139 2116 2108 2104 2079 2065 2057 2055 2052 2041 2069 2004 2002 2039 2034 1984
482697 1951 1949 1935 1952 1933 1918 1907 1955 1908 1895 1907 1884 1871 1859 1876 1847 1842 1839 1808 1835 1847 1811 1792 1778 1795 1786 1777 1790 1772 1730 1726 1768 1719
483670 1745 1678 1699 1680 1687 1647 1670 1670 1668 1639 1639 1652 1629 1618 1614 1581 1603 1617 1582 1599 1566 1587 1564 1555 1551 1547 1535 1551 1515 1523 1485 1511 1515 1535 1485
484702 1500 1452 1511 1440 1429 1474 1480 1423 1443 1453 1428 1424 1403 1442 1445 1435 1400 1399 1398 1394 1393 1385 1363 1416 1309 1342 1324 1352 1340 1338 1378 1342 1314 1318
485704 1331 1329 1294 1281 1264 1285 1290 1290 1297 1292 1271 1251 1240 1227 1272 1249 1269 1231 1268 1227 1204 1175 1189 1220 1200 1205 1184 1131 1165 1195 1169 1170 1168 1156
486707 1147 1155 1167 1112 1133 1137 1115 1120 1155 1084 1124 1101 1089 1118 1100 1084 1102 1105 1079 1125 1061 1068 1090 1085 1072 1089 1065 1044 1069 1066 1070 1037 1022 999
487709 1025 1023 1010 1000 1040 1028 1023 987 1049 1032 997 1019 997 995 988 1001 974 950 995 962 953 935 948 976 941 940 943 963 916 934 930 924 947 931 931
488741 927 915 893 908 902 875 893 908 863 845 897 878 877 890 877 876 869 847 830 820 867 833 839 834 841 843 833 814 850 828 842 828 808 849 795
489773 814 799 776 812 843 815 782 794 821 784 804 774 803 783 774 775 762 778 775 759 769 775 753 774 741 776 758 734 749 740 740 703 772 753
490776 732 742 772 736 760 756 736 708 713 722 714 730 734 695 712 708 754 724 709 692 716 699 713 673 677 652 717 685 676 679 711 662 659 632 653 696
491837 688 684 681 652 663 695 616 624 662 660 675 657 658 652 646 605 630 637 621 641 605 626 583 620 652 600 619 633 619 596 583 599 589 616 589
492869 569 621 594 580 550 592 577 620 594 581 578 573 586 588 578 561 570 566 577 577 556 578 583 560 570 550 585 541 544 584 550 566 546 570 546
493901 516 537 519 557 534 593 532 482 513 521 534 512 517 540 525 540 517 510 517 538 495 499 492 480 523 523 517 517 519 535 492 510 516 512 509 515 501 501
495022 493 467 504 490 515 458 450 494 479 486 469 439 481 494 445 489 490 494 463 491 454 481 454 469 442 410 479 438 454 456 458 437 456 463
496024 445 429 430 457 489 428 430 449 444 422 415 427 453 455 445 375 427 434 432 456 417 439 392 441 414 412 419 403 433 418 435 406 416 396 399
497056 398 406 414 407 430 394 378 387 398 365 391 392 386 391 397 377 389 378 339 373 379 396 403 399 394 407 362 390 394 387 369 378 398 371 397 387 370 390
498177 379 367 363 355 314 361 356 340 376 355 365 400 355 372 371 332 403 345 344 360 365 367 366 365 335 347 356 326 330 329 320 337 366 364 317 349 361 311
499297 355 303 333 341 334 308 349 300 312 327 322 312 339 343 307 288 312 325 311 335 327 336 296 308 326 323 330 331 325 310 283 318 294 324 289 346
500359 320 329 279 288 309 317 292 266 308 283 305 289 294 295 262 256 276 277 268 279 271 299 291 281 313 296 299 307 303 273 326 262 282 306 257 285 281
501450 286 260 284 300 267 289 266 294 264 256 282 265 271 301 279 304 276 284 240 287 299 297 235 257 244 267 254 252 282 242 290 271 276
502423 257 245 262 259 266 242 242 270 277 246 258 243 217 237 294 231 240 218 216 233 240 228 223 213 222 272 244 298 226 245 217 257 249 261 255 213
503484 238 227 204 242 223 207 190 222 250 232 213 236 212 240 255 230 202 224 260 202 208 218 228 230 168 219 192 189 227 195 207 205
504428 193 229 236 222 209 203 221 218 205 237 199 179 218 191 217 190 212 177 218 192 224 178 152 205 175 227 205 210 197 213 211 217 222 194
505430 232 167 188 188 174 213 215 199 224 158 182 206 177 178 172 164 153 177 145 178 200 188 189 162 196 196 220 190 212 163 188 185 201 162 166
506462 193 200 152 166 160 195 195 191 177 192 191 152 173 130 182 160 168 184 180 176 155 151 190 179 151 220 184 137 160 200 180 172 145 130 144 175
507524 152 190 152 163 159 148 161 154 153 149 153 145 147 140 142 137 158 152 144 168 168 158 165 161 125 135 120 173 141 151 160 131 179 126 106 123 146 170 158
508673 141 141 107 151 163 130 164 129 137 121 126 174 125 151 158 127 129 123 161 131 120 123 129 160 134 166 126 90 113 143 117 158 156 142 112
509705 145 167 135 134 100 111 113 108 145 150 132 163 108 114 137 153 111 123 119 122 91 132 96 133 135 81 134 111 140 167 143 121 121 121 140 141
510767 135 117 103 111 86 134 143 159 116 137 119 107 83 102 107 141 135 90 111 99 135 102 75 137 151 61 111 109 125 134 132 128 123 128 140 114
511828 117 111 132 98 126 81 117 113 105 99 102 106 90 100 72 117 91 113 85 99 94 96 111 131 119 85 90 80 109 109 99 89 119 84 80 129
512890 93 50 103 75 108 111 104 98 82 103 105 106 103 101 109 78 87 116 78 89 114 97 66 77 95 90 144 65 70 83 72 74 35 60 75 87 127
513981 82 52 95 81 96 86 73 67 101 72 82 126 94 78 79 68 89 53 69 97 83 92 93 110 74 86 112 76 94 81 73 91 95 95
514983 62 110 61 68 66 62 26 89 92 62 61 63 71 41 72 33 88 34 55 79 74 67 78 101 41 56 76 73 27 53 77 77 62 68 88 79 83 61
516104 66 58 88 62 42 101 78 56 82 67 93 66 66 44 28 62 51 104 76 32 70 62 39 54 58 51 11 83 38 50 62 53 67 74
517106 48 82 98 70 53 73 66 56 58 85 55 64 38 55 65 55 79 78 72 85 49 81 51 61 32 69 47 47 47 49 83 63 81 76 71 75
518168 41 34 55 95 50 79 55 42 36 51 35 14 28 77 76 25 51 49 81 57 28 72 76 72 75 50 41 42 65 74 34 52 57 48 -13 67 54
519259 18 54 54 86 15 19 44 57 42 28 64 21 30 49 25 48 51 51 43 12 34 34 47 82 21 44 69 54 68 47 57 37 49 61 52
520291 44 17 33 28 49 49 41 35 28 16 15 -18 53 37 33 18 52 27 -8 43 58 32 27 6 30 66 43 26 17 35 31 43 84 30 10 9
521352 46 53 47 3 -6 35 35 58 30 26 55 36 38 12 38 52 16 50 51 7 -12 11 -6 9 61 46 25 41 30 29 14 6 16 34 52 15
522414 32 33 1 17 23 12 14 46 29 47 46 36 -24 13 13 27 46 46 25 4 -2 32 39 38 18 7 1 40 17 11 23 9 24 20 24 20 17 34 36
523564 19 10 22 73 23 29 15 25 39 26 33 53 36 30 33 6 -1 0 35 -18 39 20 3 -6 34 38 27 2 28 50 10 35 -29 -17 9 -11
524625 -12 12 41 41 -11 -10 31 43 -19 20 -11 3 25 47 28 -9 -1 10 13 -26 23 -6 2 5 -6 -1 9 16 -21 -2 37 -12 31 10 -7
525657 15 53 -12 26 -8 32 4 24 17 7 27 -22 22 -4 5 13 27 1 42 12 17 -22 18 10 -13 0 -5 -16 10 -8 -4 7 -1 -10 7 14
526718 30 0 6 2 18 3 6 -14 -19 -10 -14 12 5 -8 5 -5 0 26 -23 -7 15 -22 -10 -14 18 26 19 -20 -12 53 -10 25 -30 -12 2 -16 -5
527809 -25 -27 -17 -16 11 -22 14 -11 7 -9 -24 38 11 -16 -26 16 17 -9 13 32 5 23 2 -13 14 -17 -15 9 0 4 22 33 8 -13
528812 -19 7 -12 25 -6 -31 -19 16 -12 6 60 10 -7 -10 -1 -52 -58 -13 -37 -17 -47 -13 -23 -30 -2 12 -55 -26 7 -16 -22 35 13 -9
529814 0 1 -17 -9 -1 4 -12 -23 -16 -14 4 -26 5 -30 -22 -28 -9 8 -11 -7 -1 -22 -46 -33 0 21 -24 -6 -37 15 -6 -44 -10 -11 -39 -20 -28
530905 -16 -25 -2 -50 -25 14 -37 2 7 -40 -54 -2 -25 -22 -32 7 -15 20 -11 -16 4 -34 4 -10 -19 -35 -11 -32 -25 -49 -32 11 -35 -33
531908 -14 0 -52 4 -12 -8 9 -30 -38 -30 -25 12 13 -18 -13 -47 -18 -35 -40 -34 -12 13 -17 -13 -48 -22 -19 -30 -15 7 -3 -61 -26 -47 -15 -9
532969 -9 -4 -14 -15 16 0 -13 -7 -5 4 -20 -33 -5 -12 -30 -7 -47 14 8 -28 -26 5 -24 -19 -8 17 -5 -29 -2 -49 -14 -59 -25 -44 -21 -6
534031 -34 -51 -28 14 -4 -32 3 -45 -35 -66 -36 -12 -7 -1 6 -57 -30 10 -50 -33 -1 -57 11 -4 3 -36 -34 -16 -7 -24 -39 -34 -21 -34 -65
535063 11 -41 -46 1 -41 -10 -34 -26 -36 12 -11 -12 -22 -40 -3 -47 -21 -19 -62 -47 -34 -21 -39 -32 -5 -32 -20 -47 -3 -70 -68 7 -27 -53
536065 -52 5 -44 -23 8 -13 -26 -21 -34 -19 -25 -34 -52 -70 -31 -24 -25 -29 -37 -54 -53 -57 3 -57 -12 -59 -43 -34 -33 -41 -34 -56 -39 -30 -67 -64 -31 -58 -53
537215 -40 -48 -38 -52 -39 -52 -25 -32 -73 -62 -20 -39 -29 -75 -47 -60 -37 -29 -29 -37 -24 -66 -49 -30 -7 -29 -69 -71 -42 -29 -26 -27 -35 -24 -26 -22
538277 -11 -65 -21 -40 -38 -51 -51 -30 -69 -18 -39 -60 -5 -12 -65 -7 -62 -58 -45 -7 -24 -15 -32 -29 -34 -49 -27 -45 -32 -22 -62 -30 -24 -35 -65
539309 -35 -42 -43 -16 -42 -64 -62 -47 -46 -20 -44 -40 -53 -58 -73 -65 -33 -41 -1 -59 -20 -48 -74 -56 -43 -9 -39 -61 -36 -47 -36 -9 -31 -37 -37 -1
540370 -30 -40 -16 -28 -73 -47 -85 -70 -54 -25 -58 -56 -62 -27 -57 -73 -73 -44 -72 -24 -35 -17 -67 -91 -22 -61 -78 -43 -58 -25 -38 -62 -76
541343 -53 -59 -78 -54 -85 -22 -18 -30 -67 -59 -54 -58 -14 -41 -64 -38 -70 -56 -52 -42 -63 -33 -24 -53 6 -44 -48 -35 -82 -35 -54 -50 -74 -55 -46 -56
542405 -63 -73 -23 -34 -59 -79 -50 -69 -44 -40 -63 -91 -21 -35 -55 -32 -22 -64 -61 -56 -42 -48 -95 -38 -47 -72 -30 -70 -13 -41 -36 -44 -81 -110 -36
543437 -21 -33 -56 -79 -19 -80 -87 -55 -61 -50 -60 -68 -53 -35 -57 -47 -38 -50 -37 -56 -64 -58 -66 -50 -56 -65 -46 -78 -43 -40 -30 -56 -30 -77 -47 -80
544498 -47 -94 -5 -69 -25 -47 -45 -69 -65 -53 -66 -46 -74 -58 -44 -58 -43 -55 -98 -58 -44 -53 -90 -66 -26 -33 -51 -73 -28 -32 -58 -57 -50 -73 -21
545530 -38 -64 -59 -78 -42 -68 -79 -56 -72 -27 -70 -51 -51 -31 -50 -28 -87 -38 -60 -52 -85 -35 -67 -79 -42 -41 -68 -16 -62 -29 -50 -26 -38
546503 -66 -71 -56 -36 -51 -75 -53 -78 -47 -72 -34 -59 -60 -42 -89 -73 -75 -67 -58 -25 -87 -49 -47 -100 -55 -58 -67 -24 -61 -86 -49 -56 -85 -65 -60 -59
547565 -41 -55 -48 -70 -26 -34 -49 -46 -88 -72 -30 -54 -50 -73 -73 -80 -43 -57 -91 -56 -82 -54 -61 -72 -78 -94 -92 -92 -61 -44 -42 -82 -57 -84 -38 -81 -37
548656 -37 -72 -34 -68 -85 -26 -90 -81 -79 -85 -68 -60 -63 -44 -76 -57 -58 -73 -54 -64 -45 -105 -73 -42 -28 -74 -107 -28 -45 -88 -61 -79 -59 -71
549658 -64 -80 -67 -49 -74 -75 -111 -53 -56 -66 -54 -66 -61 -80 -69 -47 -29 -77 -88 -63 -52 -62 -55 -89 -68 -85 -72 -78 -102 -77 -46 -115 -104 -42
550661 -34 -74 -58 -57 -65 -72 -99 -74 -140 -82 -66 -51 -88 -85 -97 -77 -44 -92 -54 -104 -73 -85 -88 -94 -95 -60 -46 -43 -53 -36 -96 -38 -98 -92 -84 -103
551722 -87 -80 -88 -74 -81 -70 -59 -83 -82 -53 -75 -65 -61 -72 -84 -84 -54 -64 -60 -65 -25 -91 -101 -101 -84 -71 -66 -47 -66 -87 -61 -30 -45 -97 -78 -36
552784 -82 -72 -33 -80 -60 -37 -56 -82 -94 -73 -70 -73 -48 -57 -82 -71 -53 -61 -81 -72 -111 -92 -59 -98 -70 -58 -80 -78 -94 -58 -51 -108 -75 -90 -104
553815 -63 -81 -98 -66 -97 -66 -71 -112 -68 -53 -61 -74 -95 -32 -79 -34 -89 -70 -87 -56 -88 -36 -95 -80 -123 -74 -127 -69 -51 -89 -70 -67
554759 -93 -84 -77 -36 -71 -54 -52 -79 -116 -68 -70 -72 -85 -102 -50 -47 -75 -48 -12 -70 -105 -77 -53 -45 -79 -27 -97 -47 -61 -66 -92 -78 -58 -72 -81
555791 -65 -93 -101 -59 -60 -82 -77 -14 -85 -77 -46 -92 -78 -87 -73 -66 -82 -61 -54 -82 -93 -78 -73 -79 -54 -58 -53 -91 -60 -92 -58 -49 -93 -78 -58 -42 -60
556882 -47 -65 -47 -14 -38 -93 -46 -51 -69 -27 -101 -90 -106 -94 -88 -76 -80 -74 -96 -99 -81 -81 -92 -94 -96 -53 -101 -70 -97 -98 -66 -52 -75 -97 -39 -84
557943 -77 -95 -56 -67 -75 -115 -84 -72 -75 -50 -83 -73 -71 -95 -98 -47 -103 -124 -80 -48 -96 -107 -56 -89 -67 -118 -101 -82 -35 -64 -96 -93 -85 -111
558946 -90 -76 -60 -80 -99 -104 -98 -105 -87 -48 -37 -58 -72 -56 -73 -62 -95 -81 -46 -66 -65 -99 -70 -71 -82 -76 -78 -65 -101 -97 -86 -92 -99 -87 -80 -71 -36
560037 -67 -78 -85 -76 -92 -81 -75 -75 -66 -87 -95 -68 -128 -98 -74 -76 -80 -95 -87 -119 -76 -131 -57 -85 -73 -94 -92 -81 -100 -109 -53 -32 -55 -116 -81 -40 -115
561128 -63 -76 -49 -82 -95 -111 -101 -94 -115 -106 -62 -108 -85 -102 -109 -87 -102 -92 -64 -80 -110 -53 -77 -54 -76 -116 -75 -71 -71 -109 -93 -119 -71 -73
562130 -76 -60 -104 -77 -77 -65 -98 -71 -98 -93 -78 -116 -100 -78 -50 -61 -86 -122 -96 -81 -83 -83 -108 -59 -115 -81 -112 -123 -103 -97 -73 -73 -99 -104
563133 -79 -95 -115 -70 -99 -84 -80 -115 -72 -59 -87 -104 -103 -109 -55 -83 -95 -93 -80 -109 -86 -69 -93 -125 -90 -96 -78 -100 -101 -87 -89 -60 -86 -89 -69
564165 -101 -82 -72 -88 -126 -88 -53 -73 -29 -114 -119 -65 -104 -92 -101 -77 -115 -112 -91 -114 -76 -89 -93 -73 -86 -64 -93 -75 -78 -93 -66 -90 -93
565138 -124 -112 -104 -70 -89 -78 -121 -103 -104 -72 -101 -95 -81 -100 -57 -80 -44 -100 -99 -120 -79 -79 -60 -90 -82 -114 -137 -89 -72 -46 -118 -91 -97 -72
566140 -102 -96 -31 -130 -123 -113 -97 -111 -94 -133 -108 -127 -101 -91 -76 -76 -112 -60 -115 -94 -79 -105 -82 -114 -108 -57 -111 -113 -80 -129 -120 -89 -98 -79
567143 -62 -111 -67 -93 -94 -105 -81 -125 -98 -92 -131 -76 -59 -91 -107 -120 -116 -77 -56 -56 -105 -73 -99 -84 -77 -43 -76 -87 -97 -108 -52 -130 -91 -35
568145 -86 -76 -68 -77 -101 -65 -70 -119 -64 -132 -137 -111 -111 -70 -101 -102 -70 -99 -113 -113 -63 -84 -102 -104 -54 -85 -92 -107 -122 -125 -77 -74 -108 -74 -86 -97 -109
569236 -130 -119 -141 -90 -94 -109 -74 -81 -67 -63 -95 -45 -151 -78 -131 -108 -91 -87 -84 -65 -119 -69 -94 -93 -96 -117 -83 -112 -95 -105 -141 -121 -120 -73
570239 -129 -61 -65 -83 -86 -103 -90 -111 -93 -111 -112 -125 -91 -123 -69 -100 -98 -89 -78 -98 -89 -56 -130 -82 -98 -114 -113 -79 -80 -83 -79 -127 -113 -131 -70 -119
571300 -73 -96 -103 -135 -103 -101 -100 -93 -122 -121 -104 -98 -101 -101 -60 -91 -99 -82 -75 -131 -101 -132 -51 -105 -92 -150 -98 -92 -85 -87 -144 -115 -64 -116 -92 -113 -66 -73
572421 -101 -60 -109 -126 -132 -104 -95 -72 -91 -84 -99 -103 -125 -106 -71 -71 -81 -147 -59 -119 -129 -94 -66 -115 -107 -101 -120 -85 -97 -143 -113 -72 -68 -46 -68
573453 -94 -152 -112 -157 -82 -38 -122 -124 -103 -101 -130 -102 -92 -107 -75 -106 -119 -36 -70 -93 -76 -110 -70 -97 -83 -78 -78 -85 -93 -115 -95 -93 -106 -151 -85
574485 -123 -152 -91 -133 -103 -61 -120 -125 -73 -71 -114 -56 -64 -60 -127 -125 -83 -84 -73 -76 -83 -51 -104 -86 -110 -73 -68 -155 -76 -63 -100 -75 -75 -68 -126 -121
575546 -89 -67 -139 -134 -109 -87 -121 -106 -125 -124 -78 -115 -113 -96 -77 -103 -61 -50 -132 -89 -60 -65 -128 -86 -37 -121 -95 -72 -97 -81 -96 -83 -61
576519 -141 -74 -71 -89 -117 -100 -121 -14 -60 -71 -191 -20 -11 -54 -17 -128 -52 9 23 -171 -72 -79 -50 41 -174 -165 -77 -27 19 -160
577404 182 61 -418 -312 -356 -189 -136 -278 -184 -151 -141 -72 -40 -224 -60 -99 -98 -146 -178 -106 -133 -157 -88 -108 -214 -78 -98
578200 -114 -104 -149 -73 -111 -157 -163 -116 -62 -147 -50 -86 -97 -83 -102 -143 -93 -150 -81 -159 -140 -84 -113 -95 -151 -134 -117 -128 -195 -86 -103
579114 -129 -110 -74 -99 -113 -112 -63 -109 -152 -72 -114 -56 -120 -102 -75 -79 -107 -86 -120 -74 -105 -157 -134 -95 -99 -165 -101 -105 -85 -127 -168 -80 -132
580087 -79 -131 -64 -153 -104 -109 -112 -81 -53 -86 -100 -109 -127 -83 -126 -85 -113 -66 -121 -107 -102 -84 -155 -105 -108 -133 -120 -98 -121 -124 -114 -80 -195 -109
581089 -76 -101 -60 -105 -89 -126 -132 -178 -99 -92 -147 -131 -172 -112 -116 -95 -79 -113 -121 -76 -119 -120 -123 -110 -106 -120 -116 -126 -125 -128 -103 -134 -110 -113 -112 -136 -78
582180 -67 -97 -147 -110 -99 -66 -112 -140 -68 -111 -158 -132 -142 -109 -73 -138 -124 -120 -93 -84 -118 -109 -115 -158 -145 -101 -114 -132 -111 -97 -132 -86 -109
583153 -119 -95 -115 -77 -100 -120 -124 -83 -98 -134 -120 -118 -88 -171 -138 -135 -106 -116 -91 -102 -113 -96 -67 -110 -137 -127 -139 -106 -112 -89 -120 -110 -85
584126 -93 -116 -84 -112 -127 -115 -132 -96 -140 -129 -129 -155 -89 -112 -91 -104 -116 -70 -137 -136 -115 -80 -153 -124 -123 -132 -116 -134 -150 -113 -106 -96 -131 -118
585129 -63 -87 -148 -101 -143 -125 -80 -136 -92 -104 -99 -88 -143 -117 -125 -106 -128 -122 -101 -114 -107 -116 -121 -130 -96 -95 -141 -111 -114 -105 -116 -131 -80 -102 -155 -84
586190 -137 -121 -87 -105 -119 -141 -122 -124 -111 -84 -133 -112 -125 -111 -146 -85 -111 -118 -104 -119 -127 -123 -150 -130 -122 -131 -88 -111 -117 -118 -165 -99 -97 -92 -111 -117
587252 -146 -133 -96 -112 -103 -142 -151 -164 -100 -140 -133 -71 -139 -140 -107 -120 -126 -124 -82 -109 -102 -96 -96 -149 -116 -97 -93 -123 -115 -135 -118 -123 -102 -125 -89 -113 -140
588343 -135 -81 -94 -119 -143 -154 -139 -128 -129 -132 -128 -99 -147 -130 -113 -67 -125 -120 -167 -122 -117 -76 -127 -107 -108 -113 -107 -119 -129 -100 -109 -105 -128 -126 -118 -136 -111
589434 -130 -138 -106 -144 -101 -99 -117 -115 -102 -111 -133 -120 -111 -120 -129 -124 -52 -125 -130 -115 -123 -127 -109 -105 -93 -127 -124 -128 -124 -104 -91 -112 -95 -140 -104 -122 -151 -126
590554 -108 -128 -120 -124 -121 -119 -106 -127 -160 -135 -110 -149 -169 -100 -112 -128 -122 -133 -124 -123 -112 -128 -119 -111 -149 -101 -111 -140 -134 -158 -109 -105 -154 -108 -132 -95
591616 -111 -85 -152 -145 -126 -128 -175 -93 -92 -105 -130 -105 -124 -123 -133 -143 -129 -123 -119 -99 -101 -100 -106 -137 -100 -128 -87 -128 -119 -114 -99 -120 -136 -115 -117 -117 -104
592707 -113 -100 -103 -94 -111 -133 -120 -85 -133 -160 -119 -84 -115 -126 -101 -107 -94 -129 -138 -136 -103 -119 -109 -98 -115 -96 -108 -105 -151 -117 -90 -100 -150 -126
593709 -121 -128 -103 -137 -93 -101 -114 -97 -139 -134 -127 -113 -107 -115 -156 -153 -125 -152 -97 -129 -105 -112 -132 -132 -108 -107 -107 -136 -122 -165 -120 -114 -150 -151 -125 -137 -138
594800 -136 -124 -111 -115 -130 -156 -116 -129 -143 -86 -107 -118 -146 -137 -153 -91 -131 -109 -80 -134 -116 -118 -145 -94 -93 -110 -127 -98 -121 -110 -141 -87 -128
595773 -132 -168 -89 -111 -133 -135 -113 -105 -111 -109 -117 -176 -146 -90 -137 -103 -127 -119 -155 -130 -155 -123 -136 -116 -119 -112 -136 -122 -141 -149 -110 -104 -115 -128 -151 -178
596835 -90 -147 -132 -129 -95 -115 -117 -115 -140 -112 -80 -96 -133 -125 -130 -125 -165 -167 -94 -126 -141 -148 -116 -150 -134 -89 -133 -91 -102 -137 -103 -96 -99 -130 -125 -93 -117
597925 -146 -133 -105 -101 -136 -153 -124 -114 -170 -99 -91 -129 -159 -110 -108 -137 -136 -110 -128 -123 -107 -149 -142 -132 -118 -123 -142 -141 -155 -139 -120 -148 -106 -118 -124
598958 -111 -175 -156 -117 -152 -128 -129 -92 -133 -127 -145 -149 -159 -133 -114 -128 -126 -93 -133 -139 -81 -108 -110 -155 -130 -108 -122 -142 -110 -91 -158 -138 -130 -121
599960 -82 -100 -126 -110 -116 -146 -114 -105 -154 -110 -120 -136 -116 -118 -109 -123 -142 -107 -123 -129 -136 -150 -138 -121 -140 -129 -105 -117 -136 -169 -121 -136 -177 -121
600963 -132 -104 -133 -155 -100 -104 -151 -133 -120 -133 -146 -127 -135 -136 -132 -123 -125 -160 -130 -130 -80 -106 -140 -130 -111 -115 -136 -122 -110 -129 -146 -124 -107 -97 -162
601994 -110 -123 -154 -130 -161 -131 -88 -126 -124 -107 -94 -108 -105 -148 -132 -119 -129 -121 -115 -119 -147 -137 -137 -132 -133 -119 -139 -118 -166 -166 -96 -173 -118 -119 -139 -111
603056 -144 -121 -124 -147 -175 -157 -128 -135 -102 -128 -152 -114 -104 -128 -136 -124 -148 -128 -121 -100 -145 -159 -151 -115 -118 -160 -126 -134 -107 -120 -145 -151 -139 -78 -81
604088 -180 -160 -142 -127 -150 -124 -119 -114 -97 -151 -127 -109 -149 -129 -145 -121 -151 -97 -115 -143 -167 -125 -122 -103 -177 -148 -161 -97 -121 -144 -128 -103
605031 -117 -128 -96 -153 -137 -90 -137 -115 -148 -117 -141 -117 -161 -122 -94 -97 -137 -142 -119 -91 -99 -135 -111 -110 -146 -127 -125 -137 -122 -111 -143 -135 -121 -157
606034 -162 -129 -128 -96 -120 -146 -131 -99 -118 -108 -152 -146 -175 -159 -121 -137 -155 -130 -99 -147 -110 -160 -130 -136 -158 -179 -134 -164 -153 -126 -123 -157 -134
607007 -100 -150 -98 -143 -142 -132 -146 -122 -136 -119 -139 -125 -142 -162 -153 -145 -143 -106 -132 -143 -120 -108 -160 -123 -150 -163 -170 -123 -119 -128 -102 -152 -140 -126
608009 -155 -98 -148 -136 -172 -114 -95 -138 -122 -131 -123 -129 -160 -112 -124 -163 -116 -137 -142 -110 -137 -140 -118 -109 -107 -105 -128 -142 -159 -130 -135 -106 -107 -136 -106 -185
609071 -124 -116 -150 -121 -127 -147 -157 -124 -128 -137 -131 -177 -110 -141 -124 -108 -155 -106 -131 -108 -120 -137 -124 -134 -147 -174 -151 -107 -147 -128 -117 -137 -134
610044 -134 -131 -163 -119 -94 -105 -114 -112 -149 -124 -131 -129 -146 -88 -144 -119 -123 -174 -121 -155 -119 -163 -149 -152 -105 -128 -134 -115 -131 -165 -126 -114 -135 -132 -122
611076 -140 -127 -157 -122 -141 -162 -129 -114 -119 -119 -163 -138 -119 -129 -147 -139 -137 -112 -148 -156 -148 -150 -161 -81 -123 -136 -156 -135 -139 -160 -168 -178 -136 -128 -130 -149
612137 -132 -124 -129 -146 -143 -154 -160 -158 -159 -147 -126 -160 -119 -133 -149 -140 -153 -108 -144 -97 -148 -141 -158 -165 -110 -174 -122 -124 -130 -155 -144 -133 -129 -141 -151 -104 -144
613228 -116 -126 -133 -129 -122 -160 -195 -154 -167 -139 -152 -141 -115 -162 -164 -120 -133 -151 -170 -102 -154 -168 -132 -131 -145 -128 -146 -118 -113 -121 -137 -126 -140 -119
614231 -151 -161 -144 -117 -110 -147 -161 -129 -124 -127 -128 -159 -138 -143 -173 -154 -152 -120 -129 -180 -136 -143 -110 -139 -142 -153 -152 -144 -134 -133 -114 -155 -187 -168 -115 -124 -130
615322 -137 -155 -160 -187 -106 -116 -156 -155 -127 -188 -164 -158 -133 -129 -134 -110 -153 -146 -148 -150 -172 -121 -143 -157 -139 -144 -155 -136 -138 -148 -153 -167 -117 -135 -116 -146
616383 -168 -132 -100 -157 -147 -160 -152 -136 -179 -164 -165 -150 -177 -159 -142 -134 -142 -113 -144 -135 -150 -117 -145 -142 -165 -144 -93 -179 -129 -136 -155 -185 -164 -153
617386 -119 -146 -139 -136 -154 -145 -154 -128 -147 -137 -165 -102 -162 -110 -138 -160 -127 -136 -165 -143 -145 -163 -171 -143 -144 -161 -169 -148 -165 -154 -152 -141 -142 -169 -143 -133
618447 -137 -133 -171 -133 -168 -127 -113 -142 -137 -162 -153 -176 -134 -126 -138 -135 -128 -158 -120 -123 -178 -136 -153 -170 -145 -137 -133 -128 -150 -159 -136 -134 -162 -120 -152 -142 -147
619538 -100 -147 -157 -139 -132 -155 -143 -158 -125 -190 -172 -129 -153 -135 -141 -138 -173 -162 -187 -157 -133 -139 -170 -180 -141 -161 -166 -185 -150 -171 -124 -148 -159
620511 -144 -149 -141 -139 -132 -167 -139 -155 -171 -139 -140 -120 -157 -128 -137 -157 -120 -167 -129 -145 -137 -153 -198 -123 -141 -176 -161 -146 -152 -152 -156 -126 -155 -188 -142 -132
621573 -147 -139 -136 -155 -144 -179 -131 -151 -125 -162 -192 -140 -139 -148 -210 -161 -168 -143 -138 -129 -191 -120 -168 -102 -144 -179 -157 -185 -162 -147 -147 -156 -142 -143 -152 -126
622634 -174 -208 -139 -147 -164 -159 -138 -162 -179 -141 -119 -142 -138 -163 -148 -154 -163 -187 -172 -139 -135 -181 -163 -131 -167 -148 -182 -145 -148 -169 -136 -179 -148 -120
623637 -142 -171 -139 -158 -151 -180 -184 -183 -146 -158 -170 -147 -142 -179 -147 -155 -155 -164 -118 -133 -133 -183 -144 -148 -99 -149 -161 -179 -170 -179 -157 -157 -165 -140 -161 -147 -146
624728 -146 -147 -134 -146 -189 -140 -154 -139 -147 -143 -159 -115 -152 -151 -143 -148 -139 -139 -125 -165 -159 -164 -184 -169 -188 -144 -178 -158 -165 -157 -144 -173 -129 -146 -154 -179 -172
625819 -176 -165 -161 -137 -131 -166 -158 -191 -132 -156 -136 -140 -137 -170 -150 -132 -139 -165 -155 -150 -151 -188 -131 -153 -126 -136 -187 -182 -164 -148 -164 -161 -160 -148 -162 -143
626880 -123 -161 -160 -198 -153 -147 -160 -165 -167 -155 -159 -150 -174 -165 -134 -169 -145 -162 -193 -135 -161 -127 -157 -176 -153 -182 -165 -156 -135 -138 -194 -121 -144 -156 -137
627912 -178 -112 -180 -177 -154 -153 -160 -170 -166 -146 -156 -152 -172 -155 -150 -142 -163 -173 -152 -154 -145 -169 -146 -138 -123 -147 -169 -143 -163 -161 -177 -147 -142 -173 -157 -194 -128
629003 -186 -159 -185 -152 -163 -194 -165 -156 -174 -126 -119 -134 -128 -164 -111 -144 -139 -201 -136 -121 -143 -138 -127 -147 -150 -157 -117 -160 -136 -108 -123 -162 -118 -136
630006 -156 -128 -176 -152 -189 -144 -172 -192 -154 -137 -148 -149 -142 -178 -142 -139 -174 -125 -155 -136 -187 -169 -163 -169 -169 -142 -121 -150 -166 -182 -173 -171 -164 -137 -143
631038 -153 -144 -155 -151 -140 -129 -141 -141 -191 -176 -153 -154 -183 -162 -165 -168 -173 -131 -135 -157 -112 -142 -172 -149 -158 -168 -164 -163 -165 -173 -155 -152 -181 -159 -169 -162 -172 -142
632158 -162 -158 -151 -202 -152 -168 -153 -180 -165 -143 -148 -155 -136 -145 -174 -131 -157 -139 -122 -147 -154 -163 -141 -161 -141 -121 -142 -159 -159 -189 -155 -199 -156 -190 -208
633190 -149 -142 -181 -170 -126 -180 -154 -164 -164 -157 -165 -202 -187 -198 -156 -162 -140 -195 -152 -191 -153 -152 -177 -140 -176 -159 -149 -170 -157 -155 -145 -154 -157 -153 -149 -160
634251 -175 -161 -144 -151 -193 -135 -166 -176 -183 -152 -184 -150 -152 -160 -155 -167 -158 -131 -172 -134 -156 -174 -168 -164 -171 -158 -203 -170 -147 -183 -170 -167 -189 -183 -154 -164
635313 -169 -211 -159 -192 -185 -145 -199 -180 -180 -160 -135 -164 -190 -141 -169 -172 -171 -178 -143 -171 -199 -178 -164 -189 -171 -175 -180 -182 -155 -196 -192 -166 -174 -179 -156 -165
636374 -186 -175 -188 -171 -181 -165 -169 -185 -189 -164 -188 -153 -180 -139 -152 -185 -191 -168 -179 -167 -162 -158 -168 -158 -163 -167 -153 -170 -185 -181 -186 -185 -139 -159 -167 -176
637436 -144 -225 -172 -140 -179 -171 -198 -166 -156 -173 -182 -159 -189 -181 -189 -167 -207 -183 -168 -182 -149 -162 -189 -138 -209 -172 -182 -165 -203 -185 -140 -153 -193
638409 -182 -169 -166 -176 -165 -168 -150 -194 -142 -186 -149 -144 -183 -192 -156 -165 -181 -161 -192 -134 -178 -147 -180 -182 -162 -151 -197 -156 -184 -181 -173 -162 -210 -218 -178
639441 -194 -167 -170 -155 -174 -133 -181 -157 -185 -150 -170 -168 -167 -190 -208 -172 -173 -174 -200 -153 -145 -156 -147 -150 -156 -158 -198 -180 -131 -177 -179 -166 -186 -160 -188 -188
640502 -196 -186 -173 -173 -163 -132 -172 -135 -131 -157 -115 -144 -168 -175 -173 -122 -162 -186 -179 -173 -146 -175 -132 -144 -182 -181 -162 -166 -148 -156 -166 -165 -155 -157 -134 -168
641564 -167 -192 -172 -167 -147 -160 -156 -163 -151 -159 -165 -146 -102 -137 -104 -105 -99 -108 -137 -152 -140 -140 -156 -118 -163 -118 -148 -130 -100 -154 -146 -109 -104 -112 -94 -99 -118
642655 -96 -115 -78 -75 -69 -50 -28 -62 -60 -40 -53 -22 -8 75 80 54 116 127 182 220 265 346 384 469 563 680 741 856 1065 1314 1418
643569 1441 1250 1084 1073 1109 1252 1334 1306 1050 778 592 485 407 363 290 242 281 247 279 256 214 207 245 252 240 257 237 268
644394 319 321 351 383 438 538 605 645 724 815 979 1096 1221 1384 1589 1876 2157 2448 2472 2470 2547 2705 2790 2796 2699 2568 2265
645190 2152 2144 1955 1648 1278 1079 880 727 648 568 523 476 465 422 386 387 366 335 322 338 302 366 345 310 338 363 328 403
646016 424 467 486 587 627 696 742 840 933 1045 1253 1474 1635 1651 1443 1299 1222 1296 1464 1568 1528 1250 937 723 531
646753 449 409 342 338 320 280 307 275 237 271 257 245 221 275 280 273 306 305 349 415 451 490 559 660 702 827 918 1048 1148 1303 1483
647667 1667 1982 2290 2571 2720 2735 2713 2564 2408 2362 2400 2385 2170 2024 1742 1385 1073 872 734 621 546 507 478
648345 446 431 399 372 354 365 378 360 328 285 275 298 274 304 334 320 395 403 435 461 477 593 665 770 812 950 1076 1189 1372
649200 1530 1753 2061 2415 2707 2866 2908 2857 2742 2522 2445 2508 2447 2281 2039 1815 1436 1094 884 733 615 556 477
649879 435 401 325 349 232 251 249 225 197 143 161 118 139 103 107 74 76 49 4 21 7 -23 2 -18 -12 -17 -60 -48 -39 -77 -89 -98 -68 -90
650881 -88 -107 -118 -133 -110 -143 -114 -145 -141 -104 -125 -138 -120 -135 -124 -129 -157 -148 -128 -115 -123 -91 -150 -132 -109 -113 -113 -119 -97 -77 -104 -106 -113 -77 -53 -79
651943 -31 -14 -35 0 35 24 49 117 150 177 253 288 314 415 400 402 405 374 347 352 346 352 367 292 237 127 103 23 22 14 -54 -33 -21 -60
652945 -53 -26 -67 -66 -67 -60 -30 -60 -85 -48 -65 -69 -67 -62 -85 -39 -42 -8 -20 7 -4 41 91 74 107 138 191 246 332 349 451 481 487 443 428
653977 397 369 390 389 371 321 252 186 104 77 47 -1 17 -22 -61 -50 -78 -78 -95 -90 -153 -90 -93 -126 -165 -170 -152 -137 -157 -128 -155 -144 -176
654950 -178 -139 -165 -148 -161 -178 -182 -172 -194 -183 -147 -144 -176 -144 -176 -167 -175 -156 -128 -122 -163 -138 -132 -145 -93 -142 -167 -111 -114 -127 -122 -102 -141 -142 -185
655982 -182 -194 -201 -192 -222 -195 -203 -211 -182 -188 -182 -205 -208 -203 -202 -225 -227 -192 -260 -246 -202 -212 -206 -196 -261 -208 -254 -192 -196 -199 -187 -190 -208 -198 -182 -244 -215 -188
657103 -203 -200 -175 -164 -152 -203 -187 -167 -195 -164 -172 -209 -170 -189 -212 -182 -223 -196 -213 -226 -216 -227 -199 -232 -225 -254 -179 -228 -210 -234 -212 -233
658046 -184 -221 -222 -222 -211 -218 -251 -214 -215 -242 -238 -215 -229 -186 -230 -214 -205 -218 -235 -202 -244 -191 -228 -239 -195 -200 -232 -238 -253 -236 -236 -252 -270 -215 -260
659078 -243 -194 -189 -209 -241 -228 -236 -254 -235 -229 -218 -214 -263 -275 -225 -225 -221 -256 -205 -214 -230 -228 -229 -192 -254 -215 -231 -209 -200 -190 -160 -220 -220 -181 -221 -201
660139 -178 -178 -204 -229 -226 -201 -210 -245 -250 -203 -224 -213 -236 -197 -222 -215 -219 -206 -225 -208 -197 -228 -231 -217 -222 -195 -255 -175 -232 -257 -221 -215 -221 -224 -231 -198 -189
661230 -172 -220 -197 -229 -206 -204 -203 -212 -193 -212 -195 -205 -207 -180 -191 -189 -195 -205 -211 -185 -199 -178 -198 -158 -212 -174 -183 -181 -125 -165 -137 -168 -199 -169 -132
662262 -170 -158 -164 -145 -154 -169 -129 -174 -125 -121 -133 -136 -107 -146 -154 -117 -90 -89 -88 -92 -83 -86 -70 -77 -78 -54 -62 -53 -61 -34 -39 -10 4 -24 -3 48 8 51 49
663412 49 91 74 105 97 98 87 65 124 143 126 98 132 187 169 189 226 174 229 228 211 227 242 253 291 286 283 278 309 329 313 318 336 328 372
664444 380 402 440 429 382 433 439 466 466 545 492 544 567 590 616 650 682 660 702 742 738 789 786 791 806 826 821 818 865 880 887 916 919 946 935
665476 956 1019 1062 1085 1114 1098 1108 1197 1248 1263 1297 1370 1377 1408 1442 1490 1532 1570 1651 1689 1724 1785 1844 1915 1978 2036 2156 2201 2250 2355 2453
666390 2528 2676 2727 2859 2960 3027 3190 3295 3437 3561 3737 3856 4061 4242 4430 4632 4886 5128 5395 5719 6022 6390
667039 6778 7185 7575 8035 8575 9217 10106 11340 12786 14384 16390 18494 20772 23414 26494 29849 33468 37696
667570 42334 47311 53093 59456 67132 76800 89502 101487 110763 112859 110935 105537 96991 95477 98705 102270
668042 102214 94915 86012 71668 56925 47100 40182 35376 31920 29691 27684 26223 24933 23932 23074
668484 22564 22005 21588 21119 20723 20318 20071 19942 20203 20729 21759 22780 24296 25893 27774 29872 32509 35515
669015 38899 42696 47227 51859 57551 63638 71052 80045 92589 105584 116737 121564 120044 116114 106673
669457 101534 103580 106837 108545 102768 93719 80653 64070 51943 43351 37339 32946 29914 27357 25360
669899 23533 22048 20741 19668 18642 17739 16745 15851 14872 13994 13205 12528 11890 11309 10760 10171 9617 9038 8449
670459 7966 7498 7062 6633 6249 5912 5572 5240 4952 4624 4413 4142 3896 3720 3484 3338 3201 3047 2833 2750 2591
671079 2491 2357 2295 2162 2076 1982 1966 1887 1797 1680 1617 1538 1443 1390 1386 1321 1233 1166 1049 986 918 879 835 803 810 706 735 706 644
671934 626 595 595 551 524 511 492 463 484 456 406 427 408 443 475 459 485 513 519 511 601 611 660 674 794 852 826 880 815 780 734 755
672877 747 757 729 661 627 499 434 385 357 335 311 297 266 255 289 279 217 238 247 209 222 186 187 191 185 183 187 209 223 226 193 213 217 216
673880 233 247 244 254 279 310 347 411 425 456 439 398 391 394 345 356 343 383 291 282 252 169 150 154 134 142 105 108 86 63 103 69 85 107
674882 71 51 54 65 51 54 53 58 25 61 39 19 33 43 38 28 28 20 5 18 31 -5 -9 45 52 48 47 2 60 29 31 81 35 63 52 75 98
675973 74 66 105 88 82 47 87 100 47 81 44 40 12 20 15 -6 -7 -14 -16 31 -33 20 -22 -17 -54 -16 -20 3 19 -59 14 -17 -39 -16 -19 -45 -34
677064 -32 -37 -36 -6 -56 -9 -8 -40 23 -7 -21 47 28 6 28 58 80 32 29 31 57 28 60 32 6 -14 -7 -34 -49 -45 -12 -73 -55 -55 -63
678096 -81 -74 -74 -47 -64 -83 -60 -77 -78 -85 -90 -69 -70 -73 -59 -69 -78 -93 -105 -134 -83 -77 -65 -97 -83 -87 -127 -102 -125 -92 -107 -89 -84 -85 -98 -125 -105
679187 -91 -63 -81 -120 -106 -80 -81 -88 -94 -120 -70 -94 -86 -124 -123 -104 -107 -95 -131 -105 -162 -110 -94 -99 -79 -106 -101 -103 -126 -94 -105 -67 -107 -76 -105 -141
680248 -90 -64 -98 -105 -116 -109 -67 -127 -112 -113 -90 -87 -91 -71 -72 -98 -69 -91 -118 -69 -74 -92 -83 -88 -87 -97 -94 -52 -49 -74 -108 -73 -34 -41 -84 -54 -88 -77
681369 -68 -91 -58 -40 -62 -66 -40 -40 -61 -19 -15 -7 -6 -24 6 -12 7 1 -40 14 0 -16 5 21 7 40 30 23 34 69 41 120 120 91 111
682401 133 122 142 145 179 190 221 239 289 271 324 346 371 394 466 506 615 662 711 760 779 775 748 739 750 767 800 799 705 678 610 575
683344 556 512 512 492 486 520 511 477 535 523 544 549 526 559 555 609 585 592 588 585 627 651 706 724 727 759 762 821 835 895 932 984 1029 1072 1137 1242
684406 1311 1406 1428 1467 1470 1465 1480 1481 1519 1581 1597 1560 1493 1478 1395 1397 1359 1403 1410 1376 1430 1447 1475 1497 1562 1566 1590 1680 1699 1716 1809 1819 1916
685379 1970 2001 2130 2154 2243 2260 2358 2389 2528 2613 2745 2820 2920 3028 3184 3340 3504 3680 3928 4131 4413 4635 4801 5017
686087 5265 5569 6125 6848 7729 8553 9474 10519 11783 13252 14991 16956 18934 20970 23457 26082 29242 32555
686617 36718 41815 49634 58038 63189 61184 53323 48259 46035 46999 51695 55856 55696 47509 37358 30851
687089 25838 22582 20315 18972 17805 17146 16439 16182 15916 15951 15911 16066 16067 16215 16308 16631 17248 18307 19453 21065
687679 22880 24893 27127 29918 33058 36632 40402 44988 49545 55038 61013 68123 76602 88246 102146 114281
688151 121577 120142 116136 107872 100367 100645 103622 106618 103964 95683 84789 68668 55587 46515 40072
688593 35357 32107 29555 27600 26009 24723 23714 22962 22291 21666 21056 20398 19856 19385 19236 19375 19782 20163 20765
689153 21378 22284 23329 24799 26522 28300 30208 32628 35284 38545 42177 46858 52895 62204 71006 75342
689625 70655 61315 55835 53450 55064 60085 63687 61393 50644 39687 32259 26614 22682 19921 17996 16399
690097 15134 13977 13118 12347 11695 11146 10697 10200 9748 9224 8719 8179 7744 7348 7053 6793 6508 6113 5730 5347
690686 4997 4695 4431 4161 3942 3700 3474 3253 3110 2935 2778 2619 2489 2329 2219 2140 1995 1884 1842 1716 1635 1554
691335 1450 1433 1350 1267 1202 1153 1117 1077 1038 965 956 900 836 824 795 779 711 683 699 630 651 590 595 558 511 544 571 515 507 487 446 481
692278 423 440 407 419 385 346 372 316 338 328 311 312 388 324 352 333 331 326 305 298 298 299 287 264 284 271 266 278 229 237 273 223 223 237 237
693310 231 240 227 210 237 206 188 218 207 218 195 204 226 226 197 235 241 249 238 229 228 225 259 214 241 272 276 277 245 223 239 252 229 260 218 236
694372 258 262 278 260 269 283 268 344 339 369 401 419 494 532 547 546 469 471 464 400 442 428 467 449 478 547 554 505 432 417 380 327 337 343
695374 305 303 274 255 278 274 263 304 285 308 240 254 263 328 297 286 345 327 337 375 382 396 447 467 478 560 643 678 681 756 722 747 768
696347 720 712 753 772 806 870 871 977 965 1034 1061 1048 1056 1096 1103 1163 1301 1523 1732 1829 1681 1417 1266 1186 1111 1115 1161 1214 1386 1592
697232 1697 1586 1249 1082 900 800 706 665 674 641 645 649 605 662 696 712 695 728 726 722 716 736 752 826 864 935 1089 1142 1167 1247
698117 1318 1436 1633 1864 2105 2212 2142 1933 1897 1949 2118 2292 2504 2460 2376 2384 2343 2185 1862 1693 1604 1659 1758 1801 1682
698854 1367 1094 981 814 730 655 597 587 522 468 481 455 499 456 465 444 429 474 468 493 491 539 557 562 572 626 689 702 818 900
699738 1009 1196 1416 1506 1380 1161 1006 920 844 843 881 961 1076 1250 1316 1215 915 733 553 459 417 377 304 256 211
700475 271 226 188 194 201 183 138 126 114 132 125 115 87 94 95 83 83 93 67 80 86 85 55 74 31 50 39 26 23 37 51 46 51 43 62 89 59
701566 77 72 109 128 121 141 184 244 260 223 182 189 201 174 233 217 228 170 128 110 68 87 45 80 15 23 29 31 44 24 17 33 16 53 28
702598 24 27 32 74 47 87 81 46 94 115 148 142 155 189 260 255 293 368 406 485 561 560 573 498 473 471 464 511 490 459 450 361 286 254 184 147
703660 88 104 100 90 94 68 76 46 29 79 57 62 37 69 50 2 84 41 73 77 87 83 131 92 125 180 130 213 201 239 258 325 367 368
704662 380 333 301 312 261 320 348 349 317 275 205 173 122 135 87 80 91 56 74 60 75 76 75 77 58 57 22 86 61 77 60 88 93 86
705665 99 97 98 86 104 126 135 133 120 155 111 131 125 143 145 161 178 193 174 188 205 236 201 199 214 230 221 234 254 258 246 269 239 324 277 310
706726 317 283 316 318 335 376 350 331 365 399 388 406 455 440 456 470 506 499 549 562 589 597 600 639 649 631 668 641 661 690 721 736 703
707699 763 781 775 812 861 829 843 870 835 895 927 944 996 986 1014 1000 1076 1087 1087 1149 1159 1210 1246 1308 1299 1356 1390 1453 1510 1529 1540 1632
708643 1698 1734 1746 1887 1948 2019 2096 2168 2247 2344 2366 2488 2596 2700 2812 2970 3147 3283 3467 3609 3731 3840 3965 4148
709350 4341 4550 4708 4914 5200 5545 5959 6503 7213 8174 9155 10264 11547 12904 14350 16066 17719 19475 21547
709911 24193 27115 30436 34079 38658 44788 54255 63503 68143 63510 53469 47277 43381 41808 41596 43356
710382 46797 54078 61257 64147 57733 45513 36772 30500 26155 23124 21300 19927 19009 18185 17618 17281 17118
710884 17064 17110 17244 17628 18170 18922 19983 21329 23013 24885 26895 29283 31746 34511 37918 41703 45859 50481
711414 56352 63761 74358 85789 94229 96153 94313 96856 98758 95788 86514 80573 78776 82013 87324 91120
711886 89399 84367 83185 81564 74807 61114 49711 41800 35935 31616 28642 26516 24902 23524 22451 21482
712358 20732 19992 19391 18981 18740 18673 18740 18885 19274 19793 20400 21125 21996 22830 23884 25344 27172 29246 31600 34412
712948 38191 44208 52271 58108 58385 50589 43177 38826 36238 35200 35445 37162 41074 47228 51322 50200 41276
713449 32154 25971 21356 18052 15786 14203 12950 11962 11160 10460 9881 9386 8965 8529 8096 7644 7212 6848 6546
714009 6261 6010 5724 5400 5118 4941 4691 4427 4148 3955 3808 3606 3471 3203 3005 2825 2655 2524 2396 2255 2124
714628 1988 1952 1848 1758 1632 1560 1502 1445 1377 1298 1251 1230 1153 1135 1090 984 991 925 919 872 844 830 825 759 740 706 692 691 634 664 598
715542 636 586 537 597 508 503 495 495 470 463 479 431 473 398 425 375 396 385 377 339 362 343 363 400 322 334 339 359 332 312 327 319 311 367 335
716574 333 271 323 325 322 327 283 330 321 325 299 346 306 304 289 302 291 302 294 284 326 316 299 276 335 287 239 245 284 273 240 229 253 266 217
717606 229 220 234 248 219 224 231 231 199 211 222 215 216 210 185 211 180 225 212 187 207 224 224 231 209 186 245 245 225 225 237 201 227 267 232 280
718668 225 249 229 258 188 194 214 147 214 238 215 202 217 222 207 179 159 128 136 142 148 143 141 165 131 120 111 158 145 188 131 110 151 172 118
719700 167 164 160 162 116 147 150 156 178 180 172 146 209 199 188 186 171 204 182 180 143 156 166 150 159 197 158 157 138 143 141 124 130 119 134 104 123 121
720820 115 139 124 108 120 83 75 108 112 92 120 102 85 84 97 130 96 107 91 70 107 94 67 86 126 85 160 130 139 103 71 96 105
721793 124 100 106 113 92 38 93 81 67 113 115 112 50 112 101 65 64 58 52 59 49 64 38 66 61 31 98 48 64 56 64 70 50 72 81 73 63 24
722914 71 71 46 107 85 42 46 49 24 21 75 89 39 72 57 48 72 74 25 66 39 87 36 49 29 51 68 45 39 -11 21 30 78 31 83
723946 56 24 23 39 33 45 28 63 47 78 57 56 52 50 49 28 36 42 48 77 44 41 33 44 67 57 89 99 95 114 129 131 137 120 161 200 205 219 248
725096 289 358 334 305 313 241 197 243 253 252 256 322 350 314 272 222 194 145 131 94 147 107 93 82 85 100 110 70 97 80 88 82 136 122
726098 122 130 132 128 171 166 171 250 243 245 333 304 397 435 488 510 508 501 496 545 494 475 450 485 486 501 484 454 442 427 385 344 328 237 218 151
727160 182 158 160 114 129 88 123 118 82 41 117 117 105 106 138 89 60 114 98 113 90 131 126 169 128 193 186 214 265 305 293 270 236 213
728162 234 175 200 168 205 247 259 230 259 208 152 93 82 96 109 47 55 53 69 51 49 62 25 32 16 11 -3 62 14 22 -8 -11 18 2
729165 2 -17 -3 -10 14 -11 -6 -17 -13 -4 -10 -10 2 -1 4 12 9 -17 -18 -2 -40 6 -15 -19 -18 -31 -16 -19 -16 -47 -34 -12 -41 -42 -60 -31 1 -41 -58 -27
730344 -24 -60 -34 -33 -44 -23 -24 -16 -65 -30 -5 -58 -55 -29 -34 -43 -28 -25 -66 -48 -33 -59 -57 -44 8 -55 -40 -35 -25 -46 -36 -48 -55 -42 -16 -26
731405 -4 -34 -39 -33 -64 -72 -33 -14 -7 -26 -5 -43 -36 -52 -61 -45 -46 -35 -30 -58 -38 -65 -37 -28 -11 -26 -37 -57 -50 -77 -21 -43 -42 -42 -54 -72 -45 -37
732526 -36 -56 -63 -46 -9 -56 -35 -41 -47 -27 -9 -15 -56 -7 -56 -77 -43 -26 -60 24 -28 -33 -66 -21 -44 -45 -31 -20 -30 -8 -1 -56 -56 26 -34
733558 -38 -30 -18 -39 -16 -12 -22 16 -16 -26 0 -19 -4 -24 16 3 23 -13 9 -11 25 20 37 -22 17 17 41 21 45 33 39 40 82 65
734560 87 88 75 97 110 72 129 95 130 142 171 211 231 264 279 300 344 402 419 467 516 592 718 778 812 841 854 828 851 891 945
735474 1018 1147 1267 1368 1438 1558 1643 1727 1821 2064 2390 2670 2822 2788 2752 2552 2208 2046 1967 1923 2044 2269 2480 2588
736182 2502 2391 2157 1785 1442 1237 1090 964 916 884 890 858 877 885 914 921 973 1066 1066 1108 1039 1073 1055 1043 1079 1118 1213 1258 1324
737037 1424 1515 1567 1609 1674 1801 2018 2284 2586 2747 2768 2687 2524 2225 1994 1890 1834 1917 2099 2313 2415 2372 2216 2054
737745 1647 1298 1074 880 749 677 599 549 471 493 455 395 389 359 360 329 278 291 267 219 214 208 184 169 140 159 121 109 124 81
738629 71 44 56 53 24 30 28 -3 16 47 -11 9 -2 -20 -34 -23 -39 -38 -12 -55 -55 -33 -58 -30 -50 -55 -64 -66 -70 -80 -49 -70 -45 -116 -75 -73
739691 -77 -100 -79 -108 -92 -111 -96 -97 -76 -83 -62 -75 -96 -53 -128 -64 -101 -99 -118 -94 -69 -91 -104 -99 -99 -104 -103 -100 -93 -105 -97 -92 -96 -93 -91 -84 -93 -139 -101
740841 -110 -118 -87 -117 -98 -87 -78 -113 -143 -106 -111 -108 -112 -130 -109 -78 -84 -117 -80 -109 -97 -134 -98 -87 -112 -113 -127 -120 -125 -90 -114 -74 -113 -99 -102
741873 -122 -80 -107 -99 -79 -117 -110 -106 -86 -102 -104 -105 -115 -99 -77 -110 -108 -124 -135 -122 -112 -112 -110 -97 -128 -109 -123 -100 -121 -86 -111 -107 -126 -133 -118 -108
742934 -129 -95 -137 -105 -87 -111 -127 -127 -115 -104 -133 -136 -126 -108 -105 -111 -96 -98 -90 -94 -94 -101 -91 -120 -109 -87 -99 -105 -125 -123 -77 -99 -97 -99 -102 -83 -94 -98
744055 -92 -143 -73 -87 -97 -110 -109 -90 -82 -109 -77 -87 -98 -112 -90 -87 -111 -58 -64 -70 -66 -75 -90 -63 -65 -49 -100 -59 -52 -53 -74 -38 -64 -53 -61 -105 -68
745146 -49 -35 -29 -43 -30 -20 -27 -4 -14 -27 -24 -44 -12 -60 -21 -34 -7 2 -12 -16 -19 4 35 16 20 40 17 45 31 88 83 58 84 68 80
746178 107 101 129 103 141 144 117 146 145 153 177 177 182 194 212 230 224 227 227 245 253 290 299 322 300 311 361 318 312 372 377 403 370 380 426 435 416 415
747298 465 452 491 504 481 503 481 564 570 538 580 600 602 641 650 660 679 688 755 732 781 788 803 795 853 861 891 909 910 901 894 931 957 967 1000 1046
748360 1036 1124 1109 1151 1129 1158 1188 1177 1229 1259 1308 1323 1373 1423 1470 1487 1523 1555 1600 1618 1689 1721 1793 1886 1901 1986 2012 2109 2181 2240
749244 2358 2434 2481 2568 2702 2827 2928 3041 3174 3295 3405 3555 3720 3863 3999 4191 4430 4685 4902 5205 5470 5814
749893 6219 6542 6840 7114 7333 7677 7943 8413 8986 9810 10913 12369 13987 15933 18034 20118 22538 25164 27979
750453 30895 34311 38169 42603 47799 53748 61003 70004 82432 95705 106632 111211 108450 103135 91110
750895 81103 76062 74832 77094 84135 92919 100019 101021 94513 85710 70560 56382 46841 40198 35422 32269
751367 30059 28442 27142 26149 25327 24650 24098 23738 23462 23475 23732 24291 25060 26232 27532 29087 30909 33068 35279
751927 37791 40700 44005 47848 52525 58007 64931 74098 86513 98116 106944 107759 104211 96517 83906 76092
752399 72297 72164 75425 82983 90246 95349 92855 85990 75424 60304 48421 40167 34295 29928 26883 24612
752871 22861 21369 20204 19186 18314 17460 16610 15755 14868 14053 13168 12457 11762 11145 10631 10145 9764 9370 8947 8479
753460 8008 7508 6980 6499 6153 5769 5407 5121 4811 4565 4315 4062 3827 3617 3455 3266 3050 2948 2840 2681 2550
754080 2447 2309 2178 2073 1962 1874 1774 1747 1598 1524 1492 1434 1380 1320 1257 1222 1164 1125 1064 1031 984 994 924 915 881 867 861 766
754905 748 749 686 681 672 624 686 684 618 604 612 596 586 576 534 489 522 526 520 503 540 493 489 518 467 494 471 427 406 476 431 416 377 446 401
755937 382 379 367 384 357 356 387 372 357 356 344 385 347 329 330 354 318 338 321 334 333 336 347 386 352 345 354 380 315 345 315 331 362 321 345
756969 333 359 336 367 337 362 361 328 348 322 375 351 330 335 319 375 343 356 334 325 363 372 349 330 329 370 363 385 384 396 409 468 528 549
757972 572 498 457 367 328 320 318 309 307 324 336 300 265 247 277 287 261 323 299 289 285 268 271 305 257 272 257 273 224 273 261 281 249 271
758974 271 208 190 223 196 211 193 149 155 211 176 208 178 176 169 192 189 175 167 181 166 178 168 194 142 139 173 155 192 173 202 219 184 155
759977 202 134 181 156 146 141 162 169 165 177 161 183 171 184 172 150 186 128 135 161 128 162 147 127 109 136 147 156 128 135 116 125 152 134
760979 111 104 94 113 109 101 145 92 106 79 92 73 92 115 83 99 60 134 93 107 99 80 116 94 97 132 74 90 117 88 74 76 94 113
761982 99 96 117 140 97 83 99 117 121 87 122 88 105 77 94 87 71 85 92 83 77 82 66 113 63 51 118 73 115 98 99 79 89 90 119 108
763043 59 55 87 69 81 44 101 74 94 66 64 97 54 101 51 75 58 52 61 65 103 58 50 69 108 84 73 83 53 111 42 56 65 76 63
764075 66 73 48 85 102 52 54 58 56 53 85 65 56 92 76 61 70 80 67 52 92 84 92 75 78 55 98 118 42 113 75 118 67 71 118 97 115
765166 120 61 112 113 94 86 119 136 133 102 127 144 143 181 175 172 248 226 264 310 292 372 409 420 509 530 625 642 642 590 524 502 480 476
766169 519 525 554 583 619 571 534 450 413 292 258 250 261 237 208 190 169 221 165 182 153 154 181 184 166 205 203 189 192 183 224 246 241 269
767171 280 331 351 366 415 458 537 580 621 592 608 565 526 433 446 449 486 509 544 592 533 500 446 348 309 281 243 214 206 148 160 141
768115 154 137 136 121 87 144 171 120 91 77 97 131 85 101 75 89 88 51 72 73 43 39 53 60 59 71 58 30 34 18 27 51 31 39 29
769147 -10 45 29 64 26 28 22 37 58 56 32 36 33 4 42 48 48 45 19 63 38 46 57 11 -7 35 33 12 27 23 17 18 11 14 8 16 -4 11 8 32
770326 12 8 16 16 19 8 47 -1 18 -3 7 -4 37 26 -13 -10 19 38 -22 30 -26 6 20 8 30 -12 15 -9 30 9 35 48 20 19
771329 18 33 16 2 -14 13 -12 12 27 24 -6 21 9 52 -1 -20 40 1 -10 15 8 -3 30 52 8 26 -2 17 11 30 19 -36 -7
772302 14 13 47 12 27 22 -3 23 13 15 25 6 3 -30 -9 -18 -9 -20 33 31 -6 34 -8 28 -31 33 9 12 25 47 -2 19 32 25 30 77
773363 53 65 73 55 37 74 34 10 26 34 60 23 41 49 19 53 25 32 39 9 -16 0 30 7 28 15 19 8 -17 -1 -2 31 11 -25 -29
774395 23 17 14 19 10 15 23 -2 44 7 42 -29 44 19 59 44 59 23 53 31 23 5 33 45 23 75 63 44 48 77 15 31 37 -22 55 18
775457 1 -17 4 -3 7 -21 4 23 -38 7 8 -10 3 21 14 -18 21 -3 5 -21 -9 11 -18 -43 -5 2 31 7 9 -32 -25 -23 -3 -35 4 -31
776518 -3 5 -16 -9 7 0 -12 4 -33 20 22 5 9 -14 12 -29 -4 -20 8 0 7 4 -14 -25 -21 -9 2 -20 -9 -4 -2 -20 -4 -10 -45 15 -9 13
777638 -37 -5 -11 -27 -11 -21 28 -1 -22 -12 -14 -42 -10 -21 10 1 -10 14 -29 6 -37 1 -10 -6 -2 10 -18 -21 -6 -39 -32 4 -6 35 -19
778670 -33 -18 8 -29 -14 -46 -21 5 -27 -26 -20 -17 -4 -21 -56 4 26 -28 -5 -30 -12 -24 -23 -33 -11 -27 2 -27 12 -5 -18 -17 -71 5
779673 -20 -13 -43 -4 -27 -18 -8 -23 -12 -15 -29 -20 -2 -54 -65 -12 -16 -12 -21 -19 -24 -38 -27 4 -10 -10 -19 -21 -18 -18 -13 11 -56 -42 -48 -42 0 0 -56 -40
780852 -33 -46 -8 -15 6 -59 -15 -26 -19 -49 -22 -12 2 -30 -62 -11 -23 -11 0 -8 -1 -28 -31 -15 -16 -18 -33 -24 -8 -3 -16 -42 -16 -15 -9 -22 11
781943 29 -22 -24 -18 -37 -28 -13 10 -25 -6 -56 -38 -32 -13 -58 17 -2 -39 -14 -43 -19 -16 -36 -39 -53 -5 -11 -5 -11 4 -37 -9 -7 1 -18 -27 -18
783034 -36 -35 -18 -35 -12 -57 -30 13 -50 -37 -18 39 -36 -34 -26 -33 -29 -60 -22 -31 -25 -18 -33 -30 -20 -55 -26 -35 -37 -41 -49 -31 -8 -38 -34 -46 -49 -27 -69
784184 -38 -32 2 -23 -49 -14 -30 -50 -21 -14 -39 -18 -31 -40 -54 -31 -79 -19 -57 -38 -3 -26 -46 -18 -50 -24 -58 -44 -10 -56 -38 -51 -10
785157 -39 -59 -19 -44 -13 -52 -45 -49 -40 -73 -35 -51 -47 -31 -27 -17 9 -21 -75 -22 -12 -38 -52 -56 -35 -38 -48 -37 -46 -29 -49 -43 -54 -41 -40 -30
786219 -50 -10 -42 -53 -23 -18 -27 -14 -9 -36 -26 -31 -27 -32 -58 -34 -54 -14 -54 -30 -17 -68 -47 -57 -44 -69 -59 -60 -19 -13 -57 -39 -12 -16 -59 -48
787280 -36 -42 -24 -44 -22 -20 -37 -35 -30 -35 -21 -39 -50 -46 -34 -34 -53 -48 -64 -19 -49 -40 -39 -65 -13 -44 -29 -44 -19 -71 -72 -23 -65 -35 -46 -22 -61
788371 -34 -50 -41 -60 -63 -42 -44 -26 -44 -28 -26 -30 -19 -75 -27 -35 -64 -51 -23 -57 -1 -32 -23 -55 -58 -80 -12 -34 21 -54 -47 -29 -48 -36 -41 -36
789433 -56 -63 -60 -13 -70 -59 -39 -59 -55 -35 -28 -14 -24 -46 -16 -30 -78 -66 -53 -30 -42 -93 -58 -42 -15 -54 -26 -42 -20 -63 -53 -28 15
790406 -34 -59 -66 -48 -38 -87 -36 -78 -47 -67 -55 -23 -63 -53 -54 -55 -66 -46 -46 -47 -43 -18 -54 -58 -57 -64 -42 -62 -19 -18 -53 -26 -52 -59 -44 -66 -23
791497 -21 -47 -35 -37 -55 -55 5 -73 -93 -41 -55 -43 -52 -21 -44 -50 -68 -51 -32 -70 -38 -44 -49 -17 -53 -6 -43 -59 -47 -44 -39 -50 -38 -60 -37
792529 -59 -36 -25 -16 -27 -27 -16 -37 -59 -45 -41 -18 -56 -36 -45 -42 -28 -40 -45 -47 -87 -54 -44 -35 -37 -90 -20 -41 -23 -61 -40 -43 -64 -80 -36 -46
793590 -26 -10 -71 -46 -43 -47 -77 -42 -23 -33 -62 -52 -32 -58 -50 -45 -52 -58 -38 -53 -36 -23 -57 -24 -21 -47 -37 -44 -23 -71 -61 -49 -48 -67 -47 -35
794651 -83 -27 -80 -67 -47 -43 -54 -7 -47 -37 -63 -55 -65 -27 -52 -24 -41 -45 -57 -69 -25 -67 -37 -46 -15 -23 -53 -49 -45 -66 -52 -51 -55 -44 -55 -44
795713 -29 -75 -20 -40 -60 -53 -21 -70 -40 -83 -64 -66 -79 -50 -33 -57 -58 -76 -63 -13 -65 -32 -56 -49 -39 -47 -34 -70 -68 -72 -50 -48 -30 -58 -85
796745 -64 -42 -51 -77 -58 -68 -67 -57 -28 -23 -46 -29 -63 -28 -62 -20 -51 -31 -72 -51 -71 -58 -85 -45 -93 -56 -56 -43 -33 -58 -51 -60 -53 -27 -37
797777 -58 -82 -48 -69 -55 -27 -42 -46 -52 -26 -50 -44 -78 -60 -50 -16 -21 -56 -34 -52 -58 -47 -14 -73 -47 -84 -41 -37 -34 -67 -69 -60 -48 -58 -35 -54
798838 -54 -16 -43 -39 -43 -30 -45 -33 -52 -31 -38 -38 -12 -32 -51 -66 -44 -29 -23 -50 -57 -24 -35 -52 -58 -40 -84 -68 -64 -30 -66 -39 -65 -46 -19
799870 -58 -82 -56 -60 -32 -41 -62 -44 -64 -23 -62 -20 -45 -41 -33 -66 -23 -47 -51 -65 -74 -55 -81 -35 -64 -19 -59 -67 -35 -33 -54 -77 -51 -41 -67
800902 -61 -73 -72 -92 -24 -58 -72 -52 -69 -62 -74 -30 -82 -64 -66 -60 -58 -36 -69 -53 -41 -57 -50 -7 -47 -60 -58 -22 -28 -74 -55 -75 -79 -51 -50 -56
801964 -27 -28 -42 -51 -67 -5 -70 -75 -1 -59 -58 -24 -61 -10 -53 -29 -16 -56 -45 -67 -67 -33 -116 -44 -45 -65 -44 -61 -62 -74 -76 -77 -52 -73 -40 -43
803025 -60 -64 -59 -67 -74 -42 -45 -38 -52 -21 -62 -83 -81 -53 -45 -63 -49 -64 -58 -54 -50 -49 -83 -75 -56 -34 -37 -83 -52 -51 -73 -41 -70 -59 -67 -88 -24 -54 -19
804175 -49 -33 -74 -57 -76 -74 -75 -98 -3 -47 -37 -17 -71 -35 -92 -37 -58 -69 -49 -21 -41 -85 -58 -86 -44 -96 -40 -70 -45 -63 -62 -74 -93
805148 -99 -105 -75 -72 -60 -41 -85 -56 -16 -59 -59 -48 -67 -72 -40 -41 -47 -60 -88 -52 -62 -56 -57 -72 -77 -57 -58 -65 -56 -48 -53 -85 -68 -76 -79 -52 -56 -76 -59 -81
806328 -57 -64 -87 -58 -46 -71 -64 -61 -87 -67 -78 -63 -54 -109 -35 -53 -42 -70 -72 -46 -67 -53 -59 -113 -47 -36 -61 -36 -57 -70 -75 -48 -51 -91 -61
807360 -60 -68 -65 -67 -63 -68 -51 -45 -32 -75 -46 -79 -65 -50 -59 -60 -51 -60 -34 -45 -21 -67 -73 -41 -61 -31 -41 -70 -37 -73 -52 -77 -59 -56 -45 -55 -56
808451 -56 -80 -58 -60 -81 -56 -96 -61 -73 -58 -59 -73 -72 -38 -58 -75 -70 -65 -55 -86 -40 -74 -85 -59 -79 -60 -60 -45 -47 -25 -75 -54 -25 -77 -101
809483 -35 -57 -71 -61 -92 -41 -56 -71 -65 -74 -29 -33 -34 -48 -68 -24 -75 -40 -87 -31 -65 -57 -40 -68 -66 -92 -66 -62 -36 -71 -39 -57 -52 -79 -50
810515 -58 -61 -70 -48 -79 -84 -57 -22 -59 -57 -71 -83 -95 -94 -70 -40 -65 -64 -54 -49 -48 -43 -47 -57 -63 -77 -70 -61 -43 -53 -70 -68 -53 -98 -38 -80 -78 -77 -40
811665 -71 -46 -86 -76 -32 -35 -55 -64 -71 -55 -79 -44 -73 -37 -55 -90 -54 -70 -79 -67 -44 -42 -30 -45 -63 -90 -60 -80 -50 -57 -66 -67 -76 -90 -71 -65
812726 -81 -71 -43 -42 -49 -53 -73 -82 -55 -102 -45 -35 -50 -45 -56 -42 -70 -66 -62 -43 -79 -65 -12 -61 -58 -68 -81 -68 -72 -55 -77 -94 -96 -63 -84 -13
813787 -84 -28 -65 -55 -78 -79 -48 -67 -21 -86 -71 -62 -56 -63 -99 -50 -80 -76 -47 -85 -59 -61 -59 -57 -86 -63 -39 -64 -47 -40 -61 -55 -64 -77 -53 -64 -48
814878 -71 -56 -67 -58 -72 -79 -56 -67 -79 -50 -79 -79 -66 -59 -47 -9 -69 -47 -90 -62 -74 -61 -89 -121 -34 -61 -74 -69 -51 -61 -78 -92 -54 -57
815881 -68 -48 -55 -51 -49 -85 -71 -53 -60 -25 -56 -77 -61 -14 -84 -55 -66 -76 -43 -68 -35 -101 -72 -53 -68 -78 -10 -39 -70 -85 -65 -80 -42
816854 -79 -70 -99 -57 -85 -67 -66 -107 -58 -47 -88 -66 -58 -67 -57 -89 -71 -35 -71 -57 -45 -63 -77 -67 -79 -59 -102 -61 -83 -53 -59 -88 -58 -63
817856 -36 -75 -72 -86 -119 -68 -108 -74 -68 -53 -80 -67 -85 -72 -97 -52 -71 -54 -35 -38 -68 -100 -63 -65 -55 -62 -38 -50 -67 -60 -43 -44 -79 -60 -34
818888 -51 -32 -55 -52 -43 -90 -90 -79 -87 -97 -59 -83 -66 -65 -73 -74 -52 -86 -91 -85 -74 -68 -56 -77 -68 -75 -74 -45 -52 -75 -98 -77 -60 -58 -60 -90 -75 -47 -39
820038 -57 -81 -84 -55 -63 -80 -82 -73 -52 -59 -61 -60 -69 -97 -80 -89 -64 -75 -63 -65 -53 -70 -64 -90 -44 -68 -75 -79 -44 -75 -56 -87 -98 -28 -49 -71 -77 -66
821159 -100 -60 -45 -73 -49 -83 -45 -28 -63 -90 -79 -74 -54 -54 -89 -78 -38 -55 -52 -106 -69 -74 -69 -94 -77 -44 -59 -67 -55 -63 -20 -87 -35 -60
822161 -102 -82 -96 -71 -44 -39 -60 -51 -58 -49 -31 -75 -83 -60 -73 -86 -86 -75 -75 -36 -88 -97 -66 -60 -76 -49 -83 -68 -74 -79 -73 -72 -64 -97 -52 -77 -82 -48
823282 -53 -101 -25 -39 -59 -48 -74 -64 -63 -55 -74 -92 -48 -83 -52 -76 -94 -73 -43 -48 -85 -58 -44 -88 -59 -98 -66 -102 -57 -81 -39 -70 -83
824255 -50 -72 -103 -62 -80 -83 -40 -44 -43 -28 -71 -52 -62 -76 -96 -42 -93 -105 -58 -60 -51 -72 -61 -73 -39 -107 -70 -71 -53 -48 -95 -82 -54 -73 -49
825287 -71 -25 -137 -47 -92 -56 -64 -96 -67 -79 -66 -101 -66 -65 -59 -44 -54 -86 -62 -73 -84 -62 -88 -98 -95 -67 -60 -74 -67 -78 -98 -44 -76 -89
826289 -73 -51 -83 -54 -66 -57 -58 -51 -93 -70 -55 -85 -104 -103 -57 -65 -68 -70 -65 -56 -35 -61 -69 -73 -76 -64 -45 -72 -74 -54 -52 -66 -63 -70 -67 -68 -34 -124 -59 -64
827469 -77 -72 -69 -51 -94 -70 -80 -74 -76 -40 -67 -89 -62 -71 -114 -51 -84 -86 -79 -66 -105 -68 -76 -87 -51 -70 -55 -100 -66 -81 -16 -65 -41 -54 -59
828501 -54 -89 -63 -59 -87 -95 -35 -81 -69 -80 -71 -58 -61 -97 -76 -68 -66 -80 -83 -101 -71 -74 -56 -94 -100 -93 -57 -60 -53 -67 -56 -68 -63 -50 -62 -59 -91 -73
829621 -47 -89 -49 -107 -104 -33 -77 -61 -79 -34 -39 -103 -89 -92 -93 -81 -61 -72 -26 -73 -65 -50 -85 -60 -51 -123 -88 -79 -95 -86 -53 -81 -61 -93 -71
830653 -65 -72 -74 -91 -87 -69 -90 -63 -62 -78 -53 -42 -19 -95 -63 -33 -77 -77 -52 -62 -77 -49 -48 -83 -80 -52 -53 -57 -110 -75 -54 -82 -38 -78 -43 -61
831715 -71 -80 -72 -96 -73 -63 -78 -76 -45 -117 -86 -41 -61 -54 -62 -69 -61 -84 -48 -97 -89 -94 -66 -73 -91 -80 -85 -73 -88 -83 -51 -88 -57 -35 -98 -64 -75
832805 -103 -99 -81 -86 -100 -76 -100 -88 -96 -116 -60 -68 -94 -88 -38 -49 -46 -63 -96 -66 -49 -79 -69 -93 -81 -69 -58 -62 -81 -95 -88 -100 -3 -42 -54
833837 -75 -75 -79 -87 -62 -66 -90 -102 -73 -59 -71 -90 -74 -74 -68 -93 -108 -103 -78 -95 -74 -67 -68 -47 -102 -72 -73 -74 -58 -28 -47 -63 -69 -56 -45 -82 -86
834928 -59 -60 -67 -96 -96 -67 -103 -102 -60 -56 -93 -83 -59 -90 -73 -90 -68 -65 -90 -78 -96 -65 -98 -82 -39 -70 -86 -55 -73 -81 -71 -73 -103 -52 -75
835960 -64 -64 -118 -63 -24 -58 -74 -64 -72 -77 -74 -77 -83 -97 -60 -84 -63 -78 -68 -71 -75 -61 -76 -90 -86 -78 -35 -98 -75 -46 -72 -93 -87 -64 -72 -90 -72
837051 -82 -72 -88 -39 -96 -45 -86 -71 -98 -79 -91 -53 -83 -40 -107 -66 -88 -91 -73 -92 -82 -46 -106 -53 -59 -50 -83 -71 -54 -52 -115 -63 -52
838024 -89 -61 -72 -88 -60 -87 -100 -51 -76 -55 -120 -70 -39 -59 -85 -51 -84 -96 -90 -103 -110 -54 -107 -73 -100 -60 -75 -71 -84 -74 -94 -72 -89
838997 -64 -72 -83 -62 -78 -109 -60 -81 -96 -87 -91 -43 -65 -85 -75 -105 -90 -42 -70 -80 -95 -70 -34 -72 -77 -66 -85 -71 -92 -72 -71 -91 -97 -68
840000 -65 -62 -76 -75 -82 -82 -55 -72 -61 -103 -75 -83 -76 -68 -43 -91 -74 -68 -40 -70 -53 -57 -60 -97 -59 -87 -63 -97 -78 -90 -65 -61 -58 -108 -92 -71 -65
841091 -83 -72 -79 -55 -69 -71 -81 -82 -72 -72 -86 -59 -112 -95 -62 -91 -95 -96 -64 -82 -71 -78 -58 -78 -66 -85 -97 -114 -55 -96 -90 -96 -89 -80 -70 -75 -91
842182 -88 -89 -70 -54 -37 -66 -93 -31 -40 -78 -48 -65 -73 -51 -78 -81 -90 -13 -90 -63 -46 -60 -74 -103 -125 -99 -66 -77 -59 -83 -90 -59 -44 -45
843184 -107 -68 -70 -105 -77 -95 -53 -78 -117 -72 -75 -70 -68 -90 -78 -65 -101 -92 -55 -43 -60 -113 -83 -104 -87 -101 -56 -48 -95 -59 -71 -44 -78 -56
844187 -107 -76 -59 -67 -89 -95 -105 -66 -80 -84 -68 -87 -46 -76 -79 -73 -74 -103 -57 -69 -109 -71 -71 -76 -98 -51 -94 -91 -78 -97 -82 -84 -78 -69 -85 -93 -86
845278 -61 -37 -87 -93 -88 -92 -70 -89 -83 -69 -66 -61 -53 -60 -72 -82 -58 -34 -79 -67 -75 -34 -71 -103 -57 -64 -50 -75 -95 -61 -94 -69 -76 -51 -38 -83 -94
846369 -63 -71 -78 -78 -66 -79 -111 -80 -74 -54 -78 -78 -80 -80 -35 -66 -64 -58 -75 -79 -78 -68 -78 -59 -69 -77 -54 -56 -99 -98 -91 -57 -80 -77 -65 -56 -79 -79 -75 -77 -67
847578 -89 -82 -103 -22 -91 -89 -56 -102 -74 -88 -78 -71 -86 -65 -91 -72 -51 -65 -48 -73 -57 -114 -68 -66 -117 -67 -84 -57 -73 -71 -67 -66 -66 -128 -88
848610 -104 -71 -85 -87 -71 -97 -76 -82 -88 -84 -81 -87 -83 -71 -67 -86 -76 -103 -89 -89 -80 -82 -80 -64 -84 -55 -60 -83 -108 -59 -89 -64 -100 -46 -92 -90 -82 -64
849730 -113 -102 -74 -86 -67 -115 -86 -77 -104 -78 -89 -81 -79 -81 -79 -51 -69 -84 -85 -69 -63 -90 -43 -104 -68 -77 -78 -103 -85 -90 -82 -112 -53 -44 -63 -60 -84
850821 -61 -68 -71 -61 -60 -92 -73 -49 -77 -69 -103 -127 -76 -95 -102 -69 -55 -74 -115 -36 -58 -82 -104 -86 -55 -77 -106 -42 -83 -76 -113 -78 -67 -79
851823 -109 -72 -62 -48 -56 -63 -81 -81 -84 -66 -80 -59 -95 -69 -66 -107 -77 -97 -69 -88 -62 -63 -42 -113 -75 -90 -53 -91 -104 -107 -102 -96 -95 -58 -73 -48
852885 -81 -50 -65 -73 -80 -71 -87 -62 -99 -78 -93 -85 -64 -56 -86 -84 -100 -93 -100 -40 -71 -68 -93 -66 -50 -77 -70 -110 -113 -74 -100 -58 -64 -102 -82 -84 -148 -89
854005 -69 -82 -98 -75 -74 -68 -65 -110 -72 -71 -46 -122 -70 -62 -53 -68 -99 -97 -63 -65 -81 -84 -70 -44 -73 -103 -58 -51 -95 -86 -69 -91 -68 -85 -53 -85 -118
855096 -86 -109 -48 -75 -59 -80 -76 -74 -87 -74 -81 -48 -64 -85 -80 -62 -96 -54 -120 -63 -105 -78 -71 -92 -126 -65 -76 -89 -72 -116 -97 -90 -126 -95
856099 -72 -95 -103 -70 -87 -72 -94 -93 -85 -73 -62 -58 -49 -90 -49 -111 -62 -108 -77 -78 -91 -68 -96 -123 -87 -95 -103 -82 -96 -103 -102 -65 -68 -104 -66 -71 -55
857190 -81 -64 -83 -95 -83 -97 -66 -98 -84 -79 -77 -71 -117 -106 -77 -95 -72 -85 -68 -71 -64 -97 -84 -95 -68 -41 -93 -86 -65 -80 -78 -85 -69 -81 -86
858222 -89 -77 -45 -103 -75 -78 -66 -93 -107 -78 -70 -80 -92 -66 -37 -74 -81 -47 -79 -58 -60 -90 -48 -40 -38 -69 -65 -91 -46 -85 -108 -82 -58 -112 -103
859254 -95 -90 -96 -94 -52 -100 -91 -41 -85 -83 -110 -69 -101 -80 -101 -62 -102 -86 -54 -47 -56 -84 -80 -81 -81 -66 -80 -69 -109 -78 -80 -66 -81 -111 -61 -111 -70
860345 -92 -69 -94 -65 -63 -84 -91 -80 -104 -68 -107 -86 -89 -94 -110 -60 -71 -104 -68 -109 -73 -87 -102 -80 -83 -78 -63 -72 -63 -89 -87 -86 -76 -111 -80 -102
861406 -48 -72 -82 -74 -97 -63 -96 -84 -80 -96 -69 -68 -102 -63 -101 -67 -94 -60 -104 -88 -73 -45 -108 -85 -80 -106 -85 -107 -93 -87 -103 -109 -110 -95 -92
862438 -98 -73 -69 -52 -118 -93 -77 -83 -85 -91 -107 -82 -86 -72 -60 -103 -63 -92 -58 -95 -83 -64 -86 -86 -83 -101 -81 -103 -59 -70 -86 -85 -46 -85 -79
863470 -77 -100 -93 -59 -73 -107 -45 -59 -53 -89 -119 -99 -91 -85 -81 -91 -98 -76 -91 -75 -105 -85 -50 -70 -84 -83 -66 -88 -97 -77 -69 -76 -76 -87 -102 -85 -91
864561 -89 -121 -79 -107 -95 -68 -79 -105 -73 -59 -79 -95 -87 -88 -117 -92 -46 -83 -82 -99 -33 -80 -70 -111 -108 -86 -71 -75 -116 -96 -49 -80 -61 -67
865564 -67 -107 -71 -83 -82 -84 -81 -106 -75 -64 -93 -89 -68 -64 -66 -75 -87 -72 -67 -70 -73 -84 -113 -81 -50 -56 -72 -102 -82 -122 -52 -95 -90 -61 -54 -82 -70 -69
866684 -87 -72 -85 -84 -69 -101 -114 -91 -69 -81 -48 -62 -111 -68 -97 -91 -77 -94 -118 -90 -97 -76 -105 -78 -67 -101 -99 -73 -60 -85 -84 -93 -94 -92 -95
867716 -74 -67 -112 -119 -75 -83 -33 -83 -75 -58 -67 -71 -73 -92 -87 -90 -66 -75 -98 -73 -91 -68 -74 -88 -48 -94 -64 -72 -54 -68 -111 -64 -81 -117 -83 -85 -75 -58
868836 -76 -70 -60 -82 -73 -87 -81 -67 -83 -74 -114 -58 -80 -70 -84 -77 -60 -95 -81 -112 -62 -114 -100 -90 -88 -76 -72 -54 -77 -89 -63 -64 -88 -104 -83
869868 -97 -74 -81 -62 -84 -103 -67 -105 -69 -101 -98 -62 -105 -83 -107 -95 -67 -75 -69 -58 -60 -54 -91 -72 -90 -60 -40 -74 -73 -63 -102 -76 -96 -78 -107
870900 -78 -66 -44 -83 -89 -89 -98 -90 -103 -81 -61 -69 -76 -64 -88 -71 -95 -88 -63 -82 -80 -80 -75 -103 -111 -87 -79 -98 -77 -88 -59 -106 -67 -77 -87 -87 -75 -59
872021 -74 -95 -52 -64 -56 -64 -58 -84 -77 -91 -84 -90 -76 -62 -97 -74 -76 -75 -85 -78 -85 -62 -76 -93 -81 -56 -74 -85 -70 -95 -55 -64 -77 -94 -78 -65 -98
873112 -72 -70 -87 -63 -71 -79 -53 -98 -73 -104 -107 -74 -75 -83 -80 -88 -109 -110 -61 -114 -66 -72 -83 -78 -83 -74 -68 -56 -81 -82 -66 -82 -91 -111 -108 -89 -100 -62 -115 -119
874291 -84 -66 -96 -105 -106 -78 -111 -73 -72 -97 -107 -77 -131 -104 -62 -72 -87 -100 -71 -82 -123 -78 -71 -102 -71 -58 -78 -83 -81 -78 -82 -84 -38 -85 -71 -88
875353 -94 -97 -89 -92 -93 -89 -72 -81 -74 -101 -78 -62 -99 -86 -46 -75 -66 -113 -87 -80 -59 -76 -76 -73 -55 -90 -79 -86 -68 -56 -96 -93 -85 -74 -100 -57 -70 -63
876473 -101 -90 -95 -90 -103 -89 -57 -100 -97 -51 -75 -92 -114 -59 -68 -70 -79 -64 -56 -91 -95 -94 -73 -79 -61 -83 -77 -84 -116 -71 -57 -106 -91 -91 -84 -60 -81 -98
877594 -56 -95 -89 -83 -98 -83 -96 -79 -84 -77 -41 -80 -56 -73 -75 -95 -75 -109 -108 -69 -112 -34 -86 -137 -81 -82 -77 -98 -111 -82 -119 -101 -100 -49 -95 -83
878655 -48 -103 -59 -90 -121 -87 -80 -35 -46 -78 -69 -84 -64 -112 -114 -102 -47 -66 -84 -51 -60 -67 -68 -84 -98 -77 -77 -60 -111 -101 -58 -89 -109 -86 -82
879687 -78 -89 -80 -94 -79 -106 -89 -100 -86 -76 -87 -71 -58 -107 -105 -75 -67 -94 -90 -81 -80 -125 -91 -81 -66 -72 -76 -57 -63 -151 -105 -49 -84 -52 -83 -92
880749 -114 -62 -63 -94 -116 -82 -51 -92 -66 -87 -81 -62 -70 -96 -125 -105 -110 -51 -89 -82 -50 -88 -98 -83 -97 -89 -71 -70 -78 -105 -69 -83 -72 -114 -83
881781 -71 -108 -76 -115 -96 -64 -93 -92 -89 -87 -60 -87 -88 -65 -82 -91 -97 -77 -97 -94 -108 -65 -54 -101 -87 -107 -53 -86 -119 -96 -93 -81 -106 -88 -65
882813 -86 -73 -83 -113 -66 -91 -108 -63 -105 -99 -115 -93 -88 -95 -80 -90 -106 -65 -59 -87 -73 -101 -108 -95 -93 -84 -96 -113 -88 -70 -73 -97 -69 -60 -81 -99
883874 -88 -104 -98 -86 -96 -75 -92 -49 -67 -69 -87 -70 -90 -96 -98 -75 -73 -91 -99 -76 -72 -96 -89 -99 -87 -125 -108 -103 -82 -71 -82 -61 -93 -126 -70 -84
884935 -52 -101 -139 -89 -48 -87 -80 -95 -83 -75 -78 -62 -124 -83 -104 -60 -103 -128 -110 -68 -105 -79 -90 -87 -107 -100 -82 -105 -83 -93 -94 -92 -80 -61 -108
885967 -68 -20 -109 -82 -90 -71 -81 -69 -72 -110 -105 -72 -97 -98 -121 -94 -54 -76 -95 -105 -94 -58 -73 -102 -58 -100 -85 -93 -79 -88 -108 -90 -87 -87 -111
886999 -79 -71 -85 -106 -86 -79 -109 -71 -61 -51 -57 -104 -105 -51 -104 -58 -91 -84 -95 -83 -98 -102 -77 -132 -106 -95 -83 -103 -77 -105 -70 -64 -65 -93 -58
888031 -82 -118 -62 -75 -86 -58 -55 -131 -118 -62 -77 -66 -101 -63 -67 -53 -72 -86 -78 -66 -48 -80 -84 -45 -82 -102 -96 -106 -103 -55 -106 -112 -77 -95 -102
889063 -95 -61 -97 -99 -107 -88 -93 -80 -89 -80 -51 -72 -83 -73 -105 -86 -70 -110 -114 -73 -90 -71 -69 -97 -73 -121 -80 -74 -95 -66 -112 -73 -59 -88 -84
890095 -105 -97 -78 -92 -93 -79 -57 -98 -99 -118 -102 -93 -109 -81 -64 -97 -110 -88 -84 -74 -88 -108 -53 -64 -74 -86 -71 -85 -92 -101 -78 -106 -76 -80
891098 -93 -108 -99 -64 -97 -90 -82 -83 -86 -71 -69 -71 -74 -72 -104 -130 -84 -71 -57 -104 -82 -72 -96 -57 -76 -82 -98 -106 -87 -85 -36 -53 -82 -89 -71 -101 -85 -90
892218 -100 -101 -60 -76 -79 -82 -76 -92 -84 -56 -41 -87 -110 -81 -115 -76 -87 -110 -107 -70 -99 -84 -85 -88 -91 -89 -76 -93 -73 -73 -92 -70 -99 -71 -83 -79
893280 -109 -49 -81 -92 -105 -102 -75 -105 -69 -109 -77 -110 -103 -83 -75 -73 -98 -93 -79 -98 -97 -107 -71 -114 -81 -117 -90 -112 -75 -101 -78 -100 -94 -85
894282 -77 -72 -88 -87 -87 -54 -80 -113 -86 -112 -123 -104 -80 -86 -89 -98 -117 -92 -103 -53 -118 -55 -65 -109 -79 -98 -98 -80 -76 -84 -89 -75 -79 -103 -65 -72 -108
895373 -82 -85 -85 -83 -107 -63 -79 -54 -86 -90 -69 -105 -93 -86 -101 -68 -104 -103 -44 -49 -77 -92 -71 -111 -96 -63 -102 -85 -85 -76 -64 -75 -99 -146 -78 -136
896435 -60 -98 -78 -52 -90 -97 -80 -110 -100 -92 -84 -93 -73 -96 -82 -83 -77 -87 -110 -74 -121 -92 -64 -102 -85 -72 -126 -62 -78 -95 -61 -94 -110 -98
897437 -141 -122 -100 -100 -98 -63 -49 -90 -83 -87 -84 -85 -85 -60 -88 -113 -95 -88 -91 -96 -93 -119 -80 -99 -101 -120 -91 -91 -68 -91 -101 -61 -130 -98 -65 -76 -94
898528 -98 -101 -94 -91 -73 -78 -103 -67 -95 -68 -72 -73 -71 -55 -87 -87 -57 -55 -75 -85 -115 -77 -92 -106 -79 -103 -94 -70 -123 -104 -92 -77 -109 -100 -74 -95 -73
899619 -65 -84 -89 -108 -63 -120 -85 -76 -56 -87 -76 -103 -87 -82 -74 -56 -58 -62 -73 -99 -98 -127 -85 -110 -107 -75 -128 -87 -93 -77 -79 -118 -87 -54 -94 -77
900681 -94 -114 -72 -102 -97 -68 -89 -79 -80 -90 -96 -71 -80 -86 -109 -59 -56 -89 -71 -92 -78 -105 -90 -105 -88 -40 -106 -85 -78 -66 -94 -90 -49 -47 -97 -90
901742 -98 -87 -138 -80 -96 -70 -68 -94 -66 -98 -89 -85 -96 -107 -74 -58 -86 -104 -101 -95 -99 -58 -88 -85 -104 -103 -97 -92 -104 -117 -64 -64 -91 -78 -68 -62 -72
902833 -110 -68 -111 -87 -124 -70 -84 -93 -74 -101 -99 -93 -93 -69 -88 -96 -85 -112 -97 -110 -75 -81 -78 -122 -84 -42 -80 -88 -65 -99 -90 -103 -46 -100 -78
903865 -71 -69 -88 -71 -61 -76 -77 -99 -96 -79 -89 -97 -59 -90 -115 -87 -110 -113 -88 -81 -119 -100 -65 -78 -71 -119 -81 -78 -78 -85 -79 -99 -83 -100 -94 -67 -122
904956 -96 -90 -98 -98 -86 -111 -57 -102 -101 -115 -87 -78 -128 -87 -101 -93 -80 -86 -128 -111 -81 -66 -87 -111 -141 -58 -67 -81 -75 -106 -82 -131 -97 -100 -121 -93
906017 -95 -85 -78 -102 -111 -70 -91 -77 -102 -53 -69 -109 -56 -73 -105 -105 -76 -100 -97 -100 -95 -77 -110 -110 -70 -78 -81 -101 -112 -80 -72 -103 -65 -88 -79 -53 -90
907108 -97 -72 -60 -94 -79 -50 -118 -79 -69 -102 -78 -73 -114 -98 -73 -87 -119 -41 -93 -90 -49 -74 -76 -74 -79 -107 -83 -92 -135 -106 -67 -47 -79 -99
908111 -88 -111 -58 -125 -72 -60 -96 -108 -74 -84 -93 -97 -87 -100 -69 -114 -89 -76 -84 -110 -96 -97 -110 -93 -69 -97 -85 -92 -86 -65 -78 -56 -91 -58
909113 -157 -113 -62 -111 -77 -126 -84 -128 -74 -133 -85 -99 -86 -78 -87 -43 -107 -95 -81 -27 -93 -71 -107 -72 -107 -99 -88 -91 -105 -73 -122 -64 -72
910086 -77 -82 -85 -94 -131 -100 -82 -70 -90 -69 -92 -75 -98 -84 -92 -58 -102 -121 -94 -78 -59 -86 -115 -80 -75 -92 -43 -100 -71 -101 -88 -87 -90 -87 -74
911118 -95 -63 -71 -97 -100 -80 -68 -91 -91 -65 -129 -84 -92 -98 -97 -115 -80 -98 -93 -72 -85 -63 -79 -76 -46 -76 -93 -98 -76 -95 -121 -90 -82 -81 -85 -91 -90 -99
912239 -86 -100 -84 -84 -91 -118 -80 -82 -94 -82 -106 -89 -77 -83 -114 -92 -72 -95 -88 -92 -83 -91 -69 -78 -73 -128 -96 -91 -111 -108 -91 -100 -87 -97 -55 -60 -111 -71
913359 -97 -101 -84 -70 -66 -109 -104 -107 -67 -95 -83 -89 -84 -80 -80 -108 -97 -81 -69 -107 -57 -87 -62 -110 -79 -76 -102 -95 -79 -65 -111 -121 -118 -82 -84 -105 -74
914450 -105 -91 -112 -98 -97 -114 -81 -81 -109 -105 -114 -100 -83 -107 -83 -68 -100 -87 -96 -89 -96 -105 -62 -102 -108 -107 -105 -82 -67 -84 -69 -92 -91 -94 -123 -90 -129
915541 -80 -98 -71 -76 -84 -82 -88 -107 -110 -85 -113 -103 -79 -97 -76 -104 -109 -80 -85 -65 -74 -60 -78 -84 -84 -94 -116 -114 -86 -62 -95 -125 -60 -80 -62 -116 -99
916632 -22 -78 -125 -89 -79 -94 -60 -83 -82 -79 -114 -118 -85 -59 -95 -69 -59 -80 -65 -66 -85 -86 -67 -98 -96 -76 -90 -117 -86 -62 -94 -101 -84 -77 -94
917664 -101 -90 -91 -53 -83 -85 -103 -65 -93 -87 -91 -47 -57 -73 -105 -58 -59 -86 -136 -66 -85 -72 -100 -102 -97 -83 -48 -67 -121 -94 -80 -73 -105 -130 -99
918696 -94 -93 -84 -73 -72 -89 -72 -78 -116 -86 -116 -117 -100 -78 -109 -95 -95 -85 -40 -84 -105 -78 -80 -57 -91 -114 -83 -119 -95 -84 -106 -123 -93 -116 -105
919728 -95 -64 -118 -99 -103 -113 -92 -135 -106 -82 -92 -111 -99 -100 -102 -110 -119 -83 -118 -88 -82 -100 -114 -108 -84 -100 -91 -91 -77 -90 -108 -84 -50 -111 -94 -73
920790 -57 -104 -80 -101 -104 -84 -86 -62 -96 -95 -118 -81 -110 -90 -73 -103 -65 -109 -100 -106 -107 -87 -119 -87 -106 -76 -81 -80 -108 -87 -96 -100 -91 -95 -120 -88 -74
921881 -103 -70 -89 -104 -78 -97 -110 -116 -72 -96 -100 -79 -103 -86 -81 -114 -94 -88 -78 -68 -93 -80 -105 -58 -97 -91 -79 -103 -123 -112 -95 -96 -100 -105
922883 -85 -92 -116 -108 -136 -100 -76 -110 -80 -88 -47 -99 -96 -115 -79 -103 -94 -81 -67 -88 -89 -85 -133 -113 -90 -61 -77 -65 -104 -83 -93 -108 -68 -107 -90
923915 -82 -68 -99 -110 -130 -77 -73 -92 -114 -109 -72 -69 -99 -99 -128 -102 -74 -95 -112 -91 -90 -107 -100 -146 -91 -82 -94 -54 -94 -85 -90 -92 -72 -80 -86 -92 -121 -87
925036 -97 -93 -39 -69 -80 -82 -75 -72 -97 -100 -59 -96 -70 -81 -61 -53 -78 -57 -66 -63 -108 -125 -53 -116 -91 -77 -105 -76 -89 -83 -120 -98 -113 -75 -115 -84
926097 -85 -71 -83 -91 -88 -90 -97 -90 -106 -107 -93 -62 -91 -74 -102 -91 -77 -125 -104 -110 -76 -65 -76 -114 -98 -97 -71 -68 -80 -99 -83 -113 -67 -64 -102 -63
927158 -96 -79 -98 -79 -48 -85 -94 -95 -87 -91 -75 -61 -96 -109 -81 -99 -115 -101 -97 -119 -106 -96 -58 -44 -56 -65 -85 -69 -80 -122 -81 -67 -115 -110
928161 -68 -111 -110 -60 -92 -96 -95 -89 -74 -116 -123 -114 -99 -62 -71 -97 -75 -71 -92 -98 -111 -49 -105 -58 -75 -93 -93 -101 -100 -77 -100 -102 -92 -79 -64 -100 -92 -109
929281 -92 -76 -114 -88 -102 -105 -89 -93 -85 -66 -77 -70 -113 -108 -103 -80 -100 -91 -83 -92 -90 -90 -73 -86 -68 -106 -94 -109 -82 -110 -88 -86 -75 -74 -82 -88 -95 -114 -80
930431 -99 -106 -107 -66 -76 -86 -88 -86 -113 -53 -84 -85 -103 -92 -93 -94 -88 -83 -64 -90 -80 -87 -95 -79 -104 -71 -105 -102 -94 -85 -106 -109 -76 -107 -71 -71 -95 -84 -81
931581 -98 -105 -72 -68 -71 -113 -72 -118 -139 -100 -107 -99 -80 -77 -81 -81 -93 -92 -75 -93 -70 -107 -54 -67 -70 -132 -130 -87 -89 -94 -104 -83 -73 -96 -99 -112 -108 -92 -59
932731 -87 -124 -75 -100 -119 -85 -101 -73 -105 -77 -94 -95 -83 -105 -90 -109 -100 -97 -111 -67 -125 -79 -72 -99 -112 -93 -102 -102 -92 -110 -100 -95 -106 -91 -102
933763 -101 -118 -116 -63 -49 -67 -62 -83 -89 -110 -89 -84 -81 -40 -81 -103 -95 -84 -72 -102 -93 -55 -93 -92 -72 -70 -91 -100 -107 -99 -95 -107 -71 -108 -111 -96 -92 -75
934884 -92 -97 -93 -96 -92 -107 -113 -100 -46 -125 -72 -81 -106 -81 -156 -84 -90 -94 -91 -128 -104 -64 -82 -117 -74 -111 -88 -65 -110 -78 -82 -108 -115 -72 -78 -96 -92
935975 -89 -97 -62 -102 -83 -72 -86 -67 -95 -98 -107 -59 -113 -88 -100 -122 -73 -110 -73 -119 -88 -118 -87 -69 -75 -79 -113 -101 -116 -87 -105 -72 -60 -75
936977 -67 -68 -76 -66 -101 -67 -93 -105 -85 -65 -94 -70 -79 -73 -94 -106 -101 -69 -71 -70 -62 -102 -113 -52 -110 -85 -87 -72 -140 -100 -119 -83 -69 -117 -93 -97
938039 -89 -57 -105 -95 -80 -97 -76 -84 -69 -61 -75 -119 -133 -110 -133 -99 -75 -94 -102 -113 -89 -55 -107 -114 -117 -107 -95 -108 -81 -88 -75 -107 -112 -28 -79
939070 -99 -80 -109 -94 -94 -90 -116 -71 -97 -115 -129 -98 -92 -125 -111 -78 -73 -73 -68 -103 -87 -93 -91 -65 -93 -100 -102 -73 -74 -82 -97 -68 -105 -125 -102 -86 -81
940161 -111 -115 -66 -128 -85 -99 -80 -92 -84 -93 -89 -92 -88 -103 -67 -80 -90 -95 -78 -93 -49 -91 -99 -93 -80 -76 -88 -130 -76 -111 -66 -101 -127 -92 -106 -100
941223 -86 -103 -110 -73 -111 -80 -100 -116 -83 -89 -105 -96 -87 -84 -89 -73 -105 -76 -91 -90 -80 -71 -83 -90 -84 -91 -94 -81 -86 -91 -116 -135 -75 -109 -93 -82 -87 -100 -96
942373 -69 -72 -97 -49 -113 -113 -81 -106 -85 -54 -73 -94 -95 -75 -78 -105 -66 -98 -89 -132 -117 -85 -99 -74 -91 -69 -95 -127 -104 -88 -98 -104 -109 -76 -120
943405 -68 -142 -51 -133 -96 -115 -57 -90 -112 -86 -94 -84 -109 -88 -95 -76 -92 -84 -90 -110 -91 -137 -107 -65 -84 -105 -113 -104 -86 -75 -61 -125 -76 -106
944407 -92 -128 -96 -122 -111 -92 -86 -91 -89 -93 -109 -77 -93 -109 -94 -86 -38 -121 -118 -73 -102 -79 -93 -59 -109 -60 -114 -119 -86 -100 -74 -75 -87 -97 -72
945439 -110 -92 -113 -129 -83 -114 -83 -78 -118 -90 -88 -80 -134 -79 -109 -124 -116 -62 -139 -114 -124 -82 -125 -95 -118 -96 -117 -110 -58 -85 -85 -126 -95 -101
946442 -83 -72 -83 -114 -87 -116 -101 -73 -82 -61 -91 -101 -102 -139 -111 -88 -87 -96 -81 -104 -80 -103 -101 -112 -119 -107 -73 -83 -121 -115 -128 -98 -78 -117 -91
947474 -103 -81 -90 -78 -78 -97 -78 -143 -109 -106 -110 -85 -120 -83 -52 -77 -83 -99 -91 -76 -82 -79 -119 -79 -87 -106 -86 -87 -76 -69 -81 -85 -91 -60 -76 -111 -97
948565 -115 -115 -78 -131 -92 -103 -110 -110 -108 -125 -103 -54 -107 -95 -74 -113 -64 -90 -74 -95 -75 -81 -87 -78 -97 -74 -89 -83 -104 -125 -87 -56 -72 -72 -99
949597 -111 -127 -129 -126 -85 -74 -113 -114 -111 -93 -77 -77 -72 -94 -108 -132 -97 -93 -111 -58 -79 -110 -105 -80 -120 -86 -118 -118 -105 -88 -85 -85 -93 -113 -89 -75 -104
950688 -87 -98 -80 -77 -98 -104 -70 -46 -93 -99 -86 -114 -94 -54 -117 -107 -79 -96 -77 -101 -96 -83 -93 -75 -83 -91 -111 -127 -111 -91 -99 -77 -82 -114 -103
951720 -73 -91 -119 -97 -108 -67 -108 -91 -86 -101 -102 -93 -135 -113 -76 -44 -101 -52 -105 -81 -90 -98 -73 -94 -84 -83 -84 -108 -98 -121 -92 -112 -106 -111 -92 -91
952781 -126 -79 -108 -70 -109 -113 -96 -74 -84 -49 -104 -90 -99 -81 -92 -96 -90 -52 -98 -86 -98 -81 -88 -117 -88 -80 -113 -131 -88 -35 -58 -96 -92 -106
953784 -95 -77 -87 -72 -99 -82 -79 -106 -101 -112 -104 -78 -104 -121 -84 -113 -99 -75 -76 -101 -90 -109 -96 -111 -79 -89 -53 -107 -103 -101 -116 -59 -113 -118
954786 -118 -81 -121 -83 -92 -105 -141 -113 -72 -98 -81 -103 -110 -77 -62 -95 -121 -114 -102 -93 -108 -129 -94 -86 -66 -84 -103 -90 -116 -110 -82 -96 -82 -84
955789 -107 -85 -88 -67 -69 -97 -118 -82 -88 -91 -101 -119 -90 -93 -82 -120 -82 -83 -98 -106 -72 -64 -91 -112 -113 -78 -74 -78 -98 -79 -103 -120 -78 -98 -89 -68 -108
956880 -99 -94 -132 -98 -76
957027a18  $$checkpoint
##END=
##TITLE= acetophenone
##JCAMP-DX= 5.01 $$ JDXView vs 1
##DATA TYPE= NMR SPECTRUM
##DATA CLASS= XYDATA
##BLOCK_ID=2
##ORIGIN= Dept of Chemistry, UWI, Mona, JAMAICA
##OWNER= public domain
##SPECTROMETER/DATA SYSTEM= TECMAG APOLLO NTNMR
##$MODELS=
<Models>
 <ModelData id="acetophenone" type="MOL">
acetophenone
  DSViewer          3D                             0

 17 17  0  0  0  0  0  0  0  0999 V2000
   -1.6931    0.0078    0.0000 C   0  0  0  0  0  0  0  0  0  1
   -0.2141    0.0078    0.0000 C   0  0  0  0  0  0  0  0  0  2
    2.5839    0.0872    0.0000 C   0  0  0  0  0  0  0  0  0  3
    0.4615    1.2373   -0.0005 C   0  0  0  0  0  0  0  0  0  4
    0.5257   -1.1809    0.0001 C   0  0  0  0  0  0  0  0  0  5
    1.9188   -1.1393    0.0005 C   0  0  0  0  0  0  0  0  0  6
    1.8539    1.2756   -0.0001 C   0  0  0  0  0  0  0  0  0  7
   -0.1262    2.1703   -0.0009 H   0  0  0  0  0  0  0  0  0  8
    0.0144   -2.1556    0.0002 H   0  0  0  0  0  0  0  0  0  9
    2.4947   -2.0764    0.0009 H   0  0  0  0  0  0  0  0  0 10
    2.3756    2.2439   -0.0001 H   0  0  0  0  0  0  0  0  0 11
    3.6838    0.1161    0.0003 H   0  0  0  0  0  0  0  0  0 12
   -2.3403    1.0639    0.0008 O   0  0  0  0  0  0  0  0  0 13
   -2.3832   -1.3197   -0.0010 C   0  0  0  0  0  0  0  0  0 14
   -2.0973   -1.8988    0.9105 H   0  0  0  0  0  0  0  0  0 15
   -2.0899   -1.9018   -0.9082 H   0  0  0  0  0  0  0  0  0 16
   -3.4920   -1.1799   -0.0059 H   0  0  0  0  0  0  0  0  0 17
  1  2  1  0  0  0
  2  5  4  0  0  0
  2  4  4  0  0  0
  3 12  1  0  0  0
  4  7  4  0  0  0
  5  6  4  0  0  0
  6 10  1  0  0  0
  6  3  4  0  0  0
  7  3  4  0  0  0
  7 11  1  0  0  0
  8  4  1  0  0  0
  9  5  1  0  0  0
 13  1  2  0  0  0
 14 16  1  0  0  0
 14  1  1  0  0  0
 14 15  1  0  0  0
 17 14  1  0  0  0
M  END
  </ModelData>
</Models>
##$PEAKS=
<Peaks type="HNMR" xUnits="ppm" yUnits="arbitrary units" >
<PeakData id="1" title="methyl group ~2.6" peakShape="singlet" model="acetophenone" atoms="15,16,17"  xMax="2.7" xMin="2.5"  yMax="10000" yMin="0" />
<PeakData id="2" title="meta H's ~7.4" peakShape="multiplet" model="acetophenone"  atoms="10,11"  xMax="7.5" xMin="7.3"  yMax="10000" yMin="0" />
<PeakData id="3" title="para H ~7.5" peakShape="multiplet" model="acetophenone" atoms="12"   xMax="7.6" xMin="7.4"  yMax="10000" yMin="0" />
$$ [...]
971366c0  $$checkpoint
##END=
##END=