##TITLE=PHENACETIN W/TMS[CDCL3 + 4 DROPS DMSO $$ Begin of the data block
##JCAMP-DX=5.00 $$ ACD/SpecManager v 12.00
##DATE= 11JAN95
##DATA TYPE=NMR SPECTRUM
##DATA CLASS=XYDATA
##ORIGIN=Pacific Lutheran
##OWNER=public domain
##.OBSERVE FREQUENCY=300.65161
##.ACQUISITION TIME=1.76475
##.ZERO FILL=0
##.SHIFT REFERENCE=INTERNAL,  ,10631, -1.0008
##.OBSERVE NUCLEUS=^1H
##.ACQUISITION MODE=SIMULTANEOUS
##SPECTROMETER/DATA SYSTEM=??
##.SOLVENT NAME=DMSO-d6
##NPOINTS=10631
##FIRSTX=3607.94042969
##LASTX=-300.88342285
##MAXX=3607.94042969
##MINX=-300.88342285
##MAXY=5684181.00000000
##MINY=-8564.44238281
##XFACTOR=1.0000000000
##YFACTOR=0.010000000000000
##FIRSTY=-2159.62963867
##DELTAX=-0.36771625
##XUNITS=HZ
##YUNITS=ARBITRARY UNITS
##XYDATA=(X++(Y..Y))
3607.9b15963b24989b45549c54503c21807b27543b39823b40552b11071a99277h7369
3603.9a38389a43578b52470b62825b21585b52032b34669a59026b11619b04766b35592
3599.9b04629b62289a99816b94082a96912a51239a90362a56890b12388b76933b88647
3595.8b91598b38316a81029b47889b92939b29007a80823b34086b75277a98792a78276
3591.8a85791a83904a05862b22122a05580a50162a61936a94983a47457b00109a95469
3587.7a86036a45955a74487a70999a57544a38693a02006a92340a51614a49729a58175
3583.7a09955b09286b55141b99395b48662b51245a66463a87420b75890b14035a89425
3579.6b03190b08166b38449b50477b27031a80376a52510a68454a51839b42293b15870
$$ y = [-215963, -224989, -245549, -354503, -321807, -227543, -239823, -240552, -211071, -199277, -87369, -138389, -143578, -252470, -262825, -221585, -252032, -234669, -159026, -211619, -204766, -235592, -204629, -262289, -199816, -294082, -196912, -151239, -190362, -156890, -212388, -276933, -288647, -291598, -238316, -181029, -247889, -292939, -229007, -180823, -234086, -275277, -198792, -178276, -185791, -183904, -105862, -222122, -105580, -150162, -161936, -194983, -147457, -200109, -195469, -186036, -145955, -174487, -170999, -157544, -138693, -102006, -192340, -151614, -149729, -158175, -109955, -209286, -255141, -299395, -248662, -251245, -166463, -187420, -275890, -214035, -189425, -203190, -208166, -238449, -250477, -227031, -180376, -152510, -168454, -151839, -242293, -215870]
3575.6b45059b83835a67484a76573a60473a33647b12349b07643b38724a74683a93959
3571.5c02451b38787b27732c03214c24376b50121b41679b12751b70086b88844c21540
3567.5b96061a82330b73723b11476b11176a96452a75713b20418a86590a86760b04556
3563.5a80576b50809c34706b43298b14614b32603a57127b13485b72948c08604b31838
3559.4b18190b12921a60149a98875b29687a83756b37976a90232b12407a96889b23607
3555.4a80367b43067b49769b96240b33411b34830a70356a65072b05716a72765b38053
3551.3b28367a42705i2593a44497a69300a57735a45912a26735b35089a83199a33740
3547.3b09056a71818b40796b02921a91368b39333a31178a38569b51031b54024b74318
$$ y = [-245059, -283835, -167484, -176573, -160473, -133647, -212349, -207643, -238724, -174683, -193959, -302451, -238787, -227732, -303214, -324376, -250121, -241679, -212751, -270086, -288844, -321540, -296061, -182330, -273723, -211476, -211176, -196452, -175713, -220418, -186590, -186760, -204556, -180576, -250809, -334706, -243298, -214614, -232603, -157127, -213485, -272948, -308604, -231838, -218190, -212921, -160149, -198875, -229687, -183756, -237976, -190232, -212407, -196889, -223607, -180367, -243067, -249769, -296240, -233411, -234830, -170356, -165072, -205716, -172765, -238053, -228367, -142705, -92593, -144497, -169300, -157735, -145912, -126735, -235089, -183199, -133740, -209056, -171818, -240796, -202921, -191368, -239333, -131178, -138569, -251031, -254024, -274318]
3543.2a09376a62990b06155b03126a57185b79439b39496a49032h5443a50022a48894
3539.2b16605b02731a46141b34642a86497a03902a29430a77982b11035a75713a48964
3535.1a70845b23813a48452a82578a69646b28387a68614d4929a15551a90019b06218
3531.1a63567b24010a60749a99675a28748a53776a96276b13140b64079a77878a74887
3527.1a77063a66591a89109a84079b19818b30769b44098a61945a96440b09388a37024
3523a35414b37280a54724a96321g4187a59025a57395a81271a54719a27625a49887a51923
3518.6a58875a83444b26025b76510b59804b54545b52201a84926b53980a42240b32552
3514.6a89795b51987b54766b67810b95121b73395a93725a95479a06989b12050b77045
$$ y = [-109376, -162990, -206155, -203126, -157185, -279439, -239496, -149032, -85443, -150022, -148894, -216605, -202731, -146141, -234642, -186497, -103902, -129430, -177982, -211035, -175713, -148964, -170845, -223813, -148452, -182578, -169646, -228387, -168614, -44929, -115551, -190019, -206218, -163567, -224010, -160749, -199675, -128748, -153776, -196276, -213140, -264079, -177878, -174887, -177063, -166591, -189109, -184079, -219818, -230769, -244098, -161945, -196440, -209388, -137024, -135414, -237280, -154724, -196321, -74187, -159025, -157395, -181271, -154719, -127625, -149887, -151923, -158875, -183444, -226025, -276510, -259804, -254545, -252201, -184926, -253980, -142240, -232552, -189795, -251987, -254766, -267810, -295121, -273395, -193725, -195479, -106989, -212050, -277045]
3510.5b83649b55655a29395a51980i9134a57776b26017b18657a60884a40990b11479
3506.5a87565a98383a71570b55730b51035b01986b48674b25282b46645b15898b10511
3502.4a91433b27697a85744a95807a46953a35811b19805a79217a54356a75063b23418
3498.4b05375b27579a04029b13160b13281b34382c06101c02238b28794b70143b99370
3494.3b71002b65128a85789a80925a97984b08129a98342a26155a67785a66268b10891
3490.3a63992a35436h5532a71653a40374a59298a38352a41079a77272b64985b43804
3486.2b35936b31862b08152a90652a50152a82643b35289c04689c12509b36875a93010
3482.2b15854b69353b22312b33592a54242b28237b72932b61306b11525b43778a96186
$$ y = [-283649, -255655, -129395, -151980, -99134, -157776, -226017, -218657, -160884, -140990, -211479, -187565, -198383, -171570, -255730, -251035, -201986, -248674, -225282, -246645, -215898, -210511, -191433, -227697, -185744, -195807, -146953, -135811, -219805, -179217, -154356, -175063, -223418, -205375, -227579, -104029, -213160, -213281, -234382, -306101, -302238, -228794, -270143, -299370, -271002, -265128, -185789, -180925, -197984, -208129, -198342, -126155, -167785, -166268, -210891, -163992, -135436, -85532, -171653, -140374, -159298, -138352, -141079, -177272, -264985, -243804, -235936, -231862, -208152, -190652, -150152, -182643, -235289, -304689, -312509, -236875, -193010, -215854, -269353, -222312, -233592, -154242, -228237, -272932, -261306, -211525, -243778, -196186]
3478.2a45107h0211a66189a55482a39451b91003a91388a92023b09637b33224b46516
3474.1b63804b76350b24338b32988b28251a79878a62186b16227a92183b62552b05815
3470.1b00185b49657a58178a63568b09042b18905a88747a61750a80479a24604b35098
3466b46164b73337b18949b57289b38382a51555a71089a43548a11127a68567a60674
3462b09055h6203a05358a53298a58499a95233a03625a56527a96497a68529a88448a99926
3457.6a11570a82262a77824b27422b52508b24443b51240a98070a29393a79462b24109
3453.5b48785a43461a92602a74475a58285a57901a52851a03697a98121b67128b53739
3449.5a66443a84087i8687a52178a74962b10368b38875b60945c01585b96814a74898
$$ y = [-145107, -80211, -166189, -155482, -139451, -291003, -191388, -192023, -209637, -233224, -246516, -263804, -276350, -224338, -232988, -228251, -179878, -162186, -216227, -192183, -262552, -205815, -200185, -249657, -158178, -163568, -209042, -218905, -188747, -161750, -180479, -124604, -235098, -246164, -273337, -218949, -257289, -238382, -151555, -171089, -143548, -111127, -168567, -160674, -209055, -86203, -105358, -153298, -158499, -195233, -103625, -156527, -196497, -168529, -188448, -199926, -111570, -182262, -177824, -227422, -252508, -224443, -251240, -198070, -129393, -179462, -224109, -248785, -143461, -192602, -174475, -158285, -157901, -152851, -103697, -198121, -267128, -253739, -166443, -184087, -98687, -152178, -174962, -210368, -238875, -260945, -301585, -296814, -174898]
3445.4b05390b58993a81393b14888c15985a90376a94769b08598b56077b62954a76562
3441.4a35140a56067a42551b28721b44493a67289b67878a76201a24986a96019a57173
3437.3a50869a12427a14765b19825b20834a83703a97625a93664a41529a47894b19326
3433.3b64552c07213b85421b57309a46469a56750a91418a97968a40426a80522b14344
3429.3a78855b31973b41554b27721b12066a09800a96941a70522b65819b16350c06673
3425.2b53620a78935b06469b62608a87493b41400a80663a55444a31445b13077b12763
3421.2b29796b26870b04701a90649a71933b11340b58003b02845a60141b12988a45742
3417.1a10834a41464a89584a83405a84012b59258a79277b02550a70783b24570b54001
$$ y = [-205390, -258993, -181393, -214888, -315985, -190376, -194769, -208598, -256077, -262954, -176562, -135140, -156067, -142551, -228721, -244493, -167289, -267878, -176201, -124986, -196019, -157173, -150869, -112427, -114765, -219825, -220834, -183703, -197625, -193664, -141529, -147894, -219326, -264552, -307213, -285421, -257309, -146469, -156750, -191418, -197968, -140426, -180522, -214344, -178855, -231973, -241554, -227721, -212066, -109800, -196941, -170522, -265819, -216350, -306673, -253620, -178935, -206469, -262608, -187493, -241400, -180663, -155444, -131445, -213077, -212763, -229796, -226870, -204701, -190649, -171933, -211340, -258003, -202845, -160141, -212988, -145742, -110834, -141464, -189584, -183405, -184012, -259258, -179277, -202550, -170783, -224570, -254001]
3413.1a83450b30436b54375a45030b39404b38231b36658b20826b09088b94050b11462
3409a51517b48861b73161a33549b35647b64443b30635a87573b61445a80683a39371
3405a69614b12956a73892a21373a36705b04071a50507a34695a63998a66461a68509
3400.9a58566a19407a30776b19398b20296b43974b20800a80385a47627a54742b04852
3396.9a81887a15720b01756a90533b96649b85401a36158i5484a29682i7980h4204b00749
3392.5b09704a65890b37481b62471b28420b57934b24902a97720a89307b07253b29449
3388.4a52863b26953b02191a87358a85070b41504b38474a61579a94189b23911a84083
3384.4a70513a67005b03792a83545a66333a69431b51634b54113b48313b80749a93620
$$ y = [-183450, -230436, -254375, -145030, -239404, -238231, -236658, -220826, -209088, -294050, -211462, -151517, -248861, -273161, -133549, -235647, -264443, -230635, -187573, -261445, -180683, -139371, -169614, -212956, -173892, -121373, -136705, -204071, -150507, -134695, -163998, -166461, -168509, -158566, -119407, -130776, -219398, -220296, -243974, -220800, -180385, -147627, -154742, -204852, -181887, -115720, -201756, -190533, -296649, -285401, -136158, -95484, -129682, -97980, -84204, -200749, -209704, -165890, -237481, -262471, -228420, -257934, -224902, -197720, -189307, -207253, -229449, -152863, -226953, -202191, -187358, -185070, -241504, -238474, -161579, -194189, -223911, -184083, -170513, -167005, -203792, -183545, -166333, -169431, -251634, -254113, -248313, -280749, -193620]
3380.3b16720b58371b20713a78120a82411a63695a32420a84834b21522b46675b81212
3376.3c10651b49622a85387b36157b33930b72816b71700b36429b69516b72684b10105
3372.3a20989b37694i4694b18949b09710b21737b44497b92664b85883a73464a70760
3368.2a90858a79148a72087a10983b20184a98877a97530a77931b14137a84291b20317
3364.2b43427b91752b36275a84765b62791a53223b39364b75827c04894b56881b38581
3360.1a68338b18782b24015a93354b42582a88832b26026b52203b31582c17462b40197
3356.1b73456a52378a80026a92300b12098b07873b37019a94089b51743a95654a90387
3352a40574a99086b04717b34311b35003b15701a21162b05506b05520b01903b26148
$$ y = [-216720, -258371, -220713, -178120, -182411, -163695, -132420, -184834, -221522, -246675, -281212, -310651, -249622, -185387, -236157, -233930, -272816, -271700, -236429, -269516, -272684, -210105, -120989, -237694, -94694, -218949, -209710, -221737, -244497, -292664, -285883, -173464, -170760, -190858, -179148, -172087, -110983, -220184, -198877, -197530, -177931, -214137, -184291, -220317, -243427, -291752, -236275, -184765, -262791, -153223, -239364, -275827, -304894, -256881, -238581, -168338, -218782, -224015, -193354, -242582, -188832, -226026, -252203, -231582, -317462, -240197, -273456, -152378, -180026, -192300, -212098, -207873, -237019, -194089, -251743, -195654, -190387, -140574, -199086, -204717, -234311, -235003, -215701, -121162, -205506, -205520, -201903, -226148]
3348a83147b34528b24709b10033a85086c22742b20940b23905c00053b59439b69047
3343.9b34501a74483a10605a66259b28366b55050b79747b17724b03565a66075g8329
3339.9a81294a80020a94243b12144b47609b19106a64619a56581a62771a90465b64754
3335.9b72046a62650a76158b18807a00942h1902a31419a27316b18983b47542b44083
3331.8a94636b42546a85074a41770a48853a75844b65092a77803b65651b00745a51433
3327.8a32327b03577a81829b26895b62213b19059b76586b34753b05048b49364a80853
3323.7b20352a74866a36876a51933a75288a34219a48029a98642b99113b62477c00413
3319.7b78180c29109a74190a76436b21734b12871b34368a33298a39749b63495c20879
$$ y = [-183147, -234528, -224709, -210033, -185086, -322742, -220940, -223905, -300053, -259439, -269047, -234501, -174483, -110605, -166259, -228366, -255050, -279747, -217724, -203565, -166075, -78329, -181294, -180020, -194243, -212144, -247609, -219106, -164619, -156581, -162771, -190465, -264754, -272046, -162650, -176158, -218807, -100942, -81902, -131419, -127316, -218983, -247542, -244083, -194636, -242546, -185074, -141770, -148853, -175844, -265092, -177803, -265651, -200745, -151433, -132327, -203577, -181829, -226895, -262213, -219059, -276586, -234753, -205048, -249364, -180853, -220352, -174866, -136876, -151933, -175288, -134219, -148029, -198642, -299113, -262477, -300413, -278180, -329109, -174190, -176436, -221734, -212871, -234368, -133298, -139749, -263495, -320879]
3315.6c30645b73358b46024b32481c50835b28480a40710a73404a83023b22881a52260
3311.6a97446b23873b14981a54550a70276a28994a11889b52228a91005a55191a89401
3307.5b20835b47637b46289b05815b16989a99629b00607a85526a46802a92553a64139
3303.5a90589b12396a00740a60210b05159b16300a64668a93916a80925a55649b98604
3299.5a98725c18712b44122b30747b42818a98760b28928a61610a82110a76196b46187
3295.4a94202b20112b16363b52345a78460b05911b33702c00415b23413b46713b22730
3291.4b35729b33559b03742a93139a91651b18886a63752b07724a05021b03866b34560
3287.3a43838a72107a82875b27546b37693c05165b77735a96020b12009b43443b03149
$$ y = [-330645, -273358, -246024, -232481, -350835, -228480, -140710, -173404, -183023, -222881, -152260, -197446, -223873, -214981, -154550, -170276, -128994, -111889, -252228, -191005, -155191, -189401, -220835, -247637, -246289, -205815, -216989, -199629, -200607, -185526, -146802, -192553, -164139, -190589, -212396, -100740, -160210, -205159, -216300, -164668, -193916, -180925, -155649, -298604, -198725, -318712, -244122, -230747, -242818, -198760, -228928, -161610, -182110, -176196, -246187, -194202, -220112, -216363, -252345, -178460, -205911, -233702, -300415, -223413, -246713, -222730, -235729, -233559, -203742, -193139, -191651, -218886, -163752, -207724, -105021, -203866, -234560, -143838, -172107, -182875, -227546, -237693, -305165, -277735, -196020, -212009, -243443, -203149]
3283.3b04418a24638b18047a77525a92012b60021b46189b40261b19273b43359b20208
3279.2c15545b42319b40891b66250b29773b36840a62293b00812b04827b50804b74600
3275.2b50339b11658b80429b50557a75981c13185b33053b27609b68449b82270a92848
3271.1a67837b51860a86279b06644b18483b78751b26746c15226b65483b11632b75751
3267.1a96841b33367b37879c24672b76066b48588a75542a31376a79444b37610a93476
3263.1b25975b55056b39901c56013b44356b31080a94164b00769a08981a68147b32222
3259b12738b36971b43053b00715b65382b76736b82086b56584b72397b75947b29498
3255a81870a77414a94649b38352a89413b26910a51968a73002b52771b20737b43946
$$ y = [-204418, -124638, -218047, -177525, -192012, -260021, -246189, -240261, -219273, -243359, -220208, -315545, -242319, -240891, -266250, -229773, -236840, -162293, -200812, -204827, -250804, -274600, -250339, -211658, -280429, -250557, -175981, -313185, -233053, -227609, -268449, -282270, -192848, -167837, -251860, -186279, -206644, -218483, -278751, -226746, -315226, -265483, -211632, -275751, -196841, -233367, -237879, -324672, -276066, -248588, -175542, -131376, -179444, -237610, -193476, -225975, -255056, -239901, -356013, -244356, -231080, -194164, -200769, -108981, -168147, -232222, -212738, -236971, -243053, -200715, -265382, -276736, -282086, -256584, -272397, -275947, -229498, -181870, -177414, -194649, -238352, -189413, -226910, -151968, -173002, -252771, -220737, -243946]
3250.9b30501c09403b42673b63968b91973b09160b78091b25063a69114c04446b71821
3246.9c06220b71208b40457b90985b93369b92337b32891a23678a49849a51739b61795
3242.8b47541b24980b15565a78461a88225b07602a44946b11531a22000b04545a96721
3238.8b06573a79942a71458b62515b81291b20158b33099b59478c29929a94743a41427
3234.7a17627a88301b30727b73895a75388a63554b01753b22148b91355b38288b35056
3230.7b09156b51058b08998b66765a72042a70953a99789b93318b61242b86839b53279
3226.7b68822c12950a82537b24740b09735a32130b51649b90188a60816b33520b00500
3222.6a41255b24822a61146b68340a90555b08509a51779a65480a56727b19000b28596
$$ y = [-230501, -309403, -242673, -263968, -291973, -209160, -278091, -225063, -169114, -304446, -271821, -306220, -271208, -240457, -290985, -293369, -292337, -232891, -123678, -149849, -151739, -261795, -247541, -224980, -215565, -178461, -188225, -207602, -144946, -211531, -122000, -204545, -196721, -206573, -179942, -171458, -262515, -281291, -220158, -233099, -259478, -329929, -194743, -141427, -117627, -188301, -230727, -273895, -175388, -163554, -201753, -222148, -291355, -238288, -235056, -209156, -251058, -208998, -266765, -172042, -170953, -199789, -293318, -261242, -286839, -253279, -268822, -312950, -182537, -224740, -209735, -132130, -251649, -290188, -160816, -233520, -200500, -141255, -224822, -161146, -268340, -190555, -208509, -151779, -165480, -156727, -219000, -228596]
3218.6b04580a64626b25202b25292b36959a95799b47502b87002b36573b12934b39500
3214.5c41885b59254a57353a59816a99901b20378a54375b03277b04127b57803b49224
3210.5b14015a43394b04887a84080a39153b36696a66781b68081b84300b49518b30031
3206.4b49081b36466a63402b06354a41963b54868b66376b09953b10518b01800a53596
3202.4a56255a91048a78580a79415a78977a86135b64071a64857a13576b18085a99898
3198.3b62035a75727a83475b18614b07902b31077a90346a89316b73578b71569a61663
3194.3b48890b54523b45167a77157a24286a51150b03984b75299a73133c26026b90356
3190.3a50665a90178a45414a88015b80743b43037b23678b72695b52497b48982b30063
$$ y = [-204580, -164626, -225202, -225292, -236959, -195799, -247502, -287002, -236573, -212934, -239500, -341885, -259254, -157353, -159816, -199901, -220378, -154375, -203277, -204127, -257803, -249224, -214015, -143394, -204887, -184080, -139153, -236696, -166781, -268081, -284300, -249518, -230031, -249081, -236466, -163402, -206354, -141963, -254868, -266376, -209953, -210518, -201800, -153596, -156255, -191048, -178580, -179415, -178977, -186135, -264071, -164857, -113576, -218085, -199898, -262035, -175727, -183475, -218614, -207902, -231077, -190346, -189316, -273578, -271569, -161663, -248890, -254523, -245167, -177157, -124286, -151150, -203984, -275299, -173133, -326026, -290356, -150665, -190178, -145414, -188015, -280743, -243037, -223678, -272695, -252497, -248982, -230063]
3186.2b27860b12380a42895b19058b14940a28573a72509b03608b48251b36599b50964
3182.2b41393b81449b98473b02837b15575a88418b74253b10755a74161b96778a59341
3178.1a26481a53517a33612a93848a84286c32377b16047a73697b19973a78172b45276
3174.1b31908a59827b89624a88371a63525b60401c09843a72741a93543b38161b92186
3170b89296b59139b53344a98809b33405a85598b10254b28623b31905b82593c21958
3166a81026b31563a89094a84573b63388b56556b06732a92068b44184b06065b17184
3161.9a37566a61092a80682b51660b44088a97264b68524b47448b31036b38326a94699
3157.9a34098b24162b90455b08614a84711a98365c06814b18980b00476a70971b36940
$$ y = [-227860, -212380, -142895, -219058, -214940, -128573, -172509, -203608, -248251, -236599, -250964, -241393, -281449, -298473, -202837, -215575, -188418, -274253, -210755, -174161, -296778, -159341, -126481, -153517, -133612, -193848, -184286, -332377, -216047, -173697, -219973, -178172, -245276, -231908, -159827, -289624, -188371, -163525, -260401, -309843, -172741, -193543, -238161, -292186, -289296, -259139, -253344, -198809, -233405, -185598, -210254, -228623, -231905, -282593, -321958, -181026, -231563, -189094, -184573, -263388, -256556, -206732, -192068, -244184, -206065, -217184, -137566, -161092, -180682, -251660, -244088, -197264, -268524, -247448, -231036, -238326, -194699, -134098, -224162, -290455, -208614, -184711, -198365, -306814, -218980, -200476, -170971, -236940]
3153.9b68978c59727c76229b36340a81843a16889a47993b36823b25949b10338b06897
3149.8a92039a97322b71551b23089a76573b62191b49867c14382b47154b95311c21014
3145.8a93274b76977c04973b74129a78996a71681b08520c02859b44594b68696b48644
3141.7b61099a78991b29066b39277a77271a80225b43256b45289b25973a94918a83285
3137.7b39158b32737a62521b66231a76804b11125a34565a61089a49460b08690a80559
3133.6b86555b75889b36269b05297a32636b02966b46673a82565a66548b50637b48550
3129.6a68946a87602b29939b92691b72212b54684b64142c04162b58729a80195a88424
3125.5a79004b22259b92419b92888a94170b97647a64133a96257b04308b34290a54451
$$ y = [-268978, -359727, -376229, -236340, -181843, -116889, -147993, -236823, -225949, -210338, -206897, -192039, -197322, -271551, -223089, -176573, -262191, -249867, -314382, -247154, -295311, -321014, -193274, -276977, -304973, -274129, -178996, -171681, -208520, -302859, -244594, -268696, -248644, -261099, -178991, -229066, -239277, -177271, -180225, -243256, -245289, -225973, -194918, -183285, -239158, -232737, -162521, -266231, -176804, -211125, -134565, -161089, -149460, -208690, -180559, -286555, -275889, -236269, -205297, -132636, -202966, -246673, -182565, -166548, -250637, -248550, -168946, -187602, -229939, -292691, -272212, -254684, -264142, -304162, -258729, -180195, -188424, -179004, -222259, -292419, -292888, -194170, -297647, -164133, -196257, -204308, -234290, -154451]
3121.5a99523b53548b23844b57066b97479b59852a94080a78488b46701b03423a97162
3117.5a89121b39988b70416b61580b79640b06987b38040a99946b23314b71294b73792
3113.4b55435b32904b94478b12683b40918a93457a49269b58847a99494a68614a90793
3109.4b08062c41516b98299b04839b15774a73274b14904b01718a82755b04259b45323
3105.3a82426b54663b52366a57925b83165b84378a92254b45455b37444a78128b15225
3101.3a52650b35764a81373b42675b84949b38966b11165a56007a41390a92689a39531
3097.2a64074b44800b53630b07958b15429b07206b40121b03865a87755a23693a87627
3093.2a89327a98633b26944b20955b16231c20538c34638a95048b23100b19135b50447
$$ y = [-199523, -253548, -223844, -257066, -297479, -259852, -194080, -178488, -246701, -203423, -197162, -189121, -239988, -270416, -261580, -279640, -206987, -238040, -199946, -223314, -271294, -273792, -255435, -232904, -294478, -212683, -240918, -193457, -149269, -258847, -199494, -168614, -190793, -208062, -341516, -298299, -204839, -215774, -173274, -214904, -201718, -182755, -204259, -245323, -182426, -254663, -252366, -157925, -283165, -284378, -192254, -245455, -237444, -178128, -215225, -152650, -235764, -181373, -242675, -284949, -238966, -211165, -156007, -141390, -192689, -139531, -164074, -244800, -253630, -207958, -215429, -207206, -240121, -203865, -187755, -123693, -187627, -189327, -198633, -226944, -220955, -216231, -320538, -334638, -195048, -223100, -219135, -250447]
3089.1b13812b39935b24130b52373a91044b00246a68513b07318b78120a75899a61970
3085.1b56904b98453b10583b28423b37351b51810b45835a86575a25239b78332b73971
3081.1b22262b04370b02131b65219b36458b05800a27999a77864a80755b46712b75147
3077b17172b27483b44049b16014a88786a63716b64381b82460a61030b15954b13420
3073b16175a94153b00614b31224a49773a55195a63165b65164a97277a97392a98397
3068.9a91853a70505b25445a91285a67667b48090c09538b54145b89888b19407b36063
3064.9b34074b25392b32036b17048b00557a22175a28702b02333a57091a55341b45070
3060.8b26951b67656a76552b08088a53560a92184a19602h7553a87347b19906b63101
$$ y = [-213812, -239935, -224130, -252373, -191044, -200246, -168513, -207318, -278120, -175899, -161970, -256904, -298453, -210583, -228423, -237351, -251810, -245835, -186575, -125239, -278332, -273971, -222262, -204370, -202131, -265219, -236458, -205800, -127999, -177864, -180755, -246712, -275147, -217172, -227483, -244049, -216014, -188786, -163716, -264381, -282460, -161030, -215954, -213420, -216175, -194153, -200614, -231224, -149773, -155195, -163165, -265164, -197277, -197392, -198397, -191853, -170505, -225445, -191285, -167667, -248090, -309538, -254145, -289888, -219407, -236063, -234074, -225392, -232036, -217048, -200557, -122175, -128702, -202333, -157091, -155341, -245070, -226951, -267656, -176552, -208088, -153560, -192184, -119602, -87553, -187347, -219906, -263101]
3056.8c11139b06068a50636a46303a66388a28768a64898b51559b41092b63147b18175
3052.8b94154c16518b48544a88571b30559b52063c24131a76921b04208b51879a72059
3048.7b07454b29614a51432i4172a90249b01710b04732b15154a82048b91132b21068
3044.7a65285g2025b22804a89903b23123a21824a59579a32151a23840i4565a16825
3040.6a43723b42832a45233a75725b17914a53185b25506b43374b13763b32321c13168
3036.6b08630a78793b11044b14756b54921a83576a86854a25335a40544b44020b88189
3032.5b72696b12378i5281a45516a48632h5553b18047b87256b11233b12089b08338
3028.5b58507b55082b21672b18639b22494b10512b47066b67602b82280b17632b75881
$$ y = [-311139, -206068, -150636, -146303, -166388, -128768, -164898, -251559, -241092, -263147, -218175, -294154, -316518, -248544, -188571, -230559, -252063, -324131, -176921, -204208, -251879, -172059, -207454, -229614, -151432, -94172, -190249, -201710, -204732, -215154, -182048, -291132, -221068, -165285, -72025, -222804, -189903, -223123, -121824, -159579, -132151, -123840, -94565, -116825, -143723, -242832, -145233, -175725, -217914, -153185, -225506, -243374, -213763, -232321, -313168, -208630, -178793, -211044, -214756, -254921, -183576, -186854, -125335, -140544, -244020, -288189, -272696, -212378, -95281, -145516, -148632, -85553, -218047, -287256, -211233, -212089, -208338, -258507, -255082, -221672, -218639, -222494, -210512, -247066, -267602, -282280, -217632, -275881]
3024.4c32310b45199b84345c08578c36467b69546a84910b00285b45830b77622b45880
3020.4a72861a62669a96215a39656b57371b44258a92534a78195b04185b35972c00295
3016.4b24693b55386b41857b46213b24670b95407b20283a84383a68532a69033a92206
3012.3a50611e8309a89818a95941a54619a37114a79220b23537b35028a69479a28453
3008.3a71469b24940a68255a87024b40584b31514a03141b27565c16209a64220a77342
3004.2a95388a74130b43989a82040b76979b53592b54821a84568b59091a59891a80473
3000.2b10030a40137b24976b41020b46640b33271a85015a94541b25410b68069b57644
2996.1b74037b46063c28130b52062b21961a86583b49584b62096b87925b76882b55073
$$ y = [-332310, -245199, -284345, -308578, -336467, -269546, -184910, -200285, -245830, -277622, -245880, -172861, -162669, -196215, -139656, -257371, -244258, -192534, -178195, -204185, -235972, -300295, -224693, -255386, -241857, -246213, -224670, -295407, -220283, -184383, -168532, -169033, -192206, -150611, -58309, -189818, -195941, -154619, -137114, -179220, -223537, -235028, -169479, -128453, -171469, -224940, -168255, -187024, -240584, -231514, -103141, -227565, -316209, -164220, -177342, -195388, -174130, -243989, -182040, -276979, -253592, -254821, -184568, -259091, -159891, -180473, -210030, -140137, -224976, -241020, -246640, -233271, -185015, -194541, -225410, -268069, -257644, -274037, -246063, -328130, -252062, -221961, -186583, -249584, -262096, -287925, -276882, -255073]
2992.1b75606b35633a88461b67850b71441b38107b13284b34906b67874b19493b72843
2988b03986b34170a98227b42896b30622a96330b68903c33481b59357b33203c22571
2984b28896a45024b53203b10855b57284b06062b43840a59586b20068b04753a91647
2980b66126b14172c55286b73342b30362b48945b51211b16131b63964a96132b68972
2975.9b93324b26334b49296b78977a49282a39637b30852b81962b58261b74027b84613
2971.9a41157a30224b16885a84511b66330b36996b55475a68383a50661a99329a67061
2967.8a99355a96938b06148b91728a88989b29466b65199a72280b46757a85662a50121
2963.8b23888a19073b08627b54602b20778b02660i5300a29064a46344b20314a65161
$$ y = [-275606, -235633, -188461, -267850, -271441, -238107, -213284, -234906, -267874, -219493, -272843, -203986, -234170, -198227, -242896, -230622, -196330, -268903, -333481, -259357, -233203, -322571, -228896, -145024, -253203, -210855, -257284, -206062, -243840, -159586, -220068, -204753, -191647, -266126, -214172, -355286, -273342, -230362, -248945, -251211, -216131, -263964, -196132, -268972, -293324, -226334, -249296, -278977, -149282, -139637, -230852, -281962, -258261, -274027, -284613, -141157, -130224, -216885, -184511, -266330, -236996, -255475, -168383, -150661, -199329, -167061, -199355, -196938, -206148, -291728, -188989, -229466, -265199, -172280, -246757, -185662, -150121, -223888, -119073, -208627, -254602, -220778, -202660, -95300, -129064, -146344, -220314, -165161]
2959.7a19560a55543b92813b05573a95453c06216b96808c38849b22419b12387b79805
2955.7b74340a97149b12672a87887b03669a96292b01526b38946a78575a42816a40775
2951.6a61322b36078b51168b64547a16583a62697b28029b81966c21131b87551b58539
2947.6b44141b04366b88382c34372b54548b69347b47752b70618b70026b26824b04061
2943.6a93836b44337b62090b17279b68967b25022b53552b06693b86178c00450b22309
2939.5b38819a77040b00489b89517b40601b02732b08769a97444a07470a44123a66962
2935.5b05800b79472a96610a92258a86417b26304b32980b73943b56208b11708b49707
2931.4b13052b20413b44942b08637b14419a30782b02873b01189a45961a88338b02784
$$ y = [-119560, -155543, -292813, -205573, -195453, -306216, -296808, -338849, -222419, -212387, -279805, -274340, -197149, -212672, -187887, -203669, -196292, -201526, -238946, -178575, -142816, -140775, -161322, -236078, -251168, -264547, -116583, -162697, -228029, -281966, -321131, -287551, -258539, -244141, -204366, -288382, -334372, -254548, -269347, -247752, -270618, -270026, -226824, -204061, -193836, -244337, -262090, -217279, -268967, -225022, -253552, -206693, -286178, -300450, -222309, -238819, -177040, -200489, -289517, -240601, -202732, -208769, -197444, -107470, -144123, -166962, -205800, -279472, -196610, -192258, -186417, -226304, -232980, -273943, -256208, -211708, -249707, -213052, -220413, -244942, -208637, -214419, -130782, -202873, -201189, -145961, -188338, -202784]
2927.4b25227a84214b68197b01364b30821b63430b09186a89474a97678b16857b35402
2923.3c01044b02605b81601a52439b54295b67910b61487c50577b67747b02240a29248
2919.3b23252b08831b57928b02166a38895a59610a60071b04236b33780a44874b36327
2915.2b79664a73867b27581b08195b89594b06445a56067a82614a59845b88954b14219
2911.2b36953b95657b11798b82436c09077b40928b78339b57013b36608a60904a96606
2907.2a40174b09586a80547a67490b25130b07713b00852a29634b07860b03059b03028
2903.1a86198b24583b32531a96419b16943b37415b32334b06574a87131b56530b53755
2899.1c12354b22819c16751c10377b68017c12614b83163a90942b29859b71262b70535
$$ y = [-225227, -184214, -268197, -201364, -230821, -263430, -209186, -189474, -197678, -216857, -235402, -301044, -202605, -281601, -152439, -254295, -267910, -261487, -350577, -267747, -202240, -129248, -223252, -208831, -257928, -202166, -138895, -159610, -160071, -204236, -233780, -144874, -236327, -279664, -173867, -227581, -208195, -289594, -206445, -156067, -182614, -159845, -288954, -214219, -236953, -295657, -211798, -282436, -309077, -240928, -278339, -257013, -236608, -160904, -196606, -140174, -209586, -180547, -167490, -225130, -207713, -200852, -129634, -207860, -203059, -203028, -186198, -224583, -232531, -196419, -216943, -237415, -232334, -206574, -187131, -256530, -253755, -312354, -222819, -316751, -310377, -268017, -312614, -283163, -190942, -229859, -271262, -270535]
2895b25505a90713b13765b40139b21279a16616a19770a31398a39532b30706a79795
2891b66862b57128a81146a30344a20852b12004b36437a85163b22029b85319b87345
2886.9c47466b97586b14979b35344b13170a98710b35043a04901b44625b87807b84344
2882.9b76936a86806b13808a95155b02022b42990a02767a46563a94886a62894a90644
2878.8b01795a87884b05943b07383a40105a89774b27002a50437a30517b55172b66351
2874.8a29562a62713a66486b10643a97527b46573b21041b31671b22087b58772b03601
2870.8b14689a52577a60447b01084b07914a93409b21343b88916b28580a87557b01591
2866.7b39234b47276a30276a40122b12312c41034b73177a88070b21131b31185b52611
$$ y = [-225505, -190713, -213765, -240139, -221279, -116616, -119770, -131398, -139532, -230706, -179795, -266862, -257128, -181146, -130344, -120852, -212004, -236437, -185163, -222029, -285319, -287345, -347466, -297586, -214979, -235344, -213170, -198710, -235043, -104901, -244625, -287807, -284344, -276936, -186806, -213808, -195155, -202022, -242990, -102767, -146563, -194886, -162894, -190644, -201795, -187884, -205943, -207383, -140105, -189774, -227002, -150437, -130517, -255172, -266351, -129562, -162713, -166486, -210643, -197527, -246573, -221041, -231671, -222087, -258772, -203601, -214689, -152577, -160447, -201084, -207914, -193409, -221343, -288916, -228580, -187557, -201591, -239234, -247276, -130276, -140122, -212312, -341034, -273177, -188070, -221131, -231185, -252611]
2862.7b62270b72000c05648c15434b78003b38395a65942a71151a82681a45117a24525
2858.6a73671a91102a51389a91008a19445a73074b24452b21704b59216a90527a41061
2854.6a77421b32492b56944b07499a78823a90691a61223a52681a69788a63881a19389
2850.5a53308d0482g8248f1800d1255A26104B59724A261286d94693e63226d55487c08861
2846.1c29627c16067c26142b87310b65051b30456b38616b37193b43693b48369c70714
2842.1c38294b99411b30263a57459b85153b87309a73928a23240a72458a47759b06975
2838b83312b16221a78059a85782a60327a87943b78362c30278b57705a81128b09331
2834a41672a97477a66212b39616a83900b26102b56032c40181c15537a24604a91802
$$ y = [-262270, -272000, -305648, -315434, -278003, -238395, -165942, -171151, -182681, -145117, -124525, -173671, -191102, -151389, -191008, -119445, -173074, -224452, -221704, -259216, -190527, -141061, -177421, -232492, -256944, -207499, -178823, -190691, -161223, -152681, -169788, -163881, -119389, -153308, -40482, -78248, -61800, -41255, 126104, 259724, 1261286, -494693, -563226, -455487, -308861, -329627, -316067, -326142, -287310, -265051, -230456, -238616, -237193, -243693, -248369, -370714, -338294, -299411, -230263, -157459, -285153, -287309, -173928, -123240, -172458, -147759, -206975, -283312, -216221, -178059, -185782, -160327, -187943, -278362, -330278, -257705, -181128, -209331, -141672, -197477, -166212, -239616, -183900, -226102, -256032, -340181, -315537, -124604, -191802]
2829.9a97039b30731b11794a81128b84729c28531b83592a62771b76604a65693a83442
2825.9b44549c01362c23749c00788c40417b83158a99354c03756c30221b66892b18581
2821.8b20459b20915a99116a57281a79488b32387b62785b84260b83670a79359b40028
2817.8a87884a90777a62999a48220a92072a65854a09426a85004a86243b07168b42053
2813.8b48864b21888c62396b24758a93310b01941a34522b54722b10184b76438b81325
2809.7c07829b45950b44958a79425a79935b67436a62615b07660a78197g2801a17237
2805.7a34536b38302a99952b39086a85301a80986a97243a55675a23169a65820a68524
2801.6a37607a54214a90155b08943a54312a70735b21236b19754c05515b51337b58273
$$ y = [-197039, -230731, -211794, -181128, -284729, -328531, -283592, -162771, -276604, -165693, -183442, -244549, -301362, -323749, -300788, -340417, -283158, -199354, -303756, -330221, -266892, -218581, -220459, -220915, -199116, -157281, -179488, -232387, -262785, -284260, -283670, -179359, -240028, -187884, -190777, -162999, -148220, -192072, -165854, -109426, -185004, -186243, -207168, -242053, -248864, -221888, -362396, -224758, -193310, -201941, -134522, -254722, -210184, -276438, -281325, -307829, -245950, -244958, -179425, -179935, -267436, -162615, -207660, -178197, -72801, -117237, -134536, -238302, -199952, -239086, -185301, -180986, -197243, -155675, -123169, -165820, -168524, -137607, -154214, -190155, -208943, -154312, -170735, -221236, -219754, -305515, -251337, -258273]
2797.6b15008a69944a99844a90140b50696b07019a79852a80887h3064a70026c05263
2793.5b35928b33909a81858a49797a96996d6709a18473a59109a61076b03247b13115
2789.5a85970b58881b99368a80887b36682b19567b20502c33358b99758b72484b05403
2785.4a92528a66148a76235b34986b49055b53899b39497a46685a95358a69226b09253
2781.4a70481a64602b41601a81999a27324a51040i3464a20219b18624a45455h0282
2777.4b73745a29851a33140a65773b09698a62099a67635a58218a79851a23955a59708
2773.3b47356b79635b34593a17119b11257a86428a22208a85090b29138b61664b19897
2769.3a72196b84056a85715a53292b44435a94399a60601a55894b27840b32146b15936
$$ y = [-215008, -169944, -199844, -190140, -250696, -207019, -179852, -180887, -83064, -170026, -305263, -235928, -233909, -181858, -149797, -196996, -46709, -118473, -159109, -161076, -203247, -213115, -185970, -258881, -299368, -180887, -236682, -219567, -220502, -333358, -299758, -272484, -205403, -192528, -166148, -176235, -234986, -249055, -253899, -239497, -146685, -195358, -169226, -209253, -170481, -164602, -241601, -181999, -127324, -151040, -93464, -120219, -218624, -145455, -80282, -273745, -129851, -133140, -165773, -209698, -162099, -167635, -158218, -179851, -123955, -159708, -247356, -279635, -234593, -117119, -211257, -186428, -122208, -185090, -229138, -261664, -219897, -172196, -284056, -185715, -153292, -244435, -194399, -160601, -155894, -227840, -232146, -215936]
2765.2a63687f0882a27182a52371h5293b8145a49256a72609b20290a69408a94435a64091
2760.8a89559a44276a47056g2635a31389a94090a69311a74222a71918a03454a73315
2756.8a89333b10316a29802a37860a03291a48868a21137f3591h5247a27280b26803
2752.7a48614a16737b41636a29856a42913a35681a92176a81937a55021a60375a42822
2748.7a56820a23747a50662a32246a93266i4239g4557a30325a04528h8913a13783a90432
2744.3i6671b60513b21929a12485b19892h3148a48875a38690b05095i6192a31088b26470
2739.9a31155a32745a64514a34882g4085e7948g4363f7740e5025g0586a38314f9362
2735.4a73026a27102a64520e7311e41a05502a11991B589a23797a33964i9648a02586
$$ y = [-163687, -60882, -127182, -152371, -85293, -28145, -149256, -172609, -220290, -169408, -194435, -164091, -189559, -144276, -147056, -72635, -131389, -194090, -169311, -174222, -171918, -103454, -173315, -189333, -210316, -129802, -137860, -103291, -148868, -121137, -63591, -85247, -127280, -226803, -148614, -116737, -241636, -129856, -142913, -135681, -192176, -181937, -155021, -160375, -142822, -156820, -123747, -150662, -132246, -193266, -94239, -74557, -130325, -104528, -88913, -113783, -190432, -96671, -260513, -221929, -112485, -219892, -83148, -148875, -138690, -205095, -96192, -131088, -226470, -131155, -132745, -164514, -134882, -74085, -57948, -74363, -67740, -55025, -70586, -138314, -69362, -173026, -127102, -164520, -57311, -541, -105502, -111991, 2589, -123797, -133964, -99648, -102586]
2731a25116a12102h5514f7300a14350c9198d5878f2077h3263e5076e2031C6082C6212
2726.3A2007f3467b3470f0215c8943e3346a0844a6631e8314C5738B2000A26058A88089
2721.5B21170B54724B75726B50953A83668A12815G5809G3793A52112A96898A61780
2717.4A25788A37973B34753A98865B07358A83827B11324A81874A78044A57978A12380
2713.4A32063A58350A69935A95188A54090A46177A69211A55798A19709B41445A65403
2709.3A67619B36111A98812A84639C71806C37864C96139B90121C36471C56383C61594
2705.3B93605B41110C43548C81112C89316D59690E13219D99038D18878D92252E25538
2701.3E08154E41393E49237E96503F19951G01342F90971G23191G37729H14000H31014
$$ y = [-125116, -112102, -85514, -67300, -114350, -39198, -45878, -62077, -83263, -55076, -52031, 36082, 36212, 12007, -63467, -23470, -60215, -38943, -53346, -10844, -16631, -58314, 35738, 22000, 126058, 188089, 221170, 254724, 275726, 250953, 183668, 112815, 75809, 73793, 152112, 196898, 161780, 125788, 137973, 234753, 198865, 207358, 183827, 211324, 181874, 178044, 157978, 112380, 132063, 158350, 169935, 195188, 154090, 146177, 169211, 155798, 119709, 241445, 165403, 167619, 236111, 198812, 184639, 371806, 337864, 396139, 290121, 336471, 356383, 361594, 293605, 241110, 343548, 381112, 389316, 459690, 513219, 499038, 418878, 492252, 525538, 508154, 541393, 549237, 596503, 619951, 701342, 690971, 723191, 737729, 814000, 831014]
2697.2H39820H64117I44526I46858I63669I47678A032359A065646A172246A184049
2693.5A264618A351339A390243A424423A469448A509722A658828A710407A798567B016826
2689.9B000509B193600B397071B638822B729290C028230C245292C447140C751333D021316
2686.2D381190D707324D982174E273939E668659F085964F597080F974429G465555H090644
2682.5H637289I321547A0070546A0864751A1665942A2814523A3983591A5358083A6925608
2679.2A8792459B0892572B3260981B5809972B8816478C1648350C4442384C6820297
2676.3C8379216C8975119C8762369C7328153C5317388C2624572B9702628B6731669
2673.3B3795233B1154906A8639136A6566414A4676527A3028776A1597720A0343562
$$ y = [839820, 864117, 944526, 946858, 963669, 947678, 1032359, 1065646, 1172246, 1184049, 1264618, 1351339, 1390243, 1424423, 1469448, 1509722, 1658828, 1710407, 1798567, 2016826, 2000509, 2193600, 2397071, 2638822, 2729290, 3028230, 3245292, 3447140, 3751333, 4021316, 4381190, 4707324, 4982174, 5273939, 5668659, 6085964, 6597080, 6974429, 7465555, 8090644, 8637289, 9321547, 10070546, 10864751, 11665942, 12814523, 13983591, 15358083, 16925608, 18792459, 20892572, 23260981, 25809972, 28816478, 31648350, 34442384, 36820297, 38379216, 38975119, 38762369, 37328153, 35317388, 32624572, 29702628, 26731669, 23795233, 21154906, 18639136, 16566414, 14676527, 13028776, 11597720, 10343562]
2670.4I382767H485504G667583F932248F322153E834993E307745D951464D631792D236382
2666.7C951453C649792C512402C274042C140687B908728B741754B661682B550534B514507
2663B354207B204679B229818B159231B107944B022644A811961A791931A601946A600163
2659.3A558747A504473A326915A329981A304340A292390A156531A170881A196574A195250
2655.7A085738A080906A104861I40836I45046I03360G90215F82802F29721F83763F87479
2651.6G32265F93588G10717F31077E94417E76851E86419E69960D97159D81325D02912
2647.6D07527D32398D10769E33454D53672D77835C73866C97328C60278C86431C15135
2643.5B70064C75177C04336C78573C18026C11453B99496B45244C01814C28912B69503
$$ y = [9382767, 8485504, 7667583, 6932248, 6322153, 5834993, 5307745, 4951464, 4631792, 4236382, 3951453, 3649792, 3512402, 3274042, 3140687, 2908728, 2741754, 2661682, 2550534, 2514507, 2354207, 2204679, 2229818, 2159231, 2107944, 2022644, 1811961, 1791931, 1601946, 1600163, 1558747, 1504473, 1326915, 1329981, 1304340, 1292390, 1156531, 1170881, 1196574, 1195250, 1085738, 1080906, 1104861, 940836, 945046, 903360, 790215, 682802, 629721, 683763, 687479, 732265, 693588, 710717, 631077, 594417, 576851, 586419, 569960, 497159, 481325, 402912, 407527, 432398, 410769, 533454, 453672, 477835, 373866, 397328, 360278, 386431, 315135, 270064, 375177, 304336, 378573, 318026, 311453, 299496, 245244, 301814, 328912, 269503]
2639.5C05945B34714C08800A83323A90540B35151A90596A56118B05068A40244A41504
2635.4A69980B30817A90563H0398A33049A17175A51366A44389B45562B63627B21800
2631.4B38313C10720C58450C01646A80227B03379H1830D6729H4161G3871G7327b1994
2627c2457f069C3715C3102F3836i7755i1592F7620e2039i9075c5974i3595A6316f813
2621.8b8809h9838e1312e5602a29353B7344f3548a17851a10378b0545F741c0468a16122
2617.1b3149a0500d4890i6503h2339f5566f8982a37498a19090g3074f1572g2026i6674
2612.3a13532a06559g9496a31176b17975i0902a46483b06534b52149a38434i2563e7461
2607.9a04230a28042i9502a68776i2485a15626a32920e7804a41863a76996i6114c5797
$$ y = [305945, 234714, 308800, 183323, 190540, 235151, 190596, 156118, 205068, 140244, 141504, 169980, 230817, 190563, 80398, 133049, 117175, 151366, 144389, 245562, 263627, 221800, 238313, 310720, 358450, 301646, 180227, 203379, 81830, 46729, 84161, 73871, 77327, -21994, -32457, -6069, 33715, 33102, 63836, -97755, -91592, 67620, -52039, -99075, -35974, -93595, 16316, -6813, -28809, -89838, -51312, -55602, -129353, 27344, -63548, -117851, -110378, -20545, 6741, -30468, -116122, -23149, -10500, -44890, -96503, -82339, -65566, -68982, -137498, -119090, -73074, -61572, -72026, -96674, -113532, -106559, -79496, -131176, -217975, -90902, -146483, -206534, -252149, -138434, -92563, -57461, -104230, -128042, -99502, -168776, -92485, -115626, -132920, -57804, -141863, -176996, -96114, -35797]
2603.5a56093a53455h9729a45808a12172a17821a33494a38881a26036a63839a28141
2599.4a92184a53365a83432a84744b16202b43084b11707a53439a99122b05895b03046
2595.4b58820b75062a17266b05402b29228a91694a44094a82745a64535a65912a85631
2591.3a90665a04478b75094b64434b58458b40364b23436a50800a24117b06330b21639
2587.3a89434a56685a38743a65889a62540b38690b28846a53756a92556b33672b69019
2583.2a83729b42285b01458b21541a57737a25089a34113a37774b21018b13205a91087
2579.2a77940b69217b55765b58329a31503b57311b07442b21213b11458b43580b09510
2575.1b01624c10906c21305c89451c18080b16799b69589b14634b40843b56465b20378
$$ y = [-156093, -153455, -89729, -145808, -112172, -117821, -133494, -138881, -126036, -163839, -128141, -192184, -153365, -183432, -184744, -216202, -243084, -211707, -153439, -199122, -205895, -203046, -258820, -275062, -117266, -205402, -229228, -191694, -144094, -182745, -164535, -165912, -185631, -190665, -104478, -275094, -264434, -258458, -240364, -223436, -150800, -124117, -206330, -221639, -189434, -156685, -138743, -165889, -162540, -238690, -228846, -153756, -192556, -233672, -269019, -183729, -242285, -201458, -221541, -157737, -125089, -134113, -137774, -221018, -213205, -191087, -177940, -269217, -255765, -258329, -131503, -257311, -207442, -221213, -211458, -243580, -209510, -201624, -310906, -321305, -389451, -318080, -216799, -269589, -214634, -240843, -256465, -220378]
2571.1b64129b36615b82178b07570b12849a96991b25430a57784b32567b27836b32827
2567.1b22059b05824b39167c01803c74256b75713b00180b71070b89996c15233a40555
2563a99630b25062a82316b38113c12429b60695b62151b20554b01853b68629b70908
2559b43694b34330b54048b26581b60875b27341b38819b91371b06559b94283b28219
2554.9b25021b14141b76641b73624b69019a94729a89193a44208a47111a91399a88251
2550.9b68749b13119b18904a32940a99595a69364b10609a70180a51890a62028a99907
2546.8b53755a78765a76767i7431a70357a79203a73345a10907a80156a80874b04376
2542.8b30403a08508a76607b33468a81501b91795b32115b09099c12954b11005a89958
$$ y = [-264129, -236615, -282178, -207570, -212849, -196991, -225430, -157784, -232567, -227836, -232827, -222059, -205824, -239167, -301803, -374256, -275713, -200180, -271070, -289996, -315233, -140555, -199630, -225062, -182316, -238113, -312429, -260695, -262151, -220554, -201853, -268629, -270908, -243694, -234330, -254048, -226581, -260875, -227341, -238819, -291371, -206559, -294283, -228219, -225021, -214141, -276641, -273624, -269019, -194729, -189193, -144208, -147111, -191399, -188251, -268749, -213119, -218904, -132940, -199595, -169364, -210609, -170180, -151890, -162028, -199907, -253755, -178765, -176767, -97431, -170357, -179203, -173345, -110907, -180156, -180874, -204376, -230403, -108508, -176607, -233468, -181501, -291795, -232115, -209099, -312954, -211005, -189958]
2538.7a75353a75495a72003a54851b80640b13099b40168a64009a42445a71575b55467
2534.7b22726b19551a27496a60918b28868b52044b33480b25670b84649a81509b36996
2530.7a93108a21123b35127b15344a96207a83621b67317a94549a77005a79910b16716
2526.6a81913b38386b74446b21811b71253a60149a90359a96903a54517b19414a62959
2522.6b23759b49035b19849a83224a76674b11198a36355b79182b21438c56515c21617
2518.5b44551b34833a72679a57891b38979b49601a69289b22037a68798b24987b77974
2514.5c13197a93417b66345b25411b73290b81355a62212a61860a44895a67667b70611
2510.4c21579c44446b68275b90684b05143b58388b36234b33908b83167b69311c42358
$$ y = [-175353, -175495, -172003, -154851, -280640, -213099, -240168, -164009, -142445, -171575, -255467, -222726, -219551, -127496, -160918, -228868, -252044, -233480, -225670, -284649, -181509, -236996, -193108, -121123, -235127, -215344, -196207, -183621, -267317, -194549, -177005, -179910, -216716, -181913, -238386, -274446, -221811, -271253, -160149, -190359, -196903, -154517, -219414, -162959, -223759, -249035, -219849, -183224, -176674, -211198, -136355, -279182, -221438, -356515, -321617, -244551, -234833, -172679, -157891, -238979, -249601, -169289, -222037, -168798, -224987, -277974, -313197, -193417, -266345, -225411, -273290, -281355, -162212, -161860, -144895, -167667, -270611, -321579, -344446, -268275, -290684, -205143, -258388, -236234, -233908, -283167, -269311, -342358]
2506.4c15512b93957b79042b27596b77436b80291b32047a92305b11533b43271b50449
2502.3a90043b17691b12665b12871a99945b52317b67108b20564b13938b85559a88061
2498.3a92624b18996b81938a84849b03093b54760b20963b60222b79394b72871c19546
2494.3c11593b49541b56734b68870b20987b50680b51209a67652b27964b70381c42059
2490.2b57804b55391c29025b96729b21803b18422c11951c17243c30598b00821a21589
2486.2b85747b91493a48121b41950b51717b48895b52930b25140c12326c79606b44402
2482.1b24909b19034b15638b71193b09924b15078b72059b66785b71608b08323b40609
2478.1b61057b31356b05861c21082b79452c28837b76786b54892b30579b28506b45132
$$ y = [-315512, -293957, -279042, -227596, -277436, -280291, -232047, -192305, -211533, -243271, -250449, -190043, -217691, -212665, -212871, -199945, -252317, -267108, -220564, -213938, -285559, -188061, -192624, -218996, -281938, -184849, -203093, -254760, -220963, -260222, -279394, -272871, -319546, -311593, -249541, -256734, -268870, -220987, -250680, -251209, -167652, -227964, -270381, -342059, -257804, -255391, -329025, -296729, -221803, -218422, -311951, -317243, -330598, -200821, -121589, -285747, -291493, -148121, -241950, -251717, -248895, -252930, -225140, -312326, -379606, -244402, -224909, -219034, -215638, -271193, -209924, -215078, -272059, -266785, -271608, -208323, -240609, -261057, -231356, -205861, -321082, -279452, -328837, -276786, -254892, -230579, -228506, -245132]
2474b63924b36873b00947b78178a96808a88037b28276b76108a83547b39575b94400
2470b89132b31772b34153b44786b88105b37134a46364a47859b19690b12715b51819
2465.9b91213b48648b99109b45364b62064a87328b34699b71786b59696c32542b95225
2461.9b74029b81243c38895c51100b36573b55589b36796b32628b59666b07976b25305
2457.9b22126b87359c75728c23148a99767b79545b74735b69612a70747a45935b56723
2453.8a83709b26608b39308a93949b41887a94222b43962a98651a93883a81419b01299
2449.8b21975b26562c05170d23629c45086b15157a94066c47887c43336c21762c06350
2445.7b88209c16260a71559b37118b84863b20286a87934a66893a66392b10298b88243
$$ y = [-263924, -236873, -200947, -278178, -196808, -188037, -228276, -276108, -183547, -239575, -294400, -289132, -231772, -234153, -244786, -288105, -237134, -146364, -147859, -219690, -212715, -251819, -291213, -248648, -299109, -245364, -262064, -187328, -234699, -271786, -259696, -332542, -295225, -274029, -281243, -338895, -351100, -236573, -255589, -236796, -232628, -259666, -207976, -225305, -222126, -287359, -375728, -323148, -199767, -279545, -274735, -269612, -170747, -145935, -256723, -183709, -226608, -239308, -193949, -241887, -194222, -243962, -198651, -193883, -181419, -201299, -221975, -226562, -305170, -423629, -345086, -215157, -194066, -347887, -343336, -321762, -306350, -288209, -316260, -171559, -237118, -284863, -220286, -187934, -166893, -166392, -210298, -288243]
2441.7b54914c06423b81876b24910b48110b71424b25967a46666b68946a77701b13306
2437.6b10067b44627b04373b26708a46988b28912b54374b61819b73088a97856b61653
2433.6b59907a34409b37768b17681b00017b29737b15820b63539b25298b94405c19079
2429.5c51131b73148b30684b55230b03825b21230b39268b44976b85134b54117b45873
2425.5b11932b73717b32280b42187b07670b79468b23594b09202b37524c58732c02597
2421.5c41387b65601a92062c34330b57908a86063a87434a32048a63184a80461b10758
2417.4a65503b43775b20100b07052b18568b85386b49463b35565b60197c19088b54581
2413.4a91271b13668b95979b57783b42780a85754a89469a68700b30151a83638b61633
$$ y = [-254914, -306423, -281876, -224910, -248110, -271424, -225967, -146666, -268946, -177701, -213306, -210067, -244627, -204373, -226708, -146988, -228912, -254374, -261819, -273088, -197856, -261653, -259907, -134409, -237768, -217681, -200017, -229737, -215820, -263539, -225298, -294405, -319079, -351131, -273148, -230684, -255230, -203825, -221230, -239268, -244976, -285134, -254117, -245873, -211932, -273717, -232280, -242187, -207670, -279468, -223594, -209202, -237524, -358732, -302597, -341387, -265601, -192062, -334330, -257908, -186063, -187434, -132048, -163184, -180461, -210758, -165503, -243775, -220100, -207052, -218568, -285386, -249463, -235565, -260197, -319088, -254581, -191271, -213668, -295979, -257783, -242780, -185754, -189469, -168700, -230151, -183638, -261633]
2409.3b07006a94469b60139b41143c02624b13371b73633b42238a65226a82771b60545
2405.3b05547c39443c29357b25985b18251c06688b78712a98393a63673a32049a58014
2401.2a75951b14136c00324b34969b42789b39507b52966b23901b10295a77523b07133
2397.2b44988b41149b22421a98571b28306a47545b16096a69766b02938b07916b77212
2393.1b68324c28219c15012c20483b58094a80671b23648a80197a69447b09414b34184
2389.1a91005a33650a95577b37548a72742a29214a68161b68623b40936b11004b98593
2385.1c67020b33721a86444b29500b27599a89895b17266b27051b43124b24083a71159
2381a70942a77600b05216b43934b22550b11774b27470b79854b22134a69144a35733
$$ y = [-207006, -194469, -260139, -241143, -302624, -213371, -273633, -242238, -165226, -182771, -260545, -205547, -339443, -329357, -225985, -218251, -306688, -278712, -198393, -163673, -132049, -158014, -175951, -214136, -300324, -234969, -242789, -239507, -252966, -223901, -210295, -177523, -207133, -244988, -241149, -222421, -198571, -228306, -147545, -216096, -169766, -202938, -207916, -277212, -268324, -328219, -315012, -320483, -258094, -180671, -223648, -180197, -169447, -209414, -234184, -191005, -133650, -195577, -237548, -172742, -129214, -168161, -268623, -240936, -211004, -298593, -367020, -233721, -186444, -229500, -227599, -189895, -217266, -227051, -243124, -224083, -171159, -170942, -177600, -205216, -243934, -222550, -211774, -227470, -279854, -222134, -169144, -135733]
2377a65779a86020a22003b10007a76275a84547b53301b33585b14972b61727b87800
2372.9a98741b28943a88117b07150b41621a64229a73430a89926b32019b13788b40660
2368.9a89747a18618a63052b80603a84481a31663a93038a68446a35493a74447b33971
2364.8b71814b84163b11085a51825b17498b08297a93776a49737b06597b14377b27853
2360.8a55571a70924a99436b89082a98179a29729a45314a82538b05866a29276b17666
2356.7i2190g3950h7942a60773h9232h3762b163a00386A8473b1929f1778f0253D7159
2352F0571F2933I0721D9134H8101G5107A78741B63785B59767B89065B32275C32845
2347.5D45478D46234D76663D87980E36367E37373E74682E26878D91284D05104D89248
$$ y = [-165779, -186020, -122003, -210007, -176275, -184547, -253301, -233585, -214972, -261727, -287800, -198741, -228943, -188117, -207150, -241621, -164229, -173430, -189926, -232019, -213788, -240660, -189747, -118618, -163052, -280603, -184481, -131663, -193038, -168446, -135493, -174447, -233971, -271814, -284163, -211085, -151825, -217498, -208297, -193776, -149737, -206597, -214377, -227853, -155571, -170924, -199436, -289082, -198179, -129729, -145314, -182538, -205866, -129276, -217666, -92190, -73950, -87942, -160773, -89232, -83762, -2163, -100386, 18473, -21929, -61778, -60253, 47159, 60571, 62933, 90721, 49134, 88101, 75107, 178741, 263785, 259767, 289065, 232275, 332845, 445478, 446234, 476663, 487980, 536367, 537373, 574682, 526878, 491284, 405104, 489248]
2343.5D12683C91328C63446B96413B37410B06736A69927A23468A07804F9415A5725
2339.5A7999i843f5866g4768g891g3198i5561f8141d8562a41897g7539c5336h4846
2334.7a06329a35748e5426a28446f2034a24238f3516a37646a45893a12184b54588b22453
2330.3a54956a51869a26087a07573a51329b42325b37069a72800b03014e2828a62745
2326.2a96174a17459a32176a92507a77201b01359b24175h1552a38398a39856a70128
2322.2a53305a73865a30663b42116b50956b01469b47033b17442a03548a97193b50328
2318.1c09665b15150b89983b40612b04047b72488a80291b35170a49555b81990b64155
2314.1b52123b37675a89300b89359b49797b12420a97453b17220a64594b13234a83623
$$ y = [412683, 391328, 363446, 296413, 237410, 206736, 169927, 123468, 107804, 69415, 15725, 17999, -9843, -65866, -74768, -7891, -73198, -95561, -68141, -48562, -141897, -77539, -35336, -84846, -106329, -135748, -55426, -128446, -62034, -124238, -63516, -137646, -145893, -112184, -254588, -222453, -154956, -151869, -126087, -107573, -151329, -242325, -237069, -172800, -203014, -52828, -162745, -196174, -117459, -132176, -192507, -177201, -201359, -224175, -81552, -138398, -139856, -170128, -153305, -173865, -130663, -242116, -250956, -201469, -247033, -217442, -103548, -197193, -250328, -309665, -215150, -289983, -240612, -204047, -272488, -180291, -235170, -149555, -281990, -264155, -252123, -237675, -189300, -289359, -249797, -212420, -197453, -217220, -164594, -213234, -183623]
2310a47337a58080b19307b08025a99712a94190a93991b38740b16946a65176a87385
2306b29593b04093b56979b89089b84289b83983b70281b78182b68969b26059a84240
2302b17177b04916b21231a95487b71827b22284b50767b03969b73390b74598b36164
2297.9b11011a70373h3516a53888a35015a09814i4768a92457b26674a93927a55320
2293.9a99110a33500a61392a78352b50287b23443c30561b49485b64260b78297b22609
2289.8a73254b46198b62292b34210a88000b24971b76513b96923a39187a50730a43661
2285.8b71161b35279b00935b48435a82909b23028b67700b14384a78431a43861a52563
2281.7i4118h5569f4984e4373C075c2442d9466F0012A42410A78059C9525d1628C6815
$$ y = [-147337, -158080, -219307, -208025, -199712, -194190, -193991, -238740, -216946, -165176, -187385, -229593, -204093, -256979, -289089, -284289, -283983, -270281, -278182, -268969, -226059, -184240, -217177, -204916, -221231, -195487, -271827, -222284, -250767, -203969, -273390, -274598, -236164, -211011, -170373, -83516, -153888, -135015, -109814, -94768, -192457, -226674, -193927, -155320, -199110, -133500, -161392, -178352, -250287, -223443, -330561, -249485, -264260, -278297, -222609, -173254, -246198, -262292, -234210, -188000, -224971, -276513, -296923, -139187, -150730, -143661, -271161, -235279, -200935, -248435, -182909, -223028, -267700, -214384, -178431, -143861, -152563, -94118, -85569, -64984, -54373, 3075, -32442, -49466, 60012, 142410, 178059, 39525, -41628, 36815]
2277E2657A8391f175F0117E0810C8387F4623b2501i411i7343b2790d7495f7287a02870
2271.8a00476B1945F1908b76E4578A49304B45245B05525B04777A84734B45267A36025
2267.4A48101H2570A15066D1759a26558g1949b6607B1400f6252a99769a61971a84627
2263a83417a51456a21844h3492a09140b28835a33756a18222f8256a26684a12999a55185
2258.6a90471a72089a90406a60627b19245b01089b40583b10469a52609a12838a38053
2254.5a42207b14744b18040a61926b09132a27853a20993a32931a40611a69265a14854
2250.5a15669a82758b06925b27280g6514a68397a78719i8126a52651i4551a52763a69162
2246.1i5583b6060a70403a62058i0879d6486h9289A8389H67g205c1016h400g35C669
$$ y = [52657, 18391, -6175, 60117, 50810, 38387, 64623, -22501, -9411, -97343, -22790, -47495, -67287, -102870, -100476, 21945, 61908, -276, 54578, 149304, 245245, 205525, 204777, 184734, 245267, 136025, 148101, 82570, 115066, 41759, -126558, -71949, -26607, 21400, -66252, -199769, -161971, -184627, -183417, -151456, -121844, -83492, -109140, -228835, -133756, -118222, -68256, -126684, -112999, -155185, -190471, -172089, -190406, -160627, -219245, -201089, -240583, -210469, -152609, -112838, -138053, -142207, -214744, -218040, -161926, -209132, -127853, -120993, -132931, -140611, -169265, -114854, -115669, -182758, -206925, -227280, -76514, -168397, -178719, -98126, -152651, -94551, -152763, -169162, -95583, -26060, -170403, -162058, -90879, -46486, -89289, 18389, 867, -7205, -31016, -8400, -735, 3669]
2240.9C6164A7938I8879A47837D58796E76389C91985B27561B41825B48609B42638A78525
2236.5A68913A13936E3651F8278A16466a8160c6864d1803H0192I7725A98133B34730
2232.1B99704B08234A85995C21980E15147H30096G79519E04371E07088E39525D39604
2228.1B24688A77951A64704A61328I8521A31810B12606C01087B51159B18922B95165
2224A99940A85993B37814B69984C13375C11433B74418B65735B95860B66582B57500
2220D19605D62062C76784C92194D62799D80950E16074F02905F46967E08136E99639
2215.9G06296F76870F99548G54971G40869H24296H82581F68706E72105E31074D69528
2211.9F59191F76537F85379H23344I14099A245319A724898B021754B291900B442212
$$ y = [36164, 17938, 98879, 147837, 458796, 576389, 391985, 227561, 241825, 248609, 242638, 178525, 168913, 113936, 53651, 68278, 116466, -18160, -36864, -41803, 80192, 97725, 198133, 234730, 299704, 208234, 185995, 321980, 515147, 830096, 779519, 504371, 507088, 539525, 439604, 224688, 177951, 164704, 161328, 98521, 131810, 212606, 301087, 251159, 218922, 295165, 199940, 185993, 237814, 269984, 313375, 311433, 274418, 265735, 295860, 266582, 257500, 419605, 462062, 376784, 392194, 462799, 480950, 516074, 602905, 646967, 508136, 599639, 706296, 676870, 699548, 754971, 740869, 824296, 882581, 668706, 572105, 531074, 469528, 659191, 676537, 685379, 823344, 914099, 1245319, 1724898, 2021754, 2291900, 2442212]
2208.2B610047B708236B910548C256349C494861C637365C837905D104159D497663D853592
2204.5E107927E479197E880125F426637G053341G819246H912942I982803A1472107
2201.2A4037916A8607128B0615898A8805489A8204184A9497892B2116361B6940181
2198.3C7913163F3555831A13006963A38173513A06387788F7502875D6709581D1262725
2195.3D5704425D8983772C8055928B6195863B0380484A7745252A6835031A6773405
2192.4A6845916A7613636B0050272B5683864C6973900E0344053E0018925D2780456
2189.4D4511269F1291344I9267025A42956325A35518800G8947325D2858281B7224734
2186.5A9094405A4570291A2730098A3206286A6162073A6613923A2902933A2000408
$$ y = [2610047, 2708236, 2910548, 3256349, 3494861, 3637365, 3837905, 4104159, 4497663, 4853592, 5107927, 5479197, 5880125, 6426637, 7053341, 7819246, 8912942, 9982803, 11472107, 14037916, 18607128, 20615898, 18805489, 18204184, 19497892, 22116361, 26940181, 37913163, 63555831, 113006963, 138173513, 106387788, 67502875, 46709581, 41262725, 45704425, 48983772, 38055928, 26195863, 20380484, 17745252, 16835031, 16773405, 16845916, 17613636, 20050272, 25683864, 36973900, 50344053, 50018925, 42780456, 44511269, 61291344, 99267025, 142956325, 135518800, 78947325, 42858281, 27224734, 19094405, 14570291, 12730098, 13206286, 16162073, 16613923, 12902933, 12000408]
2183.6A6253570A0220470F247636D768205C869443C343963B823171B363051B117711
2180.3A872178A868544A758106A672130A467385A340769A465812A598536A676384A694008
2176.6A554304A499440A542295A805831A918195A887198A789238A622034A498651A412900
2172.9A321661A209449I58513H84469H16450G76330G12656F97418F66830F70043H21801
2168.9I39292A060844I65957A012759H60156F80846E70502E64704E43909D92432E12329
2164.8D26059D54556D24099D06624C50083C23886C80142C16154C49774D08671C93263
2160.8C33097C08833B80649B86776C74461C96753D15637B53060C82337C83290D61117
2156.7C45769B38371B04507C10902B57031C15614B45219B33320B38267B87662C29897
$$ y = [16253570, 10220470, 6247636, 4768205, 3869443, 3343963, 2823171, 2363051, 2117711, 1872178, 1868544, 1758106, 1672130, 1467385, 1340769, 1465812, 1598536, 1676384, 1694008, 1554304, 1499440, 1542295, 1805831, 1918195, 1887198, 1789238, 1622034, 1498651, 1412900, 1321661, 1209449, 958513, 884469, 816450, 776330, 712656, 697418, 666830, 670043, 821801, 939292, 1060844, 965957, 1012759, 860156, 680846, 570502, 564704, 543909, 492432, 512329, 426059, 454556, 424099, 406624, 350083, 323886, 380142, 316154, 349774, 408671, 393263, 333097, 308833, 280649, 286776, 374461, 396753, 415637, 253060, 382337, 383290, 461117, 345769, 238371, 204507, 310902, 257031, 315614, 245219, 233320, 238267, 287662, 329897]
2152.7B16876B06387A99828B23807A80444A14480A70802B69265B09579I0648A30367
2148.6D5349H6888E9570D5462A58027A90563A76997B33743A47343A59827H1878F2851
2144.2A52524A57473g542g3509b3338h9736a07041A281c4820b7389b7034e1744E2270
2139.4d2133g0569I568B6421F4336B3255c3941e3154e9290g1277b1763a49260i3129
2134.7a00812i8069e3505i3139h1582e3478a45389g5240A6014A07853I3767G5311a3185
2129.9d4850D464E464h5847h0687d6685a29360b8960D1161A38a9816a01333a62029
2125.1a76780e2226A5218a5185f9572d0807f1292h057E7631f9473a24757e4601d8163
2120.3f4560a5309d5880e0684D1905G2695H8479A20920A22215A36893I4659A01124
$$ y = [216876, 206387, 199828, 223807, 180444, 114480, 170802, 269265, 209579, 90648, 130367, 45349, 86888, 59570, 45462, 158027, 190563, 176997, 233743, 147343, 159827, 81878, 62851, 152524, 157473, -7542, -73509, -23338, -89736, -107041, 1281, -34820, -27389, -27034, -51744, 52270, -42133, -70569, 9568, 26421, 64336, 23255, -33941, -53154, -59290, -71277, -21763, -149260, -93129, -100812, -98069, -53505, -93139, -81582, -53478, -145389, -75240, 16014, 107853, 93767, 75311, -13185, -44850, 4464, 5464, -85847, -80687, -46685, -129360, -28960, 41161, 138, -19816, -101333, -162029, -176780, -52226, 15218, -15185, -69572, -40807, -61292, -8057, 57631, -69473, -124757, -54601, -48163, -64560, -15309, -45880, -50684, 41905, 72695, 88479, 120920, 122215, 136893, 94659, 101124]
2115.9H0698a30159F240F8986a2981C6973B9133a735A14479a7730F292f3108a13809
2111.1a67688a46214c1091A08335G7828A49554A87322B91140C95442B77816A90183
2107.1A03002A175F7827A19258A62331A04341H9217H977i6475b04512a27388a03072
2102.7i4879h2794d0437f3995a16073h8680a63336a41011a45536a95526a39985a29222
2098.3a07169a10046a18580a24466a73250a79639a36748a14106e9594a04288a95152
2094.2a01009c5603a5185i1807e5039A5308F1316b6947A1257A21470A07799B35223
2089.8B46563B28823C41752D75327D26330D02557C88181E08197G05277F82193F35067
2085.8G97603G99516H52727H21387I87106I86495I98131A148653A255342A292910A274356
$$ y = [80698, -130159, 6240, 68986, -12981, 36973, 29133, -1735, 114479, -17730, 6292, -63108, -113809, -167688, -146214, -31091, 108335, 77828, 149554, 187322, 291140, 395442, 277816, 190183, 103002, 1175, 67827, 119258, 162331, 104341, 89217, 8977, -96475, -204512, -127388, -103072, -94879, -82794, -40437, -63995, -116073, -88680, -163336, -141011, -145536, -195526, -139985, -129222, -107169, -110046, -118580, -124466, -173250, -179639, -136748, -114106, -59594, -104288, -195152, -101009, -35603, -15185, -91807, -55039, 15308, 61316, -26947, 11257, 121470, 107799, 235223, 246563, 228823, 341752, 475327, 426330, 402557, 388181, 508197, 705277, 682193, 635067, 797603, 799516, 852727, 821387, 987106, 986495, 998131, 1148653, 1255342, 1292910, 1274356]
2081.7A326176A290649A200986A052766A017754A000049I16189I75964I33741H86477
2078I78441I65746A072617A035051A057366A156897A146791A266383A323750A370817
2074.4A419583A508070A472758A468155A257575A085165H65261H22092F84216E66142
2070.7D41759D81459D82702C94609B95350A67745I2473E2752f916H8056g1d689b2598
2065.9i092i581B1604I391d0628d0197b1606a0824A4396C1793I295A4721b9233G909
2060.8a8986c6664a42925a02299a09508a21305a73230a22710a11449E209f039i9734
2056.3a77513a14936a26219e128C7746F8456D7162F9563g782D6871A08561A35961g42
2051.6A2791B7444H2790C23571F45401G35288D41054C39387D08646C08380C74208B34891
$$ y = [1326176, 1290649, 1200986, 1052766, 1017754, 1000049, 916189, 975964, 933741, 886477, 978441, 965746, 1072617, 1035051, 1057366, 1156897, 1146791, 1266383, 1323750, 1370817, 1419583, 1508070, 1472758, 1468155, 1257575, 1085165, 865261, 822092, 684216, 566142, 441759, 481459, 482702, 394609, 295350, 167745, 92473, 52752, -6916, 88056, -71, -4689, -22598, -9092, -9581, 21604, 9391, -40628, -40197, -21606, -10824, 14396, 31793, 9295, 14721, -29233, 7909, -18986, -36664, -142925, -102299, -109508, -121305, -173230, -122710, -111449, 5209, -6039, -99734, -177513, -114936, -126219, -5128, 37746, 68456, 47162, 69563, -7782, 46871, 108561, 135961, -742, 12791, 27444, 82790, 323571, 645401, 735288, 441054, 339387, 408646, 308380, 374208, 234891]
2047.2A78759A5948d3449c1935C6797D3277b6637A21459I6283I1617A70021B52371
2042.7B51884B89153C30616C94829F40835H18756F65706E11925D07326D17507C18148
2038.7C16223B56973B54353B51354B45874B27386C13833C81306C48946C49108C34462
2034.7D63924C82869D62722E17143F47868G27218F89662G47653H21939H12583H54909
2030.6H84975A024141A245313A465977A752763A890944B080862B229475B279505B227417
2026.9B246137B309348B099133B189854B070678A926080A954290A803945A633930A433304
2023.3A403799A374576A574534A711127A857779A917063B134925B490706C087436C516595
2019.6C772266D091576D229928D329095D371302D623600D784516D895283E033750E224149
$$ y = [178759, 15948, -43449, -31935, 36797, 43277, -26637, 121459, 96283, 91617, 170021, 252371, 251884, 289153, 330616, 394829, 640835, 818756, 665706, 511925, 407326, 417507, 318148, 316223, 256973, 254353, 251354, 245874, 227386, 313833, 381306, 348946, 349108, 334462, 463924, 382869, 462722, 517143, 647868, 727218, 689662, 747653, 821939, 812583, 854909, 884975, 1024141, 1245313, 1465977, 1752763, 1890944, 2080862, 2229475, 2279505, 2227417, 2246137, 2309348, 2099133, 2189854, 2070678, 1926080, 1954290, 1803945, 1633930, 1433304, 1403799, 1374576, 1574534, 1711127, 1857779, 1917063, 2134925, 2490706, 3087436, 3516595, 3772266, 4091576, 4229928, 4329095, 4371302, 4623600, 4784516, 4895283, 5033750, 5224149]
2015.9E603603F080052F371070F575093F947238G548608H323553I052377A0108578
2012.6A1509610A3381888A6675225B1943883B3545664B1110869B0441995B1977280
2009.7B5298919C1928606D5730756G7740900A32125988A50135688A08999013F8071644
2006.7D7908384D3298559D8438191E0399844C8095603B6022519B0202166A7627758
2003.8A6721688A6495761A6578533A7208375A9703198B5429627C6717953D8598684
2000.8D6993419D0797972D3773638F1501344I7845325A32950800A16807825F5958050
1997.9C6169919B3126247A6414573A2682486A0939675A1361051A3546095A3460795
1994.9I846405G317886E671554D354243C723387C341433C144298B794155B387396B053487
$$ y = [5603603, 6080052, 6371070, 6575093, 6947238, 7548608, 8323553, 9052377, 10108578, 11509610, 13381888, 16675225, 21943883, 23545664, 21110869, 20441995, 21977280, 25298919, 31928606, 45730756, 77740900, 132125988, 150135688, 108999013, 68071644, 47908384, 43298559, 48438191, 50399844, 38095603, 26022519, 20202166, 17627758, 16721688, 16495761, 16578533, 17208375, 19703198, 25429627, 36717953, 48598684, 46993419, 40797972, 43773638, 61501344, 97845325, 132950800, 116807825, 65958050, 36169919, 23126247, 16414573, 12682486, 10939675, 11361051, 13546095, 13460795, 9846405, 7317886, 5671554, 4354243, 3723387, 3341433, 3144298, 2794155, 2387396, 2053487]
1991.3A825310A732326A791906A565565A385344A289619A136478A304453A530456A607170
1987.6A656970A480043A396349A477552A767802A836710A681044A611660A486707A317689
1983.9A282926A262681A079165H64950F26185E82357F05178F47383F16865F20923F35033
1979.9F72772H33050H63232I10035I18163G97663F49675E37308E00983E18005E11398
1975.8D46056D54045C75178C51958C96073B78688B68309B93974C02963B21607B02746
1971.8B85043B68496B41242B46819C63563B71581C83456C25484A90823B96404B96403
1967.7B45420C18324C26677C14842B49086B36586B95342B64602B49861B00072B47262
1963.7B36075A99600A82376A93664A84628A54447A58113A51399B24864A78132A56883
$$ y = [1825310, 1732326, 1791906, 1565565, 1385344, 1289619, 1136478, 1304453, 1530456, 1607170, 1656970, 1480043, 1396349, 1477552, 1767802, 1836710, 1681044, 1611660, 1486707, 1317689, 1282926, 1262681, 1079165, 864950, 626185, 582357, 605178, 647383, 616865, 620923, 635033, 672772, 833050, 863232, 910035, 918163, 797663, 649675, 537308, 500983, 518005, 511398, 446056, 454045, 375178, 351958, 396073, 278688, 268309, 293974, 302963, 221607, 202746, 285043, 268496, 241242, 246819, 363563, 271581, 383456, 325484, 190823, 296404, 296403, 245420, 318324, 326677, 314842, 249086, 236586, 295342, 264602, 249861, 200072, 247262, 236075, 199600, 182376, 193664, 184628, 154447, 158113, 151399, 224864, 178132, 156883]
1959.6F4438A31602A11738A99945A69927A52769A30451A24982A12967A36289b0128
1955.6c5289C9526a6058A7748h5616c1880d581i4436g0602F1436i735a1006A5402A3839
1950.5d1240b1191a30420a32316a38313e9738h4855d8632b1080a56314a94405a08967
1946d8773h6146a60869b39764a94546b31929b27298a94297b60113a86458g6664b11092
1941.6a86264a38220a26850b37788b14014a40338a31549B4787f4672a81084a88377
1937.6b26785b54119a75458a72785b14953b06691a96949a44645a86131a81828a23094
1933.5a66942a39107a80385b16869a08053a28130a29326g0798a70336i0408E4921F4001
1929.1A41518G0709B10311A68468B01012A55162B09362B17822A87372G8902d0725i3050
$$ y = [64438, 131602, 111738, 199945, 169927, 152769, 130451, 124982, 112967, 136289, -20128, -35289, 39526, -16058, 17748, -85616, -31880, -4581, -94436, -70602, 61436, -9735, -11006, 15402, 13839, -41240, -21191, -130420, -132316, -138313, -59738, -84855, -48632, -21080, -156314, -194405, -108967, -48773, -86146, -160869, -239764, -194546, -231929, -227298, -194297, -260113, -186458, -76664, -211092, -186264, -138220, -126850, -237788, -214014, -140338, -131549, 24787, -64672, -181084, -188377, -226785, -254119, -175458, -172785, -214953, -206691, -196949, -144645, -186131, -181828, -123094, -166942, -139107, -180385, -216869, -108053, -128130, -129326, -70798, -170336, -90408, 54921, 64001, 141518, 70709, 210311, 168468, 201012, 155162, 209362, 217822, 187372, 78902, -40725, -93050]
1924.7b8078b0764d7049a08520a06274i4148e820b0587g6463F9772I3176A06130I4572
1919.9A84248A55092b0025e4050a0706b5698a0232F5569d741f00A8186a10783a47528
1915.2a14663a85470a63096d5376i2431a58842a80752b45847b44952b20916b56073
1911.1b06457b06361a96440b41972b18512b21736a42642b14944b48270b06659b02795
1907.1a82687a86436a91788b57815b69440b28748b05193c14008b77599c03271b34205
1903b28987b18664b21523a39738a75339a23345b19337a38597c43523c39289c29286
1899b48953b85240c01462b39898b98994a81780b80824b99045b65094a43019b57170
1894.9b58563c49501c06015b53391b40847c22102a99427a88421a85375a95924b79691
$$ y = [-28078, -20764, -47049, -108520, -106274, -94148, -5820, -20587, -76463, 69772, 93176, 106130, 94572, 184248, 155092, -20025, -54050, -10706, -25698, -10232, 65569, -4741, -600, 18186, -110783, -147528, -114663, -185470, -163096, -45376, -92431, -158842, -180752, -245847, -244952, -220916, -256073, -206457, -206361, -196440, -241972, -218512, -221736, -142642, -214944, -248270, -206659, -202795, -182687, -186436, -191788, -257815, -269440, -228748, -205193, -314008, -277599, -303271, -234205, -228987, -218664, -221523, -139738, -175339, -123345, -219337, -138597, -343523, -339289, -329286, -248953, -285240, -301462, -239898, -298994, -181780, -280824, -299045, -265094, -143019, -257170, -258563, -349501, -306015, -253391, -240847, -322102, -199427, -188421, -185375, -195924, -279691]
1890.9c07941b50787c09590b13617b14471b06115c21424b80914b03025a80541b90609
1886.9a97917a53604a55907b13294a41723a69126a42594a57361b48765b16723b44240
1882.8b57781b96952b79476b62214b75699b97843b53873b66643b42384b58598b70262
1878.8b07653b12944a43773b86861b85983b68326b57927b85441b56350c43686c30376
1874.7b08129b94561b42220b11727b06484b23768b56098a87286a70855b01109b04276
1870.7a93165b12187b02423a89004a38296b04898a68424a20032a53640b26326b14012
1866.6a87139a64725b11253b10001a98595a90945a08641a10196b05937b28857a79382
1862.6a93122b68199b12254b56905b10160c49308b26466b36391b32734b88140b29415
$$ y = [-307941, -250787, -309590, -213617, -214471, -206115, -321424, -280914, -203025, -180541, -290609, -197917, -153604, -155907, -213294, -141723, -169126, -142594, -157361, -248765, -216723, -244240, -257781, -296952, -279476, -262214, -275699, -297843, -253873, -266643, -242384, -258598, -270262, -207653, -212944, -143773, -286861, -285983, -268326, -257927, -285441, -256350, -343686, -330376, -208129, -294561, -242220, -211727, -206484, -223768, -256098, -187286, -170855, -201109, -204276, -193165, -212187, -202423, -189004, -138296, -204898, -168424, -120032, -153640, -226326, -214012, -187139, -164725, -211253, -210001, -198595, -190945, -108641, -110196, -205937, -228857, -179382, -193122, -268199, -212254, -256905, -210160, -349308, -226466, -236391, -232734, -288140, -229415]
1858.5b59250b52493a28274a59644b80429c11300b71671c24170b06877a53771b13971
1854.5b03115b36384a60384a52644b78760b64062b09825b37569b55558b21462b68917
1850.5b57229a99035b51112a94738b20389b87005b17697b21886b43170a51168b15480
1846.4b27391b93263b09214a47014a72474a61088a84670b12352a86426b16298b45020
1842.4b03415b31146b63997b74872b64464a72514a93347b20067b54370b54883b41765
1838.3b39561c15527b57443c03281b31304b26587a80682b63482b81785b61980b88572
1834.3c09086b87083b81076b22164b41646b67339c05521b77965a52003a26972a56450
1830.2b00120b29072a82369b21874a25890a89086b15674c03672b08307b14303b07178
$$ y = [-259250, -252493, -128274, -159644, -280429, -311300, -271671, -324170, -206877, -153771, -213971, -203115, -236384, -160384, -152644, -278760, -264062, -209825, -237569, -255558, -221462, -268917, -257229, -199035, -251112, -194738, -220389, -287005, -217697, -221886, -243170, -151168, -215480, -227391, -293263, -209214, -147014, -172474, -161088, -184670, -212352, -186426, -216298, -245020, -203415, -231146, -263997, -274872, -264464, -172514, -193347, -220067, -254370, -254883, -241765, -239561, -315527, -257443, -303281, -231304, -226587, -180682, -263482, -281785, -261980, -288572, -309086, -287083, -281076, -222164, -241646, -267339, -305521, -277965, -152003, -126972, -156450, -200120, -229072, -182369, -221874, -125890, -189086, -215674, -303672, -208307, -214303, -207178]
1826.2b73275b72333b40508b19019c20717c10751b66205b40086b29803b60583b61159
1822.1b12493a74413a79372b90858a92929b31937a76388a74675a88253b19287a82705
1818.1a80729c08092b80966b68654c36325b54616b04058a89662a71163a07742a54077
1814.1a87167a93419b40594b06918b34829a72959b57146b51754b03103a86118a13592
1810b13552b29644b54865b30395b99284b87614c12924b71511b87165b74579b40482
1806a79503a46906a83375a75412b08911a80754b06099b19753b22821b29065a77347
1801.9a42313a97001b38986b08493a58967a61461a17083a63052b04662a81833b44777
1797.9b49404b11424a57804a92111b22560b17886b17294a69161a92558a73606b48507
$$ y = [-273275, -272333, -240508, -219019, -320717, -310751, -266205, -240086, -229803, -260583, -261159, -212493, -174413, -179372, -290858, -192929, -231937, -176388, -174675, -188253, -219287, -182705, -180729, -308092, -280966, -268654, -336325, -254616, -204058, -189662, -171163, -107742, -154077, -187167, -193419, -240594, -206918, -234829, -172959, -257146, -251754, -203103, -186118, -113592, -213552, -229644, -254865, -230395, -299284, -287614, -312924, -271511, -287165, -274579, -240482, -179503, -146906, -183375, -175412, -208911, -180754, -206099, -219753, -222821, -229065, -177347, -142313, -197001, -238986, -208493, -158967, -161461, -117083, -163052, -204662, -181833, -244777, -249404, -211424, -157804, -192111, -222560, -217886, -217294, -169161, -192558, -173606, -248507]
1793.8b48118b21153b74131b98079b18915a97928c18308b82321b27046a65097b30509
1789.8b82131c06046b15770b43557c50949c59104c56438c76184b94446b82898b46609
1785.7b23933a96048b11433b31847b04267b36448b62307b59650a67958a12494a24543
1781.7a42415b57367b06864a81951b56709a98779a69404a92476b69500b07842b80623
1777.7a62463b35418b96123b39018a96267a70845a97054b29362a40334b04423b38072
1773.6b72406a55538b26070b96431b06210b83909b58126a70195a32182b50913a74641
1769.6a87458a91822b41680b31895b04697b11871b94763a79747a49816b34746a99448
1765.5a42442a91502b77223b51009c62015b71622b23001a69230a82970i4282a40044
$$ y = [-248118, -221153, -274131, -298079, -218915, -197928, -318308, -282321, -227046, -165097, -230509, -282131, -306046, -215770, -243557, -350949, -359104, -356438, -376184, -294446, -282898, -246609, -223933, -196048, -211433, -231847, -204267, -236448, -262307, -259650, -167958, -112494, -124543, -142415, -257367, -206864, -181951, -256709, -198779, -169404, -192476, -269500, -207842, -280623, -162463, -235418, -296123, -239018, -196267, -170845, -197054, -229362, -140334, -204423, -238072, -272406, -155538, -226070, -296431, -206210, -283909, -258126, -170195, -132182, -250913, -174641, -187458, -191822, -241680, -231895, -204697, -211871, -294763, -179747, -149816, -234746, -199448, -142442, -191502, -277223, -251009, -362015, -271622, -223001, -169230, -182970, -94282, -140044]
1761.5a86183b22930b62599b33756b65151b09892i9095a92125a76263b53864b60484
1757.4a33981a86316b55788c11770b32791b46711c12528c03678b89270b18659b32396
1753.4a86379b45734b38939a92555b64280b03102a71703b03513a50157a88687a21587
1749.3a64780b79956a58114a88017b18991b10805a65622b43178a88067a85266b74008
1745.3b70729b30440b56986b10181a90215b51938a65710a47212g4202a46435a29585
1741.3i0314a31071a53338b78861b94145b09847b64125a44175b01058a62680b16969
1737.2c15288b06396a16383b60218c22743b94709b94415b48737a26909a27956a03771
1733.2b36634a66205b03015a90823a73864a56140a31433b67801a48765a95543a98525
$$ y = [-186183, -222930, -262599, -233756, -265151, -209892, -99095, -192125, -176263, -253864, -260484, -133981, -186316, -255788, -311770, -232791, -246711, -312528, -303678, -289270, -218659, -232396, -186379, -245734, -238939, -192555, -264280, -203102, -171703, -203513, -150157, -188687, -121587, -164780, -279956, -158114, -188017, -218991, -210805, -165622, -243178, -188067, -185266, -274008, -270729, -230440, -256986, -210181, -190215, -251938, -165710, -147212, -74202, -146435, -129585, -90314, -131071, -153338, -278861, -294145, -209847, -264125, -144175, -201058, -162680, -216969, -315288, -206396, -116383, -260218, -322743, -294709, -294415, -248737, -126909, -127956, -103771, -236634, -166205, -203015, -190823, -173864, -156140, -131433, -267801, -148765, -195543, -198525]
1729.1b34752b95859a53284a05040a56764b18395a96987b34888a93424b25646b69269
1725.1b85726b43125b37197b85663b98299c01224b48062b94229b18617b41460a49538
1721i8023b60976c06119b37566a74526a70020b35706a20411b16036b22298b00268a03409
1716.6b72163b65000b82539b47615b01696b18567a83181b18334a78120b01739b70170
1712.6b64882b96585c09675b98065b80559b66621b63329b62310b73655b47263b29020
1708.5b31894b47496a85045b22316a97808b29036b31369a94182b03279a63241i8505
1704.5b04558a78602a18587b00844a46360b27127a43165a63720a98178b26816a77352
1700.4b72974a82962a73809b47763b07015a77915a81510a48629b08303b15774b23277
$$ y = [-234752, -295859, -153284, -105040, -156764, -218395, -196987, -234888, -193424, -225646, -269269, -285726, -243125, -237197, -285663, -298299, -301224, -248062, -294229, -218617, -241460, -149538, -98023, -260976, -306119, -237566, -174526, -170020, -235706, -120411, -216036, -222298, -200268, -103409, -272163, -265000, -282539, -247615, -201696, -218567, -183181, -218334, -178120, -201739, -270170, -264882, -296585, -309675, -298065, -280559, -266621, -263329, -262310, -273655, -247263, -229020, -231894, -247496, -185045, -222316, -197808, -229036, -231369, -194182, -203279, -163241, -98505, -204558, -178602, -118587, -200844, -146360, -227127, -143165, -163720, -198178, -226816, -177352, -272974, -182962, -173809, -247763, -207015, -177915, -181510, -148629, -208303, -215774, -223277]
1696.4a34745a49227b42408b17741b51006b84323b01399b00001b71664a88948b01908
1692.3b19283b76732b18032b01025b30507a87427b20073a91688a99847a99362a72887
1688.3a64518b14520a85408a62133a70138b72928b78355c03245b36979b62975a93484
1684.3b60188b56794b30783b31057a71217a91200a46441b14471a65459b14008b20043
1680.2b22506b28967a82454a81322b08003b64550b67114a70421a80408b35236b28268
1676.2a74674a99305a63351a60485a43787a65415a51297a57549b39452a79321a92577
1672.1b16818b15060a61948a82424b56017b36970b13995b17333b28750c01564c54294
1668.1a94411a64420a79127b63885a83440a06318a26351a60091a69317b44633b15979
$$ y = [-134745, -149227, -242408, -217741, -251006, -284323, -201399, -200001, -271664, -188948, -201908, -219283, -276732, -218032, -201025, -230507, -187427, -220073, -191688, -199847, -199362, -172887, -164518, -214520, -185408, -162133, -170138, -272928, -278355, -303245, -236979, -262975, -193484, -260188, -256794, -230783, -231057, -171217, -191200, -146441, -214471, -165459, -214008, -220043, -222506, -228967, -182454, -181322, -208003, -264550, -267114, -170421, -180408, -235236, -228268, -174674, -199305, -163351, -160485, -143787, -165415, -151297, -157549, -239452, -179321, -192577, -216818, -215060, -161948, -182424, -256017, -236970, -213995, -217333, -228750, -301564, -354294, -194411, -164420, -179127, -263885, -183440, -106318, -126351, -160091, -169317, -244633, -215979]
1664a96900a93751b42955b03023a41359a31162a06843b60105b34045b60809b17635
1660b48608b38552a28317a24156b37996a68075b23129b00529a95774b49308a96034
1655.9a51892b14922b23290a43557a55995i7165a55362a32353h4675i4427a20469i5327
1651.5a47841a38103a19912a67832b37243a59394b49547c16260b22072a96723a65058
1647.5b00351b02786b62368a77705a55098a81744a97551a74303b23947a55066b22049
1643.4b06912a87986a69714b58085a93131a89009b25199b11327b08129a44595b32717
1639.4a90218b74898b77094b45340b22617a53265a59882a88286b01081a39106b02831
1635.4a42770b12486b07575b36075b90151a68340a86061a53151a82564b32179a82991
$$ y = [-196900, -193751, -242955, -203023, -141359, -131162, -106843, -260105, -234045, -260809, -217635, -248608, -238552, -128317, -124156, -237996, -168075, -223129, -200529, -195774, -249308, -196034, -151892, -214922, -223290, -143557, -155995, -97165, -155362, -132353, -84675, -94427, -120469, -95327, -147841, -138103, -119912, -167832, -237243, -159394, -249547, -316260, -222072, -196723, -165058, -200351, -202786, -262368, -177705, -155098, -181744, -197551, -174303, -223947, -155066, -222049, -206912, -187986, -169714, -258085, -193131, -189009, -225199, -211327, -208129, -144595, -232717, -190218, -274898, -277094, -245340, -222617, -153265, -159882, -188286, -201081, -139106, -202831, -142770, -212486, -207575, -236075, -290151, -168340, -186061, -153151, -182564, -232179, -182991]
1631.3a91648a68484b35620a60015a50879b25836a50090b06738a51593b57166b24165
1627.3b03633b11015b53584c52282b87399b14469a60402a13934b04922b53360b78130
1623.2b22514b83253b38710b48694a87579b22394a81599a42069b12996b26695b20113
1619.2i5297a46334b15146a56721b14618b50935b39066a38553a33001a82831g8749
1615.1a46968a95504a97977a20743a48029a41425b80794b08128a86034a70697b06371
1611.1b24994b68663c01322c39382b50998a88457h7155a16989a43894a57552b39921
1607b35161b32834b68682b25379a77218b11027b15308a65055b25124a84976a81529
1603a81504b46044b65364b55455b29521a72141a79485b18693a58144a98517b42627
$$ y = [-191648, -168484, -235620, -160015, -150879, -225836, -150090, -206738, -151593, -257166, -224165, -203633, -211015, -253584, -352282, -287399, -214469, -160402, -113934, -204922, -253360, -278130, -222514, -283253, -238710, -248694, -187579, -222394, -181599, -142069, -212996, -226695, -220113, -95297, -146334, -215146, -156721, -214618, -250935, -239066, -138553, -133001, -182831, -78749, -146968, -195504, -197977, -120743, -148029, -141425, -280794, -208128, -186034, -170697, -206371, -224994, -268663, -301322, -339382, -250998, -188457, -87155, -116989, -143894, -157552, -239921, -235161, -232834, -268682, -225379, -177218, -211027, -215308, -165055, -225124, -184976, -181529, -181504, -246044, -265364, -255455, -229521, -172141, -179485, -218693, -158144, -198517, -242627]
1599a95688b45170a93934a62792b03668b43825b29594b55967b98682a89776b55548
1594.9b00814b45014b54439b82491b87242b23353a23600b01115b58140b04966a26147
1590.9a60954b34214a61616c46822b29822a72440b13375b13304a87008b24701a71697
1586.8a71935a34989a47258b47475b39260b19781b35810a79486a55179h6667a96037
1582.8a10879f9542a55554a97262i0365a66389b07713b37056a27822b06405a62961
1578.7b63941b46298a77195b26531a91868a93954b84508c06539b91915c02936a84355
1574.7a96227b46660b90577b07848a52549a94297b38116b08835b14342a37353g9637
1570.6a28620b59746b85590b72753b73856a99140b00788a10695a85058b62505b04454
$$ y = [-195688, -245170, -193934, -162792, -203668, -243825, -229594, -255967, -298682, -189776, -255548, -200814, -245014, -254439, -282491, -287242, -223353, -123600, -201115, -258140, -204966, -126147, -160954, -234214, -161616, -346822, -229822, -172440, -213375, -213304, -187008, -224701, -171697, -171935, -134989, -147258, -247475, -239260, -219781, -235810, -179486, -155179, -86667, -196037, -110879, -69542, -155554, -197262, -90365, -166389, -207713, -237056, -127822, -206405, -162961, -263941, -246298, -177195, -226531, -191868, -193954, -284508, -306539, -291915, -302936, -184355, -196227, -246660, -290577, -207848, -152549, -194297, -238116, -208835, -214342, -137353, -79637, -128620, -259746, -285590, -272753, -273856, -199140, -200788, -110695, -185058, -262505, -204454]
1566.6b02693b83462b10157a85500b32934b31325b45925a95533a64242a30544b30241
1562.6b31879b06178b70500a92910a72303a85281a88252b15583b29422b50844a48944
1558.5a86154a84415a70700b07057b85293b20479b29979b98573c14811a80589b64159
1554.5b69932b07018b48629b83970b72722a91945a64860a95029b06002a65352a08910
1550.4h3141a60591h6997a64594a54181a96445b76303a83550b77428b00003b17590
1546.4a68300a59718f8702a91328b48093b09204a88252b00329b19702a90786a92203
1542.3a19287a04983b30346b15115a89713b11614a69931f9276a69426b84233b40507
1538.3b64302a86847b89243b60859b50166a67119a11453i3072b03138a72235b07539
$$ y = [-202693, -283462, -210157, -185500, -232934, -231325, -245925, -195533, -164242, -130544, -230241, -231879, -206178, -270500, -192910, -172303, -185281, -188252, -215583, -229422, -250844, -148944, -186154, -184415, -170700, -207057, -285293, -220479, -229979, -298573, -314811, -180589, -264159, -269932, -207018, -248629, -283970, -272722, -191945, -164860, -195029, -206002, -165352, -108910, -83141, -160591, -86997, -164594, -154181, -196445, -276303, -183550, -277428, -200003, -217590, -168300, -159718, -68702, -191328, -248093, -209204, -188252, -200329, -219702, -190786, -192203, -119287, -104983, -230346, -215115, -189713, -211614, -169931, -69276, -169426, -284233, -240507, -264302, -186847, -289243, -260859, -250166, -167119, -111453, -93072, -203138, -172235, -207539]
1534.2b37785b42858b89275b16832b67978c39598b81983b60731b08054a69109a26530
1530.2b08953a45949a85073b03295a60522a46287b12802b53932b34065a37599a67492
1526.2a75258a89993h5432a44244a19562b22318b38118b77377a06489a87694a39427
1522.1a78626a43351a68916a98264a88430a42460d6772a08024a97322a72321g5940
1518.1a09165b12179b01667b03820a28990a71371a78687a63766b38808a77224a56059
1514a96142b46396a54465a91595a92563a94505a39111a38916b61314b08781a37022
1510a91670a73640b13982b82754a80166b70042c47607b41073a56576a19082a66042
1505.9c07447b29799a91576b31691b90921b07695a59030a46341b23704b27393i0909
$$ y = [-237785, -242858, -289275, -216832, -267978, -339598, -281983, -260731, -208054, -169109, -126530, -208953, -145949, -185073, -203295, -160522, -146287, -212802, -253932, -234065, -137599, -167492, -175258, -189993, -85432, -144244, -119562, -222318, -238118, -277377, -106489, -187694, -139427, -178626, -143351, -168916, -198264, -188430, -142460, -46772, -108024, -197322, -172321, -75940, -109165, -212179, -201667, -203820, -128990, -171371, -178687, -163766, -238808, -177224, -156059, -196142, -246396, -154465, -191595, -192563, -194505, -139111, -138916, -261314, -208781, -137022, -191670, -173640, -213982, -282754, -180166, -270042, -347607, -241073, -156576, -119082, -166042, -307447, -229799, -191576, -231691, -290921, -207695, -159030, -146341, -223704, -227393, -90909]
1501.9a83408a83117b26312a42950a19373a11586a72361b38292b93353b56348a70827
1497.8a61206b10541a68133a93647c17503b05366a94287b07893a68093a39583a63300
1493.8a84766a73449a19182b09818b29891a59373a05676a90901a90933a73807a99176
1489.8b27522b11525a85498b34025b36229b06434a13960a09876a50379a76948b08099
1485.7b18126a73248b00453b00694b50751b99922b01539a81930b70316b71484a53603
1481.7a60953a65185a20246i5817f8317a44902a26502f8662a83106a64992b13652a55935
1477.3a93398b10013b03791a86294b27935a12069c5441f0109h5431b03734b56656b33880
1472.8b60489a38328a44552a57826a41982a85214a91213b50577b51038a76853b31464
$$ y = [-183408, -183117, -226312, -142950, -119373, -111586, -172361, -238292, -293353, -256348, -170827, -161206, -210541, -168133, -193647, -317503, -205366, -194287, -207893, -168093, -139583, -163300, -184766, -173449, -119182, -209818, -229891, -159373, -105676, -190901, -190933, -173807, -199176, -227522, -211525, -185498, -234025, -236229, -206434, -113960, -109876, -150379, -176948, -208099, -218126, -173248, -200453, -200694, -250751, -299922, -201539, -181930, -270316, -271484, -153603, -160953, -165185, -120246, -95817, -68317, -144902, -126502, -68662, -183106, -164992, -213652, -155935, -193398, -210013, -203791, -186294, -227935, -112069, -35441, -60109, -85431, -203734, -256656, -233880, -260489, -138328, -144552, -157826, -141982, -185214, -191213, -250577, -251038, -176853, -231464]
1468.8a89052b53462a90412a28725i5973b46705b58047b28891b24392a15210a67206
1464.8a32279a07546i1343a29637a52515a67874e4729a26113b11078a78314a23953
1460.7a41953a00995a96429c15642c11773b88671c41156a34709a63104b52210b39924
1456.7b26439a85650b13738b31111a73641b73043b49226b83907a70041a96997a61095
1452.6a87087a77579a81750a98731b47309a81486a35814a21984b50362b68713b38977
1448.6a75598a34409a21746a27797a74457b03105a41072b12562b47295a28472a83619
1444.5a92844a55945b14395b13656a88518b29040a66454a90988a95803b76851a69523
1440.5a45858a66782b34371b46373b93062b52313b89870b52359a73294a97703b10905
$$ y = [-189052, -253462, -190412, -128725, -95973, -246705, -258047, -228891, -224392, -115210, -167206, -132279, -107546, -91343, -129637, -152515, -167874, -54729, -126113, -211078, -178314, -123953, -141953, -100995, -196429, -315642, -311773, -288671, -341156, -134709, -163104, -252210, -239924, -226439, -185650, -213738, -231111, -173641, -273043, -249226, -283907, -170041, -196997, -161095, -187087, -177579, -181750, -198731, -247309, -181486, -135814, -121984, -250362, -268713, -238977, -175598, -134409, -121746, -127797, -174457, -203105, -141072, -212562, -247295, -128472, -183619, -192844, -155945, -214395, -213656, -188518, -229040, -166454, -190988, -195803, -276851, -169523, -145858, -166782, -234371, -246373, -293062, -252313, -289870, -252359, -173294, -197703, -210905]
1436.4a29809a87438b67303a55916a14448a74162a81468a98334a71499i1332e4500
1432.4a71087a96430a14824a48403b36073a80769b29956a17260b25660b14980a58805
1428.4b33171b33363b03971c28875b67777a85759b55189b49372b35932b48725a68022
1424.3a04945c9438a19849a89689a76337a68813a54420a57909h2866a32703b07696
1420.3a02181a11060a55000a71081a51787a59342g0702a34605b51796b96676b91847
1416.2b87382b43147a84572b62522a89527a77166a82494a05118a55697a90683b19806
1412.2g7366i8169i9800b04430b21733a88646a73587a95425a77748b12527a64251i8720
1407.8f4906b0051d0908a46421a08161h0180a01143b00932a30200a17672a66876a75573
$$ y = [-129809, -187438, -267303, -155916, -114448, -174162, -181468, -198334, -171499, -91332, -54500, -171087, -196430, -114824, -148403, -236073, -180769, -229956, -117260, -225660, -214980, -158805, -233171, -233363, -203971, -328875, -267777, -185759, -255189, -249372, -235932, -248725, -168022, -104945, -39438, -119849, -189689, -176337, -168813, -154420, -157909, -82866, -132703, -207696, -102181, -111060, -155000, -171081, -151787, -159342, -70702, -134605, -251796, -296676, -291847, -287382, -243147, -184572, -262522, -189527, -177166, -182494, -105118, -155697, -190683, -219806, -77366, -98169, -99800, -204430, -221733, -188646, -173587, -195425, -177748, -212527, -164251, -98720, -64906, -20051, -40908, -146421, -108161, -80180, -101143, -200932, -130200, -117672, -166876, -175573]
1403.4a58996f3044a57643a12028h3963a18325a48037a50810a59872a00305a23442
1399.3a86823b21240b04139b12551i8057a01045a49168i0687a66093a65605a70140
1395.3a36514i4271a43737a62227i8396A3128f4177a18408a62183a05139a41824a70022
1390.9b49270a68194a96110a69974a06091b20583b30164b11502a86291a17723b30746
1386.8a15018e6458a64882b45478b27287c03894b86508b43268a80980a66419a44040
1382.8d6046a17551a91054b17539c03049a70169h0389a69924a89409b37801b41493
1378.7b08226b27700a36625a41004b12050a96300a05156i4911g3176a15932a10510
1374.7a00179a56993b09197a93512b59897b14590a68065a27613a05125a09271a83691
$$ y = [-158996, -63044, -157643, -112028, -83963, -118325, -148037, -150810, -159872, -100305, -123442, -186823, -221240, -204139, -212551, -98057, -101045, -149168, -90687, -166093, -165605, -170140, -136514, -94271, -143737, -162227, -98396, 13128, -64177, -118408, -162183, -105139, -141824, -170022, -249270, -168194, -196110, -169974, -106091, -220583, -230164, -211502, -186291, -117723, -230746, -115018, -56458, -164882, -245478, -227287, -303894, -286508, -243268, -180980, -166419, -144040, -46046, -117551, -191054, -217539, -303049, -170169, -80389, -169924, -189409, -237801, -241493, -208226, -227700, -136625, -141004, -212050, -196300, -105156, -94911, -73176, -115932, -110510, -100179, -156993, -209197, -193512, -259897, -214590, -168065, -127613, -105125, -109271, -183691]
1370.6a33173b71016b41878b10609a50579b18089b06125a93744b38361b77996b14590
1366.6a83920b40390b30403a31689a64846c36220a57476a29450a64214b12052a29425
1362.5b11127a89859a54866b28200b36138b70292b87187b45660a71526a26171b28851
1358.5a92976a49586a95344h7736b04073a62530b13847a47291a88735b16087b14610
1354.5b83392b80125b28041a97558a29088a43133a58874a57925a64708b21462a10822
1350.4i5052a07380a10289a53341a17505a35362a41217g5811a84368b32983a17668
1346.4a43224c5134a99747b39402c09674b22836a55995a63812b05175b38143a35090
1342.3a34284a81724a79930b03767b53695b34540a65015h7270a45939b00461b61195
$$ y = [-133173, -271016, -241878, -210609, -150579, -218089, -206125, -193744, -238361, -277996, -214590, -183920, -240390, -230403, -131689, -164846, -336220, -157476, -129450, -164214, -212052, -129425, -211127, -189859, -154866, -228200, -236138, -270292, -287187, -245660, -171526, -126171, -228851, -192976, -149586, -195344, -87736, -204073, -162530, -213847, -147291, -188735, -216087, -214610, -283392, -280125, -228041, -197558, -129088, -143133, -158874, -157925, -164708, -221462, -110822, -95052, -107380, -110289, -153341, -117505, -135362, -141217, -75811, -184368, -232983, -117668, -143224, -35134, -199747, -239402, -309674, -222836, -155995, -163812, -205175, -238143, -135090, -134284, -181724, -179930, -203767, -253695, -234540, -165015, -87270, -145939, -200461, -261195]
1338.3a71026b22613g9496b05225b45927b18393a30519a46768a29488b08960a75880
1334.2b46929a80923b05592a16933a92538a88648b56020b58441a83902a38160a76757
1330.2b12016a94158a50180a36866b47056b69691a52056b20838a54639a95703a50174
1326.1b04645b40996b33593b56103b02171b71669b33381b39087b79816b92350b61652
1322.1a87914a01686b21554a86589b90556b04138a97553i3071a31195a25558a62299
1318.1a83809a50341a15244a56470a61048b00384b36926a88436a87710a39042e0166
1314a55588b08577a74142b18844a69190a57628a75328a53710a65840i5495b06741b32950
1309.6a55313b19026a62086b46134a88956a96375b44711a69318a59216a61539b35153
$$ y = [-171026, -222613, -79496, -205225, -245927, -218393, -130519, -146768, -129488, -208960, -175880, -246929, -180923, -205592, -116933, -192538, -188648, -256020, -258441, -183902, -138160, -176757, -212016, -194158, -150180, -136866, -247056, -269691, -152056, -220838, -154639, -195703, -150174, -204645, -240996, -233593, -256103, -202171, -271669, -233381, -239087, -279816, -292350, -261652, -187914, -101686, -221554, -186589, -290556, -204138, -197553, -93071, -131195, -125558, -162299, -183809, -150341, -115244, -156470, -161048, -200384, -236926, -188436, -187710, -139042, -50166, -155588, -208577, -174142, -218844, -169190, -157628, -175328, -153710, -165840, -95495, -206741, -232950, -155313, -219026, -162086, -246134, -188956, -196375, -244711, -169318, -159216, -161539, -235153]
1305.6a62190b26419b06153a93425b02618a99543b88561b52512b24516b60563a86916
1301.5b23856a85169a41414a92249a91590a63406a14428a75170a71511b55383a93423
1297.5b18888a87140a30688a51369a42435b19624b22942b01274a85499b32907b68818
1293.4d6831a27855b33634a53692a74102a68775b43993b74981b32266b45715b34430
1289.4b36299a57362a47547a52224a57979a49499b66938a24498a88961b60661b80041
1285.3b17045b30547a84383a59588b19050a71241d9583a94100b08811a53767a71197
1281.3b41133b28142b78141a20869b04817b08554a64645b65763b30318a76434b41018
1277.2b52516b07296b49952a51397a48575a86774a99416a78425a56310b27325b01675
$$ y = [-162190, -226419, -206153, -193425, -202618, -199543, -288561, -252512, -224516, -260563, -186916, -223856, -185169, -141414, -192249, -191590, -163406, -114428, -175170, -171511, -255383, -193423, -218888, -187140, -130688, -151369, -142435, -219624, -222942, -201274, -185499, -232907, -268818, -46831, -127855, -233634, -153692, -174102, -168775, -243993, -274981, -232266, -245715, -234430, -236299, -157362, -147547, -152224, -157979, -149499, -266938, -124498, -188961, -260661, -280041, -217045, -230547, -184383, -159588, -219050, -171241, -49583, -194100, -208811, -153767, -171197, -241133, -228142, -278141, -120869, -204817, -208554, -164645, -265763, -230318, -176434, -241018, -252516, -207296, -249952, -151397, -148575, -186774, -199416, -178425, -156310, -227325, -201675]
1273.2a98275a25788a60601a99506a68155a71296a14974a79594a70133b03242b48980
1269.2b22353b77647a91314a02947a09680a36465a52617a82682a33046a32471g2408
1265.1a44379a83805a71394a99089b17795b34936a59145a24373i1709a34865a14586
1261.1a74881b38514a80618a09286a60437a88356b01213b07283a67021a96362b02186
1257a92410a57843a30850a51263a16154a03894i6505a45977a74700b07058b44542a66790
1252.6i6082a12469f9807h4967i3797a28062a06350a92210a42905b30489b27466a74097
1248.2d3573i2909h9515a67468b28590a79040a05218a07749a69115b04277a95800a50928
1243.8a47071g5976a54965a41988F14b3991b9758a10654a61705a15232e6216b6743
$$ y = [-198275, -125788, -160601, -199506, -168155, -171296, -114974, -179594, -170133, -203242, -248980, -222353, -277647, -191314, -102947, -109680, -136465, -152617, -182682, -133046, -132471, -72408, -144379, -183805, -171394, -199089, -217795, -234936, -159145, -124373, -91709, -134865, -114586, -174881, -238514, -180618, -109286, -160437, -188356, -201213, -207283, -167021, -196362, -202186, -192410, -157843, -130850, -151263, -116154, -103894, -96505, -145977, -174700, -207058, -244542, -166790, -96082, -112469, -69807, -84967, -93797, -128062, -106350, -192210, -142905, -230489, -227466, -174097, -43573, -92909, -89515, -167468, -228590, -179040, -105218, -107749, -169115, -204277, -195800, -150928, -147071, -75976, -154965, -141988, 614, -23991, -29758, -110654, -161705, -115232, -56216, -26743]
1239.4g5636c9988i862i3451f8617C9537F7441C6768A28260E3041C6498a8035a1020
1234.6b3623a14234d1120h2818A7131e3632d7377D5320G7247E0328A73388C68618F15299
1229.8E54449D03450A41484G2359I1536a551d2330b8522a7961A0846f4483B7066g141
1225c6341E198D0355B01268C05959E18320E34617B96698A08462G5389G6739c340g1948
1220.3e9100e0709g6859a31707a55163d6892g5181F015A8260d9138A08758A65724A25840
1215.5B7616C6852H732a39557a00058d8398a33127a19333d3212a97627a02987b9359
1211.1a1210a28121f9481c484g5555H533D5737A91140B74737A53649C2694H4202A01049
1206.3D2123D3723A2684g824c0002h4533c6892A9848b9544C3497H7006G7086B42416
$$ y = [-75636, -39988, -9862, -93451, -68617, 39537, 67441, 36768, 128260, 53041, 36498, -18035, -11020, -23623, -114234, -41120, -82818, 17131, -53632, -47377, 45320, 77247, 50328, 173388, 368618, 615299, 554449, 403450, 141484, 72359, 91536, -1551, -42330, -28522, -17961, 10846, -64483, 27066, -7141, -36341, 5198, 40355, 201268, 305959, 518320, 534617, 296698, 108462, 75389, 76739, -3340, -71948, -59100, -50709, -76859, -131707, -155163, -46892, -75181, 6015, 18260, -49138, 108758, 165724, 125840, 27616, 36852, 8732, -139557, -100058, -48398, -133127, -119333, -43212, -197627, -102987, -29359, -11210, -128121, -69481, -3484, -75555, 8533, 45737, 191140, 274737, 153649, 32694, 84202, 101049, 42123, 43723, 12684, -7824, -30002, -84533, -36892, 19848, -29544, 33497, 87006, 77086, 242416]
1201.5E80845H10842D86646C43545C24927C04163B23540A03033A5993I0660I6498I515
1197.1E247F3585A08387F9112A22761A94740C37234F56039H77783F43409D20869D84163
1192.7D87680C15763B56308A08158A83335A52588G7040A11350A48920A79059B22955
1188.6B00730B80328C84844F39855F31989E15409E26146E00977E26718E18178E42268
1184.6F36094E74685E32472D78867E55570F36406G03934F31414E83511F73036G24535
1180.5H54624I45101A013446A183933A167915A278611A473001A752989A836084A879184
1176.9A907340A900271A990929A954211B038028A948504A933508B024174B324226B634391
1173.2B836695C084417C541261C876586D595276E112491E600115E956410F264034F498055
$$ y = [580845, 810842, 486646, 343545, 324927, 304163, 223540, 103033, 15993, 90660, 96498, 9515, 5247, 63585, 108387, 69112, 122761, 194740, 337234, 656039, 877783, 643409, 420869, 484163, 487680, 315763, 256308, 108158, 183335, 152588, 77040, 111350, 148920, 179059, 222955, 200730, 280328, 384844, 639855, 631989, 515409, 526146, 500977, 526718, 518178, 542268, 636094, 574685, 532472, 478867, 555570, 636406, 703934, 631414, 583511, 673036, 724535, 854624, 945101, 1013446, 1183933, 1167915, 1278611, 1473001, 1752989, 1836084, 1879184, 1907340, 1900271, 1990929, 1954211, 2038028, 1948504, 1933508, 2024174, 2324226, 2634391, 2836695, 3084417, 3541261, 3876586, 4595276, 5112491, 5600115, 5956410, 6264034, 6498055]
1169.5F817424G346093G988972H837846I994486A2002172A5823397B3451692C7451331
1166.2D8600009C9436403B6248928A9369063A6189034A4397923A3461978A2979936
1163.3A3012473A3362305A4227020A5393109A7016278A9308823B2881692B8702294
1160.3C9547288F2012831A06919313A49667500A12664763F2905994C9814713B8408953
1157.4B1689953A7811423A5601828A4607416A4409731A4812111A5643573A6912289
1154.4A9045127B2496502B8273769C8988822F1338394A06110875A49569263A12172625
1151.5F0462500C6413394B4499883A7313481A3043842A0370199H913480H070677G681371
1148.2G622560G790734H315636I380880A1563812A5608550B3207200C6694406D7448191
$$ y = [6817424, 7346093, 7988972, 8837846, 9994486, 12002172, 15823397, 23451692, 37451331, 48600009, 39436403, 26248928, 19369063, 16189034, 14397923, 13461978, 12979936, 13012473, 13362305, 14227020, 15393109, 17016278, 19308823, 22881692, 28702294, 39547288, 62012831, 106919313, 149667500, 112664763, 62905994, 39814713, 28408953, 21689953, 17811423, 15601828, 14607416, 14409731, 14812111, 15643573, 16912289, 19045127, 22496502, 28273769, 38988822, 61338394, 106110875, 149569263, 112172625, 60462500, 36413394, 24499883, 17313481, 13043842, 10370199, 8913480, 8070677, 7681371, 7622560, 7790734, 8315636, 9380880, 11563812, 15608550, 23207200, 36694406, 47448191]
1144.9C6691353B1506975A3433014I203120F547511D725235C674854B805852B371692
1141.6B101471A738496A513832A418495A415802A662530B160781B313572B209785B023704
1137.9A874507A748053A663020A479579A253229A073102H42596G10876F77406F65545
1134.2E75487E79629E67017G74921A000860A160432A257568A182778A063726I14279
1130.5G95091G08088F17870F79822E34978D44427D63242D71488D29306C24866C33109
1126.5B58226C27688C47895D14902D53424E61723D42333C96716B78522B68874C03652
1122.5D33529C32955B28213C43252C57855B20100A63112B18709A20293A90840B62444
1118.4B26312A78531B51862B66043C12154B21838A08805A91142A53836A89547A79316
$$ y = [36691353, 21506975, 13433014, 9203120, 6547511, 4725235, 3674854, 2805852, 2371692, 2101471, 1738496, 1513832, 1418495, 1415802, 1662530, 2160781, 2313572, 2209785, 2023704, 1874507, 1748053, 1663020, 1479579, 1253229, 1073102, 842596, 710876, 677406, 665545, 575487, 579629, 567017, 774921, 1000860, 1160432, 1257568, 1182778, 1063726, 914279, 795091, 708088, 617870, 679822, 534978, 444427, 463242, 471488, 429306, 324866, 333109, 258226, 327688, 347895, 414902, 453424, 561723, 442333, 396716, 278522, 268874, 303652, 433529, 332955, 228213, 343252, 357855, 220100, 163112, 218709, 120293, 190840, 262444, 226312, 178531, 251862, 266043, 312154, 221838, 108805, 191142, 153836, 189547, 179316]
1114.4B04384A36966A53852I7171F7399E8994I0983A11797B30297A84694A13334A22550
1110I0064A06970E6950G4348G3170D5284B0748E3018B3703e645h5091I848e629i234
1104.8g1402F6157A2258d430A4462F004B6200E1121b6126a8597a40511a02287d3862
1100f8619I720A1889f6589h3997a15976a50394c6624a889a20659h4949e4067a00811
1095.2b0400D5828A5541A14487A4236A1511f1599F9000G2627i7869a64784d7175a10087
1090.5a25966g0283A9900A0496c0160a04458a52258b011A16755C07668E66707C45074
1086.1A41871C0564a8191e7938a33637a65631i1315a1491a14305f7855a23939a36022
1081.6h9815f1718b4139G1522C68788D88517C38036D5950e5081f6341a95774a36359
$$ y = [204384, 136966, 153852, 97171, 67399, 58994, 90983, 111797, 230297, 184694, 113334, 122550, 90064, 106970, 56950, 74348, 73170, 45284, 20748, 53018, 23703, -5645, -85091, 9848, -5629, -9234, -71402, 66157, 12258, -4430, 14462, 6004, 26200, 51121, -26126, -18597, -140511, -102287, -43862, -68619, 9720, 11889, -66589, -83997, -115976, -150394, -36624, -1889, -120659, -84949, -54067, -100811, -20400, 45828, 15541, 114487, 14236, 11511, -61599, 69000, 72627, -97869, -164784, -47175, -110087, -125966, -70283, 19900, 10496, -30160, -104458, -152258, -2011, 116755, 307668, 566707, 345074, 141871, 30564, -18191, -57938, -133637, -165631, -91315, -11491, -114305, -67855, -123939, -136022, -89815, -61718, -24139, 71522, 368788, 488517, 338036, 45950, -55081, -66341, -195774, -136359]
1077.2a61451b10633a93056b02607a64392b07602a82604b61064b15939a99354f7738
1073.2h4494a9267d5272a06085a91913a48678a72977b17729a85002b05709a66381a44608
1068.8a45421a37632a53586b09912b44061a61385b23203b38508c28175a87945b90289
1064.7b23497a99757a94414g9270a11236a57680a59450b44247b15615b74122c04290
1060.7b50476c03348b50189a87928b01685b34473b08417a48742a99005a62447a21675
1056.6a89258a99139a19484a78929b98190b74533b51673b50477b44006b83271c14236
1052.6b91974b88502b99796c25178c57548c16450b66133b54334b67569b48630b58392
1048.5c15552b21375b41745b29518b23269b58775c02697b93353a89406b20808a50012
$$ y = [-161451, -210633, -193056, -202607, -164392, -207602, -182604, -261064, -215939, -199354, -67738, -84494, -19267, -45272, -106085, -191913, -148678, -172977, -217729, -185002, -205709, -166381, -144608, -145421, -137632, -153586, -209912, -244061, -161385, -223203, -238508, -328175, -187945, -290289, -223497, -199757, -194414, -79270, -111236, -157680, -159450, -244247, -215615, -274122, -304290, -250476, -303348, -250189, -187928, -201685, -234473, -208417, -148742, -199005, -162447, -121675, -189258, -199139, -119484, -178929, -298190, -274533, -251673, -250477, -244006, -283271, -314236, -291974, -288502, -299796, -325178, -357548, -316450, -266133, -254334, -267569, -248630, -258392, -315552, -221375, -241745, -229518, -223269, -258775, -302697, -293353, -189406, -220808, -150012]
1044.5a72680a97569b15639b24733b01680b78724a91138b66156b23094a95725b13800
1040.5b36746b55583c07644b66404b40680b82324b37244b65841b34834b45009b56560
1036.4b28849c25968c21558b24114b72759b17222b82772c01272b94985b75489a93868
1032.4a79953b58645c29053b42195b40160b59317b36736b41399a85483b05015c13868
1028.3b07403b28002b70424b59552b09747a64902a92211g4749b09691a95935b02323
1024.3b51303b28968b41311a58778a56959b51741b74545b46406b36216b74465b52470
1020.2a70980b97771b68225a97849b47719b33204b48246b98454c20616b86303a38908
1016.2b62877b95562b43603b70529b99103c16582b94854b72421b37010c05447b52721
$$ y = [-172680, -197569, -215639, -224733, -201680, -278724, -191138, -266156, -223094, -195725, -213800, -236746, -255583, -307644, -266404, -240680, -282324, -237244, -265841, -234834, -245009, -256560, -228849, -325968, -321558, -224114, -272759, -217222, -282772, -301272, -294985, -275489, -193868, -179953, -258645, -329053, -242195, -240160, -259317, -236736, -241399, -185483, -205015, -313868, -207403, -228002, -270424, -259552, -209747, -164902, -192211, -74749, -209691, -195935, -202323, -251303, -228968, -241311, -158778, -156959, -251741, -274545, -246406, -236216, -274465, -252470, -170980, -297771, -268225, -197849, -247719, -233204, -248246, -298454, -320616, -286303, -138908, -262877, -295562, -243603, -270529, -299103, -316582, -294854, -272421, -237010, -305447, -252721]
1012.1b04394a74021b93099c78702b71203b22539a72003b39205b56213a85471b50628
1008.1b67936b12060b28009b21243b78582c24354b23559b27473a16911a97126b71979
1004.1b75454b91907b47312b44844a54601b22712b67685c19276b31897b04953b33652
1000a59073b74466c13806b33806b08845b02013b26232b20549b25688c18979c21408
996b74617b42380b97213c45561c07475b18357a80300b07174b19306b75046b48661b42185
991.6b63336b45689c09982c00600c19085c34666c44787b26681b41871b35498c06607
987.5c29716b92416a85731b31056b58344b63926b39310b56137c01090b99239b26148
983.5b73013c01519c07490c01901a15765a79090b31441a74496b72043c12652b15970
$$ y = [-204394, -174021, -293099, -378702, -271203, -222539, -172003, -239205, -256213, -185471, -250628, -267936, -212060, -228009, -221243, -278582, -324354, -223559, -227473, -116911, -197126, -271979, -275454, -291907, -247312, -244844, -154601, -222712, -267685, -319276, -231897, -204953, -233652, -159073, -274466, -313806, -233806, -208845, -202013, -226232, -220549, -225688, -318979, -321408, -274617, -242380, -297213, -345561, -307475, -218357, -180300, -207174, -219306, -275046, -248661, -242185, -263336, -245689, -309982, -300600, -319085, -334666, -344787, -226681, -241871, -235498, -306607, -329716, -292416, -185731, -231056, -258344, -263926, -239310, -256137, -301090, -299239, -226148, -273013, -301519, -307490, -301901, -115765, -179090, -231441, -174496, -272043, -312652, -215970]
979.4b79059c19857b80238b21473a92865a68725b66809b81709b39972b58600b56221
975.4b18048b71576b56914b56976a68973a90086a91262a58404b55763c04954b78306
971.3b10496a73588b50623b65992b42152b92126b77829b15009b57593b70020b35696
967.3b85771a60570c12855b28930b29727a74158b29855b06401a95335a74883b54303
963.2b95356a88941b89313b46528a51971b34098b77950b07892b62004b35790b84369
959.2a78896b66520b60905a76175b25502b16017b02816b75949c12903b57864b14700
955.1a80821b26497a95373a65832b15737b03500b21325c12802b16318b13062a22877
951.1a61655b03790b00268b20257b61552b38362a79405a38706b05296b20194a15778
$$ y = [-279059, -319857, -280238, -221473, -192865, -168725, -266809, -281709, -239972, -258600, -256221, -218048, -271576, -256914, -256976, -168973, -190086, -191262, -158404, -255763, -304954, -278306, -210496, -173588, -250623, -265992, -242152, -292126, -277829, -215009, -257593, -270020, -235696, -285771, -160570, -312855, -228930, -229727, -174158, -229855, -206401, -195335, -174883, -254303, -295356, -188941, -289313, -246528, -151971, -234098, -277950, -207892, -262004, -235790, -284369, -178896, -266520, -260905, -176175, -225502, -216017, -202816, -275949, -312903, -257864, -214700, -180821, -226497, -195373, -165832, -215737, -203500, -221325, -312802, -216318, -213062, -122877, -161655, -203790, -200268, -220257, -261552, -238362, -179405, -138706, -205296, -220194, -115778]
947.1b28319b29314a91230b08837b16080a91660a98232a84355c83501c42341b68788
943a96888b34084b13356b29091b92662b51789b25650b26835a46682a65373a40657a29593
938.6i7839a38910b26072b13506c00878b95883b91810a31815a15890b55839c31393
934.6b07522b21033a39515a95530b20504a45464g3960a64736b05213b37487a55637
930.5a81749a75383b07461b65884a66736a26411a05941h2878e7062a06950a69945a58720
926.1a35233a14039a21212a47470a44182a63745a78657a69202a29260a56016a00617
922.1h8190h9278c1131C3246a2102a8875E2623G1110F4669B51649C51225D28001E33651
917.3E73356D00701C10903A57797B6284f7674b1257e3272a57405f4397f5225f1074
$$ y = [-228319, -229314, -191230, -208837, -216080, -191660, -198232, -184355, -383501, -342341, -268788, -196888, -234084, -213356, -229091, -292662, -251789, -225650, -226835, -146682, -165373, -140657, -129593, -97839, -138910, -226072, -213506, -300878, -295883, -291810, -131815, -115890, -255839, -331393, -207522, -221033, -139515, -195530, -220504, -145464, -73960, -164736, -205213, -237487, -155637, -181749, -175383, -207461, -265884, -166736, -126411, -105941, -82878, -57062, -106950, -169945, -158720, -135233, -114039, -121212, -147470, -144182, -163745, -178657, -169202, -129260, -156016, -100617, -88190, -89278, -31131, 33246, -12102, -18875, 52623, 71110, 64669, 251649, 351225, 428001, 533651, 573356, 400701, 310903, 157797, 26284, -67674, -21257, -53272, -157405, -64397, -65225, -61074]
912.9a42986h9022g5320f6049B3387A9752a02978h2711A7668a5763a9970D5413A14303
908.1F5592A88258B0841E7866E7191A9423F1042G1124C6151H3158B6586A02242I7361
903.3I4189A88522A66382A14058A60025A00681B8112H7891E5671I6120A98127B87460
898.9C12370D53977D45732E91979F62700E78074E61243E68354F13920F42554G01001
894.8G10090G51812G02636F80775E73616D26116C91009D53088C93676D14330D42038
890.8E93342G18762A022084A408939A640915A835488B151936B393697B648533B821480
887.1C078574C221645C392252C647281C973233D314414D759189E232083E513552F000980
883.4F423880F775571G096523G391216G851405H321702H936702I914151A1146100A2746213
$$ y = [-142986, -89022, -75320, -66049, 23387, 19752, -102978, -82711, 17668, -15763, -19970, 45413, 114303, 65592, 188258, 20841, 57866, 57191, 19423, 61042, 71124, 36151, 83158, 26586, 102242, 97361, 94189, 188522, 166382, 114058, 160025, 100681, 28112, 87891, 55671, 96120, 198127, 287460, 312370, 453977, 445732, 591979, 662700, 578074, 561243, 568354, 613920, 642554, 701001, 710090, 751812, 702636, 680775, 573616, 426116, 391009, 453088, 393676, 414330, 442038, 593342, 718762, 1022084, 1408939, 1640915, 1835488, 2151936, 2393697, 2648533, 2821480, 3078574, 3221645, 3392252, 3647281, 3973233, 4314414, 4759189, 5232083, 5513552, 6000980, 6423880, 6775571, 7096523, 7391216, 7851405, 8321702, 8936702, 9914151, 11146100, 12746213]
879.8A4836730A7751191B2133481B9706794D4419472G2514631A03308600A12038838
876.8A03253300H6633119G0788244E6319219D3079116C1924475B3393866A7224327
873.9A2871019I984992G956311F454388E359026D552679C936987C414388C016692B613324
870.2B256015B026260A882268A782344A699047A581845A553603A440318A359761A264860
866.5A177108A050692I35145I44723I31235A095393A218762A319278A369607A357582
862.8A272768A321448A284464A216112A044501G98417F77788E17674E38612D11832
859.2C16862C35910D12562D23856E34260G32327F85639F72067F51969F97079E67349
855.1D77487C86130A89667B35662B42407B77146B00085E7611G9120A33111A03545E2069
$$ y = [14836730, 17751191, 22133481, 29706794, 44419472, 72514631, 103308600, 112038838, 103253300, 86633119, 70788244, 56319219, 43079116, 31924475, 23393866, 17224327, 12871019, 9984992, 7956311, 6454388, 5359026, 4552679, 3936987, 3414388, 3016692, 2613324, 2256015, 2026260, 1882268, 1782344, 1699047, 1581845, 1553603, 1440318, 1359761, 1264860, 1177108, 1050692, 935145, 944723, 931235, 1095393, 1218762, 1319278, 1369607, 1357582, 1272768, 1321448, 1284464, 1216112, 1044501, 798417, 677788, 517674, 538612, 411832, 316862, 335910, 412562, 423856, 534260, 732327, 685639, 672067, 651969, 697079, 567349, 477487, 386130, 189667, 235662, 242407, 277146, 200085, 57611, 79120, 133111, 103545, 52069]
850.7G8823A67881A32412A37525H9319E3809a0526G7961A39153G5005H4979F1399I3343
845.9I9695F3391b4516g5662A1003D3747E2222f0279D4166C0186A107I3677A02161
841.1D0994D8740d5222f5418A8081B5349d0198c6767a8755h8432A0988b5379g1488
836.4B3823C1039A26992H2014A43211C6796I0416E236a32159a16268b14029a46912
832a73183a54393b3821a30523a70374b21780a96534a47154a12404a10827a14104a90191
827.5a18334a22559a17586a85229a67851b06779a34264a58160a68979b28940a56929
823.5a84747b52232a69648a91103b51598a45454f8943a37836a89950a51672a61348
819.5a60401b19309a59451a42322a21927a09727d6513g8431a40877a19493a83074b19922
$$ y = [78823, 167881, 132412, 137525, 89319, 53809, -10526, 77961, 139153, 75005, 84979, 61399, 93343, 99695, 63391, -24516, -75662, 11003, 43747, 52222, -60279, 44166, 30186, 1107, 93677, 102161, 40994, 48740, -45222, -65418, 18081, 25349, -40198, -36767, -18755, -88432, 10988, -25379, -71488, 23823, 31039, 126992, 82014, 143211, 36796, 90416, 5236, -132159, -116268, -214029, -146912, -173183, -154393, -23821, -130523, -170374, -221780, -196534, -147154, -112404, -110827, -114104, -190191, -118334, -122559, -117586, -185229, -167851, -206779, -134264, -158160, -168979, -228940, -156929, -184747, -252232, -169648, -191103, -251598, -145454, -68943, -137836, -189950, -151672, -161348, -160401, -219309, -159451, -142322, -121927, -109727, -46513, -78431, -140877, -119493, -183074, -219922]
815a26742a23228h8175f7634a26100a75958a52322a58630a74940b31183b57223b43184
810.6b60875c02511b40428b42613b03126a45382a76680b42554b35645a77986a77543
806.6c25839b39866b70464a97855i5720b29482b08699b43969b02928b73524b78437
802.5a77339a82042f9189a68615a50656b27942b46331b69688b32801a83582b02393
798.5b31993a69090a68758b10649b27821b20600a23451a23970a55967c20666b15296
794.4b19718a60372a80968b28389b60728b30204b56201b01121b58261b08296b46450
790.4b85425b33102b53478a96036c03802b54226b18824a74580b51697b40210a46928
786.4b17694b66477b67217a15508a41962a89968a74571b25321b19988a83882a71364
$$ y = [-126742, -123228, -88175, -67634, -126100, -175958, -152322, -158630, -174940, -231183, -257223, -243184, -260875, -302511, -240428, -242613, -203126, -145382, -176680, -242554, -235645, -177986, -177543, -325839, -239866, -270464, -197855, -95720, -229482, -208699, -243969, -202928, -273524, -278437, -177339, -182042, -69189, -168615, -150656, -227942, -246331, -269688, -232801, -183582, -202393, -231993, -169090, -168758, -210649, -227821, -220600, -123451, -123970, -155967, -320666, -215296, -219718, -160372, -180968, -228389, -260728, -230204, -256201, -201121, -258261, -208296, -246450, -285425, -233102, -253478, -196036, -303802, -254226, -218824, -174580, -251697, -240210, -146928, -217694, -266477, -267217, -115508, -141962, -189968, -174571, -225321, -219988, -183882, -171364]
782.3a77151b33750b63580a61121b08624b74297b14801b04580b53946a98903b70847
778.3b75984b02766b10333a91550b41604c01917c05470a59733b17250c27887b43631
774.2b89849b11877a87333b35923b10694b39483a87528b81822a82751b04305b06527
770.2b87323b64575b46105a80080b81466a86010b05529b54316a94651b10133b21425
766.1b54937b84344c59608b87583b76666b29244a94641b32003b60515a95256b05003
762.1b44886c64640c24498b30069b80183b88795b84908b97694a78393a49255a47093
758c14529b29271b87948b47943a87752b21976b83284b63945b61327b31995b43140b16120
753.6a79444a55152b09923b02304b57504b41682a76029b44567b04951b21946a66369
$$ y = [-177151, -233750, -263580, -161121, -208624, -274297, -214801, -204580, -253946, -198903, -270847, -275984, -202766, -210333, -191550, -241604, -301917, -305470, -159733, -217250, -327887, -243631, -289849, -211877, -187333, -235923, -210694, -239483, -187528, -281822, -182751, -204305, -206527, -287323, -264575, -246105, -180080, -281466, -186010, -205529, -254316, -194651, -210133, -221425, -254937, -284344, -359608, -287583, -276666, -229244, -194641, -232003, -260515, -195256, -205003, -244886, -364640, -324498, -230069, -280183, -288795, -284908, -297694, -178393, -149255, -147093, -314529, -229271, -287948, -247943, -187752, -221976, -283284, -263945, -261327, -231995, -243140, -216120, -179444, -155152, -209923, -202304, -257504, -241682, -176029, -244567, -204951, -221946, -166369]
749.6a37596a81061b47458b48126b29808a92500b45215b75287b41264a91671b04581
745.5a99570a46862a72128a95039a56205a22975a49431a31723b56511a99898a64204
741.5a26767a84261b06473b35898a99685a26313a71419a15344b06264a58592a45764
737.4i2009e9182g9809a0541a7812i6233f8568e2143E8346B99994D15078B80220C56252
732.7D74973G20512H33346F02834E51617F62811A000962A186834H57121E13590E36210
728.6F69012G39008E49828C03701B15512C31226C88530A40290C4737i9807a34569a75670
724.2b00045a66980a55359a39174a74223b04179a97394a70404a52245a47847a47805
720.2b77207b65336a52785b08343a72652a87465a83794a45007a00511b18295b17920
$$ y = [-137596, -181061, -247458, -248126, -229808, -192500, -245215, -275287, -241264, -191671, -204581, -199570, -146862, -172128, -195039, -156205, -122975, -149431, -131723, -256511, -199898, -164204, -126767, -184261, -206473, -235898, -199685, -126313, -171419, -115344, -206264, -158592, -145764, -92009, -59182, -79809, -10541, -17812, -96233, -68568, -52143, 58346, 299994, 415078, 280220, 356252, 474973, 720512, 833346, 602834, 551617, 662811, 1000962, 1186834, 857121, 513590, 536210, 669012, 739008, 549828, 303701, 215512, 331226, 388530, 140290, 34737, -99807, -134569, -175670, -200045, -166980, -155359, -139174, -174223, -204179, -197394, -170404, -152245, -147847, -147805, -277207, -265336, -152785, -208343, -172652, -187465, -183794, -145007, -100511, -218295, -217920]
716.1a90094a58973b30246b13348b08108a80508a87216a45288b55285b42480a80026
712.1b26463a73282a83155a63398b07442b18306b43796a64621a48259a41274a13759
708b16857b49485b26319a46399b12166a90026a89349a78704a55047a07273a22400a41765
703.6a92620a25277b26376b80671b97088a60728a27310a44655a37138i0382a39294
699.6a72383b01838a58841a73655b01786a46102a46595b17311a33116a23849a87269
695.5b07737a40235a96515b25427a89403b05356a71666a74189a32375a33779a00359
691.5g8742a39023a75941a68881a99989a55026a51961b11267a31277a73024a55301
687.4a96613b00910b05945a81330c7969g5165a31647a89811b17526a12543b10318a77695
$$ y = [-190094, -158973, -230246, -213348, -208108, -180508, -187216, -145288, -255285, -242480, -180026, -226463, -173282, -183155, -163398, -207442, -218306, -243796, -164621, -148259, -141274, -113759, -216857, -249485, -226319, -146399, -212166, -190026, -189349, -178704, -155047, -107273, -122400, -141765, -192620, -125277, -226376, -280671, -297088, -160728, -127310, -144655, -137138, -90382, -139294, -172383, -201838, -158841, -173655, -201786, -146102, -146595, -217311, -133116, -123849, -187269, -207737, -140235, -196515, -225427, -189403, -205356, -171666, -174189, -132375, -133779, -100359, -78742, -139023, -175941, -168881, -199989, -155026, -151961, -211267, -131277, -173024, -155301, -196613, -200910, -205945, -181330, -37969, -75165, -131647, -189811, -217526, -112543, -210318, -177695]
683a84506a31235a96978b30593a23912b39291a75772b50661b21901a12330a55703a53742
678.6a64530a19325h6169a47133a22967a19532i0993a46598a59679b18170a90387a19651
674.2b7604c1392a07535a47809a88407a92123h9764a04555D965a09668a36821g2738
669.8f6843a09081g5747g1842a01210a54554a78570g6299g9759g6984H827a19951B5091
665A811A0229b7036A0283d5267c0451G771B1631H9913D1368b3859c6754a3011F0156
659.9D8273A19766F6285A50611A43083A52702A18573A92471C16443C11484C06727E36856
655.4H94013A428217B466268B757553A875038A240574H14907D69440B28114B33227
651.8A07874a7740e1555i4410e9481e169A8705e5925d3326f302c5932A4732G201a17899
$$ y = [-184506, -131235, -196978, -230593, -123912, -239291, -175772, -250661, -221901, -112330, -155703, -153742, -164530, -119325, -86169, -147133, -122967, -119532, -90993, -146598, -159679, -218170, -190387, -119651, -27604, -31392, -107535, -147809, -188407, -192123, -89764, -104555, 4965, -109668, -136821, -72738, -66843, -109081, -75747, -71842, -101210, -154554, -178570, -76299, -79759, -76984, 8827, -119951, 25091, 1811, 10229, -27036, 10283, -45267, -30451, 7771, 21631, 89913, 41368, -23859, -36754, -13011, 60156, 48273, 119766, 66285, 150611, 143083, 152702, 118573, 192471, 316443, 311484, 306727, 536856, 894013, 1428217, 2466268, 2757553, 1875038, 1240574, 814907, 469440, 228114, 233227, 107874, -17740, -51555, -94410, -59481, -5169, 18705, -55925, -43326, -6302, -35932, 14732, 7201, -117899]
646.6C6554C5781A3673C2337A0108A16048A49198B44102B98111A50782A02045F2917
642.2G5177I7063B9898f1152A50181A46284B25597A30657A20672F5193A45495A35701
637.8A31655B06055B46842B80484A90902B64077B45058B41420B32195C01033D72479
633.7G82531A705503C020889B384304A340040A461524A403829G99502D25096C33789
630.1B70216A75387i3741a41651I4159A92078A10055A07844B21070C05859B96384B88802
625.7C36919D44793D39855E52961E87353E65223E78097E77714D77426E26422F02579
621.6F02292E69664E58184F84712G38894G54044G66430G48308G28512G50720G75381
617.6G82723H53550H84225I07079I29030H85246H72014H67814I83091I59899I69492
$$ y = [36554, 35781, 13673, 32337, 10108, 116048, 149198, 244102, 298111, 150782, 102045, 62917, 75177, 97063, 29898, -61152, 150181, 146284, 225597, 130657, 120672, 65193, 145495, 135701, 131655, 206055, 246842, 280484, 190902, 264077, 245058, 241420, 232195, 301033, 472479, 782531, 1705503, 3020889, 2384304, 1340040, 1461524, 1403829, 799502, 425096, 333789, 270216, 175387, -93741, -141651, 94159, 192078, 110055, 107844, 221070, 305859, 296384, 288802, 336919, 444793, 439855, 552961, 587353, 565223, 578097, 577714, 477426, 526422, 602579, 602292, 569664, 558184, 684712, 738894, 754044, 766430, 748308, 728512, 750720, 775381, 782723, 853550, 884225, 907079, 929030, 885246, 872014, 867814, 983091, 959899, 969492]
613.5A118417A199152A282470A621663A818119A719753B044851B151082A800837A564622
609.8B225208B557988B491359B481493B445166B431056B350797B167676A609428A133200
606.2I82556A182324A491834A805830B081329B466970B827269D499218F227030F668866
602.5G121151G517380H098754H654390I112995I656104A0162334A0882780A1749427
599.2A3066154A4444145A5622694A6943955A8499522B0021409B1517055B2600325B3627363
595.9B4894934B6634019B8852819C2054272C6574091D2840125D9094897E6303981F8022956
592.6H5576788A18267075A91040438C48482925E68418100D84431050B57445375A43847150
589.6H8298675E7228450C9476056B9488813B3641231B0168345A6478811A3269063A1027623
$$ y = [1118417, 1199152, 1282470, 1621663, 1818119, 1719753, 2044851, 2151082, 1800837, 1564622, 2225208, 2557988, 2491359, 2481493, 2445166, 2431056, 2350797, 2167676, 1609428, 1133200, 982556, 1182324, 1491834, 1805830, 2081329, 2466970, 2827269, 4499218, 6227030, 6668866, 7121151, 7517380, 8098754, 8654390, 9112995, 9656104, 10162334, 10882780, 11749427, 13066154, 14444145, 15622694, 16943955, 18499522, 20021409, 21517055, 22600325, 23627363, 24894934, 26634019, 28852819, 32054272, 36574091, 42840125, 49094897, 56303981, 68022956, 85576788, 118267075, 191040438, 348482925, 568418100, 484431050, 257445375, 143847150, 88298675, 57228450, 39476056, 29488813, 23641231, 20168345, 16478811, 13269063, 11027623]
586.3I171716G661380F702231F098071E674184E102138D382815D108944C928477C754079
582.6C972105D056571C857808C416046C032224B697124B471122B334416B208571B082829
579A907413B351791D005938D606273D504257D399067D239540D224355D173320C945776
575.3C357814B549058A796841A539979A383012A202286I72771I17176I98352A675474
571.6B400394B632948C015023C183429B700038A975273A727113A394301A148833A019534
567.9I84200A002594I75294I47757I63971I26971H06284H53124H49147H44217H24064
563.9F32474F79832G42400G10448F98949F99257F94319H22943H34741G11086F27781
559.8F52313F09378F76789E95523F14581E39064F08343F56769G61001G14295G28225
$$ y = [9171716, 7661380, 6702231, 6098071, 5674184, 5102138, 4382815, 4108944, 3928477, 3754079, 3972105, 4056571, 3857808, 3416046, 3032224, 2697124, 2471122, 2334416, 2208571, 2082829, 1907413, 2351791, 4005938, 4606273, 4504257, 4399067, 4239540, 4224355, 4173320, 3945776, 3357814, 2549058, 1796841, 1539979, 1383012, 1202286, 972771, 917176, 998352, 1675474, 2400394, 2632948, 3015023, 3183429, 2700038, 1975273, 1727113, 1394301, 1148833, 1019534, 984200, 1002594, 975294, 947757, 963971, 926971, 806284, 853124, 849147, 844217, 824064, 632474, 679832, 742400, 710448, 698949, 699257, 694319, 822943, 834741, 711086, 627781, 652313, 609378, 676789, 595523, 614581, 539064, 608343, 656769, 761001, 714295, 728225]
555.8G60845H18966H05635H68364H90379I30465I80991A098899A237513A026453H64004
551.7I59467I23386A003242A128029A271310A405627A537140A674804A670924A618461
548.1A442633A463910A536197A697276A771777A937307B139917B406333B774324C279565
544.4C810688D328436D879796E121411D855367D274692C531519B946979B334221A991607
540.7A625598A386410A170876I02870G60912F79578E94818E06999D48897B91873C45748
536.7C37088B88075A52993B86051B37335A75205B06550A78821B18209B30817B46251
532.6B88096B25817C38294D03581D47064C00299A61569A29907B32209C25902C67661
528.6D70186D84828D98199H41619A315488B393586B834705A801078I63378E90870C24620
$$ y = [760845, 818966, 805635, 868364, 890379, 930465, 980991, 1098899, 1237513, 1026453, 864004, 959467, 923386, 1003242, 1128029, 1271310, 1405627, 1537140, 1674804, 1670924, 1618461, 1442633, 1463910, 1536197, 1697276, 1771777, 1937307, 2139917, 2406333, 2774324, 3279565, 3810688, 4328436, 4879796, 5121411, 4855367, 4274692, 3531519, 2946979, 2334221, 1991607, 1625598, 1386410, 1170876, 902870, 760912, 679578, 594818, 506999, 448897, 291873, 345748, 337088, 288075, 152993, 286051, 237335, 175205, 206550, 178821, 218209, 230817, 246251, 288096, 225817, 338294, 403581, 447064, 300299, 161569, 129907, 232209, 325902, 367661, 470186, 484828, 498199, 841619, 1315488, 2393586, 2834705, 1801078, 963378, 590870, 324620]
524.5B34053E0672E1575B9847G2368A8267e7230d7493f1509a04983d1475b5769a01834
519.7a85514a28286a95951b43963a55061a05643a65357a13005a10333a85460a40795
515.7a68245a54171a77796b01431a85080h1694h7998a01372g693a41634a39189a70313
511.3a81426a67287a66436a90941b55584b67533a91162a70330b39724a90746b61747
507.2b72932a90932b16922a87511a93543a82771a58843b98311a85881b37803b14095
503.2b63621b70077a54235a60328a56314a96306b19063b32828a89208a47519a74405
499.2a26057b00554a96664a28756b58950b20084a93858b88773b00858a41632a16623
495.1a64856b70754b51056b44901b41737a47283b06806a98159a96445a78923a61408
$$ y = [234053, 50672, 51575, 29847, 72368, 18267, -57230, -47493, -61509, -104983, -41475, -25769, -101834, -185514, -128286, -195951, -243963, -155061, -105643, -165357, -113005, -110333, -185460, -140795, -168245, -154171, -177796, -201431, -185080, -81694, -87998, -101372, -7693, -141634, -139189, -170313, -181426, -167287, -166436, -190941, -255584, -267533, -191162, -170330, -239724, -190746, -261747, -272932, -190932, -216922, -187511, -193543, -182771, -158843, -298311, -185881, -237803, -214095, -263621, -270077, -154235, -160328, -156314, -196306, -219063, -232828, -189208, -147519, -174405, -126057, -200554, -196664, -128756, -258950, -220084, -193858, -288773, -200858, -141632, -116623, -164856, -270754, -251056, -244901, -241737, -147283, -206806, -198159, -196445, -178923, -161408]
491.1a80203a80275a82891a63264a75293c17894a54445a29448g2292a54951b48688
487b03998a63764b44917b23980b35551b08816a63632a81394b37207a34519h5378b47066
482.6a65822a90125b70915a12227a37483a20304a49402b51503b32935a99005a77814
478.6a96206b07963b14077a34574b26233a80676a83062a00233h0440a00978a11188
474.5b15973a39484b05676b09952b06733a97684b77881b63622b15316b65709a66064
470.5a63249a55573a84483a75104b29823b26498a50116e7822a41207a60933a84375
466.4a65825a60656a00891h6254i3463a62862a77460a17701a69899a97807a71723b36217
462b20689i3355a25800a92587a77201a64269b03312a21153a42821a54285a58378a38233
$$ y = [-180203, -180275, -182891, -163264, -175293, -317894, -154445, -129448, -72292, -154951, -248688, -203998, -163764, -244917, -223980, -235551, -208816, -163632, -181394, -237207, -134519, -85378, -247066, -165822, -190125, -270915, -112227, -137483, -120304, -149402, -251503, -232935, -199005, -177814, -196206, -207963, -214077, -134574, -226233, -180676, -183062, -100233, -80440, -100978, -111188, -215973, -139484, -205676, -209952, -206733, -197684, -277881, -263622, -215316, -265709, -166064, -163249, -155573, -184483, -175104, -229823, -226498, -150116, -57822, -141207, -160933, -184375, -165825, -160656, -100891, -86254, -93463, -162862, -177460, -117701, -169899, -197807, -171723, -236217, -220689, -93355, -125800, -192587, -177201, -164269, -203312, -121153, -142821, -154285, -158378, -138233]
457.6a66184i9409f1554b11902g9048a21319b30160b59893a67722a34024i4804a7629
453.2h3453e2945i4704f9867a28557a10275c3737d7354c2461i2382f7218i0062c6358
448.4A062h2649C5534A07083A34820A50284B93701D31705G03763F04508C21449A55215
444A05158D7011c0161C7353A4791h605H8324G7312B1095A36595A58169A60095B82697
439.2E45740I62496A638517A345311F81547C54285A89840I7763A25632H355c4437b5244
434.8D8330D0209b7316E8296D3182D6114B10725B45402D49302G55418F44611D52743
430.4B68712A84751A09284I7920I4287a4804E9559A00846H7438A00771E7398G0929
426G7669A74651B35273E52314H12085F12496C95201C95156D03968C06731B27796A61156
$$ y = [-166184, -99409, -61554, -211902, -79048, -121319, -230160, -259893, -167722, -134024, -94804, -17629, -83453, -52945, -94704, -69867, -128557, -110275, -33737, -47354, -32461, -92382, -67218, -90062, -36358, 1062, -82649, 35534, 107083, 134820, 150284, 293701, 431705, 703763, 604508, 321449, 155215, 105158, 47011, -30161, 37353, 14791, -8605, 88324, 77312, 21095, 136595, 158169, 160095, 282697, 545740, 962496, 1638517, 1345311, 681547, 354285, 189840, 97763, 125632, 8355, -34437, -25244, 48330, 40209, -27316, 58296, 43182, 46114, 210725, 245402, 449302, 755418, 644611, 452743, 268712, 184751, 109284, 97920, 94287, -14804, 59559, 100846, 87438, 100771, 57398, 70929, 77669, 174651, 235273, 552314, 812085, 612496, 395201, 395156, 403968, 306731, 227796, 161156]
421.6A34901I3908A19313A68176A50897A95967B02876A72280B98497D51913A007507
417.5A756693A223117G50827I42868G30172E03664C52210C29089B60369A72170D9658
413.5G4786B48519C11992B94591C27634C88109D15365G21375I94624H23328G16485
409.4H10374G55463G18403E12869D78222D64249D57308C70346D72274E37791D91589
405.4E25519D95538G51596G71504H53729I28560I34769I43602H58464H22380I25692
401.3A121790A223148A234916A181271A149229A262493A219987A250251A126175A077799
397.7A063195A283866A582401A724237A755860B008569B171476B546988C042592C573450
394C750353C949377D220697D492188D781034E028612E171023E001926E084727E422949
$$ y = [134901, 93908, 119313, 168176, 150897, 195967, 202876, 172280, 298497, 451913, 1007507, 1756693, 1223117, 750827, 942868, 730172, 503664, 352210, 329089, 260369, 172170, 49658, 74786, 248519, 311992, 294591, 327634, 388109, 415365, 721375, 994624, 823328, 716485, 810374, 755463, 718403, 512869, 478222, 464249, 457308, 370346, 472274, 537791, 491589, 525519, 495538, 751596, 771504, 853729, 928560, 934769, 943602, 858464, 822380, 925692, 1121790, 1223148, 1234916, 1181271, 1149229, 1262493, 1219987, 1250251, 1126175, 1077799, 1063195, 1283866, 1582401, 1724237, 1755860, 2008569, 2171476, 2546988, 3042592, 3573450, 3750353, 3949377, 4220697, 4492188, 4781034, 5028612, 5171023, 5001926, 5084727, 5422949]
390.3E854043F331993F765941G192466G776204H316527I739120A0694979A1404948
387A2175402A3117444A4426102A6056964A7893184B0238491B3188756B6706194C1853647
383.7D1948847F4162381A10529550A58481463A17481463F8793400D6088184C4887719
380.8B8915197B5780625B4391423B3792492B4369063B5936564B8257484C1547713C6470428
377.4D2679691E1845088G0409406A13661350B09844350C12614875B12775500A13069913
374.5F8292581D5558113C2884984B6197233B2135291A9187813A7710450A7342066A7540009
371.2A8453798B0228870B2858489B7378809C7119897E7876981A00887263A44821413
368.3A03850219E5351044C2675238B1335105A4823559A1065869H562995F515191E380890
$$ y = [5854043, 6331993, 6765941, 7192466, 7776204, 8316527, 9739120, 10694979, 11404948, 12175402, 13117444, 14426102, 16056964, 17893184, 20238491, 23188756, 26706194, 31853647, 41948847, 64162381, 110529550, 158481463, 117481463, 68793400, 46088184, 34887719, 28915197, 25780625, 24391423, 23792492, 24369063, 25936564, 28257484, 31547713, 36470428, 42679691, 51845088, 70409406, 113661350, 209844350, 312614875, 212775500, 113069913, 68292581, 45558113, 32884984, 26197233, 22135291, 19187813, 17710450, 17342066, 17540009, 18453798, 20228870, 22858489, 27378809, 37119897, 57876981, 100887263, 144821413, 103850219, 55351044, 32675238, 21335105, 14823559, 11065869, 8562995, 6515191, 5380890]
364.9D499544C757486C301736C050406B800786C116825D010860D156854C896247C570925
361.3C353053C138735C046919B961306B599267B016966A617624A413674A383029A181012
357.6A138603A049096A022000A420512A942241B388988B775682B698465B230795A968954
353.9A853989A624925A378637A275380A101868I51416G76299G38858F26192E31199
350.2D47176F11018H12568I10318I44242A093035A089118H94157H12777G74048F56841
346.2F22396E80490E72989E21652E58114D92918E16098D06372D32207C47735C85001
342.1D98562E26130D78032D91357E85305E55313D93165C67804C92541C49163C97792
338.1D31327D62694E31939D33658C40900B75031B86220C29075D06574D33470C89373
$$ y = [4499544, 3757486, 3301736, 3050406, 2800786, 3116825, 4010860, 4156854, 3896247, 3570925, 3353053, 3138735, 3046919, 2961306, 2599267, 2016966, 1617624, 1413674, 1383029, 1181012, 1138603, 1049096, 1022000, 1420512, 1942241, 2388988, 2775682, 2698465, 2230795, 1968954, 1853989, 1624925, 1378637, 1275380, 1101868, 951416, 776299, 738858, 626192, 531199, 447176, 611018, 812568, 910318, 944242, 1093035, 1089118, 894157, 812777, 774048, 656841, 622396, 580490, 572989, 521652, 558114, 492918, 516098, 406372, 432207, 347735, 385001, 498562, 526130, 478032, 491357, 585305, 555313, 493165, 367804, 392541, 349163, 397792, 431327, 462694, 531939, 433658, 340900, 275031, 286220, 329075, 406574, 433470, 389373]
334.1D24749D86488D99579B81048A84282A82639B28274A57865A94483B22137B92186
330A70326A55832A62232B03118A34489A60842A65449B42676B56712B50809A41593A09826
325.6D5096I7515A9995E5505G8447A38687B70568B32690B40092B07962A04569B6759
321.2B4015A14130C4616A01251B02545C94097E69937F88584E15600C07745A94114E8297
316.8D2451A20313B02668A72411A2928b4693c4169E050E0599I1864A63898C01387E91380
312A220426A432606H08546D23657B57379I2297E3312F5313A9542C3229i4478a49920
307.6a10047g0631d0605i8231b2301B1936A49230E20079D74531A75210C5759e2542
303.2h8864a81635a29645b02451a72468a04253a24784e8607a75777a99418b64667b23371
$$ y = [424749, 486488, 499579, 281048, 184282, 182639, 228274, 157865, 194483, 222137, 292186, 170326, 155832, 162232, 203118, 134489, 160842, 165449, 242676, 256712, 250809, 141593, 109826, 45096, 97515, 19995, 55505, 78447, 138687, 270568, 232690, 240092, 207962, 104569, 26759, 24015, 114130, 34616, 101251, 202545, 394097, 569937, 688584, 515600, 307745, 194114, 58297, 42451, 120313, 202668, 172411, 12928, -24693, -34169, 5050, 50599, 91864, 163898, 301387, 591380, 1220426, 1432606, 808546, 423657, 257379, 92297, 53312, 65313, 19542, 33229, -94478, -149920, -110047, -70631, -40605, -98231, -22301, 21936, 149230, 520079, 474531, 175210, 35759, -52542, -88864, -181635, -129645, -202451, -172468, -104253, -124784, -58607, -175777, -199418, -264667, -223371]
298.8a90794a93747b21167a88224a36131a54854a56518b30537b80960b35727a86670
294.7b14342b06150b04156b22835a74974a74256b02754c08847c19798b90393c09226
290.7b86928b89170c31674b90450b84641b60966b57697c00417c07472b97687b49100
286.6c18739a84204b27639b19599a89324b10181b45195b74321b33174b37450b13885
282.6a95864b63180b85372b96987b32231c26553c42607b63754c23819b91133b41258
278.5b40348b86139b23428b10970b42332c09642b31181a66324a07734a84835b58062
274.5c03964b70572b38787b16701b22020b68092c38943a92354b39381a47257b66225
270.4c04924b84082b73076b37115c37229c05855c17470b84885b35446a75256b50651
$$ y = [-190794, -193747, -221167, -188224, -136131, -154854, -156518, -230537, -280960, -235727, -186670, -214342, -206150, -204156, -222835, -174974, -174256, -202754, -308847, -319798, -290393, -309226, -286928, -289170, -331674, -290450, -284641, -260966, -257697, -300417, -307472, -297687, -249100, -318739, -184204, -227639, -219599, -189324, -210181, -245195, -274321, -233174, -237450, -213885, -195864, -263180, -285372, -296987, -232231, -326553, -342607, -263754, -323819, -291133, -241258, -240348, -286139, -223428, -210970, -242332, -309642, -231181, -166324, -107734, -184835, -258062, -303964, -270572, -238787, -216701, -222020, -268092, -338943, -192354, -239381, -147257, -266225, -304924, -284082, -273076, -237115, -337229, -305855, -317470, -284885, -235446, -175256, -250651]
266.4a93124b41593b10079b39276b45863c14710b78727b49272b61061c36463b46121
262.4b09589b15708a68264b44883b76258b24182b25116b49934b30340a75714b25913
258.3b71329a72645b35762b02725b87627a87544a89018a36769c09660a69591a36878
254.3b16310b70644b61632b08718b67641b63317b34343a98040b73800c51702b72754
250.2b83155a43902a95667b56318a92173b62843c00988b73331b24269b34174b34593
246.2b94498b45623a94823a95761b38833b35348b22480b85022b24490b02671b03338
242.1b52286b34814b59593b84082b26190a17496a51880b00964b34521b04544b37200
238.1b43758a94399a70012a42200a93350a89463a74600a83074b48902b01211b83529
$$ y = [-193124, -241593, -210079, -239276, -245863, -314710, -278727, -249272, -261061, -336463, -246121, -209589, -215708, -168264, -244883, -276258, -224182, -225116, -249934, -230340, -175714, -225913, -271329, -172645, -235762, -202725, -287627, -187544, -189018, -136769, -309660, -169591, -136878, -216310, -270644, -261632, -208718, -267641, -263317, -234343, -198040, -273800, -351702, -272754, -283155, -143902, -195667, -256318, -192173, -262843, -300988, -273331, -224269, -234174, -234593, -294498, -245623, -194823, -195761, -238833, -235348, -222480, -285022, -224490, -202671, -203338, -252286, -234814, -259593, -284082, -226190, -117496, -151880, -200964, -234521, -204544, -237200, -243758, -194399, -170012, -142200, -193350, -189463, -174600, -183074, -248902, -201211, -283529]
234b81839b27857a94601a96703a54967a76968a49656b28982a33529a40482b60217c22258
229.6b73373b06103a93958a67672b39997b42108b37244b48303b71394b45321c64936
225.6b99135b87023a63173a40268b01909a83226b39591b58333b09753b13801b72610
221.5c47145c21195b72835b39921b40380b85586b66976b23956b31790b75896b68682
217.5b28260b69232b87444b58157b40046b04344b41517c01586b62193b03189b78092
213.4b16359a78774a97190b36166a68354b62415b35370b07970b04367b12362a89345
209.4a60985b05166b37885a64005a34765b24283b00284b46397b33230b30787b53843
205.4b66645b91213a85896a43516b32817b13687b74935c15280b20905a81621b44133
$$ y = [-281839, -227857, -194601, -196703, -154967, -176968, -149656, -228982, -133529, -140482, -260217, -322258, -273373, -206103, -193958, -167672, -239997, -242108, -237244, -248303, -271394, -245321, -364936, -299135, -287023, -163173, -140268, -201909, -183226, -239591, -258333, -209753, -213801, -272610, -347145, -321195, -272835, -239921, -240380, -285586, -266976, -223956, -231790, -275896, -268682, -228260, -269232, -287444, -258157, -240046, -204344, -241517, -301586, -262193, -203189, -278092, -216359, -178774, -197190, -236166, -168354, -262415, -235370, -207970, -204367, -212362, -189345, -160985, -205166, -237885, -164005, -134765, -224283, -200284, -246397, -233230, -230787, -253843, -266645, -291213, -185896, -143516, -232817, -213687, -274935, -315280, -220905, -181621, -244133]
201.3b85037b72834b26527a91073b02597b07801a92941b12878b23447b43253b64401
197.3b13531b11215a08197a94136b34632a98873b80919b73311b22496a44649b65262
193.2b20175b32782b27915b02568a82502b24352a79591a98078b00416b73727b41679
189.2b42598c36482b97973b12941a89306a86234a84526b05944a82503b05739c09737
185.1b32924b43316b59100a45103a09983b18986b80390b66125b35910b36935b71093
181.1b20672b69862b49095b38509b15487a95463a82169a42505b49491b85891a96479
177b73416b62427b83994a28414a63418b14827b25136b42031b27289b54922a94570a50419
172.6a86212b42358b31663b17596b28566b67537b18498a84518b00847b85748b94806
$$ y = [-285037, -272834, -226527, -191073, -202597, -207801, -192941, -212878, -223447, -243253, -264401, -213531, -211215, -108197, -194136, -234632, -198873, -280919, -273311, -222496, -144649, -265262, -220175, -232782, -227915, -202568, -182502, -224352, -179591, -198078, -200416, -273727, -241679, -242598, -336482, -297973, -212941, -189306, -186234, -184526, -205944, -182503, -205739, -309737, -232924, -243316, -259100, -145103, -109983, -218986, -280390, -266125, -235910, -236935, -271093, -220672, -269862, -249095, -238509, -215487, -195463, -182169, -142505, -249491, -285891, -196479, -273416, -262427, -283994, -128414, -163418, -214827, -225136, -242031, -227289, -254922, -194570, -150419, -186212, -242358, -231663, -217596, -228566, -267537, -218498, -184518, -200847, -285748, -294806]
168.6b45542b18984a75684b34883b81887b49726a38714a65367a64006b75242b39171
164.5b31279b89791c04955b21558b32881a86975a95240a87194b43030b46363a17876
160.5b63078b00247a92736a84757b22156a60600b39075b69465a91381a92439a55917
156.4b32848a75909a28905b26800a73431a53439a63958a79241b48079b45734b40058
152.4a77193a84468a22880i8891a69916a61788b10230a15817a62443b04436b29212
148.4b36195a99301b31627a23793a35565b73786a45479b03062b45549b02293a91713
144.3a59240b20690a77056h7377a48049a61282b21787b06550b42693b41218a59444
140.3a63942b57089b08648b63649a97539c35335b73787b68851b26782a71749b16861
$$ y = [-245542, -218984, -175684, -234883, -281887, -249726, -138714, -165367, -164006, -275242, -239171, -231279, -289791, -304955, -221558, -232881, -186975, -195240, -187194, -243030, -246363, -117876, -263078, -200247, -192736, -184757, -222156, -160600, -239075, -269465, -191381, -192439, -155917, -232848, -175909, -128905, -226800, -173431, -153439, -163958, -179241, -248079, -245734, -240058, -177193, -184468, -122880, -98891, -169916, -161788, -210230, -115817, -162443, -204436, -229212, -236195, -199301, -231627, -123793, -135565, -273786, -145479, -203062, -245549, -202293, -191713, -159240, -220690, -177056, -87377, -148049, -161282, -221787, -206550, -242693, -241218, -159444, -163942, -257089, -208648, -263649, -197539, -335335, -273787, -268851, -226782, -171749, -216861]
136.2i6265a83266b15742a69610a60546b26337b60472a58810a02472a72731a94857
132.2a75340a94764a54924a31280a46588i8053b43243a66154b28812a96810b33802
128.1a43082a86957a32460a24253b07024b27058b37918a05988i3660a87643a44975
124.1a74025a49399a60768a58369b20841b01196a77977a54851a38377a97651b11065
120a03848a81808a51998b05697a55856a77005b32332b63383b06246a93839b15543b19084
115.6b11411b30968a71078a96188h4591b03763b12815a48493a71061a43271a50584
111.6i4453a34516a55838b07128b23236a84197a91416b14481a52663a90290b31880
107.5b10266b52285b58505b56671a60786a23004b11782a27385b9130f3575a99452b55591
$$ y = [-96265, -183266, -215742, -169610, -160546, -226337, -260472, -158810, -102472, -172731, -194857, -175340, -194764, -154924, -131280, -146588, -98053, -243243, -166154, -228812, -196810, -233802, -143082, -186957, -132460, -124253, -207024, -227058, -237918, -105988, -93660, -187643, -144975, -174025, -149399, -160768, -158369, -220841, -201196, -177977, -154851, -138377, -197651, -211065, -103848, -181808, -151998, -205697, -155856, -177005, -232332, -263383, -206246, -193839, -215543, -219084, -211411, -230968, -171078, -196188, -84591, -203763, -212815, -148493, -171061, -143271, -150584, -94453, -134516, -155838, -207128, -223236, -184197, -191416, -214481, -152663, -190290, -231880, -210266, -252285, -258505, -256671, -160786, -123004, -211782, -127385, -29130, -63575, -199452, -255591]
103.1a73635a43947b50917a86871b16806b43330b52130a51397a44848b01444a55222
99.1a63135i4139a00052i3810a21674a25776a70337a34033a44000a88837b20957a45814
94.7a41073a32851a80824a49031a44097a62452a46917a93997a88797b50608a92865
90.6b53861a75238a64454a46125b56386a77977a51273a51210a95318b57323b22097
86.6b34441a85911a84483a37293a38077a36140b13347a17063a86595a56492a79010
82.5b24200b73973b34605b10473a87331b02991a17707b18537b08825b14078b06630
78.5b08407a03737a27065a76765a01769a95105a72414a76729g6866a37445a52534a07914
74.1a51168a45598b16795b26317a40251a24695i9793a39163b29186a75949a69991g2401
$$ y = [-173635, -143947, -250917, -186871, -216806, -243330, -252130, -151397, -144848, -201444, -155222, -163135, -94139, -100052, -93810, -121674, -125776, -170337, -134033, -144000, -188837, -220957, -145814, -141073, -132851, -180824, -149031, -144097, -162452, -146917, -193997, -188797, -250608, -192865, -253861, -175238, -164454, -146125, -256386, -177977, -151273, -151210, -195318, -257323, -222097, -234441, -185911, -184483, -137293, -138077, -136140, -213347, -117063, -186595, -156492, -179010, -224200, -273973, -234605, -210473, -187331, -202991, -117707, -218537, -208825, -214078, -206630, -208407, -103737, -127065, -176765, -101769, -195105, -172414, -176729, -76866, -137445, -152534, -107914, -151168, -145598, -216795, -226317, -140251, -124695, -99793, -139163, -229186, -175949, -169991, -72401]
69.7a53496b02547b00706i7675b28644b10163h9484a16858a87213a49754a29599b00215
65.3b14523a14811a16379a00284a85914a95512b52120b47538a86153a86602a28200
61.2b42596a49939a15235a81459a46204a06523a52245b20481a16172a65583a02236
57.2g5153h5633a75017a83807a56260a04511a79930a55349a73985a25624a80020b00944
52.8a54862a36883a74914a67459i3769a64124b08879b22852a89575b32171b01573b20408
48.3a85309a03183a35254a79925a49234a51244a15098a56967h3746a76753a90299a37922
43.9a11591a73817a85590a82517a67678b20306a55460f4066i2995b12919a34508a52609
39.5b08044a69009a62060a68117a40828a82488a51472a37507a77856a29057a96189
$$ y = [-153496, -202547, -200706, -97675, -228644, -210163, -89484, -116858, -187213, -149754, -129599, -200215, -214523, -114811, -116379, -100284, -185914, -195512, -252120, -247538, -186153, -186602, -128200, -242596, -149939, -115235, -181459, -146204, -106523, -152245, -220481, -116172, -165583, -102236, -75153, -85633, -175017, -183807, -156260, -104511, -179930, -155349, -173985, -125624, -180020, -200944, -154862, -136883, -174914, -167459, -93769, -164124, -208879, -222852, -189575, -232171, -201573, -220408, -185309, -103183, -135254, -179925, -149234, -151244, -115098, -156967, -83746, -176753, -190299, -137922, -111591, -173817, -185590, -182517, -167678, -220306, -155460, -64066, -92995, -212919, -134508, -152609, -208044, -169009, -162060, -168117, -140828, -182488, -151472, -137507, -177856, -129057, -196189]
35.5a51212b06670i7977a00133b59677a48170a31364a65634a14961a96508a26483a66952
31.1a44236g9457a44333a75017a49730a55797b14420a74454a42381a29231a54548b41137
26.6a87339a93888e3426B147e3983a991C1154a8763h6291h5709a55833a65944i0179
21.9F1049A34782A87638E123h1740a58409a47972a39110f4078a55465a64762i1344
17.5a39821a77313b80177a54281d2702f5173a98228a78270e9492a12343b09498g0908
13a68962a06354a44841i9240a51281b2411a03787a54342i1938h0903a17848a61674
8.6h6487g0114g0463a31498b56958a97705a75499a44136a24041a01854D7269C48748
4.2A92798B8840A41009E6571F4947b649A2434c5970g4136a65880a76847h7634a29731
$$ y = [-151212, -206670, -97977, -100133, -259677, -148170, -131364, -165634, -114961, -196508, -126483, -166952, -144236, -79457, -144333, -175017, -149730, -155797, -214420, -174454, -142381, -129231, -154548, -241137, -187339, -193888, -53426, 2147, -53983, -1991, 31154, -18763, -86291, -85709, -155833, -165944, -90179, 61049, 134782, 187638, 5123, -81740, -158409, -147972, -139110, -64078, -155465, -164762, -91344, -139821, -177313, -280177, -154281, -42702, -65173, -198228, -178270, -59492, -112343, -209498, -70908, -168962, -106354, -144841, -99240, -151281, -22411, -103787, -154342, -91938, -80903, -117848, -161674, -86487, -70114, -70463, -131498, -256958, -197705, -175499, -144136, -124041, -101854, 47269, 348748, 192798, 28840, 141009, 56571, 64947, -2649, 12434, -35970, -74136, -165880, -176847, -87634, -129731]
-0.6a17282a90152i6571e7964a61407i0931a31819f9363c8301e5896C6698d30A0965
-5.3H579a12540b1489a07104a15675a54295a54776e4909d1394g213d8805a21566d9226
-10.1c1341d1491d1803A4817c4611F070c2513d6855G291b5509e3640h8269e5760b0113
-15.3i674B4369A3778C2436A3631G9218F282B4378E4875A37181A06376C6158G6919
-20.1A2143H2655A19769A46085b1352a07241h5415i5174I9397F2620A03325A48977
-24.5D9924D20602D51587D66831E56191E37223F50042F71298G69766H95121H46495
-28.5G93036A021080A209541A257396A325419A458432A676518A849995A928191B021229
-32.2B016176B190352B332069B630140C366541D986051D473930D279930D765102E613231
$$ y = [-117282, -190152, -96571, -57964, -161407, -90931, -131819, -69363, -38301, -55896, 36698, -430, 10965, 8579, -112540, -21489, -107104, -115675, -154295, -154776, -54909, -41394, -7213, -48805, -121566, -49226, -31341, -41491, -41803, 14817, -34611, 6070, -32513, -46855, 7291, -25509, -53640, -88269, -55760, -20113, -9674, 24369, 13778, 32436, 13631, 79218, 6282, 24378, 54875, 137181, 106376, 36158, 76919, 12143, 82655, 119769, 146085, -21352, -107241, -85415, -95174, 99397, 62620, 103325, 148977, 49924, 420602, 451587, 466831, 556191, 537223, 650042, 671298, 769766, 895121, 846495, 793036, 1021080, 1209541, 1257396, 1325419, 1458432, 1676518, 1849995, 1928191, 2021229, 2016176, 2190352, 2332069, 2630140, 3366541, 4986051, 4473930, 4279930, 4765102, 5613231]
-35.9G002439I738095A6381728C7049278H6348781D0827697A7296983A0252580F105357
-39.2C564399B432746A948553A989528C001365A762564I85083F15282E11771C12865
-42.9B91328B20813B20762A30899G0274F1289A6820D0541G1204C6623E1290I7044E5538
-47.6B8808E8973I2956a5036d5298c4176f243B92599B16899A65688B35087A56340B06569
-52.4A73432A02072A09207C1927f3D4302f1962g758c6043a36269b05269h1578e0728
-57.2b6639A68052A68096G7375H1335c7083c2324b016g0202h7374a29796a16245i3706
-62f9797d1430g3309e1932a67457a64202a72656a44749f4309b9868e9547h3503f1614
-66.8f5324a11530h8415e9920a74049f2907e5917e6197i2835a5711d1692a15247a01102
$$ y = [7002439, 9738095, 16381728, 37049278, 86348781, 40827697, 17296983, 10252580, 6105357, 3564399, 2432746, 1948553, 1989528, 3001365, 1762564, 985083, 615282, 511771, 312865, 291328, 220813, 220762, 130899, 70274, 61289, 16820, 40541, 71204, 36623, 51290, 97044, 55538, 28808, 58973, 92956, -15036, -45298, -34176, -6243, 292599, 216899, 165688, 235087, 156340, 206569, 173432, 102072, 109207, 31927, -63, 44302, -61962, -7758, -36043, -136269, -205269, -81578, -50728, -26639, 168052, 168096, 77375, 81335, -37083, -32324, -2016, -70202, -87374, -129796, -116245, -93706, -69797, -41430, -73309, -51932, -167457, -164202, -172656, -144749, -64309, -29868, -59547, -83503, -61614, -65324, -111530, -88415, -59920, -174049, -62907, -55917, -56197, -92835, -15711, -41692, -115247, -101102]
-71.5d1157i2409i0667a09479f9120a44091a21687a20534a30135a78975d7233C9958
-75.9g3726f5169a79132e5084a00771h8415d257e9940i5682a4487g8423a10933b36154
-80.7a24784a26244b06871a21213a33647a27591a54680a98166i5067a09337h5637e4841
-85.1i8699f6657g4438g1205h5963g8381g2502i4220a03659g0574a25388i0355a72134
-89.9a43484a55565a79376a83569a84698a38197a40283a61902a70640a15748i3897
-94a36220f5114e8738a05409a21122a43017b5416D6866A70401A15475A1661b9587e8802
-98.7i3229a69854a46603a64500a07528a52313a81923a78678a35386a98654g7984d5840
-103.2f8012h9017g8945a60933b30880a76739a57835a73668a19875e4766a02622a45431
$$ y = [-41157, -92409, -90667, -109479, -69120, -144091, -121687, -120534, -130135, -178975, -47233, 39958, -73726, -65169, -179132, -55084, -100771, -88415, -4257, -59940, -95682, -14487, -78423, -110933, -236154, -124784, -126244, -206871, -121213, -133647, -127591, -154680, -198166, -95067, -109337, -85637, -54841, -98699, -66657, -74438, -71205, -85963, -78381, -72502, -94220, -103659, -70574, -125388, -90355, -172134, -143484, -155565, -179376, -183569, -184698, -138197, -140283, -161902, -170640, -115748, -93897, -136220, -65114, -58738, -105409, -121122, -143017, -25416, 46866, 170401, 115475, 11661, -29587, -58802, -93229, -169854, -146603, -164500, -107528, -152313, -181923, -178678, -135386, -198654, -77984, -45840, -68012, -89017, -78945, -160933, -230880, -176739, -157835, -173668, -119875, -54766, -102622, -145431]
-107.6b39572b36015a69253i9211g5959a65286a73014a90409a19715a70385a45454
-111.6a53776a54962a06414a44490a98220b12959b10405a06965d8794g6109a71009
-115.7b07654b03983b39587b19701b64555a71744a39999a88813a73151b32790b46522
-119.7c03365b30687a65132a43868a67700g4802a65330a98267a26391a92687a97876
-123.8b09744a42125a99722a77599a07538a18165a59462h7789a54113a00161b33856
-127.8b28172b19446a67653a68007f4135g8075i5662a43930b18270b43758b15711b16450
-132.2a20427g7048a12517a59426h8771a75700a91875g6103a72050a17108a52294b35634
-136.6b13928a83330a20512a06597a91777a86629b52258a69650b24484a96202a89726
$$ y = [-239572, -236015, -169253, -99211, -75959, -165286, -173014, -190409, -119715, -170385, -145454, -153776, -154962, -106414, -144490, -198220, -212959, -210405, -106965, -48794, -76109, -171009, -207654, -203983, -239587, -219701, -264555, -171744, -139999, -188813, -173151, -232790, -246522, -303365, -230687, -165132, -143868, -167700, -74802, -165330, -198267, -126391, -192687, -197876, -209744, -142125, -199722, -177599, -107538, -118165, -159462, -87789, -154113, -100161, -233856, -228172, -219446, -167653, -168007, -64135, -78075, -95662, -143930, -218270, -243758, -215711, -216450, -120427, -77048, -112517, -159426, -88771, -175700, -191875, -76103, -172050, -117108, -152294, -235634, -213928, -183330, -120512, -106597, -191777, -186629, -252258, -169650, -224484, -196202, -189726]
-140.7b61249f44928h56444b43594a43660a92806a31744a61771a89763a68981b11363
-144.7g6915e6570a10985a62804a98932b31942b47377a63833a99267a63336a70993
-148.8a69455a50463a94977a62428b29090a96634a92683a59571a19927a39775b62353
-152.8a64667a30090a82559a49628a35677a95207a97890a86811b36821a72528b34841
-156.8a68004g6259b06353a57186b45675g1844g3859a23408b25284b35063b44894b30774
-161.3a81928b15557a77409g9795a56711h8633a60382b04489b01910a91226a26891
-165.3a83298a24861a88276a82423a90063a37223f2428a78496d5353i9658a47993a22781
-169.7a53466b03663a19410a13015a406i1440a38759a93338a66025b11581a78551b06043
$$ y = [-261249, -644928, -856444, -243594, -143660, -192806, -131744, -161771, -189763, -168981, -211363, -76915, -56570, -110985, -162804, -198932, -231942, -247377, -163833, -199267, -163336, -170993, -169455, -150463, -194977, -162428, -229090, -196634, -192683, -159571, -119927, -139775, -262353, -164667, -130090, -182559, -149628, -135677, -195207, -197890, -186811, -236821, -172528, -234841, -168004, -76259, -206353, -157186, -245675, -71844, -73859, -123408, -225284, -235063, -244894, -230774, -181928, -215557, -177409, -79795, -156711, -88633, -160382, -204489, -201910, -191226, -126891, -183298, -124861, -188276, -182423, -190063, -137223, -62428, -178496, -45353, -99658, -147993, -122781, -153466, -203663, -119410, -113015, -1406, -91440, -138759, -193338, -166025, -211581, -178551, -206043]
-174.1a78093a95344a95694a66942a82723a36979a06722a88614a33172a33047d4274
-178.2g0863a55646b22938b25459a87597b18097a25670a57440a57006a59963a64403
-182.2a26101a46944a32622a70596a14564a34876i3204a23223b53662b77639a00678
-186.3a07426b06247a78061a77885a72633h8053d9882a35049a24133a88986a95289
-190.3a92595b33511b05336a57595a13297a63149a35430a88172a23247g7681a82625
-194.4a82098a59397a98598a13969i5183a00858a87420a20302a32419a46993a76791
-198.4a75533a04210a51753b46674a83581a78835a63421a71474b09993a28917a80374
-202.4b39770a79798a73065a35922f7162a35227a62706a56734b26290a43606a82125
$$ y = [-178093, -195344, -195694, -166942, -182723, -136979, -106722, -188614, -133172, -133047, -44274, -70863, -155646, -222938, -225459, -187597, -218097, -125670, -157440, -157006, -159963, -164403, -126101, -146944, -132622, -170596, -114564, -134876, -93204, -123223, -253662, -277639, -100678, -107426, -206247, -178061, -177885, -172633, -88053, -49882, -135049, -124133, -188986, -195289, -192595, -233511, -205336, -157595, -113297, -163149, -135430, -188172, -123247, -77681, -182625, -182098, -159397, -198598, -113969, -95183, -100858, -187420, -120302, -132419, -146993, -176791, -175533, -104210, -151753, -246674, -183581, -178835, -163421, -171474, -209993, -128917, -180374, -239770, -179798, -173065, -135922, -67162, -135227, -162706, -156734, -226290, -143606, -182125]
-206.5a97896b21997a13298a60970a85353a21258b02482a52795b03235b42989b18938
-210.5b20079a57161b15002a96131a38979i0258i8079a62063a98460b30432b24971
-214.6a54791a54309a60330b27785a82984a85112b09619a18604e9874a29983b57714
-218.6b52875b00960b06383a11986i5821a63903a19010a60714a02402a31207a01375
-222.7e8329a2981f2029a14906a99400b92556b37089b28749b13540a68493b02123a74259
-227.1b77243b45301b48209a71114a59686a54350g1832c7922a14297a62315a27023
-231.1b28781a81123b02953a63168a62541a61766a50048a56017a86863a62738b14765
-235.2a90195a92950b14349b51509b31258b14420a84726a66999a82079b12715b15977
$$ y = [-197896, -221997, -113298, -160970, -185353, -121258, -202482, -152795, -203235, -242989, -218938, -220079, -157161, -215002, -196131, -138979, -90258, -98079, -162063, -198460, -230432, -224971, -154791, -154309, -160330, -227785, -182984, -185112, -209619, -118604, -59874, -129983, -257714, -252875, -200960, -206383, -111986, -95821, -163903, -119010, -160714, -102402, -131207, -101375, -58329, -12981, -62029, -114906, -199400, -292556, -237089, -228749, -213540, -168493, -202123, -174259, -277243, -245301, -248209, -171114, -159686, -154350, -71832, -37922, -114297, -162315, -127023, -228781, -181123, -202953, -163168, -162541, -161766, -150048, -156017, -186863, -162738, -214765, -190195, -192950, -214349, -251509, -231258, -214420, -184726, -166999, -182079, -212715, -215977]
-239.2b50893a79406a48587a56217a71860a89145i4526a17859a05780a13462a47517
-243.3a15489h6467a61317a18078a85580b09840a48552b23670a81123a82306a56769
-247.3a35167a91187a87517b03657h5413a21243a69590a23555a47796a55209a64599
-251.3a22565a83439b03078b09127b04766a97118a30949a68536b01589b79666b59773
-255.4b34070b24535a33120a58087h6328a97043a23754a22932b56610b41541a66342
-259.4a79927a14625a44930a49521a24041a80349a92724b00721a70942a52144a51671
-263.5a34251a27361a38651a15072a61274a36531b32720f5880a2637a08079a26565
-267.5a40166a20971a94905a09690a96795a76549a90919a92800a65007a79236a31184
$$ y = [-250893, -179406, -148587, -156217, -171860, -189145, -94526, -117859, -105780, -113462, -147517, -115489, -86467, -161317, -118078, -185580, -209840, -148552, -223670, -181123, -182306, -156769, -135167, -191187, -187517, -203657, -85413, -121243, -169590, -123555, -147796, -155209, -164599, -122565, -183439, -203078, -209127, -204766, -197118, -130949, -168536, -201589, -279666, -259773, -234070, -224535, -133120, -158087, -86328, -197043, -123754, -122932, -256610, -241541, -166342, -179927, -114625, -144930, -149521, -124041, -180349, -192724, -200721, -170942, -152144, -151671, -134251, -127361, -138651, -115072, -161274, -136531, -232720, -65880, -12637, -108079, -126565, -140166, -120971, -194905, -109690, -196795, -176549, -190919, -192800, -165007, -179236, -131184]
-271.6b25831a96123c01322a88929a65367a81787b01362b53402a63555a21829a59521
-275.6a59535a47605a42712a02178h6442b28590b78034g1697a13110b17894b92226
-279.7a72270a95615a05344a37759a38733b10467a99968b37202b27505a85157a84444
-283.7b05409b47421a08739i9097b46733b88719b56773a98975a29499b12846a81088
-287.8a33468a41591b05127a81162a49939b15199b09307b26798a80307b15971a59003
-291.8a91565i3789a53599a24614a54546a39201g9395b01711a55581b01276a86236
-295.8a38229f5660b0209e5977f4265a07812b06174a52422b18493a66267a06881a57389
-300.3a04986b19755
$$ y = [-225831, -196123, -301322, -188929, -165367, -181787, -201362, -253402, -163555, -121829, -159521, -159535, -147605, -142712, -102178, -86442, -228590, -278034, -71697, -113110, -217894, -292226, -172270, -195615, -105344, -137759, -138733, -210467, -199968, -237202, -227505, -185157, -184444, -205409, -247421, -108739, -99097, -246733, -288719, -256773, -198975, -129499, -212846, -181088, -133468, -141591, -205127, -181162, -149939, -215199, -209307, -226798, -180307, -215971, -159003, -191565, -93789, -153599, -124614, -154546, -139201, -79395, -201711, -155581, -201276, -186236, -138229, -65660, -20209, -55977, -64265, -107812, -206174, -152422, -218493, -166267, -106881, -157389, -104986, -219755]
##END=$$ End of the data block
