##TITLE= para-chloroaniline
##JCAMP-DX= 4.24   $$ JSpecView 
##DATA TYPE= INFRARED SPECTRUM
##ORIGIN= Chem. Dep't, UWI, JAMAICA
##OWNER= public domain
##DATE= 00/06/08
##TIME= 14:33:00
##SPECTROMETER/DATA SYSTEM= PERKIN-ELMER 1000 FT-IR
##INSTRUMENT PARAMETERS=
  X: 4000.00,400.00 cm-1; 16 scans; mode ratio; resol 2.00 cm-1; apod strong
##DATA PROCESSING=
##MOLFORM= C6H6ClN
##MW=127.57
##CASREGISTRYNO= 106-47-8
##MP= 67
##BP= 232
##STATE= solid
##RESOLUTION=   2.000000    
##DELTAX=  -2.000002    
##XUNITS= 1/CM
##YUNITS= TRANSMITTANCE
##XFACTOR= 3.6E-3
##YFACTOR= 8.11943557E-7
##FIRSTX= 400
##FIRSTY= 0.70231256
##LASTX= 4000
##NPOINTS= 1801
##XYDATA= (X++(Y..Y))
111111H64977O1013L6897K0614j8737l4297J5668O6104L357p0833N4984N5309A059641
118333A082205J914j1481p437K924o137p907J986n668J6499R675j7943k5632j4369A027979
126667A037294J0000L213k310r387j3358j6138l754K996k346q268m260o50l718I82743
135000I63103j5632l105j2997k8484k8377k7582m7583q6682j24048j21773l5308E66483
142222H06130J64808O9533L4080J0037j805p907m837o066l104K671m476o210k888A048088
150556A052276L791K130r134n524M549Q773O50p654o209o824m151j408l935M909A039713
159444A037727o787N776N524j011j877l286n018j444j300n018k491J950N018o535A014946
168333A018737j08n524j300n379j1589j1877j1156j5055j6282j6499j5524j8556H53063
$$ plain form
111111 864977 925990 962887 983501 964764 930467 946135 1012239 1015596 944763 999747 1055056 1059641
118333 1082205 1084119 1072638 1065201 1068125 1061988 1054081 1056067 1050399 1066898 1076573 1058630 1032998 1018629 1027979
126667 1037294 1047294 1050507 1048197 1038810 1025452 1009314 1005560 1008556 1006210 997942 993682 993032 989314 982743
135000 963103 947471 944366 931369 902885 874508 846926 799343 712661 588613 466840 431532 566483
142222 806130 970938 1040471 1074551 1084588 1082783 1074876 1070039 1063973 1060869 1063540 1059064 1052854 1049966 1048088
150556 1052276 1056067 1058197 1049063 1043539 1048088 1056861 1057511 1049857 1043648 1036824 1032673 1031265 1027330 1032239 1039713
159444 1037727 1030940 1036716 1042240 1041229 1039352 1036066 1031048 1029604 1028304 1023286 1020795 1022745 1027763 1021228 1014946
168333 1018737 1018629 1013105 1011805 1006426 994837 982960 971804 956749 940467 923968 908444 889888 853063
176111G94505p5237p4154m8703J2672J31557K18203J44663M4694P076l429o860A138994
183333A126503j1806o354K744q159j0723R03k599l755K130J480O86l610o823m621A074551
192222A071049j2852j8593k0542N090K7258J7726K924M34J588l610m585J011K924A072060
200556A070941j480k672R03O607L610j011n271j697J805J553m044m368M729N705A077584
209444A080617L61J335j444l502r02k058l033j010m369l466k888m69L827K094A059533
218333A056067m007p293p148q557q375r098r242j2383j7763k7329l5706m4478H03459
226111G14611j24120j37659r1664r675N2890L6535l3972o1482j4008P6357J61413G46994
233333H78191Q2638N1301L0868J9206J2781P328P149O173K383J950M223K094J697A111231
$$ plain form
176111 794505 719268 645114 596411 609083 740640 958843 1103506 1148200 1155276 1151847 1144987 1138994
183333 1126503 1114697 1108343 1111087 1102928 1092205 1093108 1090509 1086754 1088884 1090364 1091050 1087440 1080617 1075996 1074551
192222 1071049 1058197 1039604 1019062 1024152 1051410 1069136 1072060 1072494 1074082 1070472 1065887 1066898 1069822 1072060
200556 1070941 1069461 1066789 1067692 1074299 1077909 1076898 1071627 1069930 1071735 1073288 1069244 1064876 1069605 1075310 1077584
209444 1080617 1080978 1082313 1080869 1077367 1076465 1074407 1071374 1070364 1065995 1062529 1059641 1059172 1062999 1065093 1059533
218333 1056067 1052060 1044767 1037619 1029062 1020687 1011589 1002347 989964 972201 944872 909166 864688 803459
226111 714611 590491 452832 361168 351493 404383 440918 406946 345464 331456 407813 569226 746994
233333 878191 960829 1012130 1042998 1062204 1074985 1082313 1089462 1095635 1098018 1099968 1104191 1106285 1107982 1111231
241667A115492J263K455J264j878M70L827r03m549m946j841K058J733J841L61A115853
250556A116430j877j480M151K672J047%L25l935m044j733m946j5776q268J1011A105455
259444A103072k996N271L466r39p94j264r39j263j264j08M69r02k636l61m69k383A094011
269444A093902j119j624l719l646l177j228m69j011k130j372k924m802p726j1986A027438
278333I87075n9171j7655N0977N6103K3250O715r75k671m33q67p94j841J299J011A041807
287222A040038o86k852r75j769k816n813q339j1337n595P003J3828R567K527k419A025885
296111A021878p798p545k058j408q629j2022j6787k4550n4551j33506j87877l6897F20564
303889G34756K00187J13470R784o137p835q917j1372j7185k4116k7005j9351k166I47038
$$ plain form
241667 1115492 1116755 1119210 1120474 1118596 1119066 1122893 1121990 1117441 1112495 1110654 1112712 1114445 1116286 1116647 1115853
250556 1116430 1114553 1113073 1117224 1119896 1120943 1120943 1121268 1117333 1113289 1111556 1106610 1090834 1082566 1093577 1105455
259444 1103072 1100076 1105347 1108813 1107874 1107080 1105816 1104877 1103614 1102350 1102242 1102711 1101809 1099173 1098812 1098343 1095960 1094011
269444 1093902 1092783 1091159 1087440 1083794 1080617 1079389 1078920 1077909 1075779 1074407 1071483 1066681 1058955 1046969 1027438
278333 987075 927904 910249 961226 1017329 1040579 1047294 1046319 1043648 1043215 1042348 1041554 1039713 1041012 1042023 1041807
287222 1040038 1039352 1036500 1035525 1033756 1030940 1025127 1016788 1005451 999856 1006859 1020687 1030254 1032781 1030362 1025885
296111 1021878 1014080 1006535 1004477 1003069 994440 982418 965631 941081 886530 753024 565147 528250 620564
303889 734756 934943 1048413 1058197 1052060 1044225 1035308 1023936 1006751 982635 955630 936279 934113 947038
311667I59782O354O896J4477K3538K1301J2636M332M33j119l971l755o679o029A026788
320000A027113j661j624j408k167l682k491m657p618j0903j6174k2744l3575q8307F89556
328333F21864K4333J59933K00188O1699J119n704m477n343m765o391m187l177A032131
336111A028954j083q66k203k707j950l032l250l574n271m621k996m585m333k996I82960
345000I81913l502n055o065p112q917j0289j0939j3033j5344j6390j7582j7402H28694
352778G99235l2095l2204l4261l7474m2926m6716n6573p5093o9822j8412N5453E55219
360000G61038J62028Q3252L7799J6535N921%m585l899l249r75j589o859q701o137A025452
368889A023178J083Q66L25J769J733j300J09J408o50k058l177n090l575k166j299A010831
$$ plain form
311667 959782 966136 973032 987509 1011047 1032348 1044984 1049316 1049749 1048630 1044659 1040904 1034225 1028196 1026788
320000 1027113 1025452 1023828 1022420 1020253 1016571 1014080 1009423 1001805 990902 974728 951984 918409 830102 689556
328333 621864 646197 806130 1006318 1068017 1069136 1063432 1058955 1053612 1048847 1042456 1038269 1035092 1032131
336111 1028954 1027871 1027005 1024802 1022095 1020145 1017113 1013863 1010289 1005018 1000397 997401 992816 988483 985487 982960
345000 981913 978411 973356 967291 960179 951262 940973 930034 917001 901657 885267 867685 850283 828694
352778 799235 767140 734936 700675 663201 620275 573559 516986 441893 372071 353659 409112 555219
360000 761038 923066 1006318 1044117 1060652 1066573 1066573 1061988 1058089 1054840 1053865 1052276 1045417 1036716 1030579 1025452
368889 1023178 1024261 1025127 1025452 1027221 1028954 1027654 1027763 1029171 1028521 1026463 1023286 1018196 1014621 1012455 1011156 1010831
378333A009423l863N41J589p22j950k238k924k564l502p653r206j878M188K238I81479
387222I79783n777l574j769Q30R39k635k491j264l033m043l935k888q232n343I33102
396111I27904m549p762j1914r928j3791k7474j3250O86J1011J2022Q051L791l97H71295
404444H67288j9676j4513q051q665k0506k0795j4405q448q989j7402l0903l3575F06159
412222E37853o7547o5057j06718j13759k9496K2203K8738k2528O0147J35817J58092H48550
419444I45485L7800L1661J7293J517L429r855q376q557j516M766R856N126j299A027654
427778A022311j8268j1552j0289l900q917j0542q484o607P943j444J227J228l899I44475
436111I31369j7906j3069j9640j3250k924q267j0615q520j0181j1733j2997j6932G58836
$$ plain form
378333 1009423 1005560 1006101 1007690 1006968 1005018 1002780 999856 997292 993790 986137 976931 975053 979241 981479 981479
387222 979783 974006 970432 968663 969493 970432 967797 965306 964042 961009 956966 953031 950143 941911 936568 933102
396111 927904 923355 915593 903679 893751 879960 852486 839236 839922 850933 862955 871006 874797 874400 871295
404444 867288 847612 833099 825048 816383 795877 775082 760677 752229 743240 725838 694935 661360 606159
412222 537853 470306 405249 298531 184772 155276 177479 206217 183689 243836 379653 537745 848550
419444 945485 983285 1014946 1032239 1033756 1037185 1027330 1018954 1010397 1008881 1013647 1023503 1028629 1027330 1027654
427778 1022311 1004043 992491 982202 978302 969385 958843 950359 943752 951695 950251 951478 952706 948807 944475
436111 931369 913463 900394 880754 867504 864580 856313 845698 837178 826997 815264 802267 785335 758836
443889G25333l4189l6391m7042n5814o7583q1845p8522o0075l9821n776M1915C32936
451111D80487J29499Q6032P6284M1843L6247M1662L1301J0686J3611J2635J6427I99350
458333A010289J1048J5487L61N163N415K744k202P58M224j08k563M909K564p95A055634
467222A056500O86j2419J444J986L538M765R03l322J336k563K563L25j011J553A055164
476111A052746L25m549m297L647K16j877k17m332k744k202n885M369K16j660k275A033214
485556A034081m044n126R74R03n560q66R75o50L465M477J841l25J120L068K491A038269
495000A036824%k274j877N41p58k202q67l25J408n41q67l25j516k419k707j733A019929
505000A018845j841l25J09j09K058j08q67J083J517o50j950m33k816k816J08n41A012239
$$ plain form
443889 725333 691144 654753 607711 551897 484314 402469 323947 263872 224051 218275 260190 332936
451111 480487 609986 696018 772302 814145 850392 892054 923355 934041 947652 960287 976714 999350
458333 1010289 1021337 1036824 1037185 1042348 1047763 1050507 1048305 1049063 1053287 1053179 1050616 1055525 1058089 1057294 1055634
467222 1056500 1057186 1044767 1046211 1048197 1051735 1056500 1057403 1054081 1055417 1052854 1055417 1055742 1054731 1056284 1055164
476111 1052746 1053071 1048522 1044225 1047872 1048088 1046211 1045994 1041662 1038918 1036716 1030831 1035200 1035416 1033756 1031481 1033214
485556 1034081 1030037 1024911 1025885 1026788 1021228 1020362 1021337 1020687 1024152 1028629 1030470 1030145 1031265 1034333 1036824 1038269
495000 1036824 1036824 1034550 1032673 1033214 1032456 1030254 1029387 1029062 1030470 1029929 1029062 1028737 1027221 1024802 1022095 1020362 1019929
505000 1018845 1017004 1016679 1016788 1016679 1018737 1018629 1017762 1018845 1020362 1019712 1017762 1017329 1014513 1011697 1011805 1011264 1012239
515000A012672J08j408l790l105q67r38k275p256p762p401j0687j5488j6751l574I47038
523889I71479J9423J1336O643L358Q66K17q67q66N41n41j192j949j264o49l25A004585
533333A001264k17J516K455J300j408q67K17l25q66Q66Q67j083r39j733p58N41A000830
543333I99242O14P58K16K17o50k347j371j517j480n41j09%L25m33k238j806J084I90794
553889I89639j156m33o50j697j155q66j156J09P58N05Q67L25R38R39M33n41J08I86859
564444I86967l97j300j80m34j371j09N06%r39j047L97k89q66p22L97J083J08o49I80433
575556I80216r75j155k89J08p58j372n05j697l466j155K17o14p58j81P2M34J660I70938
586111I72309J156M33N05q30j372q30L25J08N05Q31K16%o13j372%L25l25K16%I70757
$$ plain form
515000 1012672 1012780 1011372 1007582 1004477 1003610 1002672 1000397 993141 985379 977978 967291 951803 935052 931478 947038
523889 971479 990902 1002238 1008881 1012239 1013105 1013322 1012455 1011589 1012130 1011589 1010397 1008448 1007184 1006535 1006210 1004585
533333 1001264 1001047 1002563 1005018 1006318 1004910 1004043 1004260 1003935 1003069 1003935 1004802 1003719 1002780 1001047 1000289 1000830 1000830
543333 999242 999856 1000614 1000830 1001047 1000397 998050 996679 995162 993682 993141 993032 993032 993357 992924 990686 988880 989964 990794
553889 989639 988483 988050 987400 985703 984548 983682 982526 982635 983393 983898 984765 985090 986028 986967 987400 986859 986967 986859
564444 986967 986570 985270 985090 984656 983285 983176 983682 983682 982743 981696 982093 981804 980938 980216 980613 981696 981804 981155 980433
575556 980216 979241 978086 977797 977905 977147 975775 975270 973573 970107 968952 969169 968555 967797 967616 967688 968122 969782 970938
586111 972309 973465 973898 974403 973573 972201 971371 971696 971804 972309 973140 973356 973356 972743 971371 971371 971696 971371 971587 971587 970757
597778I69385j372n05j08K16J81o14p22%K89j336j155l25q31j444%J336P58O14I64367
608889I64042L25L25P2%n05l25J047J08j047j047j80o50j228m33p22j264j08M33I59240
620000I59349j81j08r39q30K16m33j155o14Q31k89j264K17Q30N06J263N06j553I55197
630556I55919p2j155r39q31j119j372p94n41j553p2J841n05k672q30K89j842m296I37182
641111I35052k455P22J408J119J08p94j119k166k239k021J08j625k852O14r02I21044
650556I23571M152J011J841K130j08m766m476j733l213O86J841J805J516R03J733I28012
660000I29456L357K853J841J516K383K89o14j625o13P94n06j841j08j228j119I35666
669444I36893k17k16l97j517j08J625j09j516j119p22J08P94P22L25l25j841%I33933
$$ plain form
597778 969385 968013 967508 967400 967616 967797 967183 966461 966461 966750 965414 964259 963934 963103 961659 961659 962995 963753 964367 964367
608889 964042 964367 964692 964764 964764 964259 963934 964981 965089 964042 962995 962815 962165 960937 960504 959782 958518 958410 958843 959240
620000 959349 959168 959060 958121 957291 957507 957074 955919 955305 956136 955847 954583 954800 955630 956136 957399 957905 956352 955197
630556 955919 955847 954692 953753 952922 951803 950431 949637 949096 947543 947471 949312 948807 946135 945305 945594 943752 939456 937182
641111 935052 932597 933319 934727 935846 935954 935160 934041 931875 929636 927615 927723 926098 923246 923860 922958 921044
650556 923571 927723 928734 930575 932705 932597 927831 923355 921622 918409 919095 920936 922741 924257 925160 926893 928012
660000 929456 932813 935666 937507 939023 941406 941695 941081 939456 938843 939637 939131 937290 937182 935954 934835 935666
669444 936893 936676 936460 936063 934546 934438 936063 935954 934438 933319 932597 932705 933499 934221 934546 934221 932380 932380 933933
680000I34546K89L97J769J517o14j119j553n05J047O86%o86o14O14O14j553r02I34330
690556I34835k89o13l25j81q30o14Q30O86r02r03J81l97j228Q31j09j119o14j08I29961
701667I30647k89p22j408j841j119o14N06n06j011j010r03L25j08j408k239o13I16279
711667I13571j589K89K89j408p2J083J805K708K346J517R02J517K88j805j516I17903
721111I14762l213j191k89l25K311L826J300N06J010n05n78k16j011j914r02J119I15195
731111I13788n06j300j516j08o86N05K275K238P94J09j914j227j81j08j08J08I11657
741111I12380K093K311P22J300J408k89o14p94j841j300O14O86o86j228m69R02I15701
751111I14871k89p22J011n06j697R03k17j805j300k88%j011L97j191%K021j08I08553
$$ plain form
680000 934546 934835 935232 937001 938518 937904 936785 935232 934727 935774 936460 936460 935774 935160 935774 936388 934835 933933 934330
690556 934835 934546 933933 933608 933427 932597 931983 932813 933499 932597 931694 931875 931478 930250 931081 930972 929853 929239 929131 929961
701667 930647 930358 929636 928228 926387 925268 924654 925160 924654 923643 922633 921730 922055 921947 920539 918300 917687 916279
711667 913571 911982 912271 912560 911152 911080 912163 913968 916676 919022 920539 921441 922958 923246 921441 919925 917903
721111 914762 911549 910358 910069 909744 912055 915881 917181 917687 918697 918192 917614 917398 916387 914473 913571 914690 915195
731111 913788 913282 911982 910466 910358 909672 910177 912452 914690 915484 915593 913679 912452 912271 912163 912055 912163 911657
741111 912380 914473 916784 917506 918806 920214 919925 919311 918517 916676 915376 915990 916676 915990 914762 914293 915195 915701
751111 914871 914582 913860 914871 914365 912668 913571 913354 911549 910249 909961 909961 908950 909347 908156 908156 910177 910069 908553
761667I08264j08N05J805l97o14j80o14P94J011p22j986j408n77l97K88o85Q66I07253
772222I07072j408o13N05J08P95K16p22n77q31r74k094j300O86J191J517J80j697I01657
782778I01585j08K88j191r03k88r75p94j589j119%k455l538k888m116m874m404H69057
792778H68082J444J841L322L429K347K744O86l97J083L97j09j08j80n06p94k238H75952
802778H71945R75K455M69p58j553K89J661p94n78n78k816m476l755k816m621k960H51727
812778H52305J805L249K600K708K816K491L104L430M080R74j660J08K89n06l61H77216
822222H77505n78j769p2J552K816J877j263r75k89J661K419O14J80P94N06%L61H85664
832778H85555J769N78k89n77n06K17%j08k17n78j372j949o86j372l538r75K89H76638
$$ plain form
761667 908264 908156 908661 910466 910069 909455 909275 908661 909455 910466 909744 907758 906350 905773 905376 905664 904979 905845 907253
772222 907072 905664 905051 905556 905664 906459 906675 905953 905376 904545 903571 901477 900177 900863 902054 903571 903751 902054 901657
782778 901585 901477 901765 900574 899671 899383 898408 897614 896025 894906 894906 892451 888913 886025 881909 877035 872631 869057
792778 868082 869526 871367 874689 878118 880465 883209 883895 883498 884581 884978 884869 884761 884581 884075 883281 881043 875952
802778 871945 872920 875375 875844 875086 873533 873822 875483 874689 874111 873533 870717 866241 862486 859670 855049 852089 851727
812778 852305 854110 857359 859959 862667 865483 867974 871078 874508 878588 879562 877902 878010 878299 877793 877432 877216
822222 877505 876927 875158 875086 876638 879454 881331 880068 879093 878804 880465 882884 883498 883678 884472 884978 884978 885339 885664
832778 885555 887324 887902 887613 887036 886530 886747 886747 886639 886422 885844 884472 882523 881837 880465 876927 875952 876241 876638
843333H75663k88L104L250R74q66j877j264r75k346l033p2K996M874K563J09k89H81620
853333H81223n77J191J047k058j552m70j011m69J08j660k925k88Q66N78O86L97H75375
863333H75375j553p94j08j444j264J444K058m69j769j445o86k16L97J661%j264H69057
873333H67901J156k89n78R39K16j732p95J81K89n78j047j155j733n78o86k599H57359
883333H56313j625n78k094j913r75j697k202k094l61M730P076L863J155P2L97H61620
892778H61800J81o50j09j732n78R75%K88o85k131%L98j336j372q30j09j08j986H50753
903889H50572q66j228n05J733j228l249l97N78r39j08j408k275r75j227q30q67H35842
913889H36131J09j914j480q67j407k167j480k89J81j408k708k419j588q31l61H16275
$$ plain form
843333 875663 875375 878479 881729 882703 881837 879960 878696 877721 875375 872342 872270 875266 880140 882703 882812 882523 881620
853333 881223 880646 881837 882884 880826 879274 878804 877793 877324 877432 875772 872847 872559 873425 874003 874689 875086 875375
863333 875375 873822 873028 872920 871476 870212 871656 873714 873245 871476 870031 869345 869129 869526 871187 871187 869923 869057
873333 867901 869057 868768 868190 869129 869345 867613 866818 866999 867288 866710 865663 864508 862775 862197 861511 858912 857359
883333 856313 854688 854110 852016 850103 849128 847431 845229 843135 842774 847504 854580 858443 859598 859670 860067 861620
892778 861800 861981 861331 861222 859490 858912 859887 859887 860175 859490 857359 857359 857757 856421 855049 854219 854110 854002 852016 850753
903889 850572 849706 848478 847973 849706 848478 845229 844832 845410 844471 844363 842955 840680 839705 838478 837648 836781 835842
913889 836131 836240 834326 832846 831979 830572 828405 826925 826636 826817 825409 822701 820282 818694 817863 817502 816275
923333H15445j481l032k491j661j950j913k744l141k707k925l718l069l249o354G68836
932222G64035n921o679r856j2311j2708j4369j8231k4117l0651l9243n0471o0038D24817
940000D13878P2421J40727J32424P8559L5308J1661K238o86l718n668n380l863H65483
947778H62558n199m873k311k960o824o606l105P2k238m766l935k491m549m982H02917
956667G98332l574p798r640o715q592j1264j2455j4152j7943k1806k5488l3792E87097
964444E52547j4946K5813O8089Q4877P8378N6753L3250J8124J0289M729L141J300I20827
972222I17687j084j732l502k311o86j119k89o14j299r03p94l97k563j914O14%H99202
982222I01874j09K89j083j191n06l97L25P94P95J769L25J80K89j083k491l755H98300
$$ plain form
923333 815445 813964 810932 808441 806780 804830 802917 800173 797032 794325 791400 787682 784613 781364 775010 768836
932222 764035 758114 751435 741579 729268 716560 702191 683960 659843 629192 589949 539478 479440 424817
940000 413878 486299 627026 759450 838009 873317 884978 887216 886530 882812 877144 871764 867901 865483
947778 862558 857359 852486 850175 847215 840391 833785 830680 830752 828514 823748 819813 817322 812773 807791 802917
956667 798332 794758 786960 777320 770605 762013 750749 738294 724142 706199 684393 658905 625113 587097
964444 552547 537601 563414 631503 716380 794758 851511 884761 902885 913174 917903 921044 922344 920827
972222 917687 916603 914871 911369 909058 908372 907253 906964 906350 905051 904148 903354 902957 900394 898480 899094 899094 899202
982222 901874 901765 902054 900971 899780 899274 898877 899202 899996 900791 902560 902885 903065 903354 902271 899780 896025 898300
992222I04076K996L98K88J192J119K311l98q303R75N415J80k707k166J372M007I13860
1001667I12560k816j083J986J408N05j08j480p23K311K708J227q339k094L610L791I16170
1011111I17109k17J625K022k744l105k635L538J010r02N018P22p22K347K419l755I15268
1020556I22127p94q953K815M730M549K238j08p22n957j625J733R03K707J09l430I21441
1030000I22560k16k636k310J913L755K094j697l646p22p3K419L430j228o967k491I15195
1039444I14979J119m043L213k203R03L935J516K131p23l97K311k311q30K527j408I21225
1048889I21622k89j805j336J336J408K419K021J517J08j841n343K021J625m874I19708
1057778I17795J011O13L322L538j697K419n451l358L755O86J227J516J228p22m152I17614
$$ plain form
992222 904076 907072 907470 907758 908950 910069 912380 911982 903679 904654 910069 910249 907542 905376 906748 910755 913860
1001667 912560 909744 908661 910647 912055 912560 912452 910972 910249 912560 915268 916495 908156 906062 909672 913463 916170
1011111 917109 916892 918517 920539 917795 914690 912055 915593 916603 915701 920719 921441 920719 923066 925485 921730 915268
1020556 922127 921333 912380 915195 919925 924474 926712 926604 925882 919925 918300 920033 920936 923643 923752 920322 921441
1030000 922560 922344 919708 917398 919311 923066 925160 923463 919817 919095 919022 921441 924871 923643 916676 914185 915195
1039444 914979 916098 912055 915268 913065 913968 917903 919419 921550 920827 920430 922741 920430 919600 922127 920719 921225
1048889 921622 921333 919528 918192 919528 920936 923355 925376 926893 927001 925160 919817 921838 923463 918589 919708
1057778 917795 918806 919419 922741 926279 924582 927001 921550 918192 921947 922633 923860 925376 926604 925882 921730 917614
1067222I17903L97k16K130J624l321j2058M693L610K239K599K17k311N054j949I06170
1076111I08661M404L719J119p22L033j408j011L646q30k708K311M043o86k021j09I19095
1085556I19419L719M874P22j444n06j516k89K636j733p94J299J011O14j08j192I25485
1095000I25990q30N05P22j299R02K89L25J516p22j08J227j011J842K346j949j914I29023
1105000I29961R03Q30n41o86J011J08j228j335o86I28734
$$ plain form
1067222 917903 918300 918084 920214 921838 918517 906459 911152 914762 917001 919600 919817 917506 922560 920611 906170
1076111 908661 913065 916784 917903 917181 920214 918806 917795 921441 920611 917903 920214 924257 923571 921550 921441 919095
1085556 919419 923138 928012 928734 927290 926784 925268 924979 927615 925882 925088 926387 927398 928012 927904 926712 925485
1095000 925990 925160 925665 926387 925088 925990 926279 926604 928120 927398 927290 928517 927506 929348 931694 929745 927831 929023
1105000 929961 930864 931694 931153 930467 931478 931586 930358 929023 928337 928734
1111111I28914  $$checkpoint
##END=