##TITLE= p methoxybenzoic acid
##JCAMP-DX= 5.01
##DATA TYPE= NMR SPECTRUM
##DATA CLASS= XYDATA
##ORIGIN= Department of Chemistry, UWI, Mona, JAMAICA
##OWNER= public domain
##LONGDATE= 2002/06/14 22:11:12
##.ZEROFILL= 126
##SPECTROMETERDATASYSTEM= Bruker AVANCE 200 MHz
##.OBSERVEFREQUENCY= 200.131
##SOLVENTNAME= CHLOROFORM-D
##.ACQUISITIONTIME= 1.979
##.ACQUISITIONMODE= SIMULTANEOUS
##.OBSERVENUCLEUS= ^1H
##.OBSERVE FREQUENCY= 200.131
##XUNITS= HZ
##YUNITS= ARBITRARY UNITS
##XFACTOR= 2.10155319E-3
##YFACTOR= 1.31280325E-1
##FIRSTX= -100.15318667
##FIRSTY= 32.75150781
##LASTX= 2001.4
##NPOINTS= 8318
##XYDATA= (X++(Y..Y))
-47657B49J88P17n61j061J029j24j092Q73O86m99l1k18r4o55Q42j559K027r98d99
$$ 249 437 1154 593 -468 561 437 -655 218 904 405 374 156 62 -593 249 -1310 717 -281 -499
-45252c74M68K49k49o55r4R98l74j56R3j87L75K80m36L11J25l43q73J341n30k50f2
$$ -374 94 343 94 -561 -655 343 -31 -187 -94 -281 94 374 -62 249 374 31 -842 499 -31 -281 -62
-42618F2m05M99M37j186R67o86M68N92j185J154j247J247k80M05m68j091j25J185I36
$$ 62 -343 156 593 -593 374 -312 156 748 -437 717 -530 717 437 842 374 -717 -842 343 936
-40196I4j25R98j341Q42K18j029M68r4O3O23j029J092j029J87R3%J56J25R98j248B18
$$ 94 -31 967 -374 468 686 -343 125 31 94 717 -312 780 -249 -62 31 31 187 312 1310 62 218
-37561C12L1M99j060k19M06J56J56k19q73Q11j25L74m36Q11l12l43R67q11r4M06F86
$$ 312 343 842 -218 -437 -31 125 281 62 -811 0 -125 249 -187 624 312 -31 936 125 31 437 686
-34927a25k49N30O86j154L74r98J310p79k19O86K50l43J56L1R3l74L1J341j309c12
$$ -125 -374 156 842 -312 62 -936 374 -405 -624 62 312 -31 125 156 249 -125 -94 1247 -62 -312
-32410F55j25j25L2k19k18K49q42J248r98M05L43q10K18L1L12j56j56J154j341E61
$$ 655 530 405 437 218 0 249 -593 655 -343 62 405 -405 -187 -156 156 0 -156 998 -343 561
-29885c74J185q73%N30l43N30p49l74O24l43L1M05L75j185O2Q11p17K80K50J403I67
$$ -374 811 -62 -62 468 125 655 -94 -468 156 -187 -156 249 624 -561 -499 312 -405 -125 125 1528 967
-27200D37j25O2q73R67m68N30r3q11j87L74L1J56q73J466j373R67l1K81r98N30c74
$$ 437 312 374 -499 468 0 530 437 -374 -561 -187 -156 0 -873 593 -780 187 156 437 -561 -31 -374
-24588a56K50k19J154j216M36j403J871J56K50l12l74r36J247P80j622J88r4J25C12
$$ -156 94 -125 1029 -187 249 -1154 717 873 1123 811 437 -499 748 1528 -94 94 0 125 312
-22192c74J060o86m37K19j87O86K80r04O24j87J87L1N30M05m05j029P48l43k80C43
$$ -374 686 0 -437 -218 -405 281 561 -343 281 94 281 312 842 1247 842 -187 561 218 -62 343
-19655c12P80l74L74j87j25N61j029M06J340j528%m36P17m68Q42%r3l12k18O2B18
$$ -312 468 94 468 281 156 717 -312 94 1434 -94 -94 -530 187 -281 561 561 468 156 -62 0 218
-16993d68J154P48p48j216m37L74R4J341j216k50Q42l43K81P17n30m68P49R3r35A56
$$ -468 686 1434 686 -530 -967 -593 -499 842 -374 -624 218 -125 156 873 343 -125 624 717 -218 156
-14468g17J902n92q11M05o55R67m99M68l12N30j029O55j56K18n61O55l74m68Q73H42
$$ -717 1185 593 -218 187 -468 499 0 468 156 686 -343 312 156 374 -187 468 94 -374 499 842
-11951D68j029J091m68Q11j528N61L12j528J279l74M05L1m05N92k49J25j25o3G48
$$ 468 -561 530 62 873 -655 -94 218 -1310 -31 -405 0 31 -374 218 -31 94 -31 -94 748
-9557E30p17K18j25O55n30O55r67N30L44j684J684k50N93r98L43O2K18l12p17B81
$$ 530 -187 31 -94 561 31 686 -281 249 593 -1091 593 343 936 -62 281 343 561 249 -468 281
-7040D05p48J123m06r04r4R67N93q74%n61M68O2N62o24L74k49Q42j279P80K80C43
$$ 405 -343 780 374 -530 -624 343 936 62 62 -499 -31 31 593 -31 343 94 936 -343 437 717 343
-4403E30r04M99M68l44n30O24o86j25K81o2K18k50J154r3k81o24R67j091P48D99
$$ 530 -374 125 593 249 -281 343 -343 -468 -187 -249 -31 -281 873 780 499 -125 842 -249 499 499
-1864e30J216m05L74o2j25j87M05n30j56N93J87k81l74O2J653j653L74M99p79B81
$$ -530 686 281 655 593 468 281 686 156 0 593 780 499 125 187 1840 187 561 1060 281 281
661F2l1N30j56M99q73o2o24M37O23l11K80l74K81q74J88K49k18j56Q42l74D99
$$ 62 31 561 405 904 31 -31 -655 -218 405 94 374 0 281 -593 -405 -156 -374 -530 312 -62 499
3296h11R67O55%j435L43%N62L43o55N30N61j309J465j341K19M36r3o24Q11m99F55
$$ -811 156 811 811 -624 -281 -281 281 624 -31 499 1060 -249 1216 -125 94 530 437 -187 624 125 655
5955I04j652J434n30O55j341N30M99o2k50o2m68N92m05P17J25Q11o24r67L12b49
$$ 904 -748 686 156 811 -530 0 499 437 187 125 -343 249 -156 561 686 1497 873 -94 218 -249
8472e93J88O54Q11m67k246J778j25r36J903n93n92r4R05j497J871m99l74j248g80
$$ -593 -405 249 1060 593 -1653 125 0 -936 967 374 -218 -312 593 -904 967 468 94 -1154 -780
10866C12N92j091R3J809j653j87o2l43L74L43m99k49P48j25K50J87p48K18l74a56
$$ 312 904 -187 -94 1715 62 -125 -187 -530 -156 187 -312 -561 187 62 312 499 -249 -31 -405 -156
13391B81L1l74k50R36j029o3J528j060L12n93J56o2O2k18K49k80N61M06k81M05c1
$$ 281 312 -62 -312 624 -405 -468 1060 0 312 -281 -125 -187 -125 -343 -94 -374 187 593 312 717 -31
16076H42j372J310J56k81j25p48O2M68m68M99o2m99K151j964N30r98Q42L12j497e61
$$ 842 -530 780 936 655 530 -218 -156 312 -156 343 281 -218 1933 -31 499 -499 343 655 -842 -561
18593d37N31L74K80l43l11o55P79l74J247m98k50q11N30M06r4J87J56p17O55D99
$$ -437 94 468 748 405 94 -561 218 -156 1091 593 343 -468 62 468 374 561 717 0 655 499
21084f2O23r35M68p49J934l43j279o2Q42o55J56j56O2L74j56J87J88%p49J185I4
$$ -62 561 -374 94 -655 1279 936 -343 -405 437 -218 -62 -218 -156 218 62 249 437 437 -312 873 94
23769c1l74R66o2m37l1n92N92m68J061j061M06M68r4N30m99q42J123m37r98M06a87
$$ -31 -405 561 499 62 31 -561 31 -437 624 -437 -31 437 343 873 374 -468 655 218 -780 -374 -187
26406E93m99R35m05o55R3L12L1J88l12L1J25j030N93l1J56o86Q10o54l12J029H42
$$ 593 94 1029 624 -31 62 374 405 593 281 312 437 -593 0 -31 125 -561 249 -405 -717 312 842
29043F24m68q73J091j25o2p80J25K81R3j87O55k80K80o2j029K18J310r4j497A56
$$ 624 156 -717 374 249 187 -593 -468 -187 -94 -281 374 94 374 312 -717 -499 811 717 -780 156
31568C74r04K81J434n30l43N30r4o86O3k50R36N92j029M68p17O86j56r67J060A029
$$ 374 -530 -249 1185 655 312 842 748 62 125 -125 811 1403 374 842 125 811 655 -312 748 1029
34110D68r4k18k81N93R3R4j123O3N61l43L74J87j25O3M68r98m37J216q10N61f2
$$ 468 374 156 -125 468 561 655 -468 -405 156 -187 187 374 249 312 780 -218 -655 561 -249 312 -62
36745a56K18J341j808J24o86J747p49m68m05J154K49K81j091o3J029n92O55j684F2
$$ -156 62 1403 -405 -281 -967 780 31 -437 -842 312 561 842 -249 -312 717 125 780 -904 62
39164B81k19K81o55j25k18j56Q11J87r3l2O55p48m99M68Q73j87L43r98m37J372E30
$$ 281 62 343 -312 -437 -655 -811 0 187 94 62 717 -31 -530 -62 811 624 967 -31 -468 904 530
41778a87M68R3O3L43K18m68l1L12m06l1n61N30R4j56K80k18m68P80o2j56q74d99
$$ -187 281 374 437 780 998 530 499 811 405 374 -187 343 437 281 561 343 -125 655 593 437 -437 -499
44533D68o55K49N62p18K50o2p18R67L74m68j122K401j310j154M06O24o3k18R3a87
$$ 468 -187 62 624 -94 156 94 -624 343 717 249 -873 1528 218 -936 -530 94 31 -187 -94 -187
47058D68k19j87k80J154q11M99J154j778L12n30Q11q74o2M05M99M37j559%J590F55
$$ 468 249 62 -218 936 125 624 1778 0 312 -218 593 -281 -343 62 561 998 -561 -561 1029 655
49622I4o3J497r67n61L12J25L43n93m99N30k80L1M05o55j87R67Q42k18m68l43a87
$$ 94 31 1528 561 0 312 437 780 187 -312 218 -62 -31 374 -281 -468 499 1341 1123 655 312 -187
52234I67j56r98N92j590J279j25o3r3J091r04L74o23J87N61j435J248O55o55A029
$$ 967 811 -187 405 -1185 94 -31 -94 -187 904 0 374 -249 -62 499 -936 312 967 312 1029
54654D99l43j25P17r35R3R4l74L43R3j24k19m67M05N61r3J372j403Q42p18L12I67
$$ 499 156 31 748 -187 -94 0 -374 -31 62 -62 -281 -748 -343 218 125 1497 94 936 218 530 967
57313G17O3j279M37J87%j56L74J25m06L2J55J25r3n30J185j622l74P79P80R67E93
$$ 717 780 -499 -62 125 125 -31 343 468 62 94 249 374 281 -249 936 -686 -1060 -281 499 1466 593
59925e93P18J87l43M68K80k80j88O24m68n61%N61r66R35L1J56L2m68J24m98P48G17
$$ -593 125 312 -31 437 717 437 249 873 405 -156 -156 405 -561 374 405 561 593 125 249 -249 499 717
62690F2l43n61R98O2L43n30j25j87k80O55Q73n62o2l43L1L12O2K81p80J88J24E61
$$ 62 -281 -842 156 218 561 31 -94 -281 -561 94 967 405 343 0 31 343 405 686 -94 94 218 561
65493G17o2l74m99L43K18p17J060m05L74k18k19J123j559N61l12L43j091Q11I4
$$ 717 655 281 -218 125 343 -374 686 281 655 437 218 1341 -218 343 31 374 -717 94 94
67864C12o55N30m36O2M68m37N93k81O86l12K18m05P17r98j24l43O23M99j216d68
$$ 312 -343 187 -249 -187 281 -156 437 156 842 530 748 343 1060 62 -62 -405 218 717 -499 -468
70404A279m37r98M68r4q11M99j24N30m37J87M37J87K50N61n93m05p17Q11m37A029
$$ 1279 842 -156 312 218 -593 -94 -218 312 -125 62 499 686 936 1497 904 499 -218 593 156 1029
72921d05J87J933k089N30M37%O2L74m99m99r3r4R67L1o24O24p48R35k49m06j25A25
$$ -405 -218 1715 -374 156 593 593 655 1029 530 31 -62 -156 811 842 218 842 94 1029 780 374 249 125
75678A87r3J060j279Q73q10o86J496m36M68q11m06J25J123M99j435R36j248o2g80
$$ 187 94 1154 -125 748 -62 -748 748 312 780 -31 -437 -312 811 1310 -125 811 -437 -499 -780
78083B49N62n30J87O86j715J216Q42k433J435n93l1K81r04J060p49J123n92k50G80
$$ 249 811 281 468 1154 -561 655 1497 -936 499 -94 -125 156 -748 312 -437 686 94 -156 780
80504I67n30n31k49O55R3N31j88j964J216j87l43O24k81K49%R36r04k19l1l1F24
$$ 967 437 -94 -343 312 405 936 748 -1216 0 -187 -530 94 -187 62 62 998 94 -125 -156 -187 624
83139c43J310r36M68q42J185j372L12M05r3j56J56P48k81N93q73k81J902k557i4
$$ -343 967 31 499 -343 842 -530 -218 187 94 -62 94 842 561 1154 281 0 1902 -655 -94
85558a56M05o23o3M37O2o23Q42o3l43Q42j56m36P48r3q42O23l43N93r98L43k81f86
$$ -156 249 -374 -437 0 62 -561 281 218 -125 717 561 125 873 780 -62 561 218 811 -187 156 -125 -686
88313A87J87R4R98j341r4k80r4N92L44n31N62p18J25J060j091N93j435r4J185c12
$$ 187 374 468 1466 125 31 -249 -343 249 593 62 624 -94 31 1091 0 593 -842 -936 249 -312
90838B18N62l75K81l1K18r67l43J25P80p17o87J248p49M68P49q74K81o2k81R4I98
$$ 218 780 405 686 655 873 -94 -437 -312 468 -249 -936 312 -437 31 780 -94 187 125 -156 -62 998
93497b81p79J154n62N30N93K18r98Q11m68P49j56j123Q73L43L2p18r3M36j091B49
$$ -281 -1060 94 -468 62 655 873 -125 686 218 967 811 -312 561 904 936 218 125 561 -530 249
95989b81N30K81j25n61P80j56r05J497q42o2J56R3%r98J747r36L12j87R04M06D37
$$ -281 249 530 405 -156 624 468 -437 1060 218 156 312 405 405 -593 1154 218 530 343 1247 1653 437
98629A060%m99N62o55j25j56n30Q73M68K81P17j809P17j153R3R36O2j060N61A56
$$ 1060 1060 561 1123 468 343 187 -343 530 998 1279 1996 187 904 -249 -156 780 842 -218 343 156
101168b49k19J404j061L43M68p48L43j87m68R98k50m36%Q73%q42J216r04O23j434e30
$$ -249 -468 936 -125 218 686 -62 281 94 -374 624 374 -62 -62 811 811 -31 1185 281 904 -530 -530
103805c1M68q42O86j56K80n30N30j060J341K18m36O86j092k80N30o3P80p80L75e61
$$ -31 437 -405 281 125 405 -125 405 -655 686 904 468 1154 62 -218 312 249 1029 249 624 -561
106325h11Q11L12J87J029k089K18J434q10N92L74r35P79R4j87l74l12o3R4n61c74
$$ -811 0 312 499 1528 -561 -343 1091 281 873 1247 312 1091 1185 998 624 312 249 343 -218 -374
108864B81k19J56O3j25J56N30n30O2o2m06P49k18M67k49p17r4P17J87j091N92B81
$$ 281 62 218 281 156 312 842 312 374 312 -94 655 437 904 655 -62 -156 561 748 -343 249 281
111509e61R04m37J56O3j25J247j309M05m99n30O55j25M37j25o24J56J248j061c43
$$ -561 343 -94 62 125 0 1247 -62 343 -156 -686 -31 -156 281 156 -468 -312 936 -125 -343
113928F86n61j56O2M06J341j341N92k18M36O736P890n644l961j653j153l12j185A528
$$ 686 125 -31 31 437 1778 437 1029 811 1247 7983 15873 10229 6268 4615 3462 3150 1965 1528
116187A341j25M99J25j310J310r04L11m05q11l1J746j153N30L43o24j029J185a25
$$ 1341 1216 1715 1840 530 1840 936 1247 842 31 0 1746 593 1123 1466 842 -187 998 -125
118489I04m67L11o54N61%L74r67O55J56l43j87j25n92n93P18Q42O86q42M05O2C12
$$ 904 437 748 94 655 655 1029 62 717 873 530 343 218 -374 -967 -249 593 1279 437 842 904 312
121128B81J87P17n61j56K18L1j060P48O3L43n62Q74p18M06p80n61J372l43m37A25
$$ 281 468 1185 624 468 686 717 -343 405 468 811 249 1123 405 811 31 -530 842 499 62 125
123670D05p17J123l74R3q42m99J404j88q10Q73l12R67j154N61m68P80o24R36m37e93
$$ 405 -312 811 437 530 -312 -811 593 405 -405 468 156 1123 -31 530 62 842 218 1154 717 -593
126165a25R67m68Q11j029P48j341l74J809o24m36J153l43o54L43m99R3K50K80D68
$$ -125 842 374 1185 156 904 -437 -811 998 374 -62 1091 748 94 437 -62 31 281 561 468
128569E61k18o55O86L1o54N30k81l1j25%P17J25j403J122N93q11K81J25m37L12B81
$$ 561 343 -312 374 405 -249 281 0 -31 -156 -156 561 686 -717 405 998 187 468 593 156 468 281
131229I36j25J25j154J87M99J25m68r05J747j87r4p48m37K50o3J092q74J092j622B18
$$ 936 811 936 -218 -31 468 593 125 -780 967 780 686 -62 -499 -249 -312 780 -94 998 -624 218
133768D05l74L12m99J87q11O24Q42q73L12R66j029l74M37K18l1J029m05j716J092D37
$$ 405 31 343 -156 31 -780 -156 686 -187 125 1091 62 -312 125 343 312 1341 936 -780 312 437
136262D37M99q11M36m36M05j25m05o2M67j029J154n92O23r3r36N93j56K18L74A029
$$ 437 936 125 561 125 530 405 0 -62 405 -624 530 -62 561 468 -468 125 -31 187 561 1029
138799B49J56q10O54l11N30l1n31R4L74m05j185J091o55J310p79M36j25J092r98i67
$$ 249 405 -405 249 -62 468 437 -94 0 374 -31 -1216 -125 -780 530 -249 187 62 1154 156 -967
141324c1R04k18j154J528p17o24L12k49J185j716J528L43n30l74L1K19m37J091C43
$$ -31 873 655 -499 1029 312 -312 0 -249 936 -780 748 1091 561 187 218 437 0 1091 343
143746e93O3k18Q42M05K49k18m68O3L12O2P80n93p48J122m36l43o55J372k183e61
$$ -593 -530 -748 94 499 748 530 62 125 437 499 1279 686 -62 1060 624 281 -374 998 -1185 -561
146263A091j309Q42o55O2J060q42L2r36J029l43J123j092o23o3R98K50m99K18A123
$$ 1091 -218 624 -31 31 1091 249 281 -655 374 31 1154 62 -561 -624 374 624 125 343 1123
148682i4N31O54j340L11Q42k49m68k18J25l2m36L43N92r98R36J154o24j154J154b81
$$ -94 437 1091 -249 62 904 655 187 -31 94 62 -374 -31 561 -437 499 1653 1029 -125 1029 -281
151199g80M06J25J091l74%j061J123o24M06q11M05l43n92J247O3j25L12j56O55C43
$$ -780 -374 -249 842 468 468 -593 530 -94 312 -499 -94 -437 -1029 218 281 156 468 312 967 343
153693B18L12o86Q42p17j87%N61J25j061J466l74R67j560R98k80j528J465j87C12
$$ 218 530 -156 686 -31 -218 -218 343 468 -593 873 499 1466 -94 904 624 -904 561 374 312
156098a060K183k19j060J123r36j56J248l12j56j25o86J87K81k18L43m37Q11q73B18
$$ -1060 1123 904 -156 967 31 -125 1123 811 655 530 -156 31 312 94 437 0 811 -62 218
158542D99L1l1r67J653p48L43q11r4J25K81R04j403n62N31P17k50L43l74k81J25d68
$$ 499 530 499 -468 1185 437 780 -31 -125 0 281 1185 -218 -780 -249 468 218 561 187 -94 31 -468
161176A56N92o86Q74J24j185%k80J247m99o86M05J87q42J061j061K50M68O2R98a25
$$ 156 748 62 936 1060 -125 -125 -405 842 343 -343 62 249 -593 468 -593 -343 125 187 1185 -125
163671G48m99L44l2L2r4j154R98r4o86l43J310o2p49P18l12J87p80J56Q42k81G48
$$ 748 249 593 561 593 499 -655 343 249 -437 -780 530 468 -281 437 125 312 -468 -312 530 249 748
166333C12O2n61J56M05M06m37j56o86J123r36O24l74Q42J24o55O24j278O54J56A216
$$ 312 374 -187 -31 374 780 343 187 -499 624 -312 312 -62 780 904 249 873 -405 249 405 1216
168872I04N93j248k49j87M68J87o24R4L1J56Q42m68%r04J185M36p79L11p79l1F86
$$ 904 1497 249 0 -187 281 468 -156 -62 -31 125 967 499 499 -405 780 1216 437 748 -31 -62 686
171484C12j87Q42m68l74o55N61j87J029q73J87O55j091o3M99l43R04q42o86J123D37
$$ 312 125 967 499 125 -530 31 -156 873 0 187 842 -249 -312 187 -156 748 -94 -780 343 437
174009A123j778L74M37J56K49j56J56j87j87j87M37P17r36r3O2P49j404J123o24B49
$$ 1123 -655 -281 156 312 561 405 561 374 187 0 437 1154 218 125 187 936 -468 655 31 249
176574C12o55J029j56r3p18l43j56J871n61l1j154J403k18n61L12J87%n62R05E93
$$ 312 -343 686 530 437 -281 -624 -780 1091 530 499 -655 748 530 -31 281 468 468 -94 811 593
179090d37Q42l11o3%J279j185r05J279o2k19M37J87j590J652L2M05j247K80j87a25
$$ -437 405 94 31 31 1310 125 -780 499 437 218 655 842 -748 904 936 1341 94 374 187 -125
181607e93L44K18J56%N30j25L43J25m99%o2j88O3N30R4l75l43Q11j185J87%%%d05
$$ -593 -249 -31 125 125 655 530 873 998 499 499 437 249 312 842 936 561 218 1029 -156 31 31 31 31 -405
184628I67j87j061R67m37L2l12%M36L12m36k81J25n30J528p49M678q11j933p80C43
$$ 967 780 -281 686 249 281 -31 -31 405 717 281 0 125 -405 1123 374 5052 4241 2308 1528 343
187122I98m05m37R04k49l74L43p80o2O55m99J216j87m99M36l74O55j435O87J87i4
$$ 998 593 156 1060 811 437 780 0 -62 593 94 1310 1123 624 1060 686 1341 -94 593 780 -94
189639A185j434K18K49o55J716r98R04j279o23O2J871O3j279M99J372j060%m06H73
$$ 1185 -249 -31 218 -437 1279 281 1185 -94 -717 -655 1216 1279 0 499 1871 811 811 405 873
192043A434n92p48M99p80J029l12j466J529j56q74P49J56K80P49j56r67J404p80G17
$$ 1434 842 94 593 -187 842 530 -936 593 437 -437 312 468 748 1497 1341 374 1778 998 717
194468A403o23l2k18J87M99j154O3M36J87n92L1M99m05L74K81k19j87o55K027D05
$$ 1403 780 748 530 717 1216 62 125 561 748 156 187 686 281 655 936 717 530 -125 1902 405
196985A56k50M99L75l75j56j87J466j123m99N62J87m99N92%m36K81K49m68J56I04
$$ 156 -94 405 780 405 249 62 1528 405 -94 468 655 156 748 748 312 593 842 374 530 904
199526A25N61m05j154J247K19j88j060O24N61O3p18N62L74n62m67P48m36J87k50b81
$$ 125 686 281 -873 374 593 405 -655 -31 530 593 -125 437 811 249 -218 530 94 281 31 -281
202041C43J403j777r4J25J060o86p17L74K18K19M36j247M99R04p79m99j25J060B18
$$ 343 1746 -31 -125 0 1060 374 -343 31 249 468 904 -343 156 1060 281 -218 -343 717 218
204460a87m99J216J87k80P48r04l43J56O23j091R67k19n92J029r67K50j88r3n30D05
$$ -187 -686 530 717 437 1185 281 -62 94 717 -374 593 374 -218 811 -156 94 -94 -187 -717 405
206985E93N61l12m37m05K81K49o24J88k50J310j435L75J278r67m05L1R36o86j56E61
$$ 593 1154 842 405 0 281 530 -94 94 -156 1154 -281 94 1372 405 0 31 967 281 125 561
209499E93M05j029J372j466J466j247J87o3p17J092r05R05j341R04K18Q11q11d68
$$ 593 998 -31 1341 -125 1341 94 281 218 -499 593 -312 593 -748 156 374 1185 374 -468
211778A746r98K81r35P17J25l75J56r35J029L1O2n30K50O23p17o2o3J56l74r3C43
$$ 1746 748 1029 94 811 936 561 717 -218 811 842 904 374 624 1247 530 468 405 561 187 94 343
214438D68p49K81J25l1M99p18K19O2O55o3k80m06o2O86k49m99J278r04R98j279F2
$$ 468 -281 0 125 94 593 -125 94 156 811 748 468 62 0 686 437 -62 1216 312 1310 31 62
217050c43O86O55q11N30n61L74m68K50M99o3k18r35N61l74P17r4j24j25N61m36B49
$$ -343 343 998 187 717 156 530 62 312 811 748 530 -405 156 -218 499 405 281 156 717 281 249
219695E93n62j87L1L74L75m99%o55R98j279P80R04j497N30J25l1O86m05r4j87A091
$$ 593 31 -156 -125 249 624 125 125 -530 468 -811 -31 873 -624 -94 31 0 686 281 187 0 1091
222377A87N61N31q42o24J56J372j25l12p79L12L43O2l1j559J185O2j56L43j403D05
$$ 187 748 1279 437 -187 -31 1341 1216 904 125 437 780 842 811 -748 437 499 343 686 -717 405
224896G17j372K81J310q11l1P17l12m37j87r3J247m36o55O55l44J466q11q10m68H11
$$ 717 -655 -374 936 125 94 811 499 62 -125 -218 1029 593 -62 593 249 1715 904 94 -374 811
227413D68l1R3R98r35L1K18r04m06L12P80r05J965j590k19K50J434p79l43n93A029
$$ 468 437 530 1528 593 624 842 -62 -468 -156 624 -281 1684 94 -125 125 1559 780 437 -156 1029
229953e30J87K18P18m99k19k80J122p48o3o2P17r3M99r36L12M05k80n30l12M68f2
$$ -530 -343 -125 593 94 -125 -405 717 -31 -94 -156 561 468 967 31 343 748 468 -62 -374 94 -62
232587C74M68r4n61j56O86K19p80K49l43O55q73M99j87j25o2k18N30L74l12j87G80
$$ 374 842 748 187 31 717 936 156 405 62 717 -156 343 156 31 -31 -249 281 655 343 156 780
235202D68J87l43R3l74N93j123J590j55j310R98l43k50K81M05J25k49o24K80J25E30
$$ 468 655 312 405 31 624 -499 1091 936 -374 624 281 31 312 717 842 593 -31 249 374 530
237726@M68l1J091j216L1k49o3R67k18L11p79L12l43k19J279j154O2m98M05P48I98
$$ 0 468 437 1528 312 343 94 31 998 780 1091 312 624 281 62 1341 187 249 -249 156 904 998
240411B18n61k81J684p48r36J871q42n61M37O2o2J56l12M05%j091j87J652j247I67
$$ 218 -343 -624 1060 312 -624 1247 405 -156 281 343 281 437 125 530 530 -561 -748 904 -343 967
242905E30M37r67j87O55l1K18l74O23n61m05O2M37o3o2l1P79o23J87J24L2m68A590
$$ 530 967 0 -187 468 437 655 281 904 343 -62 0 437 374 312 281 1060 437 624 748 780 312 1590
245663b81M37m37K19L43J060r98M68j060Q42l75J56r3j56O55l12J25O2m68R04@
$$ -281 156 -281 -62 281 1341 343 811 -249 593 218 374 281 125 780 468 593 655 187 1091 0
248205G48l74R4K18l74l43P79l11k19O55n61o55L43l74R98r4n30K81m99P79p48I04
$$ 748 374 468 686 312 -31 748 437 218 873 312 -343 0 -374 624 530 0 281 -218 561 -187 904
250842c43L74N62r36Q73q11K81J622r67m99n93J248m99q11P80O55m37k18K80m99H73
$$ -343 31 593 -343 530 -281 0 1622 655 156 -437 811 312 -499 281 936 499 281 561 62 873
253381D37r4K50p80J247j122N30m06M06o24K81k81L43N61j341J653j559N61O3G48
$$ 437 343 593 -187 1060 -62 468 62 468 -156 125 -156 187 748 -593 1060 -499 62 125 748
255786A341j310P80p17J55p79J091k18O55j092J185p17M68j25r66R35O24o24j060@
$$ 1341 31 811 94 249 -530 561 343 998 -94 1091 374 842 717 -249 686 1310 686 -374 0
258207A341l74L12j466J247k80k81M99J56j341l1R04M68j497K18P80m06L12m67A154
$$ 1341 967 1279 -187 1060 780 499 998 1154 -187 -218 686 1154 -343 -125 655 249 561 94 1154
260579E61l43P80j060r05J372M37r98L12k18R66r04R67K80j403J25N30p48k81A154
$$ 561 218 998 -62 -967 405 842 -156 156 -62 904 0 967 1247 -156 -31 499 -249 -530 1154
262976A809J24j528o23J185j25K18r66l43L11J56K19R97j060j091J653n31N93f24
$$ 1809 1933 405 -218 967 842 1060 94 -249 62 218 437 1434 374 -717 936 405 998 -624
265302A216l74l1K49p79p49J279k18M98J88m68n93M68j279J217K80q42O24m05e61
$$ 1216 842 811 1060 281 -468 811 593 1091 1279 811 218 686 -593 624 904 62 686 281 -561
267707G80r4l43k49J122p79o24o2J777j466l11M98N93m99n30K49r3M99n62Q74F2
$$ 780 686 343 94 1216 437 -187 -249 1528 62 -249 249 842 343 -187 62 -31 468 -94 780 62
270221I98p80l43P18l75R05k50k18O2o23K18R3K50R67q74K50k18r05R36j123K81F55
$$ 998 218 -125 593 218 1123 873 655 717 94 312 405 655 1622 748 998 780 -125 811 -312 -31 655
272861E93R3R4o3L1j24j248J248O2l74N61p79L43o55M05o2L12R3n92L11L75o24F86
$$ 593 686 780 717 748 624 -624 624 686 312 873 94 437 -218 187 125 437 530 -62 249 624 0 686
275641E61m99O3j56R67N92m99j341L43r3R66n61M68l74m06P17l43%R4o2M67m05E30
$$ 561 62 125 -31 936 1528 1029 -312 31 -62 904 343 811 437 31 748 405 405 499 437 904 499 530
278375A091k18j777R35R36o86P48O2L75j029j56j87L43n62J466j341Q73j87J56D05
$$ 1091 873 -904 31 967 281 1029 1091 1466 437 281 94 437 -125 1341 0 873 686 842 405
280797G48j24m06K50l12O2J56O3R66j185r3N30L74n30O2M06j466J341r4K50k50a56
$$ 748 624 218 468 156 218 374 437 1403 218 125 655 1029 499 561 967 -499 842 748 998 748 -156
283437d05R35j87j25k49P48K19m06L1J061m99l43j56l75J154m36o3k80K18l12C12
$$ -405 530 343 218 -31 717 936 530 561 1622 1123 780 624 249 1403 967 904 624 842 530 312
285954A216r04N30l74O2m99N30P80j622J029p17O86m36L1K81l44j55M05N92q42B81
$$ 1216 312 842 468 530 31 561 1341 -281 748 31 717 281 312 593 249 94 499 1091 249 281
288496I36R3j154J25m99M37J247j622N31%O54O3j87q11Q42%L1J87O3k19o2%l43A559
$$ 936 1029 -125 0 -499 -62 1185 -437 94 94 748 811 624 -187 655 655 686 873 936 717 655 655 312 1559
291376F24M99j56K80m05k81k49L43p49J373p80r04J871m37r3o87J25M68j25m05A403
$$ 624 1123 967 1247 842 561 312 655 -94 1279 499 -405 1466 1029 936 249 374 842 717 312 1403
293900B18n30N93M67L2K49K50m37M99p17m06r3Q11p18J25O55l12K81o3j56l74I98
$$ 218 -312 281 748 780 1029 1279 842 1341 624 218 125 936 218 343 998 686 967 904 748 374 998
296540A434k18q11N31m68J434r66p80J123j56n93m68J404L1p17L74k50m99J435B401
$$ 1434 1216 405 936 468 1902 936 156 1279 1123 530 62 1466 1497 780 1154 904 405 1840 2401
298939A154l74N92k49r4n30l12M99l12L12j25l12O24%k49M36l1m99M99j25M37E93
$$ 1154 780 1372 1123 1029 499 187 686 374 686 561 249 873 873 624 1060 1029 530 1029 904 1341 593
301579H11m99r4Q11L1k18L12m68L12q42M99R3K19J24r3p17R98p18J497l43n30E93
$$ 811 312 218 1029 1060 842 1154 686 998 156 655 748 967 1091 998 281 1279 561 2058 1715 1185 593
304219A434l74J87m05O2k49R04m36m06J87r3R04p17j060J278j341R05L11l43L75A56
$$ 1434 1060 1247 842 904 655 1559 1123 717 904 811 1715 998 -62 1216 -125 780 1091 748 1123 156
306760a56R36K18j216O86k50r3J341r98K18O86j25k80n62P49j56J56K49m99o55A185
$$ -156 780 998 -218 468 218 125 1466 468 686 1372 1247 967 405 1154 998 1154 1403 904 249 1185
309302F2O86K50J87l74R04k339Q73L12k80K18Q11m68q73J122k49n30O2O24J372G17
$$ 62 748 998 1185 811 1715 -624 249 561 281 499 1310 842 -31 1091 842 312 374 998 2370 717
311799A091j24K18m68L12p17K49O24m99o24J217o3l43l74N61K50o3p48K81O86A091
$$ 1091 967 1185 717 1029 312 561 1185 686 62 1279 1216 873 499 1060 1310 1247 499 780 1466 1091
314321A902J466J933j122j747M37j996Q42k81m98J24l43L1K50N30k81p17M68P80A653
$$ 1902 3368 5301 4179 2432 2869 873 1715 1434 936 1060 717 748 998 1528 1247 530 998 1778 1653
316745G80J153o23O2j466J840m05N92j247M05K50m05M05m99l1%R3r04r4O3J777c1
$$ 780 1933 1310 1372 -94 1746 1341 1933 686 1091 1341 936 1341 842 811 811 904 0 -94 -31 1746 -31
319383G48o54J309q73J25m37J25L43l12l74J247n61L1p17J279N92r98o2P48p17A528
$$ 748 94 1403 530 655 218 343 686 374 0 1247 686 717 0 1279 1871 873 811 1559 842 1528
321902A902l43k49q11O24k81M05m67r4l1M99j154O55j279J217j56L43m68M36N93b49
$$ 1902 1559 1310 499 1123 842 1247 780 686 655 1154 0 655 -624 593 437 780 312 748 1341 -249
324427H11n62q10J746Q73j746J185j87m99K80j122R3O55n30O24n30R35k49K80G80
$$ 811 249 -561 1185 2058 312 1497 1310 811 1091 -31 62 717 187 811 281 1216 967 1247 780
326848A029j029N93j25J091m68J56J25j466J092k81j87M68m99m05Q10O86j029A590
$$ 1029 0 593 468 1559 1091 1247 1372 -94 998 717 530 998 499 94 904 1590 561 1590
329127A310o3n92o2j56m37K18M37K81l12J87L74L12%j684J091m67r4J372L1j247E61
$$ 1310 1247 655 593 437 0 218 655 936 624 811 1185 1497 1497 -187 904 437 343 1715 1746 499 561
331767A25J403j247Q42j372P48K81m68L1L12M68l75R36o24l1J092j185q74L2J185C74
$$ 125 1528 281 1123 -249 499 780 312 343 655 1123 748 1684 1060 1029 2121 936 62 94 1279 374
334286E30L74l1k18K81M98n61N93L1j029K49M68j56l74L43k18L11p79j56O55l12I04
$$ 530 904 873 655 936 1434 873 1466 1497 468 717 1185 1029 655 998 780 1091 312 156 811 499 904
336926A279p80o24J497l43J56k49j716J466O86j247O86l74p80J091j55N61j25A060
$$ 1279 499 -125 1372 1029 1185 936 -780 686 1372 125 811 437 -343 748 593 1154 1029 1060
339230A684p80M06p80N93p49J123r36L12m36L11J88K49j060M99N30K49p79J309C74
$$ 1684 904 1310 530 1123 374 1497 561 873 437 748 936 1185 125 624 1154 1403 624 1933 374
341652A590m05M05j247J279j809J621j528J653j684J092k50O24j092J279j684B276
$$ 1590 1185 1590 343 1622 -187 1434 -94 1559 -125 967 717 1341 249 1528 -156 2276
343696C12J964j902K183r67m67J56M67j278J091j029J622j715L11p79K339j029A715
$$ 312 2276 374 2557 1590 1123 1279 1746 468 1559 530 2152 437 748 -31 2308 1279 1715
345854B81J590j996K058p79J621j777K464j716J965k495K807l493M366k370L461B526
$$ 281 1871 -125 1933 1154 2775 998 3462 1746 3711 1216 4023 530 4896 2526 5987 2526
347900H825k432O486o86O362J528J3035L430L7734O1091L67512M95026k68407D17095
$$ 8825 6393 12879 12193 18555 20083 33118 36548 74282 135373 502885 997911 729504 417095
349591B64571p9521k7224l0967k2047j4127r199j4377n176n426l742n458j871D2973
$$ 264571 185050 157826 126859 104812 90685 81486 67109 61933 56507 52765 47307 45436 42973
351256D1943m085j434k869M05l711P49k495N92j808k50k744M68k620M37k620J934A8648
$$ 41943 37858 36424 33555 33960 30249 30998 28503 29095 27287 27037 24293 24761 22141 22578 19958 21892 18648
353423A9428j684J092l057j87r04O55j559o55j715m68k620J87q10K18j559J185E925
$$ 19428 17744 18836 15779 15592 14688 15343 13784 13129 11414 10946 8326 8513 7703 7921 6362 7547 5925
355589E551j279O24j25L12j466J653j621R98j185k50k49N92j029R67j653O86n61B370
$$ 5551 4272 4896 4771 5083 3617 5270 3649 4647 3462 3212 2963 3555 2526 3493 1840 2526 1965 2370
357848I36Q42k50P80q74Q11j24N61j279P18q42J091j060R04j871O24l12P17n30A933
$$ 936 1778 1528 2308 1434 2245 2121 2682 1403 2121 1279 2370 1310 2214 343 967 655 1372 842 1933
360272G17J123r98k18M99K18q11P49q11Q11J55j87M99J87j340N30N30j123N93A310
$$ 717 1840 842 624 1123 1341 530 1279 468 1279 1434 1247 1746 1933 593 1123 1653 530 1123 1310
362671B49M99l43M68J87M68o24q42j87J279m06P18L12q74m99N93N61j715R04r3B058
$$ 249 748 405 873 1060 1528 904 62 -125 1154 748 1466 1778 904 405 998 1559 -156 748 655 2058
365213C1R05L1P48m68p48P17l43r35L43j87R04j403K058k246J653O86n92m99R67A123
$$ 31 936 967 1715 1247 499 1216 873 -62 281 94 998 -405 1653 -593 1060 1746 1154 655 1622 1123
367733A310k19k49l74k50R98J56q11O86p79P48n61M68r4p48L74L1L12K49r98O24A029
$$ 1310 1091 842 468 218 1216 1372 561 1247 468 1216 655 1123 1029 281 655 686 998 1247 249 873 1029
370372A403m36L1o24o86J466M36r97Q10j247M05O3o3r04J029J435j310R98o24A403
$$ 1403 967 998 374 -312 1154 1590 593 1403 156 561 624 561 -343 686 2121 811 1809 1185 1403
372794A559l74l74m68l74O24R66j621R98l12K80M06j559Q10N30M68p79o86r4%E30
$$ 1559 1185 811 343 -31 593 1559 -62 936 624 904 1310 -249 561 1091 1559 780 94 0 0 530
375314A123o3L1k18m99M68l1J25r98J122r3O2o2Q11j903J497k339J809O55j25E93
$$ 1123 1060 1091 873 374 842 811 936 -62 1060 967 1029 967 1778 -125 1372 -967 842 1497 1372 593
377838I04J87l11m37M99M99j559R04m99J029L1j216K18R36j434P17p49J934l43A279
$$ 904 1091 780 343 842 1341 -218 686 187 1216 1247 31 249 1185 -249 468 -281 1653 1310 1279
380212A060o55o2k49N61J87K49n30K81K81l12m06L2N92o24P49r36L1L75m06r3B81
$$ 1060 405 343 94 655 842 1091 561 842 1123 811 405 437 1029 405 1154 218 249 624 218 125 281
382852G48R67K18R36K089n30j434p49q42l12o86J497j902J247m05P17M68j466I98
$$ 748 1715 1933 2869 4958 4428 2994 2245 1403 1091 405 1902 0 1247 842 1559 2027 561 998
385179I04l1j56l1O86n92j87P17j56l74O2m37R4L74N61l74n92k19q73J310o2o3F86
$$ 904 873 717 686 1372 780 593 1310 1154 780 842 405 499 873 1434 1060 468 249 -624 686 624 561 686
387939H11K80o86Q42p79k19J56L75o86O86q11J185j87M05j746Q42J310%j123j56B18
$$ 811 1091 405 1247 468 249 405 780 94 780 -31 1154 967 1372 -374 468 1778 1778 655 499 218
390458C43P48o86L12O3Q42j373K19J528j528J87M36o23J25l12n62P80J87J123I36
$$ 343 1091 405 717 780 1622 249 468 1996 468 655 1091 468 593 281 -281 499 686 1809 936
392832A902j777M99P48m05l43l75J279j434K49J56J185j435o54L74J434j029R98E61
$$ 1902 125 624 1372 967 624 249 1528 94 343 499 1684 249 -405 -31 1403 374 1372 561
395134A25Q42r98J310q11m06N31n62J341o24L12O3L11l43o54l12O23o2j25n30I98
$$ 125 967 -31 1279 468 62 593 31 1372 748 1060 1123 1434 1091 437 125 748 686 561 31 998
397658A25J216k18j092m99J154m37R05m99l12Q73m36M36K18j87L43p79L43m06A154
$$ 125 1341 1123 31 -468 686 249 1154 655 343 1216 780 1216 1434 1247 1590 811 1154 748 1154
400057G80q74J341j153R04k18n62N62M36k49J56l2r66L74L12P48p17o24R36o3A247
$$ 780 -94 1247 94 998 780 218 780 1216 967 1123 1091 125 499 811 1559 842 218 1154 1091 1247
402577I98K81r36L12l1l12J87k18R35J25j185k81L43J092j87O23r04k18M99o24A310
$$ 998 1279 343 655 624 312 499 281 1216 1341 156 -125 218 1310 1123 1746 842 624 1123 499 1310
405096E93J309j372M06P17k81r67L75j092J622o24J092n93n30r4O3J24l74o2o3A029
$$ 593 1902 530 936 1653 1372 405 780 -312 1310 686 1778 1185 655 561 624 748 374 312 249 1029
407663D37l75P18K49M37o86m68J091m05R3k49k81l74P49o24P48l43P49j372J278G80
$$ 437 62 780 1029 1466 780 312 1403 998 1091 842 561 187 936 312 1060 717 1466 94 1372 780
410183A403K50k50j87j56j216N93J56k19n30J092N30q11%K49K50r4o23K18Q73A310
$$ 1403 1653 1403 1216 1060 -156 437 593 374 -156 936 1466 655 655 904 1154 1060 437 655 1528 1310
412680A060j87M68r04N30M05q42O55k18k50M68n92J24P80p17j061J248J24R4M05A216
$$ 1060 873 1341 437 967 1372 530 1185 967 717 1185 593 717 1497 780 -281 967 1091 1185 1590 1216
415224H42L1k49o3O86j24J24p48M99K18r04P48m99r35J559o24M99O3L1j56n30A715
$$ 842 873 624 561 1247 1123 1247 499 998 1216 312 1060 561 -374 1185 561 1060 1123 1154 998 468 1715
417841A123p80R4M99l75R36k81k80R35j123J217o55j56M68r98Q42l12L1j56o86H73
$$ 1123 343 437 936 561 1497 1216 936 1871 748 1965 1310 1154 1622 624 1466 1154 1185 1029 343 873
420408A840j56j279K19O2L74j029J25J25R98K49k18%l74k19P80n30%K18n92M36A559
$$ 1840 1684 405 624 686 1060 31 156 281 1279 1528 1310 1310 936 717 1497 967 967 1185 593 1029 1559
423048A653o55r4q10Q73m68L1J341r04p49J123L12p17O2m05O54m36j87R35j185H73
$$ 1653 998 904 94 967 499 530 1871 967 218 1341 1653 936 998 593 1247 811 624 1559 374 873
425545A123j25J25%p18J560j029k81Q11o24K81j25K18L1l1K50O2N61j216J092B245
$$ 1123 998 1123 1123 405 1965 936 655 1466 842 1123 998 1216 1247 1216 1466 1528 2089 873 1965 2245
428089A590%j153j25N92Q11K50j154O23J25N62p18l74L12l74O2P80n93k18O2l74A060
$$ 1590 1590 437 312 904 1715 1965 811 1434 1559 2121 1403 1029 1341 967 1029 1809 1216 998 1060 686 1060
430729H42J247o23o24J56l1m99R98n62r3L74N61o23J56J185j217q10P79O24j060A185
$$ 842 2089 1466 842 998 967 468 1466 904 811 1185 1746 1123 1279 2464 1247 437 1216 1840 780 1185
433273I67n30M67k18k18J341%j216R3L1J56R4K49K81r36J372j87m05k81J653k276B245
$$ 967 437 904 686 468 1809 1809 593 686 717 873 967 1216 1497 561 1933 1746 1341 1060 2713 437 2245
435890H11L1M99M37J55m67n93o2R67l75J56J87r35R98n62%J310m99r35J87Q42A497
$$ 811 842 1341 1778 1933 1466 873 811 1778 1403 1559 1746 811 1809 1247 1247 2557 2058 1123 1310 2152 1497
438555A871k18k19m98Q42m37R3K81m68K19k50M68L74L1p17o24J279q11L43R05B089
$$ 1871 1653 1434 936 1778 1341 1434 1715 1247 1466 1216 1684 2058 2089 1372 748 2027 1216 1559 2464 2089
441052A154O86j715J309O87N30j217L44r4N30j091P48j154J840l74m05p49O2R4A746
$$ 1154 1840 125 1434 2121 2651 1434 1778 1684 2214 1123 1871 717 2557 2183 1778 1029 1091 1185 1746
443456B152L1j154J123j25q11R05P48l43j590J403j279j24%M36m68O55P80j060C118
$$ 2152 2183 1029 2152 2027 1216 2121 2869 2526 936 2339 1060 936 936 1372 904 1559 2339 1279 3118
445881A590M99l1m68O55j278R35p48J403m68n30L1J030K80o24n61l12L12l43J871A123
$$ 1590 2089 2058 1590 2245 967 1902 1154 2557 2089 1559 1590 2620 2900 2276 1715 1403 1715 1372 3243 1123
448425A091R98m67j25J060q42K81O24j529O55%J061j341k81J310j061L2N30J87B152
$$ 1091 2089 1622 1497 2557 1715 1996 2620 1091 1746 1746 2807 1466 1185 2495 1434 1466 1996 2183 2152
450802I04J747M99j154m68J310r36O24j87O2M68r67R98o55j56L43p79J310j092A809
$$ 904 2651 3150 1996 1528 2838 1902 2526 2339 2401 2869 1902 2900 2245 2089 2432 1653 2963 1871 1809
453226A871n61N61R36p80N30p17L12M05j060J060j56j56O86m99l1L1Q42n61l74B682
$$ 1871 1310 1871 2807 2027 2557 1840 2152 2557 1497 2557 2401 2245 2931 2432 2401 2432 3274 2713 2339 2682
455748B620n62P17o54J87J029j341P48j56k80N92m36O54n61Q42%j434J652j933A497
$$ 2620 2058 2775 2121 2308 3337 1996 2744 2588 2308 2900 2464 3118 2557 3399 3399 1965 3617 1684 1497
458127B900k49j25R4M05m37R36k50o23j123N93M36%M68K18j247O86J56K18R4P17C181
$$ 2900 2651 2526 2620 3025 2588 3524 3274 2651 1528 2121 2557 2557 3025 3243 1996 2682 2838 3056 3150 3867 3181
460794C711m68l12l11K80k49o24J372O3j061R4K027j934P49l74m68Q42o86l43C181
$$ 3711 3243 2931 2620 2900 2651 2027 3399 3462 2401 2495 4522 2588 3337 2963 2495 3337 2651 2308 3181
463174B775n61R98k18o3p48J247L43j060R04j24m06o2K49K027j715j341J248m68C805
$$ 2775 2214 3212 2994 2931 2183 3430 3773 2713 3617 3493 3087 3025 3274 5301 3586 2245 3493 3025 3805
465603C836l74l75j87N30K50q42J372j341P17L43k80k19M68N93j123J87R4J24C929
$$ 3836 3462 3087 2900 3430 3680 2838 4210 2869 3586 3929 3649 3430 3898 4491 3368 3555 3649 3773 3929
468010C680J25M36o2l43r4J87R4N61m99L1M99o2j310R05P79m68j87J25r4J25O24C680
$$ 3680 3805 4241 4179 3836 3742 3929 4023 4584 4085 4116 4615 4553 3243 4148 4927 4459 4272 4397 4303 4428 5052 3680
470779D397%M05J25O55k495K713j403k18J372m99l12J87p48O2O55J216o55q10D241
$$ 4397 4397 4802 4927 5582 3087 5800 4397 4179 5551 5052 4740 4927 4179 4241 4896 6112 5457 4647 4241
473186E270k49j061P49R3O87%p80m99M99O86o55J56M37N30n93P17O3j029J590D834
$$ 5270 5021 3960 4709 4802 5489 5489 4709 4210 4709 5395 4740 4896 5333 5863 5270 5987 6050 5021 6611 4834
475691E894p80Q73m98R35n30m05j25N92L1J88r4%j87M99R67r05n30P17j434L43F486
$$ 5894 5114 5987 5489 6424 5894 5489 5364 5956 5987 6175 6081 6081 5894 6393 7360 6455 5925 6642 5208 5551 6486
478365E489R35n61M05J279j653N92l11Q10l74L74L75j061L43l74J123j216O2P80G079
$$ 5489 6424 5863 6268 7547 5894 6486 6175 6985 6611 6985 7360 6299 6642 6268 7391 6175 6237 7017 7079
480750G048n93M37M68O2k18K49j56p17P48k49k81l1P17%L12l43R67J56j060K18G921
$$ 7048 6455 6892 7360 7422 7204 7453 7297 6580 7328 7079 6798 6767 7484 7484 7796 7453 8420 8576 7516 7734 7921
483374G235N61m36P79j87N93j25l12L12j279J497o2p49l1P80m37l12M99k80r4I012
$$ 7235 7796 7360 8139 7952 8545 8420 8108 8420 7141 8638 8576 7827 7796 8576 8139 7827 8326 8046 7952 9012
485926I075j216J216K49n61r4j091J497n30K18k81M37m37R05%J56L43k19o55o2I574
$$ 9075 7859 9075 9324 8763 8669 7578 9075 8545 8763 8482 8919 8482 9387 9387 9543 9886 9667 9012 8950 9574
488458H513P80M05n92J372J25l74j871R04n61O86o24N30l1k50K50M99k50M68j060I449
$$ 8513 9293 9698 9106 10478 10603 10229 8358 9262 8701 9387 8763 9293 9262 9012 9262 9761 9511 9979 8919 9449
490963H732J060N93j154N61J25L1j029Q42l12L74%M37k152J310O23l43r35P48A0416
$$ 8732 9792 10385 9231 9792 9917 9948 8919 9761 9449 9823 9823 10260 8108 9418 10041 9698 8763 9511 10416
493394I418o55J216r35O54M06o86L12R98j435M05n92R04m36k50L1k80N92N93q42A0229
$$ 9418 8763 9979 9044 9698 10104 9418 9730 10728 9293 9698 9106 10010 9574 9324 9355 9075 9667 10260 9418 10229
495879H295J310n61M99L1p80J466q11M05K19n62l43M06j435J372j278O86P79j340I075
$$ 8295 9605 9044 9543 9574 8794 10260 9449 9854 10073 9511 9168 9574 8139 9511 8233 8919 9698 8358 9075
498311I480j87o86O55K81l44m36k18K18k50J25R36q11j56J154j403j56N92j56H607
$$ 9480 9293 8607 9262 9543 9199 8763 8545 8763 8513 8638 9574 8763 8607 9761 8358 8202 8794 8638 8607
500695H233J25O54m36n62O3L1K50M36k49m68o3k80J310j061m67N92o2K18m37L75G734
$$ 8233 8358 9012 8576 8014 8077 8108 8358 8794 8545 8077 8014 7734 9044 7983 7516 8108 8046 8264 7827 8202 7734
503347G453L12J590j559m99k18R35k18j372J154P80j88n61m37N62m37q11j24M67G017
$$ 7453 7765 9355 7796 7297 7079 8014 7796 6424 7578 8358 8170 7609 7172 7734 7297 6486 6362 6829 7017
505779G703l43o24R3m05J87M06j88L75k81N61j341l1J435l1j622k81Q42l12L12F330
$$ 7703 7360 6736 6829 6424 6611 7017 6829 7204 6923 7484 6143 6112 7547 7516 5894 5613 6455 6143 6455 6330
508283F518k19M06k50o86j56L1O55J56j122J060J56m06j56%n30O86j87L74M37E333
$$ 6518 6299 6705 6455 5769 5613 5644 6299 6455 5333 6393 6549 6143 5987 5987 5457 6143 5956 6330 6767 5333
510788E520P17n61J56j030m67J465M99j185O3K49l74O2N62j029P48n30L43O55E613
$$ 5520 6237 5676 5832 4802 4335 5800 6299 5114 5177 5426 5052 5114 5676 4647 5395 4865 5208 5863 5613
513199E021j56m99l12J372n92J56N61o55q73R04j87M05n61l12j24P17R3J25n61D459
$$ 5021 4865 4366 4054 5426 4834 4990 5551 4896 4023 4927 4740 5145 4584 4272 4148 4865 4958 5083 4522 4459
515751E145n92l43l1O23m67P48l12m36j87n31M68n92R04o24O24k18j56J25M05C649
$$ 5145 4553 4210 4179 4802 4335 5083 4771 4335 4148 3617 4085 3493 4397 3773 4397 4179 4023 4148 4553 3649
518256D709j310j87L12o2J216n62p79J87L12n30o3P17R4q42M68p49J279o2j965D397
$$ 4709 3399 3212 3524 3462 4678 4116 3337 3524 3836 3306 3243 3960 4054 3212 3680 2931 4210 4148 2183 4397
520783B775M37J56j87l12Q11L1l12l74%r67k49J029%m06N93J56R3P18j123j25C181
$$ 2775 3212 3368 3181 2869 3680 3711 3399 3025 3025 2058 1809 2838 2838 2432 3025 3181 3274 3992 2869 2744 3181
523427C680M99j310J25N30K81r98k81R36n62l1M37K18n93M37q73P79n61K81j25B370
$$ 3680 4179 2869 2994 3524 3805 2807 2526 3462 2900 2869 3306 3524 2931 3368 2495 3274 2713 2994 2869 2370
525974B900P17j434M37R66K81r36K81k81o86O55J87q42O24j528J123m06K81%R3B152
$$ 2900 3617 2183 2620 3586 3867 2931 3212 2931 2245 2900 3087 2245 2869 1341 2464 2058 2339 2339 2432 2152
528496C118p79O55j279J497q11j56L12%o86L12J310r05L2m68M36L43p79R35k49B183
$$ 3118 2339 2994 1715 3212 2401 2245 2557 2557 1871 2183 3493 2588 2620 2152 2588 2931 2152 3087 2838 2183
530993B526q42N30L43n30m68J185j621P17K81j030J123k49r4k18o3r3J123k19A279
$$ 2526 1684 2214 2557 2027 1559 2744 1123 1840 2121 1091 2214 1965 1871 1653 1590 1497 2620 2401 1279
533417A996j029Q42j87Q10l11O54p48l43J154j840J840o55p17L1j25J092j185A590
$$ 1996 967 1809 1622 2432 2121 2775 2027 1684 2838 998 2838 2183 1466 1497 1372 2464 1279 1590
535674A403N93j87J122j590N30k18J56M99k50P17r04j25L12j56m68N62r4J25L1B214
$$ 1403 1996 1809 2931 1341 1871 1653 1809 2308 2058 2775 1871 1746 2058 1902 1434 1996 1902 2027 2058 2214
538218B775j091o24J404o24J56r4n92L12L11J25m05%K80j24O2O86q11j24j88P18A622
$$ 2775 1684 1060 2464 1840 1996 1902 1310 1622 1933 2058 1653 1653 1933 1809 1871 2557 1746 1622 1434 2152 1622
540883A372M06q42J87P17q42J185r4%n61m37O24r3N61k81r98J185q73r3k81P48I98
$$ 1372 1778 936 1123 1840 998 2183 2089 2089 1528 1091 1715 1622 2183 1902 904 2089 1216 1123 842 1590 998
543500A902r04J56O55j56j87r4J25%k18m99R3L43Q11j029O24m99O2O86m05l75A403
$$ 1902 998 1154 1809 1653 1466 1372 1497 1497 1279 780 873 1216 2027 998 1622 1123 1185 1871 1466 1091 1403
546165A091%R05j310P17o86K81J247p17o2m06M99O3p18O86l1m05q42J060l12M99A746
$$ 1091 1091 1996 686 1403 717 998 2245 1528 1466 1060 1559 1622 904 1590 1559 1154 312 1372 1060 1559 1746
548782D99N92N62R3m99Q74j061L43k80p18N93N61R67j247j88R05j248Q11q11K50G17
$$ 499 1091 1653 1746 1247 2121 1060 1403 1123 405 998 1559 2526 1279 1091 1996 748 1559 748 998 717
551307F55Q11J56m06p48O2J559p48m68K50J87L12m99K18%k18k81K81Q10j684N62A185
$$ 655 1466 1622 1216 468 530 2089 1341 873 1123 1310 1622 1123 1341 1341 1123 842 1123 1933 249 811 1185
553971A528M37L74j559l12N30n61R97n61R67r4j497Q74j25L74r3j25L1m99j87B214
$$ 1528 1965 2339 780 468 998 437 1434 873 1840 1746 249 1123 998 1372 1279 1154 1185 686 499 2214
556491A403n61J56k81K19M36l74L12m37j56r98N30Q11k49K18l43N61l11k81J091A933
$$ 1403 842 998 717 936 1372 998 1310 873 717 -281 249 1060 811 1029 686 1247 936 655 1746 1933
559035A403p48M68p49n61P48Q11o24M99m05k49J55J56l74P17n30J809j528N61A091
$$ 1403 655 1123 374 -187 561 1372 748 1247 842 593 748 904 530 1247 717 2526 998 1559 1091
561412F24P48j25J25l12n92R66L75j435Q11%%k81O24n92O54r35N92K19j25J87I04
$$ 624 1372 1247 1372 1060 468 1434 1809 374 1185 1185 1185 904 1528 936 1590 655 1247 1466 1341 1528 904
564076I67j87o55r4O86O55l43O24R3j060J87L43r04N92p17J092j061P49l12J341G17
$$ 967 780 125 31 717 1372 1029 1653 1746 686 873 1216 312 904 187 1279 218 967 655 1996 717
566621A809J497k464P80r36R4L74j248P80M99o2k81N61j122J153m98Q73j310L12A341
$$ 1809 3306 842 1622 686 780 1154 -94 686 1185 1123 842 1403 281 1434 936 1809 499 811 1341
568998A216R4l12R35j122l12M99N61m05k50K81j123Q11L43k49O2N93j373o2K18B49
$$ 1216 1310 998 1933 811 499 998 1559 1154 904 1185 62 873 1216 967 1029 1622 249 187 405 249
571517C12P79L2O2q73J091m05m05n93M05L12N93o24j87M05L12m36m68K49o2J154B81
$$ 312 1091 1123 1185 312 1403 998 593 0 405 717 1310 686 499 904 1216 780 312 561 499 1653 281
574182b49O23L1K50P79j029K19%K49K50j25k81N93j248R67%K81k50p79P17n61G48
$$ -249 374 405 655 1434 405 624 624 873 1123 998 717 1310 62 1029 1029 1310 1060 281 998 437 748
576821D37R66m05k18P17r04N30M67j528L43J154n61N92j029J56o2j56j56o55J653A029
$$ 437 1403 998 780 1497 593 1123 1590 62 405 1559 998 1590 561 717 655 499 343 -312 1341 1029
579366G17P17j029L12r3O2J56j56K50k50K18p17L43R67j372R35%n92N61l43J372B49
$$ 717 1434 405 717 624 686 842 686 936 686 904 187 530 1497 125 1060 1060 468 1029 686 2058 249
581983d99K214j372P80j56l74M36J25m06N31l75P80j029P79o86J25l12L43M06A123
$$ -499 1715 343 1123 967 593 1029 1154 748 1279 904 1684 655 1434 748 873 561 904 1310 1123
584407E61P80r67P17N93j403j87O86m37L12l1R04n92J24n92N92l12P18l12n93I36
$$ 561 1341 374 1091 1684 281 94 780 343 655 624 1528 936 1060 468 1060 748 1466 1154 561 936
586902A25l74J216r67O2O3J185m99M99L1n61m68o3R36P48j340K18n93O24K81n30C1
$$ 125 -249 967 0 62 125 1310 811 1310 1341 780 312 249 1185 1933 593 811 218 842 1123 593 31
589541F86q42N30O86p48J060j216Q73j56L1k49J56m37Q42j060Q42j029N61l1M05D68
$$ 686 -156 374 1060 312 1372 156 1029 873 904 655 811 374 1216 156 998 -31 530 499 904 468
592083I98q73m06J092l43k19L2%N92p79J496j247M99j091J185o3K50m68k81L74I98
$$ 998 125 -281 811 468 249 281 281 873 94 1590 343 842 -249 936 873 1123 655 374 748 998
594608A123L43l12K49j684J684O3r05L12j56K81k18l12Q73r98K18q42m36Q73J25D05
$$ 1123 1466 1154 1403 -281 1403 1466 561 873 717 998 780 468 1341 343 561 -281 -717 156 281 405
597150B18r3N61j25R05k19O55k339J310n61J091K50j559L1J060j247J029r98Q11A123
$$ 218 125 686 561 1466 1247 1902 -437 873 312 1403 1653 94 125 1185 -62 967 -31 780 1123
599549D99r4L43K19k81J310r98J25L74l43j87L12L74q42q11J091L43m05j403J341H42
$$ 499 405 748 967 686 1996 998 1123 1497 1154 967 1279 1653 811 0 1091 1434 1029 -374 967 842
602068D05k80J465l1o23M36j497J840n92j25o55O24P48o24k18r3J185o24K81j154A840
$$ 405 125 1590 1559 936 1372 -125 1715 1123 998 343 967 1715 1091 873 780 1965 1341 1622 468 1840
604613F86Q42m37j87K19L11m98O86O2l1R3K19r36q42l43J060M99k18r36J185j465I04
$$ 686 1528 1091 904 1123 1434 936 1622 1684 1653 1746 1965 1029 187 -156 904 1403 1185 249 1434 -31 904
607227G80L1l1M67j060P80r4P17j24%j217J373l12R3k49o55r4K81n30J123n31G80
$$ 780 811 780 1247 187 967 873 1590 1466 1466 249 1622 1310 1403 1154 499 405 686 156 1279 748 780
609890B81L43m37r3J029r4j56M99K18n92K49j122O55M99j185J029n62N62r98P17F86
$$ 281 624 187 94 1123 1029 873 1372 1590 998 1247 125 780 1279 94 1123 561 1123 125 842 686
612386G80k19K19R35m05o55R04j122Q42R3q73J25k19N31K18R3p79K80M06L74p17F24
$$ 780 561 780 1715 1310 655 1559 437 1279 1372 499 624 405 936 1154 1247 468 748 1154 1528 811 624
615049F2J092r4p79o3o2L43L1Q42j091j25Q73J25o24L1O24q42Q73k18O2o86%R36H11
$$ 62 1154 1060 281 218 156 499 530 1372 281 156 1029 1154 530 561 1185 343 1216 998 1060 374 374 1310 811
617954a56J341q73N92o86J310q11R4k81J87r3M05m05J060j060m37O86k49j87K18A279
$$ -156 1185 312 904 218 1528 717 811 530 717 624 1029 624 1684 624 187 873 624 437 655 1279
620451A216r98o2K058M304k682k526O55j56q42m06O24m68N93O2l74M36m98K49A091
$$ 1216 218 156 2214 6518 3836 1310 1965 1809 967 561 1185 717 1310 1372 998 1434 936 1185 1091
622875A310r36O86p17L74K19l75N93r4o55P49k81K81K80J030j965J341j497M99A653
$$ 1310 374 1060 343 717 936 561 1154 1060 405 1154 873 1154 1434 2464 499 1840 343 842 1653
625274A091o86R36k18m37O86j247N30J341j092r3O2l12k80O23l1O24j559J153A56
$$ 1091 405 1341 1123 686 1372 125 655 1996 904 811 873 561 281 904 873 1497 -62 1091 156
627679A497q73L1J060n92j56o86J216o86L74n92N30L1p17L43l2J373j061O24l74A247
$$ 1497 624 655 1715 1123 967 281 1497 811 1185 593 1123 1154 437 780 748 2121 1060 1684 1310 1247
630223A559O3k50J56R04q10M05j559Q42L12o55R66q42j55R3O24l12N61k18J87A185
$$ 1559 1622 1372 1528 2432 1622 2027 468 1310 1622 967 1933 1091 936 1029 1653 1341 1902 1684 1871 1185
632720A559l74J87L74k18k49m37J185M68j25q42J310j684J809q11n30q42P48K18B588
$$ 1559 1185 1372 1746 1528 1279 842 2027 2495 2370 1528 2838 1154 2963 2152 1622 780 1528 1746 2588
635144F24J777j122J465n30L12r36O24k18P48J25Q73r67O24j091P48K18N93j216D678
$$ 624 2401 1279 2744 2214 2526 1590 2214 1996 2744 2869 3742 2775 3399 2308 3056 3274 3867 2651 4678
637548E520J465J497N520Q295l399n676k526J217J715K650J123N707J7089O8794A89478
$$ 5520 6985 8482 14002 22297 18898 13222 10696 11913 13628 16278 17401 23108 40197 108991 189478
639477A60882l6455l5956k6039j0322n614M429J5779j029j8680j2099o611l556B1860
$$ 160882 124427 88471 62432 52110 46496 50925 66704 65675 46995 34896 28285 24729 21860
641142B1330k151o86j591k81l11O54o23J715L74N894J1008K2734K838j2225q513C9948
$$ 21330 19179 18493 16902 16621 16310 16964 16341 18056 18430 24324 35332 58066 60904 48679 40166 39948
643191D3752K6102L2993O5519N4324o5924o0842l1652j3971o050q295n021l118B8378
$$ 43752 69854 102847 168366 222690 156766 95924 64272 50301 44251 35956 30935 27817 28378
644856C1871N145o580n488n957L2l119j122k246J310k651%j185M06j372M05j154H420
$$ 31871 37016 30436 24948 18991 19023 15904 14782 12536 13846 11195 11195 10010 10416 9044 9449 8295 8420
647028G422P80k339J653j778P80j092j87p48M05J56J87j497J653j684O24j25p80B058
$$ 7422 8202 5863 7516 5738 6518 5426 5239 4491 4896 5052 5239 3742 5395 3711 4335 4210 3430 2058
649309C493k402J248j372J964j902J372k495J716q11J403k495J528j528K246j528C12
$$ 3493 1091 2339 967 2931 1029 2401 -94 1622 811 2214 -281 1247 -281 1965 437 312
651348a25J903r05N61j808K027j248l1p79K307j996J653j372J092p49R04p17L12B49
$$ -125 1778 873 1434 -374 1653 405 374 -405 1902 -94 1559 187 1279 530 1434 717 1029 249
653632D05r3J029j840J123p80J310j871J403j56j87O86m68k49n61r4J497n93l74I36
$$ 405 312 1341 -499 624 -156 1154 -717 686 530 343 1029 561 312 -249 -343 1154 561 187 936
656054b49R35l43j87K058q73j56r98J56P80j372J185l12N61j123O86p17J56m36A56
$$ -249 686 343 156 2214 1341 1185 187 343 1123 -249 936 624 1185 62 748 31 187 -249 156
658450a56J965k058J746j466J747k558L493l118R04l43R35j808K495j341R97k151B370
$$ -156 1809 -249 1497 31 1778 -780 2713 -405 499 156 1091 -717 1778 437 1434 -717 2370
660609I4J278j216J559k027K495k495K277j622J684k214K744l243L461l866L492b18
$$ 94 1372 156 1715 -312 2183 -312 1965 343 2027 -187 2557 -686 2775 -1091 2401 -218
662653B713l867M584m677M334l648L929l680L680l867L025l399L368l337L617a25
$$ 2713 -1154 3430 -1247 3087 -561 3368 -312 3368 -499 2526 -873 2495 -842 2775 -125
664574C462m522M241k932K807k744L056m023M241k463K432k838L649n021M709D68
$$ 3462 -1060 3181 249 3056 312 3368 -655 3586 1123 3555 717 4366 -655 4054 468
666497D397m148M117n270M771l337L212l617M397m335M553l493K495l804M833A965
$$ 4397 249 4366 -904 3867 530 3742 125 4522 187 4740 1247 3742 -62 4771 1965
668445E114l181L337k027J435j747L587j185J715k246L306N61j278J871K089P703B1143
$$ 5114 1933 5270 3243 4678 2931 6518 5333 7048 4802 8108 8669 7391 9262 11351 19054 21143
670471B9594P859K7879J33283P33932l50048l24071p7962q6569J8274m0072m428D1101
$$ 29594 37453 65332 198615 932547 582499 258428 180466 93897 112171 72099 67671 41101
672064E1205k0925R013j2786R761j4002P671r885O985q357O767r730Q389j0073B2359
$$ 51205 30280 39293 26507 36268 22266 29937 20052 27037 18680 25447 15717 24106 14033 22359
673847A2817P515p827O580q451O143o767P079p640N301o580O799p578N270n644A1601
$$ 12817 20332 12505 19085 10634 16777 10010 17089 9449 14750 8170 14969 7391 12661 7017 11601
675796E426N738n239L961n770M273o487M990m335K027k401K651m647L992l680C649
$$ 5426 11164 5925 9886 4116 8389 1902 6892 2557 4584 2183 4834 187 4179 499 3649
677717e61M054l555K588j840K183l368L586l742K401k619K526k682K651l025K027e61
$$ -561 3493 -62 2526 686 2869 -499 3087 -655 1746 -873 1653 -1029 1622 -1403 624 -561
679733G17j122J590k401K058j778J996j309R66j060R67j092R98j029J092j030G80
$$ 717 -405 1185 -1216 842 -936 1060 -249 717 -343 624 -468 530 -499 593 -437 780
681776i36R05o24J029j871K308j029N30R3p79l12M99J87j154J403m98l2o2m99i04
$$ -936 -31 -655 374 -1497 811 -218 312 405 -374 -686 -187 0 -1154 249 -249 -281 -343 -842 -904
684198H42j185l74K49L74m67L1k50R98j091L74j56R04j24j56r67J934j872J248a216
$$ 842 -343 -717 -468 -94 -561 -530 -780 218 -873 -499 -655 249 125 -31 -998 936 -936 312 -1216
686572I4j653K495j716R36j279J154j434J840m37M99k277L057k745J528j995K027@
$$ 94 -1559 936 -780 156 -1123 31 -1403 437 0 499 -1778 1279 -1466 62 -1933 94 0
688754C12j528J091q42J591r05O24j684K713k245J372j403J590j840J403r97J777a029
$$ 312 -1216 -125 -967 624 -281 343 -1341 1372 -873 499 -904 686 -1154 249 -748 1029 -1029
690918d37o2O24j029J528j248J310p48k81p17J216k18O55k121J965r05O55r04C43
$$ -437 -499 125 -904 624 -624 686 -62 -343 -1060 156 -62 593 -1528 437 -468 187 -717 343
693219d99P48j091N61R4J091j153r4j091J746j528R67k81R35p17J216p79J56R3B49
$$ -499 249 -842 -281 -187 904 -249 -343 -1434 312 -1216 -249 -530 405 -312 904 125 281 374 249
695616g17Q73l12l43M99J87K50k81n30j56N92m36L43o55l1L43L74m37J88j56P48B81
$$ -717 156 -156 -499 0 187 437 156 -374 -530 62 -374 -31 -686 -717 -374 0 -437 -249 -405 343 281
698253a25K19m99l12r4O55R67j092M37p49Q11n61J310r98o3q73J466q11J56j091A310
$$ -125 94 -405 -717 -811 -156 811 -281 156 -593 218 -343 967 -31 -94 -967 499 -312 -156 -1247 1310
700770f24L12q42J310j060O86m06Q42j621J559q73j25j87J590j559J185n30O24a87
$$ -624 -312 -1154 156 -904 -218 -624 218 -1403 156 -717 -842 -1029 561 -998 187 -343 281 -187
703046D05l11L43j061J341j091J559j559J091j528J591j185M99j56K80l43N93E93
$$ 405 94 437 -624 717 -374 1185 -374 717 -811 780 -405 94 -62 218 -125 468 593
705210D68o86L12k19J061r36n30J154q11m68J684l74j56q42J247L2P79j715Q73D99
$$ 468 -218 94 -125 936 0 -530 624 -187 -655 1029 655 499 -343 904 936 1715 0 873 499
707657A029k81m05L12o55N93m37n30R04j25Q11j653Q74j56L12q11Q11p49O86K81c1
$$ 1029 748 343 655 0 593 156 -374 530 405 1216 -437 437 281 593 -218 593 -156 530 811 -31
710174B81l75j55P48m37j060K18J217r4k81J154k18J87j372P48J56j56M68K81A25
$$ 281 -94 -249 499 62 -998 -780 437 343 62 1216 998 1185 -187 561 717 561 1029 1310 125
712545G80j185P48o2J247j528o2l75L43L43M68q11K152k307M36n30k81R4P48m67G17
$$ 780 -405 343 281 1528 0 -62 -437 -94 249 717 -94 2058 -249 187 -343 -624 -530 218 -249 717
715110g80P49J25M36m36M36o24L43j403K027j56n92p49K81J060j24o24%k18P48B81
$$ -780 -31 94 530 94 530 -94 249 -1154 873 717 125 -624 -343 717 593 -31 -31 -249 499 281
717635F55j029O86k81K81n30M99j87P79l74o24l12J217j497J278q10L11k80P48D05
$$ 655 -374 312 31 312 -218 281 94 873 499 -125 -437 780 -717 561 -249 62 -218 530 405
720009C1Q11k49J24M491j435j871j216J56k81J87l43p48Q73r3L74j559P17Q73c1
$$ 31 842 593 717 5208 3773 1902 686 842 561 748 405 -343 530 437 811 -748 -31 842 -31
722405D37%m06K18r3r4j24o3M06l43J87m68J715j060n61J247l1J87m99j435J029d37
$$ 437 437 31 249 156 62 -62 -125 281 -62 125 -343 1372 312 -249 998 967 1154 655 -780 249 -437
725068D05L12p17%K81j56j25o24J029N62%j279Q11l1M05m68q42J373r05N93J56A310
$$ 405 717 0 0 281 125 0 -624 405 967 967 -312 499 468 873 405 -437 936 31 624 780 1310
727707b18P48j56k18o55J435j88P18j560M06j092J341j154O24o86J248j061J965e93
$$ -218 530 374 156 -499 936 748 1466 -94 312 -780 561 -593 31 -655 593 -468 1497 -593
730009H42o24J092j123R67r36J622j591K19l12J029p48K18r04P17m37R67j060G48
$$ 842 218 1310 187 1154 218 1840 249 468 156 1185 437 655 -249 468 31 998 -62 748
732263G80j87q74Q42N93l12r67M06L12J24L43j56j278Q42j87l2L2J87N92j154E61
$$ 780 593 -281 561 1154 842 -125 281 593 717 1060 904 -374 468 281 249 281 468 1060 -94 561
734787G17M06K18j341Q11j56L12J56j56R3M37m99L74m68K50n30N92n30K50O2l12A216
$$ 717 1123 1341 0 811 655 967 1123 967 1060 1497 998 1372 904 1154 624 1216 686 936 998 686 1216
737452E30R36j248J216q73N30k49l1O23m36j092J061j061J591k81l43j87L74l1A622
$$ 530 1466 218 1434 561 1091 842 811 1434 998 -94 967 -94 1497 1216 873 686 1060 1029 1622
739876A746l74R4R66j434R98r05J466j528J871k401J123j123J965j279N61%%j122A996
$$ 1746 1372 1466 2432 998 1996 1091 2557 1029 2900 499 1622 499 2464 1185 1746 1746 1746 624 1996
742253A559L74m36J029j871K027j372J653r36J247m36J185r98Q73Q73J56j684E738
$$ 1559 1933 1497 2526 655 2682 1310 2963 2027 3274 2838 4023 3025 3898 4771 4927 3243 5738
744442E270L150M085J2162l337n114l399%P80K214P17P359J1913O3399J16662A76443
$$ 5270 8420 12505 24667 21330 16216 12817 12817 13597 15811 16528 23887 35800 99199 215861 176443
746348A35997m0198l4802q763p952N208J7744O705k5228j0479j1288j497n208B0769
$$ 135997 95799 60997 52234 44282 49490 67234 73939 48711 38232 26944 25447 20239 20769
748036A7495K775k775J372l243J528j560K495j341N738O643K8939L960j5498j0447C6143
$$ 17495 20270 17495 18867 15624 17152 15592 18087 16746 22484 29127 58066 62026 46528 36081 36143
749942C6954K6756K8098N3825P2410p7805n6757k7723j4251n021m241n800j528B4792
$$ 36954 63710 91808 145633 218043 140238 83481 55758 41507 36486 32245 26445 24917 24792
751629B7879M803p048m740l930k744j808M05r36r3k277k80j248J25o24n61K18F143
$$ 27879 32682 25634 20894 16964 14220 12412 12817 11881 11788 9511 9231 7983 8108 7484 6923 7141 6143
753821E800K50m37J56j247P17j902P48j372J56L43R4m06q42m68J88n31R4O2M68C43
$$ 5800 6050 5613 5769 4522 5239 3337 4085 2713 2869 3212 3306 2900 2058 1590 1778 1247 1341 1403 1871 343
756343A185n92m68j25O86J87j310q42J528p17L74M68j185Q42r98O86o23R3l74g17
$$ 1185 593 125 0 686 873 -437 -1279 249 -468 -94 374 -811 31 -967 -281 -904 -811 -1185 -717
758717h11Q73r35q11Q42J56L12o3m05N61m05m68P17O3K18N93o55m68J87j091L1h11
$$ -811 62 -873 -1684 -842 -686 -374 -437 -842 -281 -686 -1154 -437 -374 -156 437 -218 -686 -499 -1590 -1559 -811
761379i04P17%K49k18O2o54K18m37N30n61j56J25K49N31k50k81L75L43n93N30e61
$$ -904 -187 -187 62 -156 -94 -748 -530 -967 -437 -998 -1154 -1029 -780 -249 -499 -780 -405 -62 -655 -125 -561
764019e30p80L1l1P49n62O3P17J154j216m99j25M99J25k81O2m05l74J060o2m68a029
$$ -530 -1310 -1279 -1310 -561 -1123 -1060 -343 811 -405 -904 -1029 -530 -405 -686 -624 -1029 -1403 -343 -405 -873 -1029
766683d68R4m37l12K19K80M68p48n30J309j777J154K80o55j56K81M99k49O86o86a279
$$ -468 -374 -811 -1123 -904 -624 -156 -904 -1434 -125 -1902 -748 -468 -1123 -1279 -998 -499 -748 -62 -748 -1279
769203a56p48J24P18r67O2R4P17m99K81N92p48l12M99l43N30K18n30k80m99N92F55
$$ -156 -904 -780 -62 -1029 -967 -873 -156 -655 -374 218 -530 -842 -343 -686 -156 62 -468 -748 -1247 -655 655
771843g17P17n30j25L74q73P17l11R3j56J684j497M68k81K50j092R4Q11l74O54a87
$$ -717 0 -530 -655 -281 -1154 -437 -748 -655 -811 873 -624 -156 -437 -187 -1279 -1185 -374 -748 -94 -187
774362a434N61J56k19J373j404O24j25%n92r4Q42%J25l12p17J216r98J154n93e61
$$ -1434 -873 -717 -936 437 -967 -343 -468 -468 -1060 -1154 -312 -312 -187 -499 -1216 0 -998 156 -437 -561
776881c1k81P80j154O24n31J56m67L1M68k50%%K50L11M06p17k19J25P48p79l1a060
$$ -31 -312 468 -686 -62 -593 -437 -904 -873 -405 -655 -655 -655 -405 -94 312 -405 -624 -499 249 -530 -561 -1060
779666e30n61P79o2P79p17K81j060N61n93M99O3o24M05K50p17O86K80p79J372B49
$$ -530 -1091 -312 -374 405 -312 -31 -1091 -530 -1123 -624 -561 -1185 -780 -530 -1247 -561 -281 -1060 312 249
782183a25l1k49K80L1n61m36O2R67m68O2Q11m99P49j435K18R05j123R67r4o2J87I04
$$ -125 -156 -405 -125 -94 -655 -1091 -1029 -62 -530 -468 343 -156 593 -842 -624 281 -842 125 31 -31 156 904
784963a87Q11j560P49K49j24q42M36n30J497n30o3j24O2j25o2o86J123j88O3m06c43
$$ -187 624 -936 -187 62 -62 -904 -468 -998 499 -31 -94 -218 -156 -281 -343 -1029 94 -94 -31 -437 -343
787608g80%P49J25K80o86l12J435r05P49p80L1O87j373R05M05n61k50L75p18R36c1
$$ -780 -780 -31 94 374 -312 -624 811 -94 655 -125 -94 593 -780 125 530 -31 -281 94 -624 312 -31
790220a87K81r05P49r4O55j029l12Q73p17j56R4L1J060K81n93r3j029N30N61o86C1
$$ -187 94 -811 -62 -156 499 -530 -842 31 -686 -842 -748 -717 343 624 31 -62 -1091 -561 0 -686 31
792882E61j840J092j56o55K50p18R36R3K19M99q42L12K18n93o55J310j56l43J56c1
$$ 561 -1279 -187 -343 -998 -748 -1466 -530 -437 -218 281 -561 -249 -31 -624 -1279 31 -125 -468 -312 -31
795422b49P79k81%j87m05k18L1P79n30p48P80K18o3l11L74m37o2L12l1r67J403a154
$$ -249 530 249 249 62 -343 -561 -530 249 -281 -1029 -249 -31 -94 -405 -31 -468 -530 -218 -249 -1216 187 -1154
798179h11N62K80j56j091J56J060M37j217%J56J310j060r36O55P49%r4O2o86%@
$$ -811 -249 31 -125 -1216 -1060 0 437 -780 -780 -624 686 -374 -1310 -655 94 94 0 62 -624 -624 0
800839d37M37J87K81n93j56N93j185M36N31p80l12P49r4Q42o24m68M37J56J25a25
$$ -437 0 187 468 -125 -281 312 -873 -437 94 -686 -998 -249 -343 499 -125 -593 -156 0 125 -125
803355E30J87j216l43K18N62o86P17o3j24K80m05k50K81P49j092K50M99r36N61F2
$$ 530 717 -499 -842 -624 -62 -748 -31 -94 -218 62 -343 -593 -312 437 -655 -405 94 -842 -281 62
805880E61j497J88L74m06N31l44N93j56n92k19K81J123j123l1J122j746K18J123d99
$$ 561 -936 -748 -374 -780 -249 -593 0 -156 -748 -967 -686 437 -686 -717 405 -1341 -1123 0 -499
808279d37P80j341O55M37m68N92j56J56O3m99l1R3%k18P17o24J56r35P17P17o23e30
$$ -437 343 -998 -343 94 -374 218 62 218 281 -218 -249 -156 -156 -374 343 -281 -125 -1060 -343 374 -249 -530
811034C1r3l12N92q11L12n92P17r3o24O55J56k50P17k18L12o55p80Q11M06K80b49
$$ 31 -62 -374 218 -593 -281 -873 -156 -249 -873 -218 -62 -312 405 187 499 -156 -936 -125 281 561 -249
813669D05p79K80l1m99K81M68k81m68M99N62j56m37o24M68o55M06M36J56j091A56
$$ 405 -374 -94 -125 -624 -343 125 -156 -624 -125 437 281 -156 -780 -312 -967 -561 -125 31 -1060 156
816208I4q74J87j87o86J217o3o2j87L12K49j87k81M99j56J56L12k81o2J87J56a56
$$ 94 -780 -593 -780 -1466 -249 -312 -374 -561 -249 0 -187 -468 31 -125 31 343 62 0 187 343 -156
818845f55J87O24n30L43j466J123O55n93k81M68k80R35j403J154o55l1r4P17m36i36
$$ -655 -468 156 -374 -31 -1497 -374 281 -312 -593 -125 -405 530 -873 281 -374 -405 -499 218 -218 -936
821360E30j310N93l43P48l74J56%K81M99o55l43K49J56m36n62L74L12m05O86K49a029
$$ 530 -780 -187 -530 218 -156 0 0 281 780 125 -218 31 187 -249 -811 -437 -125 -530 156 405 -1029
824005C1R4J56j123%J497r36o2L12j092J310R4k81m05k81J87k18J216j25R4j25a56
$$ 31 125 281 -842 -842 655 -281 -343 -31 -1123 187 281 0 -405 -686 -499 -717 499 374 468 343 -156
826689d68R05o55M05j216J123L1m06k49K81r36J123L1R67j560o23R35r3O2O55a185
$$ -468 437 -218 187 -1029 94 125 -281 -530 -249 -1185 -62 -31 936 -624 -1247 -312 -405 -343 312 -1185
829209e93j87M37M05r04j87o2M67j87J248j092J123j591J217r4L74r04M99l12i4
$$ -593 -780 -343 62 -842 -1029 -1091 -624 -811 437 -655 468 -1123 94 0 374 -530 -31 -343 -94
831605e30k81K81l1O86n30J24N30j87l43k49r4J248j684P17J56l12P80j840K588c12
$$ -530 -811 -530 -561 125 -405 -281 249 62 -281 -530 -624 624 -1060 -343 -187 -499 281 -1559 1029 -312
834122f55O86K50k50l12l74J029L1j153J029j56l74k81O24m99P17r67P49m37K81I04
$$ -655 31 281 31 -281 -655 374 405 -748 281 125 -249 -530 94 -405 312 -655 94 -343 -62 904
836639A87n30R04m36n30l75N93O2k49o3P80q42l74Q11R66q10%r67K18J123j25A56
$$ 187 -343 561 125 -405 -780 -187 -125 -374 -437 343 -499 -873 -62 904 94 94 -873 -655 468 343 156
839284f2j25L1p80P18O55j092M68M36J25l74o24N93P17O2q10q11J029J25o55o3a56
$$ -62 -187 -156 -936 -218 437 -655 -187 249 374 0 -624 -31 686 748 -62 -873 156 281 -374 -437 -156
841944B49o23K80o2N61j964R66J56J88O54o86j56k18r3k50J154n30%j87o3N93C1
$$ 249 -374 -94 -156 405 -1559 -593 -437 -249 405 -281 -437 -655 -748 -998 156 -374 -374 -561 -624 -31 31
844581b49L1m68N61j247K432p79j87p49O86q11J591j528J24N93k18M36%r3m99e93
$$ -249 -218 -686 -125 -1372 1060 281 94 -655 31 -780 811 -717 -593 0 -218 218 218 125 -374 -593
847120d37k49R35m05%m68J061k81o55J466r36O3J55o54P79l74p17L12R04j497f24
$$ -437 -686 249 -156 -156 -624 437 156 -499 967 31 94 249 -405 374 0 -717 -405 499 -998 -624
849615h73M68l2j24J029o86m68O86J25l12K18M37k19j060L43n92P17o86M68Q10b81
$$ -873 -405 -437 -561 468 -218 -686 0 125 -187 31 468 249 -811 -468 -1060 -343 -1029 -561 249 -281
852182b81Q11k058K339j559J247j279M68l43j25K81L1%M06M05O2p17j25N62p18b49
$$ -281 530 -1528 811 -748 499 -780 -312 -655 -780 -499 -468 -468 -62 343 405 -312 -437 125 -593 -249
854673a25j56m05J060o55n30P80l12M37o24K81%o3M37o3r35R98O55j591P49p49E61
$$ -125 -281 -686 374 -281 -811 -31 -343 94 -530 -249 -249 -312 125 62 -873 125 780 -811 -62 -811 561
857318a091J029r36P49%m37P48j403J247m36m37Q42R4n30M36r3m06P49L1r4L75b18
$$ -1091 -62 -998 -249 -249 -686 62 -1341 -94 -530 -967 -125 -31 -561 -125 -218 -624 125 156 62 437 -218
859978c43J715j746l12L12j56N30j060L12N92L12j092P49l43K49k80N92m05R35I4
$$ -343 1372 -374 -686 -374 -530 0 -1060 -748 -156 156 -936 -187 -530 -281 -561 31 -374 561 94
862397B81n30O23o86L43k18l1q42J87J278n61n30R3N62m68N93k19K50R3p79j56h73
$$ 281 -249 374 -312 31 -187 -218 -1060 -873 405 -156 -686 -593 -31 -499 94 -125 125 218 -561 -717 -873
865009B49k18p17P17k49L1L43m68J87p48L74P48j24o86j25O86m99P80m37o24%C43
$$ 249 31 -686 31 -218 -187 156 -312 -125 -873 -499 249 125 -561 -686 0 -499 281 -156 -780 -780 343
867669a434J122P49j88o2P17j060j25k49N30K49k49l43R04j060R4J309p48n30c74
$$ -1434 -312 437 249 187 904 -156 -281 -530 0 249 0 -343 561 -499 -405 904 156 -374 -374
870068c12k18j56N61M37o86L43o24M99N93r36J123j279l43J403q42R4n30L74K81d05
$$ -312 -530 -686 -125 312 -374 -31 -655 -156 437 -499 624 -655 -998 405 -437 -343 -873 -499 -218 -405
872593D99j25j372l74J559n61O86k81l43P80n62o2p48J278p17o24Q73j87O55r04A25
$$ 499 374 -998 -1372 187 -374 312 31 -312 468 -94 -156 -904 374 -343 -967 -94 -281 374 -530 125
875110A25o3m05L12q42O86l1K80q42Q11J56r35l2P49l12M37R3j185Q11n61M99i67
$$ 125 62 -343 -31 -873 -187 -218 62 -780 31 187 -748 -780 -31 -343 94 187 -998 -187 -748 -249 -967
877792@l12O24l74K49J25n61l44L44l75N30l11m06Q73o2m68k18N30L1k18o2M36a56
$$ 0 -312 312 -62 187 312 -249 -593 -249 -624 -94 -405 -811 62 0 -468 -686 -156 -125 -343 -405 31 -156
880524d05O54j24r4O24k81j185R98n92N61n93L12O3m06J029j309J55%N62R3o55F2
$$ -405 249 125 31 655 374 -811 187 -405 156 -437 -125 -62 -468 561 -748 -593 -593 -31 62 -593 62
883161D99r67J029j403O55J25j56M36k18L43p17N61j25n61J590j216l74M99l74b49
$$ 499 -468 561 -842 -187 -62 -218 218 0 343 -374 187 62 -499 1091 -125 -499 0 -374 -249
885603c12q73R04R4r4L12j247L74K49O24m99J87K81j87l74N61M05l43N31q74L43a87
$$ -312 -1185 -281 -187 -281 31 -1216 -842 -593 31 -468 -281 0 -187 -561 0 405 62 593 -281 62 -187
888248a247J964r98O86j403K50l2J435m06p48o86P48K50K81m06j25L43K19m37c12
$$ -1247 717 -281 405 -998 -748 -780 655 249 -499 -1185 -437 -187 94 -312 -437 -94 125 -312 -312
890644I4q74Q74j88m36J590j933o3O3L1J590k80o24j87l74J091j278L43o3N30@
$$ 94 -780 94 -94 -530 1060 -873 -936 -873 -842 748 468 -156 -343 -717 374 -904 -561 -624 -94 0
893161c43P17o2l1L12l75k80j25%K81M99o24J060j310O3R66j715J216l74r35N92B18
$$ -343 374 312 281 593 218 -62 -187 -187 94 593 -31 1029 -281 -218 748 -967 249 -125 -1060 -468 218
895821B81J060j247%k19L43l12k80n93R67n93J684j902J310k50l11l2O24j87L43f2
$$ 281 1341 94 94 -125 218 -94 -374 -967 0 -593 1091 -811 499 249 -62 -94 530 343 686 -62
898338G80j061O3J56r05O55N93j341P17K18o2N92p17l74M37r4l12L43p79J091a56
$$ 780 -281 -218 -62 -967 -312 281 -1060 -343 -125 -187 405 -312 -686 -249 -343 -655 -312 -1091 0 -156
900852I4L1r98O55n93J154m68M06M05M68j092P80p48k81L1j87K49l74N30J092b49
$$ 94 125 -873 -218 -811 343 -125 281 686 1154 62 842 94 -187 -156 -343 -94 -468 62 1154 -249
903377c74L74j216J590j122J309j434J247r35K49r3M36K81q42K81j88O86p79J56c12
$$ -374 0 -1216 374 -748 561 -873 374 -561 -312 -405 31 312 -530 -249 -437 249 -530 -374 -312
905799a56m99Q73j060M68K80M99j87o86N30k49j25k81M37o55j56P80N92m99K50A185
$$ -156 -655 218 -842 -374 -94 405 218 -468 62 -187 -312 -593 -156 -811 -967 -187 405 -94 156 1185
908316D37n62L74r66J122j216k80J216j435Q11%J25P79j122R66o23N61o24m36B81
$$ 437 -125 249 -717 405 -811 -1091 125 -1310 -499 -499 -374 405 -717 249 -374 187 -437 -873 281
910735f2o55o3n30J778p17J55M68l12j902J715n92N30M68M05j029n61L11K19J25a87
$$ -62 -717 -780 -1310 468 -249 -94 374 62 -1840 -125 -717 -187 281 686 -343 -904 -593 -374 -249 -187
913252d68j621J559J341k308J466l1r67Q42o2R3J56J87j25n92%j87K49j25K19a091
$$ -468 -2089 -530 811 -1497 -31 -62 -1029 -187 -249 -156 0 187 62 -530 -530 -717 -468 -593 -374 -1091
915746F2J061j684L74j87J56R98j528L43O2J25M99j528J840n62P17j247o2L1L1d68
$$ 62 1123 -561 -187 -374 -218 780 -748 -405 -343 -218 281 -1247 593 31 748 -499 -561 -530 -499 -468
918271G80p18l74J87P49k50j341M06P79O55j185P49o55P17j154P17p48r4J154I4
$$ 780 62 -312 -125 624 374 -967 -561 218 873 -312 437 -218 499 -655 62 -686 -780 374 94
920692h42O24O86j25j216K18M68q11J029o2R3r98Q42m05N93o3O3k81O24r98J091a87
$$ -842 -218 468 343 -873 -655 -187 -998 31 -31 62 -936 -94 -499 94 31 94 -187 437 -561 530 -187
923327D99r04K18K18m99L74l74J25L74J87l12O3J87m37K50K80l11n31L2O55K18C12
$$ 499 -405 -187 31 -468 -94 -468 -343 31 218 -94 -31 156 -281 -31 249 -62 -593 -561 94 312 312
925987a56O24j123k49J341j092R36J56l75m67J216k18q42L1K80j87k80k19R36e30
$$ -156 468 -655 -904 437 -655 281 437 62 -405 811 593 -249 -218 62 -125 -405 -624 312 -530
928408D68o55j56o86M36J25k80J55N62l43l74P79o86k18N92J092o86r4M99j123I36
$$ 468 -187 -343 -1029 -593 -468 -748 -593 -31 -374 -748 31 -655 -873 -281 811 125 31 530 -593 936
930900A56j87K49j341R05m06P18p18J56O55M68l74k81m68L1M06L1r67J216r97A87
$$ 156 -31 218 -1123 -218 -624 94 -624 -468 187 655 281 0 -468 -437 -31 0 -967 249 -748 187
933425C43n61k19M06m37j56M37K18r67O87L43k19l1P17r04k18o86J278L1j060g48
$$ 343 -218 -437 -31 -468 -624 -187 31 -936 -249 94 -125 -156 561 -343 -561 -1247 31 62 -998 -748
935964@n93k49J87J25J87p48J122m05j56R98J87m99n93K027j091m68j25k49%M99B18
$$ 0 -593 -842 -655 -530 -343 -1091 31 -374 -530 468 655 156 -437 1590 499 31 -94 -343 -343 156 218
938601g80Q11r3j56L1n30j87Q42o86J55L2M05o55Q73j56J56m05J56Q42q42p17h73
$$ -780 31 -62 -218 -187 -717 -904 -62 -748 -593 -561 -156 -811 62 -94 62 -343 -187 655 -187 -904 -873
941261@l12M06k19P18k81n30m37N93N61r67O3N92j247R35L74n92O2%L2O23k80c43
$$ 0 -312 94 -125 593 312 -218 -655 -62 499 -468 -405 187 -1060 -125 249 -343 -281 -281 -249 374 94 -343
944041f24P80l43j25O55O24j404l11N30o3R36j279N30L43j153R66K50j56j590a56
$$ -624 156 -187 -312 343 967 -437 -748 -218 -281 655 -624 -94 249 -904 62 312 156 -1434 -156
946412d05j88L2O23r35R98Q11r36K81j56m99N92j87J25q73O2Q73M06O2j965J123g80
$$ -405 -593 -561 62 -873 125 936 0 281 125 -374 218 31 156 -717 -655 218 624 686 -1279 -156 -780
949057D05r98J560j497R35l74m05J87j25j56J56j029J185l43L43q42J216n61j25c1
$$ 405 -593 967 -530 405 31 -374 -187 -312 -468 -312 -1341 -156 -499 -156 -998 218 -343 -468 -31
951502I04r04k49R35p17j154i04
$$ 904 0 -249 686 -31 -1185 -904
952343i4  $$checkpoint
##END=