##TITLE=N-ethylaniline $$ Begin of the data block
##JCAMP-DX=5.00 $$
##DATA TYPE= INFRARED SPECTRUM
##ORIGIN= Dept of Chemistry, UWI, JAMAICA
##OWNER= copyright UWI, Mona, JAMAICA 2001
##LONGDATE= 1999/10/22 13:54:00
##SPECTROMETER/DATASYSTEM= PERKIN-ELMER 1000 FT-IR
##DELTAX=   .5000000
##XUNITS= 1/CM
##YUNITS= TRANSMITTANCE
##NPOINTS=7201
##FIRSTX=600.00000000
##LASTX=4200.00000000
##XFACTOR=1.0000000000
##YFACTOR=0.0000307787
##FIRSTY=0.30998418
##DELTAX=0.50000000
##XYDATA=(X++(Y..Y))
600A0071P4O7O0M9M0L5TL7M3M6TM2L5L0K5K4K6TK5K2J9K1K5L4M2M6M1L0J3lj1j0OL0
617A1141O0R0J14J28J32J29J21J12J08J06TJ05R8R0Q1P4P3P9Q7R6R9R7R1Q2P4P1TP2
631A3787P4P3TP0TP2P8Q5R1R7R6R1Q5P7P3P4P8Q4Q8TQ2P3O5O1O2O9P9Q7R1TQ7Q2Q0
647.5A6413Q0Q2Q4Q2P8P0O1N4N3N5O2O7P0O6N7M1K6J1LjKQJ5K0K2TJ7J4J1UJ6K3L4
664.5A7740M9O6Q5J01J10TR9Q2O1M0K6J8J5J6TJ4RKqj7k4k7l0l4m1n3p1r5j20j45j69
680A7825j93k21k54k94l43m00m63n31o05o84p68q51r29r93j035j048j025r66q74p54
690D594o18m78l42k16j05mR1J85K84L92N06O25P40Q46R32R92J022TR96R50Q92Q29P65
701.5A4900P02O41N82N24M69M20L76L39L07K79K55K32K11J94J78J64J52J41J31J22
$$ y = [10071, 10145, 10212, 10272, 10321, 10361, 10396, 10431, 10468, 10511, 10557, 10603, 10645, 10680, 10710, 10735, 10759, 10785, 10811, 10836, 10858, 10877, 10898, 10923, 10957, 10999, 11045, 11086, 11116, 11129, 11126, 11115, 11105, 11111, 11141, 11201, 11291, 11405, 11533, 11665, 11794, 11915, 12027, 12135, 12241, 12347, 12452, 12550, 12640, 12721, 12795, 12868, 12947, 13034, 13130, 13229, 13326, 13417, 13499, 13573, 13644, 13715, 13787, 13861, 13934, 14007, 14077, 14147, 14219, 14297, 14382, 14473, 14570, 14666, 14757, 14842, 14919, 14992, 15066, 15144, 15228, 15316, 15404, 15486, 15559, 15624, 15685, 15747, 15816, 15895, 15982, 16073, 16164, 16251, 16333, 16413, 16493, 16575, 16659, 16741, 16819, 16889, 16950, 17004, 17057, 17112, 17174, 17241, 17311, 17377, 17434, 17475, 17501, 17512, 17515, 17514, 17516, 17524, 17539, 17559, 17581, 17603, 17620, 17634, 17645, 17656, 17667, 17683, 17706, 17740, 17789, 17855, 17940, 18041, 18151, 18261, 18360, 18442, 18503, 18543, 18569, 18587, 18602, 18618, 18634, 18648, 18657, 18659, 18651, 18634, 18610, 18583, 18553, 18519, 18478, 18425, 18354, 18259, 18139, 17994, 17825, 17632, 17411, 17157, 16863, 16520, 16120, 15657, 15126, 14521, 13837, 13069, 12218, 11289, 10296, 9261, 8213, 7188, 6222, 5348, 4594, 3976, 3498, 3156, 2940, 2835, 2831, 2922, 3107, 3391, 3783, 4289, 4914, 5654, 6500, 7432, 8424, 9446, 10468, 11464, 12414, 13306, 14135, 14900, 15602, 16243, 16825, 17349, 17818, 18238, 18614, 18953, 19260, 19539, 19794, 20026, 20237, 20431, 20609, 20773, 20925, 21066, 21197, 21319]
711.5B1319J14J08J03R8R3Q5P4O4N1M2L2K7K3J8J3Pjrj5k0k4k8l3m0m9o0p2q1r0r7
726.5B1652j04j13j26j44j63j83k01k16k30k46k65k91l20l54l89m25m60m97n35n76
736.5A5814o21o69p17p67q11q51q79q96q98q87q59q18p64o99o23n43m60l79l01k32
746.5B140j71j19p8m4j8KJ9L6N6Q0J10J46J88K37K91L53M19M91N59O24O80P25P57P80
758.5H263P92P95P88P70P40P02O58O10N69N33N09M95M88M87M88M91M92TM88M81M70
769B0601M53M33M07L80L50L20K90K60K32K07J85J68J55J47J43J40TJ39J38J37J39TJ41
780.5B5844J41J38J29J17J03Q8P6P0O9TP1P0O6N8N2M3L8L4UL7L9M0L8L3K6J7J1QRJ4
796B7616J8K2TK0J5J0N%oj4k2l2m0m6n2n5n6Tn3n1m9m8n0n3n6n7n2m3l3k2j5Tj7k0
$$ y = [21319, 21433, 21541, 21644, 21742, 21835, 21920, 21994, 22058, 22109, 22151, 22183, 22210, 22233, 22251, 22264, 22271, 22270, 22261, 22246, 22226, 22202, 22174, 22141, 22101, 22052, 21992, 21920, 21839, 21749, 21652, 21548, 21435, 21309, 21165, 21002, 20819, 20618, 20402, 20172, 19926, 19661, 19370, 19050, 18696, 18307, 17882, 17422, 16925, 16390, 15814, 15193, 14524, 13807, 13040, 12229, 11378, 10499, 9603, 8705, 7818, 6959, 6141, 5377, 4678, 4055, 3512, 3052, 2673, 2372, 2140, 1969, 1850, 1772, 1728, 1710, 1712, 1731, 1767, 1823, 1903, 2013, 2159, 2347, 2584, 2875, 3228, 3647, 4138, 4697, 5321, 6001, 6726, 7483, 8263, 9055, 9850, 10638, 11408, 12148, 12850, 13508, 14118, 14687, 15220, 15729, 16224, 16712, 17199, 17687, 18178, 18670, 19162, 19650, 20131, 20601, 21054, 21487, 21894, 22274, 22624, 22944, 23234, 23494, 23726, 23933, 24118, 24286, 24441, 24588, 24731, 24871, 25011, 25150, 25288, 25425, 25564, 25703, 25844, 25985, 26123, 26252, 26369, 26472, 26560, 26636, 26706, 26775, 26844, 26915, 26985, 27051, 27109, 27161, 27204, 27242, 27276, 27310, 27344, 27381, 27420, 27460, 27498, 27531, 27557, 27574, 27585, 27593, 27602, 27616, 27634, 27656, 27678, 27698, 27713, 27723, 27728, 27728, 27722, 27708, 27686, 27654, 27614, 27568, 27516, 27461, 27405, 27349, 27296, 27245, 27196, 27148, 27098, 27045, 26989, 26932, 26880, 26837, 26804, 26782, 26767, 26752, 26735, 26715]
813B6715k1j9j5j2Tj6k2k8l1Tk6k0j7Tj8k3k4k3j6nRK1L0L5L6L5TL8M3M8N3N5N3N0
830B6860M9N2N8O4P1P3P1O7O5O3O7P1P6P8P7P3O7N9N4N0M7M4M2L7L1K3J6J0POPRJ0
846.5B8454J1TQPNLKjnj2k2l1m2n4o3p4q6r7j13j29j48j69j91k17k44k73l06l40l74
861B5510m07m36m58m73m78m72m55m26l91l47k98k46j90j32p1qN4J13J68K18K64L03
872B1342L35L61L77L87L88L87L83L79L72L65L54L40L23L08K92K78K64K49K30K08J85
882.5B8107J65J49J36J28J22J16J12J07J03J00R4Q5P4N9M3L1K3K1K4L0L4L7L5K9K3
895B9987J6J2J1J2J4J5J3RLkoTm%LNONMTLMTOQJ1J2J4J3J1QNKjloqj1j3j5j4Uj5j8
917.5C0070k3k9l7m3n2n9o6p1p6q2r0j00j14j29j43j56j66j72j74j71j65j49j24r2
$$ y = [26715, 26694, 26675, 26660, 26648, 26636, 26620, 26598, 26570, 26539, 26508, 26482, 26462, 26445, 26428, 26410, 26387, 26363, 26340, 26324, 26319, 26328, 26349, 26379, 26414, 26450, 26485, 26520, 26558, 26601, 26649, 26702, 26757, 26810, 26860, 26909, 26961, 27019, 27083, 27154, 27227, 27298, 27365, 27430, 27493, 27560, 27631, 27707, 27785, 27862, 27935, 28002, 28061, 28115, 28165, 28212, 28256, 28298, 28335, 28366, 28389, 28405, 28415, 28422, 28428, 28435, 28444, 28454, 28465, 28476, 28484, 28491, 28496, 28499, 28501, 28500, 28495, 28483, 28461, 28430, 28388, 28334, 28271, 28197, 28111, 28014, 27901, 27772, 27624, 27455, 27264, 27047, 26803, 26530, 26224, 25884, 25510, 25103, 24667, 24209, 23736, 23258, 22786, 22331, 21905, 21514, 21167, 20869, 20623, 20433, 20301, 20230, 20222, 20276, 20389, 20557, 20775, 21039, 21342, 21677, 22038, 22415, 22802, 23190, 23577, 23960, 24339, 24711, 25076, 25430, 25770, 26093, 26401, 26693, 26971, 27235, 27484, 27714, 27922, 28107, 28272, 28421, 28557, 28685, 28807, 28923, 29035, 29142, 29245, 29345, 29439, 29524, 29598, 29657, 29700, 29731, 29754, 29775, 29799, 29829, 29863, 29900, 29935, 29964, 29987, 30003, 30015, 30026, 30038, 30052, 30067, 30080, 30089, 30092, 30090, 30084, 30078, 30074, 30074, 30077, 30082, 30088, 30093, 30097, 30101, 30104, 30108, 30112, 30118, 30126, 30137, 30149, 30163, 30176, 30187, 30195, 30200, 30202, 30201, 30198, 30192, 30184, 30173, 30160, 30145, 30131, 30117, 30103, 30088, 30070, 30047, 30018, 29981, 29938, 29886, 29827, 29761, 29690, 29614, 29532, 29442, 29342, 29228, 29099, 28956, 28800, 28634, 28462, 28288, 28117, 27952, 27803, 27679, 27587]
929.5B7587n0pL6P5J07J30J46J55J57J54J45J35J23J13J04R7R1Q4P5O5N5M6M0L7L4
942B9734L3L1K6J8J0%qj4j7Uj6Tj9k1k3Tk0j5p%NPRJ0RJ0J1J2J1TJ0RPM%pj4k1k6l0
962.5B9646l0k8Tk6Tk5k3k1j6j1roprUol%Tlrj6k3k8l3l5m0m6n6o7q0r2j00j03j00
980.5B8523r4q8q5r0j06j30j64k04k50l00l55m17m90n72o65p62q50r17r44r12q09o30
991.5A8689l82q6K28N25P70R43J031J042R91R00P90O80N78M90M15L52K98K51K13J79
1001.5B8897J53J29J11R5Q1O9N9N1M2L6K8J9J2MknoTprj6k4l3m1m6n1n4n9o7p7q8j00
1017.5B9095j12j23j37j51j70j92k16k42k68k94l19l40l57l63l60l42l12k67k10j44
1027.5B4176p0J1R1J70K41K99L41L63L67L53L28K95K58K24J92J63J38J16R6P9O4M9
$$ y = [27587, 27537, 27530, 27566, 27641, 27748, 27878, 28024, 28179, 28336, 28490, 28635, 28770, 28893, 29006, 29110, 29207, 29298, 29382, 29457, 29522, 29577, 29623, 29663, 29700, 29734, 29767, 29798, 29824, 29842, 29852, 29852, 29844, 29830, 29813, 29796, 29779, 29763, 29747, 29728, 29707, 29684, 29661, 29641, 29626, 29619, 29619, 29624, 29631, 29640, 29650, 29659, 29669, 29680, 29692, 29703, 29714, 29724, 29733, 29740, 29744, 29744, 29737, 29723, 29702, 29676, 29646, 29616, 29588, 29560, 29534, 29508, 29483, 29460, 29439, 29423, 29412, 29403, 29397, 29390, 29381, 29372, 29363, 29357, 29354, 29354, 29354, 29351, 29342, 29326, 29303, 29275, 29242, 29207, 29167, 29121, 29065, 28998, 28918, 28826, 28726, 28623, 28523, 28429, 28341, 28256, 28166, 28060, 27930, 27766, 27562, 27312, 27012, 26657, 26240, 25750, 25178, 24513, 23751, 22901, 21984, 21040, 20128, 19319, 18689, 18307, 18221, 18449, 18974, 19744, 20687, 21718, 22760, 23751, 24651, 25441, 26121, 26699, 27189, 27604, 27956, 28254, 28505, 28718, 28897, 29050, 29179, 29290, 29385, 29466, 29535, 29594, 29645, 29687, 29723, 29751, 29770, 29782, 29786, 29784, 29779, 29773, 29767, 29760, 29751, 29735, 29711, 29678, 29637, 29591, 29540, 29486, 29427, 29360, 29283, 29195, 29095, 28983, 28860, 28723, 28572, 28402, 28210, 27994, 27752, 27484, 27190, 26871, 26531, 26174, 25811, 25451, 25109, 24797, 24530, 24320, 24176, 24106, 24117, 24208, 24378, 24619, 24918, 25259, 25622, 25989, 26342, 26670, 26965, 27223, 27447, 27639, 27802, 27940, 28056, 28152, 28231, 28295, 28344]
1038.5B8344L6K2Qnj7k8l7m5n3n9o5o9p4p9q7r6j08j22j35j46j55j63j71j78j88j99
1051.5B6131k11k23k33k42k50k57k64k70k73k72k65k49k24j87j36p5pO4J32J90K32
1062B3111K59K66K60K41K16J86J55J19Q3M3jm8r6j44j92k35k75l11l41l61l66l52l12
1073.5B1905k42j43k1J12K43L54M39M87N01M87M51M02L48K92K41J93J52J15Q3N5L0
1084B6484Pj6l7n7p5r3j09j26j42j58j73j87k00k13k24k36k45k54k62k67k69k66k59
1095.5B2623k45k23j95j60j22p9l3J5O2J10J56J98K34K60K78K86K85K77K64K48K31
1106B4470K14J99J83J68J54J40J25J11R9Q8P9P2O7N8N0L8K5J2%qj7k3l1l8m6n5o2o8
1120B6004p4q2r0j00j14j26j39j50j58j64j67j72j77j82j90j97k04k10k14k20k26k32
$$ y = [28344, 28380, 28402, 28410, 28405, 28388, 28360, 28323, 28278, 28225, 28166, 28101, 28032, 27958, 27879, 27792, 27696, 27588, 27466, 27331, 27185, 27030, 26867, 26696, 26518, 26330, 26131, 25920, 25697, 25464, 25222, 24972, 24715, 24451, 24181, 23908, 23636, 23371, 23122, 22898, 22711, 22575, 22500, 22493, 22557, 22689, 22879, 23111, 23370, 23636, 23896, 24137, 24353, 24539, 24694, 24813, 24896, 24939, 24938, 24890, 24794, 24650, 24458, 24223, 23948, 23637, 23296, 22935, 22569, 22217, 21905, 21663, 21520, 21499, 21611, 21854, 22208, 22647, 23134, 23635, 24122, 24573, 24975, 25323, 25615, 25856, 26049, 26201, 26316, 26399, 26454, 26484, 26491, 26475, 26438, 26381, 26306, 26213, 26104, 25978, 25836, 25678, 25505, 25318, 25118, 24905, 24681, 24445, 24200, 23946, 23684, 23417, 23148, 22882, 22623, 22378, 22155, 21960, 21800, 21678, 21599, 21566, 21581, 21643, 21753, 21909, 22107, 22341, 22601, 22879, 23165, 23450, 23727, 23991, 24239, 24470, 24684, 24883, 25066, 25234, 25388, 25528, 25653, 25764, 25863, 25951, 26030, 26102, 26169, 26227, 26277, 26315, 26340, 26352, 26352, 26344, 26327, 26304, 26273, 26235, 26189, 26134, 26072, 26004, 25930, 25848, 25758, 25658, 25544, 25418, 25279, 25129, 24971, 24807, 24640, 24468, 24291, 24109, 23919, 23722, 23518, 23308, 23094, 22874, 22648, 22416]
1131B2416k41k52k65k80k96l15l35l57l80m05m32m60m91n22n53n80o06o25o39o45o43
1141.5A3094o32o09n76n32m79m20l55k89k22j58r8m5jL1N2O4O9P4Q6J09J51K10K87
1153I811L75M64N48O17O66O91O96O83O55O21N82N42N05M69M35M05L75L47L19K93K66
1163.5B0365K41K16J93J70J44J19Q9N7K3j4n4r8j46k00k60l28m03m83n70o59p49q32
1174.5A6821r03r49r64r35q58p34n64l59j31J06L36N47P27Q68R65J019J032J012R68
1184A8004R05Q34P58O83O11N42M80M23L73L29K91K57K30K06J84J64J45J28J13R9Q7
1194.5B5846P9P1O5N8N2M5L9L3K9K4K0J8J7TK0K4K7K9L1L0TK9TL2L3L5TL2K9K3K0J9
1210.5B6920K0K4K7K9TK4J8J2PLJ%jlprj2j3j5j6k0k6l2l8m5m8m9Tm6Tm8n0n4n9o2
$$ y = [22416, 22175, 21923, 21658, 21378, 21082, 20767, 20432, 20075, 19695, 19290, 18858, 18398, 17907, 17385, 16832, 16252, 15646, 15021, 14382, 13737, 13094, 12462, 11853, 11277, 10745, 10266, 9846, 9491, 9202, 8980, 8822, 8724, 8679, 8678, 8709, 8761, 8825, 8894, 8968, 9054, 9163, 9314, 9524, 9811, 10186, 10650, 11198, 11815, 12481, 13172, 13868, 14551, 15206, 15827, 16409, 16951, 17456, 17925, 18360, 18765, 19140, 19487, 19806, 20099, 20365, 20606, 20822, 21015, 21185, 21329, 21448, 21537, 21594, 21617, 21603, 21549, 21451, 21305, 21105, 20845, 20517, 20114, 19631, 19061, 18402, 17653, 16821, 15918, 14969, 14005, 13070, 12212, 11478, 10914, 10555, 10424, 10530, 10866, 11413, 12140, 13008, 13973, 14992, 16024, 17036, 18004, 18909, 19743, 20501, 21184, 21795, 22337, 22817, 23240, 23613, 23942, 24233, 24490, 24720, 24926, 25110, 25274, 25419, 25547, 25660, 25759, 25846, 25925, 25996, 26061, 26119, 26171, 26216, 26255, 26288, 26317, 26341, 26361, 26379, 26396, 26413, 26433, 26457, 26484, 26513, 26544, 26574, 26604, 26633, 26662, 26694, 26727, 26762, 26797, 26829, 26858, 26881, 26901, 26920, 26940, 26964, 26991, 27020, 27049, 27073, 27091, 27103, 27110, 27113, 27114, 27114, 27113, 27110, 27103, 27094, 27082, 27069, 27054, 27038, 27018, 26992, 26960, 26922, 26877, 26829, 26780, 26731, 26685, 26639, 26591, 26541, 26487, 26428, 26366]
1228B6366o7p1p4p9q5q9r5j02j08j16j22j29j34j37j39j41j45j53j64j79j96k15k33
1239.5B3393k48k61k74k88l01l19l36l58l79m02m29m56m89n22n59n98o36o73p10p43
1249.5A4412p73p99q17q29q27q16p90p51p00o38n65m86m01l15k26j38m9M1J31K23L14
1260E201M00M76N41N88O16O25O14N85N39M81M16L45K75K07J46Q9M1lm0p0r5j13j27
1271.5A1737j36j42j48j52j56j57j55j51j44j36j27j17j03q6o3l6lL4P4J16J59K05
1282.5A0313K50K95L39L78M15M43M66M83M92M94M89M77M58M33M05L74L41L07K75K41
1292.5A8168K07J73J39J05P2M1J5j1l3n5p8j02j29j57j88k18k47k77l05l31l57l82
1303.5A6050m07m32m57m81n03n23n39n51n58n60n57n51n40n27n11m92m71m46m19l89
$$ y = [26366, 26299, 26228, 26154, 26075, 25990, 25901, 25806, 25704, 25596, 25480, 25358, 25229, 25095, 24958, 24819, 24678, 24533, 24380, 24216, 24037, 23841, 23626, 23393, 23145, 22884, 22610, 22322, 22021, 21702, 21366, 21008, 20629, 20227, 19798, 19342, 18853, 18331, 17772, 17174, 16538, 15865, 15155, 14412, 13639, 12840, 12023, 11194, 10367, 9551, 8761, 8010, 7310, 6672, 6107, 5621, 5220, 4905, 4679, 4541, 4492, 4533, 4664, 4887, 5201, 5601, 6077, 6618, 7206, 7822, 8447, 9061, 9646, 10185, 10666, 11082, 11427, 11702, 11909, 12055, 12144, 12185, 12182, 12142, 12072, 11977, 11864, 11737, 11601, 11459, 11311, 11159, 11003, 10846, 10691, 10540, 10396, 10260, 10133, 10016, 9913, 9827, 9764, 9728, 9725, 9759, 9833, 9949, 10108, 10313, 10563, 10858, 11197, 11575, 11990, 12433, 12899, 13382, 13874, 14368, 14857, 15334, 15792, 16225, 16630, 17004, 17345, 17652, 17927, 18168, 18375, 18548, 18687, 18792, 18864, 18905, 18920, 18909, 18876, 18821, 18743, 18641, 18512, 18355, 18167, 17949, 17702, 17425, 17120, 16789, 16432, 16050, 15643, 15211, 14754, 14273, 13770, 13247, 12708, 12157, 11599, 11039, 10482, 9931, 9391, 8864, 8353, 7861, 7390, 6944, 6525, 6136]
1313.5F136l58l27k97k69k43k20j98j76j54j31j07q1n7l0nK3N2Q4J17J53J92K34K78
1325D616L25L75M28M83N37N90O36O72O95P04O97O75O41N99N49M95M41L87L37K96K62
1335.5A5440K38K23K15K17K30K55K93L40L89M30M57M61M48M19L84L50L19K94K71K47
1345.5B1920K22J94J65J37J13R3P6O4N4M5L7K9K1J5J4J9L1M8O5P7Q2P9O9N6M1K1%k8
1359.5B3759n8q9j10j19j08q1m8j6Jol3q1j38j95k46k85l12l31l44l54l67l83m01m18
1371.5A9237m26m22l99l55k96k27j62j09p4n9o1p3q9r9j04r7p9m8lO0J36K23L10L86
1383.5A7170M42M73M82M76M68M67M72M79M80M65M32L85L32K76K25J74J25P5L2N%J7
1394.5B3952M7P9R6R3P4N0L3TN0P7J00J11J01P1K8j7n6p8q1o7m0j2PJ2jk5n5q4j06
$$ y = [6136, 5778, 5451, 5154, 4885, 4642, 4422, 4224, 4048, 3894, 3763, 3656, 3575, 3518, 3488, 3483, 3506, 3558, 3642, 3759, 3912, 4104, 4338, 4616, 4941, 5316, 5744, 6227, 6764, 7354, 7990, 8662, 9357, 10061, 10758, 11433, 12074, 12673, 13222, 13717, 14158, 14545, 14882, 15178, 15440, 15678, 15901, 16116, 16333, 16563, 16818, 17111, 17451, 17840, 18270, 18727, 19188, 19636, 20055, 20439, 20789, 21108, 21402, 21673, 21920, 22142, 22336, 22501, 22638, 22751, 22844, 22920, 22984, 23038, 23083, 23120, 23149, 23170, 23185, 23199, 23218, 23249, 23297, 23362, 23439, 23521, 23600, 23669, 23725, 23766, 23787, 23787, 23759, 23701, 23612, 23502, 23383, 23275, 23194, 23146, 23130, 23131, 23125, 23092, 23011, 22873, 22678, 22432, 22147, 21835, 21504, 21160, 20806, 20439, 20056, 19655, 19237, 18811, 18389, 17990, 17635, 17339, 17112, 16950, 16841, 16767, 16708, 16647, 16574, 16485, 16386, 16282, 16185, 16106, 16058, 16055, 16115, 16251, 16474, 16784, 17170, 17612, 18085, 18567, 19043, 19511, 19978, 20450, 20929, 21409, 21874, 22306, 22691, 23023, 23299, 23524, 23698, 23823, 23898, 23930, 23935, 23935, 23952, 23999, 24078, 24174, 24267, 24341, 24391, 24424, 24457, 24507, 24584, 24684, 24795, 24896, 24967, 24995, 24978, 24922, 24844, 24763, 24696, 24656, 24644, 24651, 24663, 24662, 24637, 24582, 24498, 24392]
1409B4392j21j27j31Uj34j39j51j67j88k11k35k62k89l18l45l62l63l42l01k50k06
1420A9488j87k01k47l13l80m31m57m61m49m38m32m40m52m65m66m50m13l57k85j98j04
1430.5A1862lJ00J99K90L63M19M54M75M89N03N20N40N52N49N21M67L93L07K22J43P3
1441A9438J1m7j05j61k18k72l25l74m19m52m68m63m35l88l32k74k20j75j38j05p4m8
1452A3956k6qOJ9M0P0J16J73K39L07L69M17M44M47M25L76L07K21J24K6o8j48k06k39
1464A7387k44k27j99j67j42j27j24j34j56j89k35k93l57m16m61m84m88m77m66m64m75
1474.5A1062m97n19n30n21m93m46l87l21k49j72r2nQ1J64K34K87L17L22L05K69K19
1485I028J61R9L5k9r1j45j89k18k32k34k31k29k36k55k81l13l42l66l79l85l81l73
$$ y = [24392, 24271, 24144, 24013, 23882, 23751, 23617, 23478, 23327, 23160, 22972, 22761, 22526, 22264, 21975, 21657, 21312, 20950, 20587, 20245, 19944, 19694, 19488, 19301, 19100, 18853, 18540, 18160, 17729, 17272, 16811, 16362, 15924, 15492, 15052, 14600, 14135, 13669, 13219, 12806, 12449, 12164, 11966, 11862, 11859, 11959, 12158, 12448, 12811, 13230, 13684, 14159, 14648, 15151, 15671, 16211, 16763, 17312, 17833, 18300, 18693, 19000, 19222, 19365, 19438, 19449, 19402, 19297, 19136, 18918, 18646, 18321, 17947, 17528, 17076, 16608, 16145, 15710, 15322, 14990, 14716, 14496, 14321, 14183, 14078, 14004, 13956, 13930, 13922, 13928, 13947, 13987, 14057, 14173, 14346, 14585, 14892, 15261, 15678, 16122, 16569, 16994, 17370, 17677, 17898, 18022, 18048, 17980, 17832, 17626, 17387, 17143, 16916, 16717, 16550, 16408, 16281, 16157, 16023, 15867, 15678, 15443, 15150, 14793, 14377, 13916, 13432, 12944, 12467, 12001, 11537, 11062, 10565, 10046, 9516, 8995, 8502, 8056, 7669, 7348, 7099, 6927, 6835, 6830, 6911, 7075, 7309, 7596, 7913, 8235, 8540, 8809, 9028, 9189, 9288, 9323, 9294, 9203, 9058, 8869, 8651, 8419, 8185, 7954, 7725, 7489, 7234, 6953, 6640, 6298, 5932, 5553, 5168, 4787, 4414]
1496D414l59l44l26l07k86k64k42k18j96j73j52j32j13r6p8o2m8l5k3j3kRJ7K3K8K7
1509A049K9L0L8N0O9R2J18J44J70J96K27K61L02L48L94M36M66M82M84M82M81M91N14
1520.5G353N48N84O10O21O15N94N71N48N31N21N15N10N06M99M93M81M59M26L78L20
1530.5A7683K60K10J75J68J83K20K65L02L13K86K17J14nj07j68j73j19k5Q5J80K45
1541B0309K69K60K32J98J76J71J86K15K42K56K41J92J15L0m1p8p5m0KK9K1j9p7j29
1553B2685j56j55j42j37j67k38l36m30m80m54l40j56O2K67M16M82M65L81K62J45N4
1563.5B2028Mj0lPkl4q5j41j81j90j65j16n6rJ4Ol0q7j58k31l01l58l94m02l83l46
1576.5A8377l05k77k78l12l72m49n27n91o36o57o50o19n63m87l97l05k21j58j18j06
$$ y = [4414, 4055, 3711, 3385, 3078, 2792, 2528, 2286, 2068, 1872, 1699, 1547, 1415, 1302, 1206, 1128, 1066, 1018, 983, 960, 947, 945, 954, 971, 994, 1022, 1049, 1078, 1108, 1146, 1196, 1265, 1357, 1475, 1619, 1789, 1985, 2212, 2473, 2775, 3123, 3517, 3953, 4419, 4901, 5385, 5867, 6348, 6839, 7353, 7901, 8485, 9095, 9716, 10331, 10925, 11496, 12044, 12575, 13096, 13611, 14121, 14627, 15126, 15619, 16100, 16559, 16985, 17363, 17683, 17943, 18153, 18328, 18496, 18679, 18899, 19164, 19466, 19779, 20065, 20282, 20396, 20391, 20284, 20116, 19943, 19824, 19799, 19884, 20064, 20309, 20578, 20838, 21070, 21268, 21444, 21615, 21801, 22016, 22258, 22514, 22755, 22947, 23062, 23092, 23051, 22973, 22898, 22858, 22860, 22889, 22910, 22891, 22814, 22685, 22529, 22374, 22232, 22095, 21928, 21690, 21354, 20924, 20444, 19990, 19650, 19494, 19556, 19823, 20239, 20721, 21186, 21567, 21829, 21974, 22028, 22032, 22022, 22019, 22026, 22024, 21990, 21905, 21764, 21583, 21393, 21228, 21112, 21056, 21047, 21061, 21067, 21037, 20950, 20792, 20561, 20260, 19902, 19508, 19106, 18723, 18377, 18072, 17795, 17517, 17205, 16833, 16384, 15857, 15266, 14630, 13973, 13323, 12704, 12141, 11654, 11257, 10952, 10731, 10573, 10455, 10349]
1586.5A0349j18j51j99k53l13l70m19m60m88n06n13Tn06m92m73m50m21l89l56l19k82
1597B358k46k11j79j50j24j02q1o4m9l5k3j3mLJ0J7K3L1M0N3P3R9J30J63K00K35K70
1610.5B424L03L33L63L86M04M14M20M26M39M59M92N28N66N95O12O17O10N94N73N49
1620.5A2107N24N03M93M97N14N39N60N68N52N17M71M28L98L87TL91L88L73L48L17K82
1631B1544K41J92J31O3Jl8m2kP1J59K40K98L21L13K83K41J99J61J33J09Q8O6L6mn3
1643.5B4751j09j58j89j92j58r4qQ1J55J95J87J26K2j07k28l08l20k53j17N5K26L55
1654.5B3912M21M20L70K95K19J57J13Q0M7J3k5n5p3o8m3jM5Q6J09J10Q6L9k3q8j43
1667B6003j77j79j52r8l4K9P7J03J05Q4M7Kl7o2o0l2J6O6R7R4N5po6j03j08r4q4j04
$$ y = [10349, 10231, 10080, 9881, 9628, 9315, 8945, 8526, 8066, 7578, 7072, 6559, 6046, 5540, 5048, 4575, 4125, 3704, 3315, 2959, 2640, 2358, 2112, 1901, 1722, 1572, 1448, 1346, 1265, 1201, 1152, 1117, 1094, 1081, 1077, 1080, 1090, 1107, 1130, 1161, 1201, 1254, 1327, 1426, 1556, 1719, 1919, 2154, 2424, 2727, 3060, 3423, 3809, 4213, 4627, 5047, 5473, 5912, 6371, 6863, 7391, 7957, 8552, 9164, 9781, 10391, 10985, 11558, 12107, 12631, 13134, 13627, 14124, 14638, 15177, 15737, 16305, 16857, 17374, 17845, 18273, 18671, 19058, 19445, 19836, 20224, 20597, 20945, 21262, 21544, 21785, 21977, 22108, 22171, 22172, 22134, 22092, 22090, 22161, 22320, 22560, 22858, 23179, 23492, 23775, 24016, 24215, 24376, 24509, 24618, 24706, 24772, 24808, 24804, 24751, 24642, 24484, 24295, 24103, 23945, 23851, 23843, 23924, 24079, 24274, 24461, 24587, 24609, 24502, 24274, 23966, 23646, 23393, 23276, 23331, 23557, 23912, 24333, 24753, 25123, 25418, 25637, 25794, 25907, 25987, 26034, 26047, 26022, 25967, 25894, 25826, 25783, 25782, 25827, 25913, 26022, 26132, 26218, 26257, 26234, 26146, 26003, 25826, 25647, 25495, 25397, 25363, 25392, 25469, 25572, 25677, 25761, 25808, 25810, 25773, 25711, 25651, 25619, 25635, 25701, 25798, 25892, 25947, 25940, 25874, 25771, 25663, 25569, 25485, 25381]
1681B5381j63k43l12l25k56j12P5K55L74M11L68K76J78J04P2P4R4J13J20J11Q9N4M
1692.5B6742o0j28j90k20k06j46o2J9O0M6j1p9j21j02k2R9K20L02L21K81K01J14M5
1704B7103J0J3M2Q4J24J50J58J44J18Q7O0M1K9J4rm6q9j28j52j59j50j36j26j16r9
1716.5B6967n9J0J05K06K86L23L06K47J65Q9L9K1K5M2N8O4O1N1L3Ok8o8j03j23j24
1729B8599j07r0q8j16j68k28k63k44j61k7J25K52L19L12K41J36L4l8o1m4lL9O2N6L0
1741.5B8567ol5m3l1j0RTj0m5p9r9j00q3n6l1j2NK4N0Q3J15J36J32J02N3on9r1r6p7
1756.5B8316m1mK1K4Kl2o6q2p2l7J3O6J03J19J10P9L7rm8p0p4o1m3k9l2n2q3j08j11
1771B7836p9j9N4J22J65J78J66J44J20J03Q9P4N1K2qk7k8j0K1N2P3P7O5M2K3J2J6K8
$$ y = [25381, 25218, 24975, 24663, 24338, 24082, 23970, 24045, 24300, 24674, 25085, 25453, 25729, 25907, 26011, 26083, 26157, 26251, 26364, 26484, 26595, 26684, 26738, 26742, 26682, 26554, 26364, 26144, 25938, 25792, 25730, 25749, 25809, 25855, 25844, 25765, 25644, 25542, 25520, 25619, 25839, 26141, 26462, 26743, 26944, 27058, 27103, 27113, 27126, 27168, 27252, 27376, 27526, 27684, 27828, 27946, 28033, 28093, 28134, 28163, 28177, 28168, 28122, 28033, 27905, 27753, 27594, 27444, 27308, 27182, 27066, 26967, 26908, 26918, 27023, 27229, 27515, 27838, 28144, 28391, 28556, 28645, 28684, 28705, 28730, 28772, 28830, 28894, 28955, 29006, 29039, 29045, 29017, 28949, 28846, 28723, 28599, 28492, 28402, 28314, 28198, 28030, 27802, 27539, 27295, 27134, 27107, 27232, 27484, 27803, 28115, 28356, 28492, 28526, 28488, 28427, 28383, 28380, 28419, 28481, 28537, 28567, 28561, 28526, 28483, 28452, 28442, 28451, 28460, 28450, 28405, 28326, 28227, 28127, 28044, 27988, 27957, 27945, 27950, 27974, 28024, 28107, 28222, 28358, 28490, 28592, 28645, 28639, 28580, 28489, 28393, 28316, 28275, 28271, 28292, 28316, 28318, 28286, 28220, 28138, 28066, 28029, 28042, 28108, 28211, 28330, 28440, 28519, 28556, 28547, 28499, 28429, 28355, 28294, 28251, 28222, 28190, 28138, 28055, 27947, 27836, 27757, 27738, 27792, 27914, 28079, 28257, 28423, 28567, 28687, 28790, 28879, 28953, 29004, 29026, 29018, 28991, 28963, 28953, 28974, 29026, 29099, 29176, 29241, 29283, 29306, 29318, 29334, 29362]
1785B9362M4N4N3M0J6j5m8q4j16j38j45j28q8l3K6P3R6TP7N5L7K9K8K6J5lk4l9m5l8
1800B9183k0JK1L6M7N1M9M0K5Nj8l7n0n8o1o7p2q0q5q3p1n1k7mJ3J9J5Mj4l2m7n5n6
1816.5B8521m9l7k5j6j3j6k4l1l9m4n0n8o7p1o6m7j5J8L9L8J2l2p3r1p6k8L8J04J46
1831B7948J60J45J15Q3N7L9K6J7ROQJ8L0M1M7M2L0J0j3l9o4q4r4q5n9j5L4P7J03J09
1846B8701J00Q8P8TQ4R2TQ5P1N4L9L1K8UK6K0J5QL%lUjJLMPRJ2J3J1Npk2m2o2q3j00
1866B9488j11j12j00p2l0J8O6J02J22J23J10Q6O3M2K9K1J7J5J2QMJjTJMRJ1J3J2PJ
1882B9958qj6k1Tj7j3j0j5k7m5o4p4Tn7l0%K6L8L4J8ql4n1n9n4m1k4r%Kkj2k3l3l8
1899.5B9196m2m0Tl8Tm1m3m8n2n7o2o8p4q1q8r3Tq9p9o4m7l1k3k1k6l4m2m7n0n4o0
$$ y = [29362, 29406, 29460, 29513, 29553, 29569, 29554, 29506, 29422, 29306, 29168, 29023, 28895, 28807, 28774, 28800, 28873, 28969, 29065, 29142, 29197, 29234, 29263, 29291, 29317, 29332, 29329, 29305, 29266, 29221, 29183, 29163, 29164, 29185, 29221, 29268, 29319, 29368, 29408, 29433, 29438, 29420, 29383, 29333, 29275, 29214, 29147, 29075, 28995, 28910, 28827, 28756, 28705, 28678, 28674, 28687, 28706, 28721, 28725, 28711, 28679, 28632, 28577, 28521, 28472, 28435, 28410, 28394, 28381, 28365, 28341, 28310, 28271, 28227, 28177, 28119, 28052, 27981, 27915, 27868, 27853, 27871, 27910, 27948, 27960, 27928, 27855, 27764, 27688, 27660, 27698, 27802, 27948, 28108, 28253, 28368, 28451, 28508, 28547, 28573, 28590, 28599, 28605, 28613, 28631, 28661, 28702, 28749, 28791, 28821, 28831, 28818, 28779, 28715, 28631, 28537, 28452, 28393, 28378, 28412, 28489, 28592, 28701, 28801, 28889, 28967, 29045, 29129, 29221, 29313, 29398, 29469, 29523, 29562, 29593, 29621, 29649, 29677, 29703, 29723, 29738, 29746, 29749, 29749, 29746, 29743, 29740, 29739, 29740, 29743, 29747, 29754, 29763, 29775, 29788, 29799, 29804, 29797, 29775, 29733, 29671, 29588, 29488, 29377, 29265, 29165, 29093, 29063, 29081, 29147, 29249, 29371, 29494, 29604, 29690, 29753, 29795, 29824, 29845, 29862, 29877, 29889, 29897, 29901, 29902, 29901, 29900, 29901, 29905, 29914, 29925, 29938, 29950, 29957, 29958, 29950, 29934, 29913, 29892, 29875, 29862, 29852, 29837, 29810, 29765, 29701, 29627, 29553, 29496, 29466, 29466, 29492, 29530, 29564, 29582, 29574, 29540, 29489, 29430, 29376, 29335, 29311, 29302, 29302, 29304, 29302, 29290, 29267, 29234, 29196, 29154, 29114, 29074, 29036, 28998, 28957, 28914, 28866, 28814, 28757, 28695, 28627, 28553, 28472, 28384, 28291, 28198, 28109, 28030, 27966, 27919, 27888, 27865, 27844, 27818, 27784, 27742, 27695, 27645, 27591, 27531]
1915B7531o9q0q4p7n7k4J0L6M6L6J4j2k6k2%L6P3J01J13J09R3P4N7M7M4M6M8M7M1L6
1930B8187K8K4K3K5L0L4L7M0TL7L3K8K3UK4K2J6Jj7l4m1l4j3K0N2P6Q8Q6P5O4N7N5
1946.5B9132N7TN5M9M0L2K7K5TK6K3K0J7J3TJ4J6J9K0K1J9J8J7J6J4J1J0POPJ0J3J4
1963B9863J1Jj2k5l5l6k5nJ7L8N2N5M9L8K6J5QMLTNULKkorj1j2Tj3j4Wj5j3j2rmjk
1985B9874nj1j7j9j7j0mkoj6k6l0k3oJ6L9N4N8N2M2K9K2J6J4UJ2J3J2J1J0QNLKTNO
2004C0141PMJmorqomjKMTLK%Tlpj4k2l1l7l6k9j6%J5K5L0K7K1J5J0QRJ1J4J6TJ7J6
2025C0185J5J7TJ8J7J6J2RNLKMOTNMKjkV%J%jnrj3j5Tj1mLQJ1RNKklUmoTpm%MRJ2TR
2052C0308PL%lTkT%J%JkmnonljTlqj3j8k0j8j3nKRJ2J1RLkoqrqTnmTkljkjkmnqrTp
$$ y = [27531, 27462, 27382, 27298, 27221, 27164, 27140, 27150, 27186, 27232, 27268, 27282, 27270, 27244, 27222, 27222, 27258, 27331, 27432, 27545, 27654, 27747, 27821, 27878, 27925, 27969, 28015, 28063, 28110, 28151, 28187, 28215, 28239, 28262, 28287, 28317, 28351, 28388, 28428, 28468, 28505, 28538, 28566, 28589, 28612, 28635, 28659, 28681, 28697, 28698, 28681, 28647, 28606, 28572, 28559, 28579, 28631, 28707, 28795, 28881, 28956, 29020, 29077, 29132, 29189, 29246, 29301, 29350, 29390, 29422, 29449, 29474, 29499, 29525, 29548, 29568, 29585, 29598, 29611, 29625, 29641, 29660, 29680, 29701, 29720, 29738, 29755, 29771, 29785, 29796, 29806, 29813, 29819, 29826, 29836, 29849, 29863, 29874, 29875, 29863, 29838, 29803, 29767, 29742, 29737, 29754, 29792, 29844, 29899, 29948, 29986, 30012, 30027, 30035, 30039, 30042, 30045, 30050, 30055, 30060, 30063, 30065, 30063, 30057, 30048, 30037, 30025, 30013, 30000, 29986, 29972, 29958, 29944, 29930, 29915, 29902, 29890, 29881, 29877, 29876, 29874, 29869, 29858, 29841, 29822, 29805, 29795, 29791, 29789, 29783, 29767, 29741, 29711, 29688, 29682, 29698, 29737, 29791, 29849, 29901, 29943, 29972, 29994, 30010, 30024, 30038, 30052, 30064, 30077, 30089, 30100, 30110, 30118, 30123, 30126, 30128, 30130, 30135, 30141, 30148, 30152, 30153, 30149, 30143, 30134, 30126, 30120, 30116, 30115, 30117, 30121, 30125, 30128, 30130, 30130, 30130, 30127, 30120, 30106, 30084, 30053, 30016, 29980, 29951, 29935, 29935, 29950, 29975, 30005, 30032, 30053, 30068, 30078, 30086, 30095, 30106, 30120, 30136, 30152, 30169, 30185, 30200, 30217, 30234, 30252, 30269, 30285, 30297, 30306, 30311, 30314, 30316, 30320, 30326, 30332, 30337, 30341, 30343, 30342, 30340, 30338, 30336, 30334, 30334, 30335, 30335, 30334, 30329, 30320, 30307, 30292, 30277, 30266, 30262, 30265, 30273, 30284, 30293, 30298, 30300, 30298, 30295, 30292, 30289, 30285, 30279, 30273, 30266, 30262, 30262, 30266, 30275, 30287, 30299, 30308, 30315, 30318, 30318, 30315, 30312, 30310, 30308, 30308, 30309, 30309, 30310, 30308, 30304, 30299, 30293, 30288, 30285, 30284, 30283, 30280, 30272, 30259, 30241, 30221, 30203, 30190, 30185, 30187, 30196, 30208, 30219, 30228, 30231, 30229, 30223, 30215, 30206, 30198, 30190, 30185, 30181, 30177, 30175, 30172, 30171, 30169, 30168, 30166, 30162, 30157, 30149, 30140, 30131, 30124]
2079C0124m%KMNLTKLNONMjmqj0rpkKOJ0J1J2TJ0QOMTLKLJU%KMOPOMKjmUk%KMNULK%
2108.5C0259jT%JU%lnoTnkjJTLTMNOMKjklj%JKJloqrTpnlklklkjklmprj0rqnj%KJUj
2139C0141%UjlmopUnmk%JKLVMLMLVNPJ0J2J4J3TJ1RQWRUQTOKjmTkJNPOLknqTonmTp
2172C0280qrTpmTnpj0Tj1rnkjJjTlkjJLNMTKJ%j%TKTMVNMTJjlprUpomnmnpVomk%LN
2204C0124OQTPTOLJkmomkJORJ0RQOMTLMNWMTLKjkmlk%KMNTMKT%jTkTj%KMULKT%KJK
2236C0285KJT%Vklnpqpnlj%jknoqTpnUoprj0UrqpXonlkJKMOPONKloj0j2j1rolkUmVl
2270.5C0017mnTomTk%Tj%JTLMVKTJjTkU%MPRJ0RPNMLUMLMKT%jlUj%LTNML%klnTmlTm
2302.5C0061moqTonjMPJ2J5TJ6J3J0QNORJ3K0K8L4L8M0L9L7L5L2L1K8K7UK9L1L3L4
$$ y = [30124, 30120, 30120, 30122, 30126, 30131, 30134, 30137, 30139, 30142, 30147, 30153, 30158, 30162, 30161, 30157, 30149, 30139, 30130, 30123, 30121, 30123, 30129, 30139, 30150, 30162, 30174, 30184, 30192, 30198, 30202, 30206, 30209, 30211, 30214, 30215, 30216, 30217, 30217, 30219, 30223, 30229, 30236, 30242, 30246, 30248, 30247, 30243, 30239, 30235, 30233, 30233, 30235, 30239, 30244, 30249, 30254, 30257, 30259, 30259, 30258, 30257, 30257, 30258, 30259, 30260, 30260, 30257, 30252, 30246, 30240, 30235, 30233, 30232, 30233, 30234, 30237, 30240, 30244, 30249, 30255, 30259, 30261, 30260, 30258, 30255, 30254, 30254, 30255, 30257, 30258, 30255, 30249, 30241, 30232, 30223, 30216, 30211, 30208, 30206, 30203, 30201, 30198, 30196, 30195, 30193, 30190, 30186, 30179, 30170, 30160, 30151, 30143, 30138, 30137, 30137, 30139, 30140, 30141, 30142, 30141, 30141, 30141, 30141, 30140, 30137, 30133, 30127, 30120, 30113, 30106, 30101, 30097, 30095, 30095, 30096, 30098, 30101, 30104, 30107, 30110, 30114, 30117, 30121, 30124, 30127, 30130, 30133, 30138, 30145, 30155, 30167, 30181, 30194, 30207, 30218, 30227, 30235, 30243, 30251, 30259, 30267, 30276, 30285, 30294, 30302, 30310, 30316, 30318, 30317, 30313, 30309, 30307, 30308, 30313, 30320, 30326, 30329, 30327, 30322, 30314, 30306, 30300, 30295, 30291, 30287, 30280, 30272, 30263, 30254, 30247, 30243, 30239, 30234, 30227, 30217, 30207, 30196, 30187, 30182, 30180, 30179, 30180, 30179, 30178, 30175, 30173, 30172, 30173, 30176, 30181, 30185, 30189, 30191, 30192, 30192, 30191, 30191, 30191, 30193, 30195, 30199, 30203, 30207, 30211, 30216, 30220, 30224, 30225, 30224, 30221, 30214, 30205, 30196, 30187, 30180, 30174, 30170, 30165, 30161, 30156, 30149, 30142, 30135, 30128, 30122, 30118, 30116, 30116, 30119, 30124, 30130, 30138, 30146, 30153, 30160, 30166, 30169, 30170, 30168, 30164, 30158, 30154, 30152, 30153, 30159, 30168, 30178, 30187, 30195, 30201, 30205, 30209, 30212, 30216, 30221, 30226, 30231, 30236, 30241, 30245, 30249, 30252, 30254, 30253, 30251, 30247, 30244, 30242, 30242, 30244, 30248, 30253, 30258, 30262, 30264, 30266, 30266, 30265, 30264, 30262, 30260, 30259, 30259, 30261, 30265, 30269, 30273, 30276, 30278, 30280, 30280, 30282, 30283, 30285, 30287, 30288, 30289, 30289, 30289, 30289, 30289, 30287, 30284, 30279, 30272, 30264, 30257, 30252, 30249, 30248, 30248, 30247, 30245, 30240, 30234, 30226, 30218, 30211, 30206, 30201, 30196, 30190, 30183, 30174, 30164, 30154, 30144, 30135, 30127, 30120, 30113, 30106, 30099, 30092, 30085, 30079, 30074, 30071, 30069, 30070, 30072, 30076, 30082, 30089, 30095, 30100, 30102, 30099, 30093, 30083, 30071, 30060, 30051, 30045, 30042, 30040, 30038, 30036, 30032, 30028, 30024, 30020, 30017, 30013, 30008, 30003, 29997, 29993, 29989, 29987, 29987, 29987, 29986, 29986, 29987, 29988, 29991, 29995, 29999, 30003, 30007, 30009, 30011, 30012, 30011, 30010, 30008, 30006, 30004, 30004, 30008, 30015, 30024, 30034, 30043, 30050, 30055, 30059, 30062, 30065, 30068, 30072, 30075, 30079, 30081, 30083, 30083, 30082, 30079, 30076, 30073, 30072, 30072, 30075, 30078, 30083, 30087, 30090, 30090, 30088, 30085, 30080, 30075, 30071, 30068, 30065, 30061, 30057, 30051, 30043, 30035, 30029, 30024, 30023, 30027, 30034, 30046, 30061, 30076, 30092, 30105, 30115, 30123, 30128, 30134, 30143, 30156, 30176, 30204, 30238, 30276, 30316, 30355, 30392, 30427, 30459, 30490, 30518, 30545, 30572, 30599, 30628, 30659, 30692, 30726]
2321.5C0726L2K9K4J8J2QOLKTNPJ3J6J9J7Rjj2k0k3j9j0JRJ5J4J1J0J1J8K8L8M5M6
2339C1109M1L0J9J1NMNOMlj2k5m0n3o3o6o0m6k3ML0N4P2Q3Q6Q5Q2P7P3P0O8O7O5O0
2356C1819N5M7L6K5J4Mlprj0Tj4k2l2m4n4o1n9n4m3l3k4k1k2k9l9m8n6o2o6o5o3o0
2372.5C0990n8Uo1o2o1n8n0m2l4k8k7l0l6m1m6m7m6m1l6l0k5k2j9j7j6j3j2j0qoTn
2389B9881orj1j4Uj2qnToqj2j4Tj5j4j3Tj5Uj7Tj8k0k2k3k6k7k6k5k1j8j5j4Tj6j7
2408.5B9293j8Tj6j3rojKORJ1J2TJ1QPTQJ1J4J5TJ2RN%jkTjJKMNONM%morpmjKNLKj
2433B9387klkJMRJ1J3J6TJ7J8J7TJ6J7J5TJ4J3J2UJ1URTPQTJ0J1TJ0ROLJ%VjlnqrTq
2458B9737omj%TjknTopVoUmTnmUk%LV%jlmTlkTjUJ%JU%jlTmkT%jTlmTk%LTMKjlpUo
$$ y = [30726, 30758, 30787, 30811, 30829, 30841, 30849, 30855, 30858, 30860, 30862, 30867, 30874, 30887, 30903, 30922, 30939, 30948, 30947, 30935, 30915, 30892, 30873, 30863, 30864, 30873, 30888, 30902, 30913, 30923, 30934, 30952, 30980, 31018, 31063, 31109, 31150, 31180, 31199, 31210, 31215, 31219, 31224, 31230, 31234, 31231, 31219, 31194, 31154, 31101, 31038, 30972, 30912, 30866, 30843, 30847, 30877, 30931, 31003, 31086, 31172, 31257, 31339, 31416, 31489, 31559, 31627, 31694, 31759, 31819, 31874, 31921, 31957, 31982, 31996, 32000, 31997, 31990, 31981, 31971, 31961, 31947, 31925, 31893, 31849, 31795, 31734, 31675, 31621, 31578, 31545, 31521, 31500, 31478, 31449, 31410, 31362, 31306, 31244, 31178, 31113, 31050, 30990, 30932, 30874, 30816, 30755, 30693, 30632, 30574, 30524, 30482, 30448, 30420, 30393, 30363, 30327, 30286, 30240, 30193, 30147, 30106, 30070, 30040, 30015, 29993, 29974, 29957, 29941, 29928, 29916, 29906, 29898, 29892, 29886, 29881, 29875, 29866, 29855, 29841, 29827, 29813, 29801, 29793, 29788, 29783, 29777, 29769, 29757, 29743, 29729, 29714, 29700, 29687, 29674, 29659, 29644, 29629, 29612, 29595, 29577, 29557, 29535, 29512, 29486, 29459, 29433, 29408, 29387, 29369, 29354, 29340, 29326, 29310, 29293, 29275, 29257, 29241, 29228, 29219, 29213, 29212, 29214, 29220, 29229, 29240, 29252, 29264, 29275, 29283, 29290, 29297, 29305, 29316, 29330, 29345, 29360, 29372, 29381, 29386, 29386, 29385, 29383, 29381, 29380, 29381, 29383, 29387, 29392, 29398, 29403, 29407, 29407, 29403, 29397, 29388, 29381, 29377, 29376, 29378, 29383, 29386, 29388, 29387, 29385, 29382, 29380, 29381, 29385, 29394, 29405, 29418, 29434, 29450, 29467, 29485, 29502, 29519, 29535, 29552, 29567, 29582, 29596, 29609, 29621, 29633, 29645, 29656, 29667, 29678, 29687, 29696, 29703, 29711, 29719, 29729, 29740, 29751, 29761, 29770, 29776, 29779, 29780, 29780, 29780, 29780, 29780, 29779, 29776, 29771, 29763, 29754, 29745, 29737, 29731, 29727, 29726, 29726, 29726, 29725, 29723, 29718, 29713, 29707, 29700, 29693, 29686, 29679, 29673, 29667, 29661, 29657, 29653, 29648, 29644, 29640, 29636, 29634, 29634, 29637, 29640, 29643, 29646, 29646, 29645, 29642, 29638, 29634, 29631, 29629, 29627, 29626, 29625, 29624, 29625, 29625, 29626, 29627, 29628, 29628, 29627, 29624, 29621, 29617, 29615, 29613, 29613, 29612, 29611, 29608, 29604, 29600, 29598, 29598, 29601, 29604, 29608, 29610, 29609, 29606, 29599, 29592, 29585, 29579]
2493B9579nlkUmnpoTnmnpj2j6k0Uj7j2j0pVqUj1j2j5j6j5Tj4j2j1j3Tj4j5Tj4j2j1
2516B9109j0qUrqrqTponUmTnmUnTopqpTnTlTmTnljKMONKjlnm%LOQTPNK%lklTkTmnr
2547.5B8914j1j3j5j4Uj2j3Tj4j5j8k0k2k3k5Tk6k5Tk6k7k9l2l4l8m1m4m7m8Tm9Tn0
2564.5B7995m9n1n0n1m9Tm6m3m2l8l7l5l3l0k7k2j8j2qnjKMPJ0J2J5J7J9K1K2K3UK2
2582B7519K0J9J8J9K0TK1TJ9J7J5J2RPNL%jlmTl%MQJ2J5J8J9J8J7J6J5J6J7K0K4K6
2601B7994K8K9TK7K4K2J9TJ7UJ9TK2K4TK5K4K2K1K0K1K3K4K5K6K5TK2K0J8J4J3J0TJ1
2619B8749J3TJ4J2J0ONLTNMNMJkmopTnmkUloqTj0Tj1j2j5j6j7j6j4rmj%Tmqj2j6j7
2642.5B8589j5j3rol%JTjknopolJLNMLjnprqpm%JLK%lmoTmlUoqrj1j0rUj0Tj2j3j4
$$ y = [29579, 29574, 29571, 29569, 29567, 29565, 29561, 29556, 29549, 29543, 29537, 29532, 29528, 29523, 29516, 29504, 29488, 29468, 29448, 29428, 29411, 29399, 29389, 29382, 29375, 29368, 29361, 29353, 29345, 29337, 29326, 29314, 29299, 29283, 29268, 29253, 29239, 29227, 29216, 29203, 29190, 29176, 29161, 29146, 29132, 29120, 29109, 29099, 29091, 29083, 29075, 29066, 29058, 29049, 29041, 29033, 29026, 29020, 29015, 29010, 29005, 29001, 28997, 28992, 28988, 28984, 28980, 28975, 28970, 28964, 28957, 28949, 28942, 28935, 28930, 28925, 28922, 28919, 28915, 28911, 28906, 28903, 28902, 28904, 28908, 28914, 28919, 28921, 28920, 28917, 28912, 28908, 28908, 28911, 28917, 28925, 28933, 28940, 28945, 28947, 28947, 28944, 28942, 28939, 28936, 28934, 28932, 28928, 28923, 28914, 28903, 28890, 28875, 28861, 28847, 28833, 28821, 28808, 28795, 28781, 28766, 28748, 28728, 28706, 28683, 28658, 28633, 28607, 28582, 28557, 28531, 28504, 28475, 28443, 28409, 28371, 28330, 28286, 28239, 28191, 28143, 28094, 28045, 27995, 27946, 27895, 27845, 27794, 27745, 27696, 27650, 27607, 27565, 27527, 27490, 27455, 27422, 27392, 27365, 27343, 27325, 27313, 27305, 27300, 27299, 27301, 27305, 27312, 27322, 27334, 27349, 27366, 27385, 27406, 27428, 27451, 27474, 27497, 27519, 27539, 27558, 27576, 27595, 27615, 27635, 27656, 27677, 27696, 27713, 27728, 27740, 27749, 27756, 27761, 27764, 27764, 27763, 27760, 27756, 27752, 27749, 27749, 27753, 27761, 27773, 27788, 27806, 27825, 27843, 27860, 27876, 27891, 27907, 27924, 27944, 27968, 27994, 28022, 28051, 28080, 28107, 28131, 28153, 28172, 28191, 28208, 28225, 28242, 28261, 28280, 28302, 28326, 28350, 28375, 28399, 28421, 28442, 28462, 28483, 28506, 28530, 28555, 28581, 28606, 28631, 28653, 28673, 28691, 28705, 28718, 28728, 28738, 28749, 28762, 28775, 28789, 28801, 28811, 28817, 28822, 28825, 28828, 28833, 28837, 28842, 28846, 28847, 28845, 28841, 28835, 28828, 28821, 28816, 28812, 28810, 28808, 28806, 28803, 28797, 28789, 28781, 28771, 28761, 28750, 28738, 28723, 28707, 28690, 28674, 28660, 28651, 28647, 28646, 28646, 28646, 28642, 28634, 28622, 28606, 28589, 28574, 28561, 28552, 28546, 28543, 28543, 28544, 28545, 28544, 28542, 28537, 28531, 28524, 28518, 28515, 28516, 28519, 28524, 28528, 28531, 28530, 28525, 28518, 28509, 28501, 28494, 28490, 28490, 28491, 28494, 28496, 28496, 28493, 28489, 28483, 28477, 28473, 28470, 28467, 28464, 28458, 28450, 28441, 28430, 28420, 28411, 28402, 28393, 28383, 28373, 28361, 28348, 28334]
2669B8334j4Tj6Uj7j5j4j0rqrj3j8k2k6k7Tk6k5k6Tk7k8l0Tl2l3l5l6l4l3k8k5k2k0
2687B7527k0Tk1k0j9j8j6j3j1qnjLMPTRJ0J4J6K0K2K5K6K7K9TK8K6K3K0J7J6TJ8TK0
2705.5B7805J8J7J3J1QNMTNPJ0J2J3J2QL%mopqj1j2j5Tj4j2pnlmorj0rplJMPRTJ0Q
2727.5B7836QOLJkTlmnUoUprj1j6k1k6k9l1l2l1l0k8k7k8l0l2l4l7l8l7Tl5l2k9k4
2747B7119j8j4rnljJLMOPNKknqTpnjJLUJlnj0j4j7k0j9Tj6j4j3j4Tj7j8k0Tk1Uk3k4
2770.5B6709k4Tk3k2Tk3k4k5k8l0l2l4l5l6l4l2k7k4k0j8Tk0k1k2Tj9j8j6Tj7j9k2
2786.5B5942k4k5k8Tl0l2l5l6l9m3m5m8n1n3n6n7o0o3o7p2p7q2q6r1r4r8j00j01j00
2801B4221r7r2q6q1p6p3o9o6o1n6m9m2l8l5l6l9m5n0n7o2o6p2p6q2q8r4r8j02j06j08
$$ y = [28334, 28320, 28306, 28290, 28274, 28258, 28241, 28226, 28212, 28202, 28193, 28185, 28176, 28163, 28145, 28123, 28097, 28070, 28043, 28017, 27992, 27966, 27940, 27913, 27885, 27855, 27825, 27793, 27760, 27725, 27689, 27655, 27622, 27594, 27569, 27547, 27527, 27507, 27487, 27466, 27446, 27427, 27409, 27393, 27380, 27369, 27361, 27356, 27355, 27358, 27362, 27369, 27376, 27385, 27395, 27409, 27425, 27445, 27467, 27492, 27518, 27545, 27574, 27603, 27631, 27657, 27680, 27700, 27717, 27733, 27749, 27767, 27785, 27805, 27823, 27840, 27853, 27864, 27872, 27877, 27881, 27885, 27890, 27897, 27907, 27919, 27932, 27944, 27952, 27955, 27955, 27951, 27945, 27938, 27930, 27919, 27907, 27892, 27877, 27863, 27851, 27844, 27839, 27836, 27832, 27826, 27817, 27807, 27798, 27791, 27788, 27789, 27793, 27800, 27809, 27818, 27828, 27836, 27844, 27850, 27853, 27854, 27852, 27850, 27847, 27843, 27838, 27833, 27828, 27822, 27816, 27810, 27803, 27794, 27783, 27767, 27746, 27720, 27691, 27660, 27628, 27597, 27567, 27539, 27512, 27484, 27454, 27422, 27388, 27351, 27313, 27276, 27239, 27204, 27172, 27143, 27119, 27101, 27087, 27078, 27073, 27070, 27069, 27070, 27073, 27077, 27083, 27090, 27095, 27097, 27095, 27090, 27082, 27074, 27067, 27062, 27061, 27062, 27065, 27068, 27071, 27072, 27069, 27064, 27054, 27040, 27023, 27003, 26984, 26965, 26949, 26935, 26922, 26908, 26894, 26877, 26859, 26839, 26819, 26798, 26777, 26756, 26733, 26709, 26685, 26661, 26638, 26616, 26594, 26571, 26547, 26522, 26494, 26464, 26432, 26398, 26363, 26327, 26293, 26261, 26234, 26210, 26190, 26172, 26154, 26134, 26113, 26091, 26069, 26050, 26032, 26016, 26000, 25983, 25964, 25942, 25918, 25893, 25865, 25837, 25807, 25775, 25740, 25704, 25665, 25622, 25577, 25529, 25478, 25425, 25369, 25312, 25252, 25189, 25122, 25050, 24973, 24891, 24805, 24714, 24620, 24522, 24422, 24321, 24221, 24124, 24032, 23946, 23865, 23789, 23716, 23647, 23581, 23520, 23464, 23415, 23373, 23335, 23300, 23264, 23225, 23180, 23130, 23073, 23011, 22945, 22873, 22797, 22715, 22627, 22533, 22435, 22333, 22227, 22119]
2816B2119j11j13j17j21j25j30j37j42j47j52j55Uj53j51Tj50j52j54j56j55j54j48
2827.5A8835j41j32j22j14j06j01r6r2q9q7q5q3q1q0Tp8Tp7p5p2p1o7o3o0n6n2m9m7
2841.5A6501m5m6m8n2n7o4o9p6p9q3q7r1r5r9j03j07j09Tj07j03r9r2q7q1p6p5p3Up1
2856.5A4072o9o7o6o9p2p7q3q6r0r2r5r8j02j07j13j16j18j20j19j16j13j06r9r1q2
2869A1706p3o4n3m1k7j4JJ5K9M3N6P1Q4R6J07J14J18J19J15J12J05J01R7R4R3UR4UR5
2884.5A3567R5TR6TR5R4TR3R4R3R1Q8Q1P3O5N8N1M8M5TM6M8M9N1N2N3N6N9O2O9P6Q4
2900.5A5862R4J01J09J13J14J13J08J04R6Q9Q3P6O9O2N2M2L0J9Qkj1j9k6l4m4n2o1
2914A7095o8p4q0q5r1r8j08j19j31j43j54j65j73j79j83Uj79j74j66j56j44j28j12
$$ y = [22119, 22008, 21895, 21778, 21657, 21532, 21402, 21265, 21123, 20976, 20824, 20669, 20514, 20359, 20206, 20055, 19904, 19754, 19602, 19448, 19292, 19137, 18983, 18835, 18694, 18562, 18440, 18326, 18220, 18119, 18023, 17931, 17842, 17755, 17670, 17587, 17506, 17426, 17346, 17268, 17190, 17113, 17038, 16966, 16895, 16828, 16765, 16705, 16649, 16597, 16548, 16501, 16456, 16410, 16362, 16310, 16253, 16189, 16120, 16044, 15965, 15882, 15795, 15704, 15609, 15510, 15407, 15300, 15191, 15082, 14975, 14872, 14773, 14681, 14594, 14513, 14437, 14362, 14289, 14216, 14143, 14072, 14003, 13936, 13870, 13801, 13729, 13652, 13569, 13483, 13393, 13301, 13206, 13108, 13006, 12899, 12786, 12670, 12552, 12432, 12313, 12197, 12084, 11978, 11879, 11788, 11706, 11633, 11569, 11516, 11475, 11448, 11434, 11435, 11450, 11479, 11522, 11578, 11649, 11733, 11829, 11936, 12050, 12168, 12287, 12402, 12514, 12619, 12720, 12817, 12911, 13004, 13097, 13190, 13284, 13378, 13472, 13567, 13662, 13757, 13853, 13949, 14044, 14138, 14232, 14325, 14419, 14512, 14603, 14691, 14772, 14845, 14910, 14968, 15019, 15067, 15112, 15157, 15203, 15251, 15300, 15351, 15403, 15456, 15512, 15571, 15633, 15702, 15778, 15862, 15956, 16057, 16166, 16279, 16393, 16506, 16614, 16718, 16814, 16903, 16986, 17062, 17131, 17193, 17245, 17287, 17317, 17336, 17344, 17342, 17331, 17312, 17286, 17252, 17208, 17156, 17095, 17027, 16953, 16873, 16788, 16697, 16599, 16491, 16372, 16241, 16098, 15944, 15779, 15606, 15427, 15244, 15061, 14878, 14699, 14525, 14359, 14203, 14059, 13931, 13819]
2926A3819r1p1m9k7oJ3L0M4N5O4P1P6P9Q1Q3UQ2Q1P9P7P4P3TP5P7Q1Q4Q7Q9TQ8Q6Q2
2943A5714P7P1O1N0L9K5J0mk0l5n2o8q5j02j21j39j58j78j99k21k46k70k94l17l37
2955.5A3201l54l71l86l99m10m18m23m22m17m09l97l84l68l50l28l05k80k54k29k02
2965.5F095j78j52j27j02p9n9m0k3qQK5M5O6Q9J11J33J55J75J95K17K38K61K86L11
2977.5G642L36L60L82M03M19M34M45M53M57M60M59M57M54M49M39M27M11L94L78L64
2987.5A6023L51L39L26L08K89K69K49K30K15K00J88J72J58J43J28J15J02R0P9O4N1
2998B0089L8K6J6P%qj6k7l8m9n9o8p3p5p6p8q0q7r8j11j26j40j54j67j77j89k00k10
3012A7870k19k27k36k42k48k50Tk45k34k20k01j80j58j32j04p3l9lL2O6R7J24J46J65
$$ y = [13819, 13728, 13657, 13608, 13581, 13575, 13588, 13618, 13662, 13717, 13781, 13852, 13928, 14007, 14088, 14171, 14254, 14337, 14419, 14500, 14579, 14656, 14730, 14803, 14876, 14951, 15028, 15109, 15193, 15280, 15369, 15458, 15546, 15632, 15714, 15791, 15862, 15923, 15973, 16012, 16037, 16047, 16043, 16023, 15988, 15936, 15868, 15783, 15681, 15560, 15421, 15263, 15085, 14886, 14665, 14419, 14149, 13855, 13538, 13201, 12847, 12476, 12090, 11691, 11281, 10863, 10440, 10018, 9601, 9192, 8795, 8411, 8043, 7693, 7365, 7060, 6780, 6526, 6297, 6095, 5917, 5765, 5638, 5536, 5457, 5398, 5358, 5335, 5327, 5335, 5360, 5405, 5471, 5560, 5671, 5804, 5959, 6134, 6329, 6546, 6784, 7045, 7331, 7642, 7978, 8338, 8720, 9123, 9542, 9976, 10421, 10874, 11331, 11791, 12250, 12707, 13161, 13610, 14049, 14476, 14887, 15281, 15659, 16023, 16374, 16713, 17039, 17347, 17636, 17905, 18154, 18384, 18599, 18799, 18987, 19159, 19317, 19460, 19588, 19703, 19805, 19895, 19974, 20038, 20089, 20127, 20153, 20169, 20176, 20176, 20168, 20152, 20125, 20087, 20038, 19979, 19911, 19838, 19763, 19687, 19609, 19529, 19442, 19344, 19233, 19107, 18967, 18813, 18646, 18469, 18280, 18080, 17870, 17651, 17424, 17188, 16946, 16698, 16448, 16198, 15953, 15719, 15499, 15298, 15118, 14960, 14828, 14724, 14651, 14612, 14609, 14641, 14707, 14804, 14928, 15074, 15239]
3024A5239J81J94K05K11K14K13K08J99J86J69J52J35J19J06R5Q6P8O8N8M4K9J0rk8
3036A8162m5o1p6r0j03j19j34j49j65j78j91k02k13k23k32k42k48k53k55k53k48k39
3047A4243k28k12j94j71j44j14q0m3lL7P7J16J53J87K18K47K73K95L11L23L28L27L22
3058.5A6268L12K99K84K69K53K37K21K07J95J85J77J69J64J60J56TJ54UJ51J48J41
3069.5B0614J32J21J08R5Q0O5N2L9K7J5Kj1k5l7m8n6o0o3o2To0n5m9l6k3oJ0K4L6M6
3084.5B0813N4O3P1P8Q3Q5Q4P8P1O3N4M7M3M2TM4M6M7M9N2N8O6P7Q7R8J04J08J10J09
3099B2826J08J10J12J14J16J17J15J11J08J05J01R8R5R0Q4P8P0O4N8N5UN7N8O1TO0
3112.5B5142N9N6N5N4N3UN6N7O1O3O4O3O1N6N2M8UM9N0M9M7M3M0L9L8TL7L5L3K8K6
$$ y = [15239, 15420, 15614, 15819, 16030, 16244, 16457, 16665, 16864, 17050, 17219, 17371, 17506, 17625, 17731, 17826, 17912, 17990, 18058, 18116, 18160, 18189, 18199, 18190, 18162, 18117, 18056, 17980, 17890, 17787, 17668, 17534, 17385, 17220, 17042, 16851, 16649, 16436, 16213, 15981, 15739, 15491, 15238, 14983, 14730, 14482, 14243, 14015, 13803, 13609, 13438, 13294, 13180, 13100, 13057, 13054, 13091, 13168, 13284, 13437, 13624, 13842, 14089, 14362, 14657, 14968, 15291, 15619, 15946, 16268, 16580, 16879, 17163, 17432, 17685, 17922, 18143, 18350, 18545, 18730, 18907, 19076, 19240, 19400, 19556, 19712, 19866, 20020, 20174, 20325, 20473, 20614, 20746, 20867, 20975, 21070, 21150, 21215, 21267, 21306, 21333, 21348, 21350, 21339, 21314, 21277, 21229, 21173, 21113, 21050, 20988, 20926, 20866, 20811, 20762, 20726, 20703, 20697, 20707, 20731, 20767, 20813, 20867, 20930, 21001, 21079, 21162, 21247, 21331, 21409, 21480, 21543, 21597, 21644, 21687, 21729, 21771, 21815, 21861, 21908, 21957, 22009, 22067, 22133, 22210, 22297, 22395, 22499, 22607, 22717, 22826, 22934, 23044, 23156, 23270, 23386, 23503, 23618, 23729, 23837, 23942, 24043, 24141, 24236, 24326, 24410, 24488, 24558, 24622, 24680, 24735, 24790, 24845, 24902, 24960, 25021, 25082, 25142, 25201, 25257, 25312, 25366, 25419, 25472, 25525, 25581, 25638, 25699, 25762, 25826, 25889, 25950, 26006, 26058, 26106, 26154, 26202, 26251, 26301, 26350, 26397, 26440, 26480, 26519, 26557, 26595, 26632, 26667, 26700, 26728, 26754]
3129B6754K3K0J8J3J0PTRJ4J9K3K4K2J8J4J2J0RQPNMKMOQJ0ROKjk%LOPTOMLTKUJKM
3152.5B7146PJ0TQMjoj0Tj1j0Tqnl%LK%nqj0j1qolj%JKMNOVPTRUPNMJjkoTnlKORJ0
3180B7162QMkoj0j3Uj1qnjJKTJklmopj0j2j6j9k0j9j6j4j1Uj3j5j4j3qm%LMLTJ%Tj
3203.5B6863klkT%KNPTQTJ1J3J4J5J1OKlkJNJ1J2J1PKlnmkKOJ0J3J2J1QLkoqTonTm
3227B7014nTlkJT%knpqpokj%KTLTMLJjmpqrj0j2Tj3j2j0pl%JKJjklTnTprj1j2j3j5
3253B6791j6j5j6j5j2j0pljLUJjlnoTrj1j6k1k4k5k3j9j4rpoqrj2j3j7j9k2k3k5k4
3273B6329k3k1k0j9j8Tj5j4j2j1j2j3j5j7j9k1k3k4Uk2k0j9j8j9k1k3k5Tk6k5k4Xk5
3292B5554k5Tk6Uk7k8l0l2Tl1Ul0l1l2Tl4Tl5l6l7l6Ul7l9m5n1n6o0n8n2m3l5k8k6
$$ y = [26754, 26777, 26797, 26815, 26828, 26838, 26845, 26852, 26861, 26875, 26894, 26917, 26941, 26963, 26981, 26995, 27007, 27017, 27026, 27034, 27041, 27046, 27050, 27052, 27056, 27062, 27070, 27080, 27089, 27095, 27097, 27096, 27094, 27094, 27097, 27103, 27110, 27117, 27123, 27127, 27130, 27133, 27135, 27137, 27139, 27140, 27142, 27146, 27153, 27163, 27173, 27181, 27185, 27184, 27178, 27168, 27158, 27147, 27137, 27127, 27119, 27114, 27111, 27111, 27114, 27116, 27116, 27111, 27103, 27093, 27082, 27074, 27068, 27065, 27064, 27064, 27065, 27067, 27071, 27076, 27082, 27088, 27094, 27100, 27107, 27114, 27123, 27132, 27141, 27148, 27153, 27157, 27158, 27157, 27155, 27149, 27143, 27138, 27135, 27137, 27143, 27152, 27162, 27170, 27174, 27172, 27166, 27156, 27143, 27130, 27117, 27106, 27098, 27093, 27092, 27093, 27095, 27097, 27098, 27096, 27093, 27089, 27083, 27076, 27066, 27054, 27038, 27019, 26999, 26980, 26964, 26950, 26939, 26928, 26917, 26904, 26889, 26875, 26862, 26854, 26850, 26850, 26853, 26857, 26860, 26863, 26864, 26864, 26864, 26863, 26861, 26858, 26856, 26854, 26854, 26856, 26861, 26868, 26875, 26883, 26891, 26902, 26915, 26929, 26944, 26955, 26961, 26963, 26960, 26958, 26959, 26964, 26975, 26987, 26998, 27005, 27007, 27004, 26999, 26995, 26993, 26995, 27001, 27011, 27024, 27036, 27047, 27055, 27058, 27056, 27050, 27042, 27034, 27028, 27023, 27018, 27014, 27009, 27004, 27001, 26999, 27000, 27001, 27001, 26999, 26994, 26987, 26979, 26972, 26966, 26964, 26963, 26963, 26965, 26967, 26970, 26973, 26977, 26980, 26981, 26980, 26976, 26969, 26961, 26952, 26942, 26930, 26918, 26905, 26893, 26883, 26876, 26873, 26873, 26874, 26876, 26877, 26876, 26874, 26871, 26868, 26863, 26858, 26851, 26842, 26831, 26819, 26806, 26791, 26775, 26760, 26744, 26729, 26717, 26707, 26700, 26697, 26696, 26699, 26702, 26705, 26706, 26705, 26702, 26697, 26691, 26685, 26676, 26665, 26649, 26628, 26604, 26579, 26556, 26537, 26523, 26514, 26507, 26501, 26493, 26484, 26472, 26459, 26442, 26423, 26401, 26378, 26353, 26329, 26306, 26285, 26265, 26246, 26228, 26210, 26195, 26181, 26169, 26158, 26146, 26133, 26118, 26101, 26082, 26061, 26038, 26014, 25990, 25966, 25944, 25924, 25905, 25887, 25868, 25847, 25824, 25799, 25774, 25748, 25723, 25699, 25675, 25651, 25627, 25603, 25579, 25554, 25529, 25504, 25478, 25452, 25426, 25399, 25371, 25341, 25309, 25277, 25246, 25215, 25184, 25154, 25123, 25091, 25059, 25025, 24991, 24956, 24920, 24883, 24847, 24811, 24775, 24738, 24699, 24654, 24603, 24547, 24487, 24429, 24377, 24334, 24299, 24271, 24245]
3310.5B4245k5l0l4l9m2m4Tm3m2Um1m3Tm4m5m6m7m9n0Tn1n0Um9n0Tm9n0Tn1n3n5n6
3328B2646n6n4n0m6m3m1m4m7n2n9o4o8p0o8o6o2n7n2m9m8m9n1n4n9o2o4o5Vo4o2To1
3345B0702n9n8o0o1o4o6o8o9o8o7To6o7o6o7o8Tp0p3p4p7Tp5p1o6o1n8n7n8o2o6o9
3361A8579p3p5p8p9q1q2q3q1q0p9p8p7Up8Tp9q2q6r1r7j03j09j12j17j18j19j20Tj19
3376A5851j20j19j20j21j24j25j29j33j36j41j45j51j54j57j58j55j53j49j47Tj50
3386.5A2917j53j56j57j56j54j52j51j53j55j56j53j49j41j34j27j23j21j19j15j08
3396.5A0084r8q6p3o1n0m3l8l3l0k6k0j2lPJ8K8L7M7N5O2O8P5P8Q3Q7R1R8J04J14J22
3411.5A0685J31J39J44J51J55J61J65J70J74J78J80J81TJ82J87J94K04K15K28K38K44
$$ y = [24245, 24220, 24190, 24156, 24117, 24075, 24031, 23987, 23944, 23902, 23860, 23818, 23777, 23734, 23691, 23647, 23602, 23556, 23509, 23460, 23410, 23360, 23309, 23259, 23209, 23159, 23110, 23060, 23010, 22961, 22911, 22861, 22810, 22757, 22702, 22646, 22590, 22536, 22486, 22440, 22397, 22356, 22312, 22265, 22213, 22154, 22090, 22022, 21952, 21884, 21818, 21756, 21699, 21647, 21598, 21550, 21501, 21450, 21396, 21337, 21275, 21211, 21146, 21081, 21016, 20951, 20887, 20825, 20763, 20702, 20643, 20585, 20525, 20464, 20400, 20334, 20266, 20197, 20129, 20062, 19995, 19929, 19862, 19796, 19729, 19661, 19593, 19523, 19450, 19376, 19299, 19222, 19147, 19076, 19010, 18949, 18891, 18834, 18776, 18714, 18648, 18579, 18506, 18431, 18353, 18274, 18193, 18111, 18028, 17947, 17867, 17788, 17710, 17633, 17556, 17479, 17401, 17323, 17244, 17162, 17076, 16985, 16888, 16785, 16676, 16564, 16447, 16329, 16210, 16090, 15970, 15851, 15731, 15612, 15492, 15371, 15247, 15122, 14993, 14860, 14724, 14583, 14438, 14287, 14133, 13976, 13818, 13663, 13510, 13361, 13214, 13067, 12917, 12764, 12608, 12451, 12295, 12141, 11989, 11838, 11685, 11530, 11374, 11221, 11072, 10931, 10797, 10670, 10547, 10426, 10307, 10192, 10084, 9986, 9900, 9827, 9766, 9716, 9673, 9635, 9602, 9572, 9546, 9526, 9514, 9511, 9518, 9536, 9564, 9601, 9648, 9703, 9765, 9833, 9908, 9986, 10069, 10156, 10247, 10345, 10449, 10563, 10685, 10816, 10955, 11099, 11250, 11405, 11566, 11731, 11901, 12075, 12253, 12433, 12614, 12795, 12977, 13164, 13358, 13562, 13777, 14005, 14243, 14487]
3422A4487K45K44K41K38K36K34K32K31K27K23K18K16K14TK12TK09K06K03K01J97J94
3433A9334J90J83J75J67J59J52J46J41J39J34J30J25J21J15J13J11J13J17J20TJ16
3443.5B2221J06R2P8O7O5P1Q4R8J13J19TJ13J03R3Q4P8P4O9O4N9N2M7M4TM5M8M9TM7
3458B4395M2L6K9K4K2K6L1M0M6N1M9M3L5K7K3K2K6L1L6L9M0L8L5L2L0K8K5K2J8J5J3
3473.5B5369J5J9K6L3M0M2L9L3K3J1%qj2ToJJ1K2L0L6L8L4K7J8J0MTRJ6K5L1L3TL2
3490.5B6026K8K6K3J6Rjj0j5j4pMJ5K4K6K3J3jj6l2m2m6m3l2j3J0L4N6P1P5O9N1K9
3506.5B6356Lj4k3j9mJ5L2M3M6M2L4K8K4K3TK2J8J1Lnj0j1qlknj6l4n3o7p2o1m0j3
3523.5B6263J2K6K7J9NkTJ0K7M4N7O2N9N4M8M4M0L5K2Pj2k7l3l0j7LK2L6L9L6K6J3
$$ y = [14487, 14732, 14976, 15217, 15455, 15691, 15925, 16157, 16388, 16615, 16838, 17056, 17272, 17486, 17700, 17912, 18124, 18333, 18539, 18742, 18943, 19140, 19334, 19524, 19707, 19882, 20049, 20208, 20360, 20506, 20647, 20786, 20920, 21050, 21175, 21296, 21411, 21524, 21635, 21748, 21865, 21985, 22105, 22221, 22327, 22419, 22497, 22564, 22629, 22700, 22784, 22882, 22995, 23114, 23233, 23346, 23449, 23542, 23626, 23704, 23778, 23847, 23911, 23970, 24022, 24069, 24113, 24157, 24202, 24250, 24299, 24348, 24395, 24437, 24473, 24502, 24526, 24548, 24574, 24605, 24645, 24691, 24742, 24791, 24834, 24869, 24896, 24919, 24941, 24967, 24998, 25034, 25073, 25113, 25151, 25186, 25218, 25248, 25276, 25301, 25323, 25341, 25356, 25369, 25384, 25403, 25429, 25462, 25502, 25544, 25583, 25616, 25639, 25650, 25650, 25642, 25630, 25618, 25612, 25613, 25624, 25646, 25676, 25712, 25750, 25784, 25811, 25829, 25839, 25843, 25847, 25856, 25872, 25897, 25928, 25961, 25994, 26026, 26054, 26080, 26103, 26119, 26128, 26127, 26117, 26102, 26088, 26081, 26085, 26100, 26124, 26150, 26173, 26186, 26185, 26169, 26137, 26095, 26049, 26006, 25974, 25961, 25971, 26005, 26061, 26132, 26207, 26276, 26327, 26356, 26359, 26345, 26322, 26303, 26299, 26314, 26346, 26389, 26435, 26477, 26511, 26539, 26563, 26586, 26609, 26631, 26649, 26660, 26663, 26658, 26648, 26637, 26629, 26626, 26624, 26619, 26603, 26569, 26516, 26449, 26377, 26316, 26276, 26263, 26275, 26301, 26328, 26347, 26352, 26350, 26348, 26358, 26385, 26429, 26486, 26548, 26607, 26661, 26709, 26753, 26793, 26828, 26850, 26857, 26845, 26818, 26785, 26755, 26738, 26741, 26763, 26799, 26838, 26874, 26900, 26913]
3539.5B6913%j3k7m2n7p1q0q3p7o3m3j8QL3N4O9P6P2N5L2Mj9l3l4k2kJ9L7M8N0M5L7
3555.5B6868K6J4%j3k4l5m0m4m2l8l4l2l6m8p1j02j37j64j74j58j15m9K5R7J51J81
3568.5B6006J85J69J38J05P2M5K2Qloqnl%Tlqj2j7j9j7j5j1j0j1j7k4l3m3n5o9q8j05
3585B6168j18j16r6n4OP1J29J65J74J55J17O8K2j5m0n0Tm1k7j2KJ1J4TRMKTPJ6K4L3
3601B6594L7TL4K3Rj0l2n5p6r1r6r0p3m9k2lOlk1m7o7p4o3l8lL0M9N1L6Qk4m8o0n6
3618B5813l6nL3P0J02J19J23J08Q0M4Qk6n3q1j14j55j97k30k36k00j25k0R2J81K30
3630.5B5525K31J92J34P8M1K6K8L6L9L4K2Pkn%MTok1l9n0m9l7k0j0j9m9r8j53j98k24
3646B5421k24k04j70j32r2m5RP7J50K17K61K71K42J82J07L6j3l3k3PM5P7R4R7Q6O8
$$ y = [26913, 26913, 26900, 26873, 26831, 26774, 26703, 26623, 26540, 26463, 26400, 26357, 26339, 26347, 26380, 26434, 26503, 26579, 26651, 26706, 26738, 26742, 26723, 26690, 26656, 26634, 26632, 26651, 26688, 26736, 26786, 26831, 26868, 26894, 26908, 26908, 26895, 26871, 26836, 26796, 26752, 26710, 26672, 26638, 26606, 26570, 26522, 26451, 26349, 26212, 26048, 25874, 25716, 25601, 25552, 25577, 25674, 25825, 26006, 26191, 26360, 26498, 26603, 26675, 26720, 26742, 26750, 26747, 26741, 26733, 26728, 26725, 26725, 26725, 26722, 26714, 26702, 26685, 26666, 26649, 26634, 26623, 26613, 26602, 26585, 26561, 26528, 26485, 26430, 26361, 26273, 26168, 26050, 25934, 25838, 25784, 25790, 25861, 25990, 26155, 26329, 26484, 26601, 26669, 26691, 26676, 26636, 26586, 26536, 26495, 26468, 26456, 26458, 26469, 26483, 26497, 26506, 26510, 26512, 26514, 26521, 26537, 26561, 26594, 26631, 26668, 26702, 26725, 26734, 26724, 26692, 26637, 26561, 26470, 26374, 26284, 26211, 26162, 26140, 26137, 26143, 26140, 26119, 26072, 26005, 25931, 25868, 25830, 25827, 25857, 25906, 25957, 25993, 26001, 25977, 25929, 25869, 25813, 25777, 25772, 25805, 25875, 25977, 26096, 26219, 26327, 26407, 26451, 26459, 26433, 26380, 26299, 26185, 26030, 25833, 25603, 25367, 25167, 25042, 25022, 25114, 25295, 25525, 25756, 25948, 26082, 26160, 26201, 26227, 26255, 26291, 26330, 26364, 26386, 26393, 26391, 26386, 26386, 26390, 26394, 26388, 26367, 26328, 26278, 26229, 26192, 26172, 26162, 26143, 26094, 25996, 25843, 25645, 25421, 25197, 24993, 24823, 24691, 24599, 24554, 24563, 24640, 24790, 25007, 25268, 25539, 25781, 25963, 26070, 26106, 26093, 26060, 26037, 26044, 26089, 26166, 26260, 26357, 26443, 26511]
3659B6511M9L6K7K3K0J6J0Koj4k3l4n2p5j05j37j69j91j94j71j19m4L6R5J11P1j8j30
3673B5525k26k70k39j40JJ41K42K87K75K29J78J39J24TJ26J18R6O5L4J2lj0k0l7o2
3685.5B6709q9j15j29j33j22j01p0l1J6O4J09J44J61J59J41J13Q1N3L0J7J3TJ7J8J0
3698B7078ol2o0q0q4p0l8KL9O3O9N7L5Rj4l2m7o0p9j03j30j57j71j68j39q6j7N4J16
3712.5B5949J53J67J58J35J06P5M6K2Jj6k5l2l6m0m9n7o3n8m4k2%J3J6OnrJK5N2P1
3727.5B6540P1M8Rl7p9j08j26j37j51j66j81j84j68j23n5K7J03J58J82J73J38R6N5
3739B6085K8J1jj9n2r4j38j64j60j21n6J6P1R7Q6M9%m6p7r2Tp7m9oN0J08J59J88J92
3753.5B5896J71J34R3N7K9Pj2k8l4k9oK8O8R9J13J06P8L7om2o2Tm4j6J2K9K7Rj7m1
$$ y = [26511, 26560, 26596, 26623, 26646, 26666, 26682, 26692, 26694, 26688, 26674, 26651, 26617, 26565, 26490, 26385, 26248, 26079, 25888, 25694, 25523, 25404, 25360, 25396, 25491, 25602, 25673, 25655, 25525, 25299, 25029, 24790, 24650, 24651, 24792, 25034, 25321, 25596, 25825, 26003, 26142, 26266, 26390, 26516, 26634, 26730, 26795, 26829, 26841, 26838, 26828, 26808, 26771, 26709, 26620, 26505, 26376, 26243, 26121, 26020, 25950, 25919, 25935, 25999, 26108, 26252, 26413, 26572, 26713, 26826, 26907, 26960, 26990, 27007, 27020, 27033, 27050, 27068, 27078, 27072, 27040, 26980, 26900, 26816, 26746, 26708, 26710, 26749, 26812, 26881, 26938, 26973, 26982, 26968, 26936, 26889, 26829, 26750, 26647, 26517, 26360, 26189, 26021, 25882, 25796, 25779, 25833, 25949, 26102, 26269, 26427, 26562, 26668, 26743, 26789, 26811, 26812, 26796, 26771, 26739, 26703, 26663, 26614, 26557, 26494, 26436, 26392, 26370, 26370, 26383, 26399, 26405, 26400, 26391, 26392, 26417, 26469, 26540, 26611, 26659, 26668, 26631, 26552, 26444, 26318, 26181, 26030, 25864, 25683, 25499, 25331, 25208, 25153, 25180, 25283, 25441, 25623, 25796, 25934, 26030, 26085, 26113, 26124, 26123, 26104, 26052, 25958, 25820, 25656, 25496, 25375, 25319, 25335, 25406, 25503, 25589, 25638, 25638, 25592, 25515, 25423, 25331, 25254, 25205, 25199, 25249, 25357, 25516, 25704, 25896, 26067, 26201, 26294, 26351, 26380, 26387, 26375, 26347, 26313, 26284, 26278, 26306, 26374, 26473, 26586, 26692, 26770, 26807, 26801, 26759, 26697, 26635, 26591, 26575, 26587, 26616, 26643, 26652, 26635, 26594]
3768.5B6594m7l2%M2P7R8R9Q6O3M2K4J2Kj0k4m3n9p0o8n3k8ML1M8M9L6J0j8m0n1m6
3784B6728k6KL0N1O1N9M8L1J7Nkmpj0j4k0k9m2n9p7r5j04j00q2n4k8j4k1n2r6j39j62
3800B5795j50j02k4O2J35J74J73J34P6J8k2l1j3K5O5R6J09J01P9N2K7Pqk3m4p3j08
3813.5B6530j37j51j41j08n7j1J6J2k3p6j22j42j24p0PQ5J45J74J72J45J03N9K5M%
3826B6315QK2L3L6K7Rj4l2m1Tl2k3j8k3l6n5p5r2j01j03r8q6o9m6j9J3M3O8Q4R0Q4
3841.5B5828P2N9N2N6O7Q2R3R0P1L7om7q2j07j29j50j79k12k41k50k26j63o9L7J31
3854B4814J96K20K10J83J53J29J16J03Q3N3J4k4n4p1q0q3q9r2q8o8k8K3O8Q6O7Ro7
3867.5B5783j33j63j42p8RQ4J28J30J00N8K9K4M3P7J08J23J13Q0L1k4p7j15j32j25
$$ y = [26594, 26547, 26515, 26515, 26557, 26634, 26732, 26831, 26917, 26980, 27022, 27046, 27058, 27060, 27050, 27026, 26983, 26924, 26854, 26786, 26733, 26705, 26709, 26740, 26788, 26837, 26873, 26883, 26865, 26825, 26774, 26728, 26702, 26704, 26734, 26785, 26846, 26905, 26953, 26984, 27001, 27006, 27004, 27000, 26993, 26983, 26969, 26949, 26920, 26878, 26819, 26742, 26647, 26543, 26443, 26361, 26307, 26279, 26265, 26244, 26192, 26096, 25957, 25795, 25645, 25543, 25519, 25581, 25716, 25890, 26063, 26197, 26273, 26291, 26269, 26238, 26225, 26250, 26315, 26411, 26520, 26621, 26700, 26752, 26779, 26786, 26778, 26755, 26711, 26638, 26530, 26393, 26242, 26101, 25993, 25936, 25925, 25941, 25953, 25930, 25854, 25732, 25590, 25466, 25396, 25403, 25488, 25633, 25807, 25979, 26124, 26227, 26286, 26311, 26315, 26315, 26323, 26345, 26378, 26414, 26441, 26450, 26436, 26404, 26363, 26322, 26290, 26267, 26249, 26226, 26190, 26135, 26060, 25968, 25867, 25764, 25666, 25580, 25511, 25465, 25446, 25459, 25502, 25570, 25654, 25744, 25828, 25900, 25959, 26011, 26067, 26134, 26216, 26309, 26399, 26470, 26507, 26501, 26454, 26372, 26265, 26136, 25986, 25807, 25595, 25354, 25104, 24878, 24715, 24646, 24683, 24814, 25010, 25230, 25440, 25623, 25776, 25905, 26021, 26124, 26207, 26260, 26274, 26250, 26196, 26125, 26045, 25962, 25873, 25781, 25693, 25625, 25597, 25620, 25688, 25774, 25841, 25850, 25783, 25650, 25487, 25345, 25267, 25276, 25360, 25488, 25618, 25718, 25776, 25805, 25829, 25872, 25949, 26057, 26180, 26293, 26373, 26404, 26380, 26303, 26188, 26056, 25931]
3879.5B5931r4m9JL9N7N1K7mk8l4j9J1N0Q2R9R0N8J1m0q1j00r0n8j4L1O5Q4Q9Q1O3
3894.5B6309L9Nl2o9r7j09j04q3n7l7k8l1l9m6m1k9oK0M6P2R6J17J35J41J38J20R5
3908B6525O6M0K0P%knoj0j8k9m5o2p4p6o7m7k3kJ3J9K2K5K9L1K8J3j2l8n7n9m0nL2
3925B6193O1P2O1L8J0j4k8l4Tl2k7k1j2NK4M6O2P3P4O6N0L1J3jj0j3j5j6k1l0m1m9
3941B6481n2m2k5kK2L5L8K8Rj3l0m0l8k7qJ3L0M3M8M7M1L2K3J6J0OJlnTlJNPKmj3j9
3960B6609k1j7rKJ0J5J6J5J0OKkmpTonlnqj3j7k1k3k1k0j7j6j1oLJ1J9K3TJ8J0Knj0
3980B6520rTnjJKLTKJkmqj3j8k1k3k1j8j1m%LKJjmoUmjLPQRPLlpj2j4j6j8k0k1k3k2
4004B6224k2j9j6j3j1ponlmlmTnToTpTopqj1j5k1k4k5k4j8j2pmnpj2j5j8k0j9j8j7
$$ y = [25931, 25837, 25788, 25789, 25828, 25885, 25936, 25963, 25959, 25931, 25897, 25878, 25889, 25939, 26021, 26120, 26210, 26268, 26279, 26239, 26158, 26058, 25968, 25910, 25896, 25927, 25992, 26076, 26165, 26246, 26309, 26348, 26353, 26321, 26252, 26155, 26046, 25942, 25859, 25802, 25765, 25737, 25706, 25667, 25621, 25580, 25551, 25545, 25565, 25611, 25683, 25779, 25896, 26031, 26172, 26310, 26430, 26525, 26591, 26631, 26651, 26658, 26658, 26656, 26651, 26645, 26635, 26617, 26588, 26543, 26481, 26407, 26331, 26264, 26217, 26194, 26192, 26205, 26224, 26246, 26271, 26300, 26331, 26359, 26372, 26360, 26322, 26265, 26206, 26166, 26161, 26193, 26254, 26326, 26387, 26425, 26435, 26421, 26393, 26359, 26325, 26293, 26266, 26245, 26233, 26238, 26262, 26308, 26370, 26443, 26517, 26583, 26633, 26664, 26677, 26676, 26666, 26653, 26638, 26622, 26601, 26571, 26530, 26481, 26429, 26387, 26362, 26360, 26382, 26417, 26455, 26483, 26492, 26479, 26449, 26409, 26371, 26344, 26336, 26349, 26379, 26422, 26470, 26517, 26558, 26590, 26613, 26629, 26639, 26645, 26646, 26643, 26638, 26633, 26630, 26631, 26636, 26643, 26645, 26641, 26628, 26609, 26588, 26571, 26562, 26564, 26574, 26589, 26605, 26620, 26630, 26636, 26638, 26636, 26632, 26625, 26618, 26612, 26607, 26604, 26599, 26591, 26578, 26561, 26540, 26517, 26496, 26476, 26459, 26443, 26432, 26426, 26429, 26440, 26459, 26482, 26505, 26523, 26533, 26535, 26530, 26520, 26511, 26502, 26497, 26496, 26497, 26499, 26502, 26505, 26507, 26508, 26506, 26502, 26494, 26481, 26463, 26442, 26419, 26398, 26380, 26369, 26365, 26365, 26368, 26370, 26371, 26370, 26366, 26360, 26354, 26348, 26344, 26343, 26346, 26353, 26361, 26370, 26377, 26380, 26377, 26370, 26358, 26344, 26328, 26310, 26290, 26269, 26246, 26224, 26202, 26183, 26167, 26154, 26143, 26136, 26130, 26125, 26122, 26118, 26115, 26111, 26107, 26102, 26097, 26091, 26085, 26078, 26071, 26065, 26058, 26050, 26039, 26024, 26003, 25979, 25954, 25930, 25912, 25900, 25893, 25889, 25884, 25877, 25865, 25850, 25832, 25812, 25793, 25775, 25758]
4024.5B5758j6j5Uj4j5j6Uj5Tj3j2j1Uj3j4j6j5Tj1pl%MULJ%jlnopqom%NRJ3J7K0K2
4047.5B5500K4TK5K4K2K0J7J4J0POTQJ2J5J6J7J5J2J0PQTJ0J2J5J7J8K0J9J7J3J0O
4064.5B5984LKJTKMNPQTPOLJ%XjTkTlmnljMJ0J6K0K1K0J7J4J0RTQRTJ0J2J3J5J4TJ1
4089.5B6285RQTRJ1TJ0QNK%jTlUmnmnmoTqj2j4j8k1Tj9j4oJPRQOKjk%TKTLMNTPQPO
4115.5B6267MKjlnponkJMNMJjk%MQJ3J4J3RLknolKOQTMjoqTnmklnonkNJ2J8K0J9J5
4141B6366RNL%Tjmqj1Tj0nJNPTOLTNQJ1J2RLlrj2j4j3j2rqoljMQJ1J4J3J2RM%npqo
4165.5B6372lKOQJ0TPMJlorj0Tpl%MLJlpj1TrnkJKLK%mnoTm%JTjmqj0rpl%JU%j%j%
4193.5B6273jT%jlorj1j2rnJO
$$ y = [25758, 25742, 25727, 25712, 25697, 25683, 25668, 25652, 25636, 25620, 25605, 25590, 25577, 25565, 25554, 25543, 25532, 25519, 25505, 25489, 25474, 25459, 25448, 25441, 25438, 25438, 25442, 25446, 25450, 25453, 25454, 25454, 25453, 25450, 25445, 25439, 25432, 25424, 25418, 25414, 25414, 25419, 25428, 25441, 25458, 25478, 25500, 25524, 25548, 25573, 25597, 25619, 25639, 25656, 25670, 25680, 25687, 25693, 25699, 25707, 25719, 25734, 25750, 25767, 25782, 25794, 25804, 25811, 25819, 25827, 25837, 25849, 25864, 25881, 25899, 25919, 25938, 25955, 25968, 25978, 25984, 25987, 25989, 25990, 25991, 25993, 25997, 26002, 26009, 26017, 26025, 26032, 26038, 26041, 26042, 26042, 26042, 26042, 26042, 26042, 26042, 26041, 26040, 26038, 26036, 26033, 26029, 26024, 26021, 26020, 26024, 26034, 26050, 26070, 26091, 26111, 26128, 26142, 26152, 26161, 26170, 26178, 26187, 26196, 26206, 26218, 26231, 26246, 26260, 26274, 26285, 26294, 26302, 26310, 26319, 26330, 26341, 26351, 26359, 26364, 26366, 26366, 26365, 26364, 26361, 26358, 26355, 26351, 26346, 26342, 26337, 26333, 26327, 26321, 26313, 26301, 26287, 26269, 26248, 26227, 26208, 26194, 26188, 26189, 26196, 26205, 26213, 26219, 26221, 26220, 26218, 26218, 26218, 26220, 26222, 26225, 26229, 26234, 26239, 26246, 26254, 26261, 26267, 26271, 26273, 26272, 26269, 26264, 26257, 26251, 26246, 26244, 26245, 26249, 26254, 26258, 26259, 26258, 26256, 26256, 26260, 26268, 26281, 26295, 26308, 26317, 26320, 26318, 26313, 26307, 26304, 26306, 26312, 26320, 26328, 26332, 26331, 26325, 26317, 26309, 26304, 26300, 26298, 26295, 26290, 26284, 26279, 26277, 26282, 26294, 26312, 26332, 26351, 26366, 26375, 26380, 26383, 26383, 26383, 26382, 26378, 26370, 26359, 26348, 26338, 26333, 26334, 26339, 26346, 26353, 26359, 26362, 26365, 26370, 26378, 26389, 26401, 26410, 26413, 26410, 26401, 26389, 26375, 26362, 26350, 26341, 26333, 26327, 26324, 26323, 26327, 26335, 26346, 26360, 26373, 26385, 26394, 26398, 26398, 26393, 26386, 26378, 26372, 26369, 26371, 26377, 26385, 26395, 26405, 26412, 26416, 26417, 26414, 26408, 26399, 26389, 26379, 26372, 26369, 26369, 26373, 26376, 26377, 26374, 26367, 26356, 26345, 26336, 26331, 26329, 26330, 26332, 26335, 26337, 26337, 26333, 26328, 26322, 26316, 26312, 26312, 26313, 26314, 26313, 26309, 26301, 26291, 26282, 26275, 26272, 26272, 26273, 26274, 26275, 26275, 26274, 26274, 26273, 26273, 26272, 26271, 26271, 26270, 26267, 26261, 26252, 26241, 26229, 26220, 26215, 26216, 26222]
4200B6222
$$ y = [26222]
##END=$$ End of the data block
